test packages.x86_64-linux.nix-ci-check-gammaloop-nextest-integration

Reproduce this run
Original Run
  1. 185.11 s gammaloop-nextest-integration> | dod2_bubble | rls.integrated | GL0 | pass | 0.0sigma | compatible within 2sigma | - |
  2. 185.11 s gammaloop-nextest-integration> +-------------+-----------------+---------+--------+----------+-----------------------------------------------------------------------------------------------------------------------+-------+
  3. 185.11 s gammaloop-nextest-integration> | dod2_bubble | mu_r.inspect | inspect | pass | - | best inspect relative delta 6.951e-1 >= 1000*accuracy 1.000e-7 (accuracy=1.000e-10, exponent=+0.0, seed=0, probes=10) | - |
  4. 185.11 s gammaloop-nextest-integration> +-------------+-----------------+---------+--------+----------+-----------------------------------------------------------------------------------------------------------------------+-------+
  5. 185.11 s gammaloop-nextest-integration> | dod2_bubble | target | - | pass | - | 2sigma | - |
  6. 185.11 s gammaloop-nextest-integration> +-------------+-----------------+---------+--------+----------+-----------------------------------------------------------------------------------------------------------------------+-------+
  7. 185.11 s gammaloop-nextest-integration> test dod2_bubble_uv ... FAILED
  8. 185.11 s gammaloop-nextest-integration>
  9. 185.11 s gammaloop-nextest-integration> failures:
  10. 185.11 s gammaloop-nextest-integration>
  11. 185.11 s gammaloop-nextest-integration> failures:
  12. 185.11 s gammaloop-nextest-integration> dod2_bubble_uv
  13. 185.11 s gammaloop-nextest-integration>
  14. 185.11 s gammaloop-nextest-integration> test result: FAILED. 0 passed; 1 failed; 0 ignored; 0 measured; 24 filtered out; finished in 34.91s
  15. 185.11 s gammaloop-nextest-integration> system-err
  16. 185.11 s gammaloop-nextest-integration> [2026-09-02 17:40:18.893] @gammaloop_api::se... INFO : Running command run generate
  17. 185.11 s gammaloop-nextest-integration> [2026-09-02 17:40:18.893] @gammaloop_api::se... INFO : Starting command block generate
  18. 185.11 s gammaloop-nextest-integration> [2026-09-02 17:40:18.893] @gammaloop_api::se... INFO : Running command import model scalars-default.json
  19. 185.11 s gammaloop-nextest-integration> [2026-09-02 17:40:18.893] @import::model INFO : Loading built-in JSON model scalars-default
  20. 185.11 s gammaloop-nextest-integration> [2026-09-02 17:40:18.896] @gammalooprs::model INFO : The following 2 external parameters were forced to zero by the restriction card:
  21. 185.11 s gammaloop-nextest-integration> width_scalar_1, width_scalar_2
  22. 185.11 s gammaloop-nextest-integration> [2026-09-02 17:40:18.897] @gammaloop_api::se... INFO : Running command remove processes
  23. 185.11 s gammaloop-nextest-integration> [2026-09-02 17:40:18.897] @gammaloop_api::se... INFO : Running command set global kv global.generation.uv.generate_integrated=true
  24. 185.11 s gammaloop-nextest-integration> [2026-09-02 17:40:18.897] @gammaloop_api::se... INFO : Running command import graphs ./tests/resources/graphs/scalar/dod2_bubble.dot -p bubble_dod2 -i scalar_bubble_below_thres
  25. 185.11 s gammaloop-nextest-integration> [2026-09-02 17:40:18.897] @commands::import INFO : Loading graphs from '/build/source/tests/resources/graphs/scalar/dod2_bubble.dot'
  26. 185.11 s gammaloop-nextest-integration> [2026-09-02 17:40:18.899] @gammaloop_api::se... INFO : Running command generate existing -p bubble_dod2 -i scalar_bubble_below_thres
  27. 185.11 s gammaloop-nextest-integration> [2026-09-02 17:40:18.901] @approx::local_4d [{#uv, #inspect, #integrated}] DEBUG : Rescaled momenta expanded
  28. 185.11 s gammaloop-nextest-integration> field value
  29. 185.11 s gammaloop-nextest-integration> res n-terms: 1, byte size: 585,expr:
  30. 185.11 s gammaloop-nextest-integration> -SCALAR_COUPLING²·q₀(αᵉ².¹)·q₀(αᵉ³.¹)·q₂(αᵉ².¹)·q₂(αᵉ³.¹)
  31. 185.11 s gammaloop-nextest-integration> /(t²·denom(3,-q₀-q₂/t,mass_scalar_2²,-mass_scalar_2²+2·(q₀.q₂)/t+(q₂.q₂)/t²+(q₀.q₀))
  32. 185.11 s gammaloop-nextest-integration> ·denom(2,q₂/t,mass_scalar_2²,-mass_scalar_2²+(q₂.q₂)/t²))
  33. 185.11 s gammaloop-nextest-integration> [2026-09-02 17:40:18.902] @approx::local_4d [{#uv, #inspect, #integrated}] DEBUG : Rescaled momenta expanded
  34. 185.11 s gammaloop-nextest-integration> field value
  35. 185.11 s gammaloop-nextest-integration> res n-terms: 1, byte size: 3,expr:
  36. 185.11 s gammaloop-nextest-integration> 1
  37. 185.11 s gammaloop-nextest-integration> [2026-09-02 17:40:18.902] @approx::final_integrand[{#generation, #profile, #uv, #graph, #summary}] DEBUG : Computed global numerator
  38. 185.11 s gammaloop-nextest-integration> field value
  39. 185.11 s gammaloop-nextest-integration> global_num n-terms: 1, byte size: 4,expr:
  40. 185.11 s gammaloop-nextest-integration> 1/2
  41. 185.11 s gammaloop-nextest-integration> span build_3d{span_context=true graph=GL0 current=subgraph=0, topo_order=0, dod=0}
  42. 185.11 s gammaloop-nextest-integration> [2026-09-02 17:40:18.905] @uv::approx [{#generation, #uv, #fourd}] DEBUG : Computing 4D
  43. 185.11 s gammaloop-nextest-integration> field value
  44. 185.11 s gammaloop-nextest-integration> simple subgraph(S_11,S_y)*Approx(subgraph(S_y,0)) of GL0
  45. 185.11 s gammaloop-nextest-integration> span compute_4d{span_context=true graph=GL0 current=subgraph=y, topo_order=1, dod=2 given=subgraph=0, topo_order=0, dod=0 reduced=SubSet { set: BitVec<usize, bitvec::order::Lsb0> { addr: 0x7fffec017290, head: 000000, bits: 6, capacity: 64 } [0, 0, 1, 1, 1, 1], id: PhantomData<linnet::half_edge::involution::Hedge> }}
  46. 185.11 s gammaloop-nextest-integration> [2026-09-02 17:40:18.905] @approx::local_4d [{#uv, #algebra, #integrated, #start}] DEBUG :
  47. 185.11 s gammaloop-nextest-integration> field value
  48. 185.11 s gammaloop-nextest-integration> integrand n-terms: 1, byte size: 409,expr:
  49. 185.11 s gammaloop-nextest-integration> SCALAR_COUPLING²·(q₀(αᵉ³.¹)+q₃(αᵉ³.¹))·q₀(αᵉ².¹)·q₀(αᵉ³.¹)·q₂(αᵉ².¹)
  50. 185.11 s gammaloop-nextest-integration> /(denom(2,q₂,mass_scalar_2²,-mass_scalar_2²+(q₂.q₂))·denom(3,q₃,mass_scalar_2²,-mass_scalar_2²+(q₃.q₃)))
  51. 185.11 s gammaloop-nextest-integration> reduced y
  52. 185.11 s gammaloop-nextest-integration> span grow{span_context=true current=subgraph=y, topo_order=1, dod=2 given=subgraph=0, topo_order=0, dod=0}
  53. 185.11 s gammaloop-nextest-integration> [2026-09-02 17:40:18.905] @approx::local_4d [{#uv, #inspect, #integrated}] DEBUG : Rescaled momenta expanded
  54. 185.11 s gammaloop-nextest-integration> field value
  55. 185.11 s gammaloop-nextest-integration> res n-terms: 1, byte size: 585,expr:
  56. 185.11 s gammaloop-nextest-integration> -SCALAR_COUPLING²·q₀(αᵉ².¹)·q₀(αᵉ³.¹)·q₂(αᵉ².¹)·q₂(αᵉ³.¹)
  57. 185.11 s gammaloop-nextest-integration> /(t²·denom(3,-q₀-q₂/t,mass_scalar_2²,-mass_scalar_2²+2·(q₀.q₂)/t+(q₂.q₂)/t²+(q₀.q₀))
  58. 185.11 s gammaloop-nextest-integration> ·denom(2,q₂/t,mass_scalar_2²,-mass_scalar_2²+(q₂.q₂)/t²))
  59. 185.11 s gammaloop-nextest-integration> span t{span_context=true current=subgraph=y, topo_order=1, dod=2 given=subgraph=0, topo_order=0, dod=0}
  60. 185.11 s gammaloop-nextest-integration> [2026-09-02 17:40:18.906] @approx::local_4d [{#uv, #integrated, #rescaled}] DEBUG : Rescaled expanded
  61. 185.11 s gammaloop-nextest-integration> field value
  62. 185.11 s gammaloop-nextest-integration> n_loops 1
  63. 185.11 s gammaloop-nextest-integration> res n-terms: 1, byte size: 707,expr:
  64. 185.11 s gammaloop-nextest-integration> -SCALAR_COUPLING²·q₀(αᵉ².¹)·q₀(αᵉ³.¹)·q₂(αᵉ².¹)·q₂(αᵉ³.¹)
  65. 185.11 s gammaloop-nextest-integration> /(t²·denom(3,-q₂,mUVexp²+t²·mass_scalar_2²,-mUV²+t²·(-mass_scalar_2²+2·(q₀.q₂)/t+(q₂.q₂)/t²+(q₀.q₀))+t²·mUVexp²)
  66. 185.11 s gammaloop-nextest-integration> ·denom(2,q₂,mUVexp²+t²·mass_scalar_2²,-mUV²+t²·(-mass_scalar_2²+(q₂.q₂)/t²)+t²·mUVexp²))
  67. 185.11 s gammaloop-nextest-integration> span t{span_context=true current=subgraph=y, topo_order=1, dod=2 given=subgraph=0, topo_order=0, dod=0}
  68. 185.11 s gammaloop-nextest-integration> [2026-09-02 17:40:18.906] @approx::local_4d [{#uv, #integrated, #series}] DEBUG : Series expanded
  69. 185.11 s gammaloop-nextest-integration> field value
  70. 185.11 s gammaloop-nextest-integration> res n-terms: 3, byte size: 1896,expr:
  71. 185.11 s gammaloop-nextest-integration> (1/2·SCALAR_COUPLING²·(2·mUVexp²-2·mass_scalar_2²)/(denom(2,q₂,mUVexp²,-mUV²+(q₂.q₂))²·denom(3,-q₂,mUVexp²,-mUV²+(q₂.q₂)))
  72. 185.11 s gammaloop-nextest-integration> -SCALAR_COUPLING²
  73. 185.11 s gammaloop-nextest-integration> ·(-1/2·(2·mUVexp²-2·mass_scalar_2²+2·(q₀.q₀))/denom(3,-q₂,mUVexp²,-mUV²+(q₂.q₂))
  74. 185.11 s gammaloop-nextest-integration> +4·(q₀.q₂)²/denom(3,-q₂,mUVexp²,-mUV²+(q₂.q₂))²
  75. 185.11 s gammaloop-nextest-integration> )/(denom(2,q₂,mUVexp²,-mUV²+(q₂.q₂))·denom(3,-q₂,mUVexp²,-mUV²+(q₂.q₂)))
  76. 185.11 s gammaloop-nextest-integration> )·q₀(αᵉ².¹)·q₀(αᵉ³.¹)·q₂(αᵉ².¹)·q₂(αᵉ³.¹)
  77. 185.11 s gammaloop-nextest-integration> +2·SCALAR_COUPLING²·(q₀.q₂)·q₀(αᵉ².¹)·q₀(αᵉ³.¹)·q₂(αᵉ².¹)·q₂(αᵉ³.¹)
  78. 185.11 s gammaloop-nextest-integration> /(t·denom(2,q₂,mUVexp²,-mUV²+(q₂.q₂))·denom(3,-q₂,mUVexp²,-mUV²+(q₂.q₂))²)
  79. 185.11 s gammaloop-nextest-integration> -SCALAR_COUPLING²·q₀(αᵉ².¹)·q₀(αᵉ³.¹)·q₂(αᵉ².¹)·q₂(αᵉ³.¹)
  80. 185.11 s gammaloop-nextest-integration> /(t²·denom(2,q₂,mUVexp²,-mUV²+(q₂.q₂))·denom(3,-q₂,mUVexp²,-mUV²+(q₂.q₂)))
  81. 185.11 s gammaloop-nextest-integration> span t{span_context=true current=subgraph=y, topo_order=1, dod=2 given=subgraph=0, topo_order=0, dod=0}
  82. 185.11 s gammaloop-nextest-integration> [2026-09-02 17:40:18.906] @approx::local_4d [{#uv, #integrated, #series}] DEBUG : Evaluated at t = 1
  83. 185.11 s gammaloop-nextest-integration> field value
  84. 185.11 s gammaloop-nextest-integration> res n-terms: 3, byte size: 1880,expr:
  85. 185.11 s gammaloop-nextest-integration> (1/2·SCALAR_COUPLING²·(2·mUVexp²-2·mass_scalar_2²)/(denom(2,q₂,mUVexp²,-mUV²+(q₂.q₂))²·denom(3,-q₂,mUVexp²,-mUV²+(q₂.q₂)))
  86. 185.11 s gammaloop-nextest-integration> -SCALAR_COUPLING²
  87. 185.11 s gammaloop-nextest-integration> ·(-1/2·(2·mUVexp²-2·mass_scalar_2²+2·(q₀.q₀))/denom(3,-q₂,mUVexp²,-mUV²+(q₂.q₂))
  88. 185.11 s gammaloop-nextest-integration> +4·(q₀.q₂)²/denom(3,-q₂,mUVexp²,-mUV²+(q₂.q₂))²
  89. 185.11 s gammaloop-nextest-integration> )/(denom(2,q₂,mUVexp²,-mUV²+(q₂.q₂))·denom(3,-q₂,mUVexp²,-mUV²+(q₂.q₂)))
  90. 185.11 s gammaloop-nextest-integration> )·q₀(αᵉ².¹)·q₀(αᵉ³.¹)·q₂(αᵉ².¹)·q₂(αᵉ³.¹)
  91. 185.11 s gammaloop-nextest-integration> -SCALAR_COUPLING²·q₀(αᵉ².¹)·q₀(αᵉ³.¹)·q₂(αᵉ².¹)·q₂(αᵉ³.¹)
  92. 185.11 s gammaloop-nextest-integration> /(denom(2,q₂,mUVexp²,-mUV²+(q₂.q₂))·denom(3,-q₂,mUVexp²,-mUV²+(q₂.q₂)))
  93. 185.11 s gammaloop-nextest-integration> +2·SCALAR_COUPLING²·(q₀.q₂)·q₀(αᵉ².¹)·q₀(αᵉ³.¹)·q₂(αᵉ².¹)·q₂(αᵉ³.¹)
  94. 185.11 s gammaloop-nextest-integration> /(denom(2,q₂,mUVexp²,-mUV²+(q₂.q₂))·denom(3,-q₂,mUVexp²,-mUV²+(q₂.q₂))²)
  95. 185.11 s gammaloop-nextest-integration> span t{span_context=true current=subgraph=y, topo_order=1, dod=2 given=subgraph=0, topo_order=0, dod=0}
  96. 185.11 s gammaloop-nextest-integration> [2026-09-02 17:40:18.908] @approx::local_4d [{#uv, #collect, #integrated}] DEBUG : After gamma chain collection
  97. 185.11 s gammaloop-nextest-integration> field value
  98. 185.11 s gammaloop-nextest-integration> expr n-terms: 3, byte size: 1880,expr:
  99. 185.11 s gammaloop-nextest-integration> (1/2·SCALAR_COUPLING²·(2·mUVexp²-2·mass_scalar_2²)/(denom(2,q₂,mUVexp²,-mUV²+(q₂.q₂))²·denom(3,-q₂,mUVexp²,-mUV²+(q₂.q₂)))
  100. 185.11 s gammaloop-nextest-integration> -SCALAR_COUPLING²
  101. 185.11 s gammaloop-nextest-integration> ·(-1/2·(2·mUVexp²-2·mass_scalar_2²+2·(q₀.q₀))/denom(3,-q₂,mUVexp²,-mUV²+(q₂.q₂))
  102. 185.11 s gammaloop-nextest-integration> +4·(q₀.q₂)²/denom(3,-q₂,mUVexp²,-mUV²+(q₂.q₂))²
  103. 185.11 s gammaloop-nextest-integration> )/(denom(2,q₂,mUVexp²,-mUV²+(q₂.q₂))·denom(3,-q₂,mUVexp²,-mUV²+(q₂.q₂)))
  104. 185.11 s gammaloop-nextest-integration> )·q₀(αᵉ².¹)·q₀(αᵉ³.¹)·q₂(αᵉ².¹)·q₂(αᵉ³.¹)
  105. 185.11 s gammaloop-nextest-integration> -SCALAR_COUPLING²·q₀(αᵉ².¹)·q₀(αᵉ³.¹)·q₂(αᵉ².¹)·q₂(αᵉ³.¹)
  106. 185.11 s gammaloop-nextest-integration> /(denom(2,q₂,mUVexp²,-mUV²+(q₂.q₂))·denom(3,-q₂,mUVexp²,-mUV²+(q₂.q₂)))
  107. 185.11 s gammaloop-nextest-integration> +2·SCALAR_COUPLING²·(q₀.q₂)·q₀(αᵉ².¹)·q₀(αᵉ³.¹)·q₂(αᵉ².¹)·q₂(αᵉ³.¹)
  108. 185.11 s gammaloop-nextest-integration> /(denom(2,q₂,mUVexp²,-mUV²+(q₂.q₂))·denom(3,-q₂,mUVexp²,-mUV²+(q₂.q₂))²)
  109. 185.11 s gammaloop-nextest-integration> span t{span_context=true current=subgraph=y, topo_order=1, dod=2 given=subgraph=0, topo_order=0, dod=0}
  110. 185.11 s gammaloop-nextest-integration> [2026-09-02 17:40:18.909] @approx::local_4d [{#profile, #uv, #collect, #integrated, #start, #trace}] DEBUG : After gamma schoonschip
  111. 185.11 s gammaloop-nextest-integration> field value
  112. 185.11 s gammaloop-nextest-integration> expr n-terms: 3, byte size: 1631,expr:
  113. 185.11 s gammaloop-nextest-integration> (1/2·SCALAR_COUPLING²·(2·mUVexp²-2·mass_scalar_2²)/(denom(2,q₂,mUVexp²,-mUV²+(q₂.q₂))²·denom(3,-q₂,mUVexp²,-mUV²+(q₂.q₂)))
  114. 185.11 s gammaloop-nextest-integration> -SCALAR_COUPLING²
  115. 185.11 s gammaloop-nextest-integration> ·(-1/2·(2·mUVexp²-2·mass_scalar_2²+2·(q₀.q₀))/denom(3,-q₂,mUVexp²,-mUV²+(q₂.q₂))
  116. 185.11 s gammaloop-nextest-integration> +4·(q₀.q₂)²/denom(3,-q₂,mUVexp²,-mUV²+(q₂.q₂))²
  117. 185.11 s gammaloop-nextest-integration> )/(denom(2,q₂,mUVexp²,-mUV²+(q₂.q₂))·denom(3,-q₂,mUVexp²,-mUV²+(q₂.q₂)))
  118. 185.11 s gammaloop-nextest-integration> )·(q₀.q₂)²
  119. 185.11 s gammaloop-nextest-integration> -SCALAR_COUPLING²·(q₀.q₂)²/(denom(2,q₂,mUVexp²,-mUV²+(q₂.q₂))·denom(3,-q₂,mUVexp²,-mUV²+(q₂.q₂)))
  120. 185.11 s gammaloop-nextest-integration> +2·SCALAR_COUPLING²·(q₀.q₂)·(q₀.q₂)²
  121. 185.11 s gammaloop-nextest-integration> /(denom(2,q₂,mUVexp²,-mUV²+(q₂.q₂))·denom(3,-q₂,mUVexp²,-mUV²+(q₂.q₂))²)
  122. 185.11 s gammaloop-nextest-integration> span t{span_context=true current=subgraph=y, topo_order=1, dod=2 given=subgraph=0, topo_order=0, dod=0}
  123. 185.11 s gammaloop-nextest-integration> [2026-09-02 17:40:18.910] @approx::local_4d [{#profile, #uv, #collect, #integrated, #start, #trace}] DEBUG : After gamma collection
  124. 185.11 s gammaloop-nextest-integration> field value
  125. 185.11 s gammaloop-nextest-integration> expr n-terms: 1, byte size: 1347,expr:
  126. 185.11 s gammaloop-nextest-integration> SCALAR_COUPLING²
  127. 185.11 s gammaloop-nextest-integration> ·(-denom(2,q₂,mUVexp²,-mUV²+(q₂.q₂))·denom(3,-q₂,mUVexp²,-mUV²+(q₂.q₂))²
  128. 185.11 s gammaloop-nextest-integration> +1/2·(2·mUVexp²-2·mass_scalar_2²)·denom(3,-q₂,mUVexp²,-mUV²+(q₂.q₂))²
  129. 185.11 s gammaloop-nextest-integration> -(-1/2·(2·mUVexp²-2·mass_scalar_2²+2·(q₀.q₀))·denom(3,-q₂,mUVexp²,-mUV²+(q₂.q₂))+4·(q₀.q₂)²)
  130. 185.11 s gammaloop-nextest-integration> ·denom(2,q₂,mUVexp²,-mUV²+(q₂.q₂))
  131. 185.11 s gammaloop-nextest-integration> +2·(q₀.q₂)·denom(2,q₂,mUVexp²,-mUV²+(q₂.q₂))·denom(3,-q₂,mUVexp²,-mUV²+(q₂.q₂))
  132. 185.11 s gammaloop-nextest-integration> )·(q₀.q₂)²/(denom(2,q₂,mUVexp²,-mUV²+(q₂.q₂))²·denom(3,-q₂,mUVexp²,-mUV²+(q₂.q₂))³)
  133. 185.11 s gammaloop-nextest-integration> span t{span_context=true current=subgraph=y, topo_order=1, dod=2 given=subgraph=0, topo_order=0, dod=0}
  134. 185.11 s gammaloop-nextest-integration> [2026-09-02 17:40:18.911] @approx::local_4d [{#profile, #uv, #gamma, #integrated, #start, #trace, #vakint}] DEBUG : After gamma simplification
  135. 185.11 s gammaloop-nextest-integration> ... omitted 3263 more lines; see full nextest output above
  136. 185.11 s gammaloop-nextest-integration>
  137. 185.11 s gammaloop-nextest-integration> 8. gammaloop-integration-tests::uv::sunrise_scalar_1_uv
  138. 185.13 s gammaloop-nextest-integration> failure: test failure with exit code 101
  139. 185.13 s gammaloop-nextest-integration> system-out
  140. 185.13 s gammaloop-nextest-integration> running 1 test
  141. 185.13 s gammaloop-nextest-integration> test sunrise_scalar_1_uv has been running for over 60 seconds
  142. 185.13 s gammaloop-nextest-integration> +------------------+------------------------+--------------+--------+----------+----------------------------------------------------------------------------------------------------------------------+-------+
  143. 185.13 s gammaloop-nextest-integration> | case | check | graph | status | sigma | threshold | error |
  144. 185.13 s gammaloop-nextest-integration> +------------------+------------------------+--------------+--------+----------+----------------------------------------------------------------------------------------------------------------------+-------+
  145. 185.13 s gammaloop-nextest-integration> | sunrise_scalar_1 | uv_profile | - | FAIL | - | - | - |
  146. 185.13 s gammaloop-nextest-integration> +------------------+------------------------+--------------+--------+----------+----------------------------------------------------------------------------------------------------------------------+-------+
  147. 185.13 s gammaloop-nextest-integration> | sunrise_scalar_1 | m_uv.inspect | inspect | pass | - | best inspect relative delta 1.624e0 >= 1000*accuracy 1.000e-3 (accuracy=1.000e-6, exponent=+1.0, seed=1, probes=10) | - |
  148. 185.13 s gammaloop-nextest-integration> +------------------+------------------------+--------------+--------+----------+----------------------------------------------------------------------------------------------------------------------+-------+
  149. 185.13 s gammaloop-nextest-integration> | sunrise_scalar_1 | m_uv.integrated | sunrise | pass | 0.1sigma | compatible within 2sigma | - |
  150. 185.13 s gammaloop-nextest-integration> +------------------+------------------------+--------------+--------+----------+----------------------------------------------------------------------------------------------------------------------+-------+
  151. 185.13 s gammaloop-nextest-integration> | sunrise_scalar_1 | rls.inspect | inspect | pass | - | best inspect relative delta 8.682e-1 >= 1000*accuracy 1.000e-3 (accuracy=1.000e-6, exponent=+1.0, seed=1, probes=10) | - |
  152. 185.13 s gammaloop-nextest-integration> +------------------+------------------------+--------------+--------+----------+----------------------------------------------------------------------------------------------------------------------+-------+
  153. 185.13 s gammaloop-nextest-integration> | sunrise_scalar_1 | rls.integrated | sunrise | pass | 0.0sigma | compatible within 2sigma | - |
  154. 185.13 s gammaloop-nextest-integration> +------------------+------------------------+--------------+--------+----------+----------------------------------------------------------------------------------------------------------------------+-------+
  155. 185.13 s gammaloop-nextest-integration> | sunrise_scalar_1 | mu_r.inspect | inspect | pass | - | best inspect relative delta 1.752e0 >= 1000*accuracy 1.000e-3 (accuracy=1.000e-6, exponent=+1.0, seed=1, probes=10) | - |
  156. 185.13 s gammaloop-nextest-integration> +------------------+------------------------+--------------+--------+----------+----------------------------------------------------------------------------------------------------------------------+-------+
  157. 185.13 s gammaloop-nextest-integration> | sunrise_scalar_1 | integrated.relerr | integrated | pass | - | relative error 9.20% <= 10.00% | - |
  158. 185.13 s gammaloop-nextest-integration> +------------------+------------------------+--------------+--------+----------+----------------------------------------------------------------------------------------------------------------------+-------+
  159. 185.13 s gammaloop-nextest-integration> | sunrise_scalar_1 | m_uv.integrated.relerr | m_uv-shifted | pass | - | relative error 5.89% <= 10.00% | - |
  160. 185.13 s gammaloop-nextest-integration> +------------------+------------------------+--------------+--------+----------+----------------------------------------------------------------------------------------------------------------------+-------+
  161. 185.13 s gammaloop-nextest-integration> | sunrise_scalar_1 | target | - | pass | - | 2sigma | - |
  162. 185.13 s gammaloop-nextest-integration> +------------------+------------------------+--------------+--------+----------+----------------------------------------------------------------------------------------------------------------------+-------+
  163. 185.13 s gammaloop-nextest-integration> test sunrise_scalar_1_uv ... FAILED
  164. 185.13 s gammaloop-nextest-integration>
  165. 185.13 s gammaloop-nextest-integration> failures:
  166. 185.13 s gammaloop-nextest-integration>
  167. 185.13 s gammaloop-nextest-integration> failures:
  168. 185.13 s gammaloop-nextest-integration> sunrise_scalar_1_uv
  169. 185.13 s gammaloop-nextest-integration>
  170. 185.13 s gammaloop-nextest-integration> test result: FAILED. 0 passed; 1 failed; 0 ignored; 0 measured; 24 filtered out; finished in 86.96s
  171. 185.14 s gammaloop-nextest-integration> system-err
  172. 185.14 s gammaloop-nextest-integration> [2026-09-02 17:40:23.306] @gammaloop_api::se... INFO : Running command run generate
  173. 185.14 s gammaloop-nextest-integration> [2026-09-02 17:40:23.306] @gammaloop_api::se... INFO : Starting command block generate
  174. 185.14 s gammaloop-nextest-integration> [2026-09-02 17:40:23.306] @gammaloop_api::se... INFO : Running command import model scalars-default.json
  175. 185.14 s gammaloop-nextest-integration> [2026-09-02 17:40:23.306] @import::model INFO : Loading built-in JSON model scalars-default
  176. 185.14 s gammaloop-nextest-integration> [2026-09-02 17:40:23.312] @gammalooprs::model INFO : The following 2 external parameters were forced to zero by the restriction card:
  177. 185.14 s gammaloop-nextest-integration> width_scalar_1, width_scalar_2
  178. 185.14 s gammaloop-nextest-integration> [2026-09-02 17:40:23.313] @gammaloop_api::se... INFO : Running command remove processes
  179. 185.14 s gammaloop-nextest-integration> [2026-09-02 17:40:23.313] @gammaloop_api::se... INFO : Running command set global kv global.generation.uv.generate_integrated=true
  180. 185.14 s gammaloop-nextest-integration> [2026-09-02 17:40:23.313] @gammaloop_api::se... INFO : Running command import graphs ./tests/resources/graphs/scalar_sunrise.dot -p sunrise_scalar_1 -i scalar_sunrise
  181. 185.14 s gammaloop-nextest-integration> [2026-09-02 17:40:23.313] @commands::import INFO : Loading graphs from '/build/source/tests/resources/graphs/scalar_sunrise.dot'
  182. 185.14 s gammaloop-nextest-integration> [2026-09-02 17:40:23.317] @gammaloop_api::se... INFO : Running command generate existing -p sunrise_scalar_1 -i scalar_sunrise
  183. 185.14 s gammaloop-nextest-integration> [2026-09-02 17:40:23.319] @approx::local_4d [{#uv, #inspect, #integrated}] DEBUG : Rescaled momenta expanded
  184. 185.14 s gammaloop-nextest-integration> field value
  185. 185.14 s gammaloop-nextest-integration> res n-terms: 1, byte size: 611,expr:
  186. 185.14 s gammaloop-nextest-integration> 1/(denom(0,q₀/t,mass_scalar_1²,-mass_scalar_1²+(q₀.q₀)/t²)
  187. 185.14 s gammaloop-nextest-integration> ·denom(1,-q₂+q₃-q₀/t,mass_scalar_1²,
  188. 185.14 s gammaloop-nextest-integration> -mass_scalar_1²+2·(q₀.q₂)/t-2·(q₀.q₃)/t+(q₀.q₀)/t²+(q₂.q₂)
  189. 185.14 s gammaloop-nextest-integration> -2·(q₂.q₃)+(q₃.q₃)
  190. 185.14 s gammaloop-nextest-integration> ))
  191. 185.14 s gammaloop-nextest-integration> [2026-09-02 17:40:23.323] @approx::local_4d [{#uv, #inspect, #integrated}] DEBUG : Rescaled momenta expanded
  192. 185.14 s gammaloop-nextest-integration> field value
  193. 185.14 s gammaloop-nextest-integration> res n-terms: 1, byte size: 3,expr:
  194. 185.14 s gammaloop-nextest-integration> 1
  195. 185.14 s gammaloop-nextest-integration> [2026-09-02 17:40:23.324] @approx::local_4d [{#uv, #inspect, #integrated}] DEBUG : Rescaled momenta expanded
  196. 185.14 s gammaloop-nextest-integration> field value
  197. 185.14 s gammaloop-nextest-integration> res n-terms: 1, byte size: 611,expr:
  198. 185.14 s gammaloop-nextest-integration> 1/(denom(1,q₁/t,mass_scalar_1²,-mass_scalar_1²+(q₁.q₁)/t²)
  199. 185.14 s gammaloop-nextest-integration> ·denom(2,-q₀+q₃-q₁/t,mass_scalar_1²,
  200. 185.14 s gammaloop-nextest-integration> -mass_scalar_1²+2·(q₀.q₁)/t-2·(q₁.q₃)/t+(q₁.q₁)/t²+(q₀.q₀)
  201. 185.14 s gammaloop-nextest-integration> -2·(q₀.q₃)+(q₃.q₃)
  202. 185.14 s gammaloop-nextest-integration> ))
  203. 185.14 s gammaloop-nextest-integration> [2026-09-02 17:40:23.328] @approx::local_4d [{#uv, #inspect, #integrated}] DEBUG : Rescaled momenta expanded
  204. 185.14 s gammaloop-nextest-integration> field value
  205. 185.14 s gammaloop-nextest-integration> res n-terms: 1, byte size: 777,expr:
  206. 185.14 s gammaloop-nextest-integration> 1/(denom(0,q₀/t,mass_scalar_1²,-mass_scalar_1²+(q₀.q₀)/t²)·denom(1,q₁/t,mass_scalar_1²,-mass_scalar_1²+(q₁.q₁)/t²)
  207. 185.14 s gammaloop-nextest-integration> ·denom(2,q₄-q₀/t-q₁/t,mass_scalar_1²,
  208. 185.14 s gammaloop-nextest-integration> -mass_scalar_1²-2·(q₀.q₄)/t-2·(q₁.q₄)/t+(q₀.q₀)/t²+2·(q₀.q₁)/t²
  209. 185.14 s gammaloop-nextest-integration> +(q₁.q₁)/t²+(q₄.q₄)
  210. 185.14 s gammaloop-nextest-integration> ))
  211. 185.14 s gammaloop-nextest-integration> [2026-09-02 17:40:23.330] @approx::local_4d [{#uv, #inspect, #integrated}] DEBUG : Rescaled momenta expanded
  212. 185.14 s gammaloop-nextest-integration> field value
  213. 185.14 s gammaloop-nextest-integration> res n-terms: 1, byte size: 611,expr:
  214. 185.14 s gammaloop-nextest-integration> 1/(denom(0,q₀/t,mass_scalar_1²,-mass_scalar_1²+(q₀.q₀)/t²)
  215. 185.14 s gammaloop-nextest-integration> ·denom(2,-q₁+q₃-q₀/t,mass_scalar_1²,
  216. 185.14 s gammaloop-nextest-integration> -mass_scalar_1²+2·(q₀.q₁)/t-2·(q₀.q₃)/t+(q₀.q₀)/t²+(q₁.q₁)
  217. 185.14 s gammaloop-nextest-integration> -2·(q₁.q₃)+(q₃.q₃)
  218. 185.14 s gammaloop-nextest-integration> ))
  219. 185.14 s gammaloop-nextest-integration> [2026-09-02 17:40:23.331] @approx::final_integrand[{#generation, #profile, #uv, #graph, #summary}] DEBUG : Computed global numerator
  220. 185.14 s gammaloop-nextest-integration> field value
  221. 185.14 s gammaloop-nextest-integration> global_num n-terms: 1, byte size: 3,expr:
  222. 185.14 s gammaloop-nextest-integration> 1
  223. 185.14 s gammaloop-nextest-integration> span build_3d{span_context=true graph=sunrise current=subgraph=0, topo_order=0, dod=0}
  224. 185.14 s gammaloop-nextest-integration> [2026-09-02 17:40:23.332] @uv::approx [{#generation, #uv, #fourd}] DEBUG : Computing 4D
  225. 185.14 s gammaloop-nextest-integration> field value
  226. 185.14 s gammaloop-nextest-integration> simple subgraph(S_47,S_y)*Approx(subgraph(S_y,0)) of sunrise
  227. 185.14 s gammaloop-nextest-integration> span compute_4d{span_context=true graph=sunrise current=subgraph=y, topo_order=1, dod=0 given=subgraph=0, topo_order=0, dod=0 reduced=SubSet { set: BitVec<usize, bitvec::order::Lsb0> { addr: 0x7fffec00e420, head: 000000, bits: 8, capacity: 64 } [0, 0, 1, 1, 1, 1, 0, 0], id: PhantomData<linnet::half_edge::involution::Hedge> }}
  228. 185.14 s gammaloop-nextest-integration> [2026-09-02 17:40:23.333] @approx::local_4d [{#uv, #algebra, #integrated, #start}] DEBUG :
  229. 185.14 s gammaloop-nextest-integration> field value
  230. 185.14 s gammaloop-nextest-integration> integrand n-terms: 1, byte size: 217,expr:
  231. 185.14 s gammaloop-nextest-integration> 1/(denom(0,q₀,mass_scalar_1²,-mass_scalar_1²+(q₀.q₀))·denom(1,q₁,mass_scalar_1²,-mass_scalar_1²+(q₁.q₁)))
  232. 185.14 s gammaloop-nextest-integration> reduced y
  233. 185.14 s gammaloop-nextest-integration> span grow{span_context=true current=subgraph=y, topo_order=1, dod=0 given=subgraph=0, topo_order=0, dod=0}
  234. 185.14 s gammaloop-nextest-integration> [2026-09-02 17:40:23.333] @approx::local_4d [{#uv, #inspect, #integrated}] DEBUG : Rescaled momenta expanded
  235. 185.14 s gammaloop-nextest-integration> field value
  236. 185.14 s gammaloop-nextest-integration> res n-terms: 1, byte size: 611,expr:
  237. 185.14 s gammaloop-nextest-integration> 1/(denom(0,q₀/t,mass_scalar_1²,-mass_scalar_1²+(q₀.q₀)/t²)
  238. 185.14 s gammaloop-nextest-integration> ·denom(1,-q₂+q₃-q₀/t,mass_scalar_1²,
  239. 185.14 s gammaloop-nextest-integration> -mass_scalar_1²+2·(q₀.q₂)/t-2·(q₀.q₃)/t+(q₀.q₀)/t²+(q₂.q₂)
  240. 185.14 s gammaloop-nextest-integration> -2·(q₂.q₃)+(q₃.q₃)
  241. 185.14 s gammaloop-nextest-integration> ))
  242. 185.14 s gammaloop-nextest-integration> span t{span_context=true current=subgraph=y, topo_order=1, dod=0 given=subgraph=0, topo_order=0, dod=0}
  243. 185.14 s gammaloop-nextest-integration> [2026-09-02 17:40:23.333] @approx::local_4d [{#uv, #integrated, #rescaled}] DEBUG : Rescaled expanded
  244. 185.14 s gammaloop-nextest-integration> field value
  245. 185.14 s gammaloop-nextest-integration> n_loops 1
  246. 185.14 s gammaloop-nextest-integration> res n-terms: 1, byte size: 723,expr:
  247. 185.14 s gammaloop-nextest-integration> 1/(denom(0,q₀,mUVexp²+t²·mass_scalar_1²,-mUV²+t²·(-mass_scalar_1²+(q₀.q₀)/t²)+t²·mUVexp²)
  248. 185.14 s gammaloop-nextest-integration> ·denom(1,-q₀,mUVexp²+t²·mass_scalar_1²,
  249. 185.14 s gammaloop-nextest-integration> -mUV²
  250. 185.14 s gammaloop-nextest-integration> +t²
  251. 185.14 s gammaloop-nextest-integration> ·(-mass_scalar_1²+2·(q₀.q₂)/t-2·(q₀.q₃)/t+(q₀.q₀)/t²+(q₂.q₂)
  252. 185.14 s gammaloop-nextest-integration> -2·(q₂.q₃)+(q₃.q₃)
  253. 185.14 s gammaloop-nextest-integration> )
  254. 185.14 s gammaloop-nextest-integration> +t²·mUVexp²
  255. 185.14 s gammaloop-nextest-integration> ))
  256. 185.14 s gammaloop-nextest-integration> span t{span_context=true current=subgraph=y, topo_order=1, dod=0 given=subgraph=0, topo_order=0, dod=0}
  257. 185.14 s gammaloop-nextest-integration> [2026-09-02 17:40:23.333] @approx::local_4d [{#uv, #integrated, #series}] DEBUG : Series expanded
  258. 185.14 s gammaloop-nextest-integration> field value
  259. 185.14 s gammaloop-nextest-integration> res n-terms: 1, byte size: 223,expr:
  260. 185.14 s gammaloop-nextest-integration> 1/(denom(0,q₀,mUVexp²,-mUV²+(q₀.q₀))·denom(1,-q₀,mUVexp²,-mUV²+(q₀.q₀)))
  261. 185.14 s gammaloop-nextest-integration> span t{span_context=true current=subgraph=y, topo_order=1, dod=0 given=subgraph=0, topo_order=0, dod=0}
  262. 185.14 s gammaloop-nextest-integration> [2026-09-02 17:40:23.333] @approx::local_4d [{#uv, #integrated, #series}] DEBUG : Evaluated at t = 1
  263. 185.14 s gammaloop-nextest-integration> field value
  264. 185.14 s gammaloop-nextest-integration> res n-terms: 1, byte size: 223,expr:
  265. 185.14 s gammaloop-nextest-integration> 1/(denom(0,q₀,mUVexp²,-mUV²+(q₀.q₀))·denom(1,-q₀,mUVexp²,-mUV²+(q₀.q₀)))
  266. 185.14 s gammaloop-nextest-integration> span t{span_context=true current=subgraph=y, topo_order=1, dod=0 given=subgraph=0, topo_order=0, dod=0}
  267. 185.14 s gammaloop-nextest-integration> [2026-09-02 17:40:23.334] @approx::local_4d [{#uv, #collect, #integrated}] DEBUG : After gamma chain collection
  268. 185.14 s gammaloop-nextest-integration> field value
  269. 185.14 s gammaloop-nextest-integration> expr n-terms: 1, byte size: 223,expr:
  270. 185.14 s gammaloop-nextest-integration> 1/(denom(0,q₀,mUVexp²,-mUV²+(q₀.q₀))·denom(1,-q₀,mUVexp²,-mUV²+(q₀.q₀)))
  271. 185.14 s gammaloop-nextest-integration> span t{span_context=true current=subgraph=y, topo_order=1, dod=0 given=subgraph=0, topo_order=0, dod=0}
  272. 185.14 s gammaloop-nextest-integration> [2026-09-02 17:40:23.334] @approx::local_4d [{#profile, #uv, #collect, #integrated, #start, #trace}] DEBUG : After gamma schoonschip
  273. 185.14 s gammaloop-nextest-integration> field value
  274. 185.14 s gammaloop-nextest-integration> expr n-terms: 1, byte size: 223,expr:
  275. 185.14 s gammaloop-nextest-integration> 1/(denom(0,q₀,mUVexp²,-mUV²+(q₀.q₀))·denom(1,-q₀,mUVexp²,-mUV²+(q₀.q₀)))
  276. 185.14 s gammaloop-nextest-integration> span t{span_context=true current=subgraph=y, topo_order=1, dod=0 given=subgraph=0, topo_order=0, dod=0}
  277. 185.14 s gammaloop-nextest-integration> [2026-09-02 17:40:23.335] @approx::local_4d [{#profile, #uv, #collect, #integrated, #start, #trace}] DEBUG : After gamma collection
  278. 185.14 s gammaloop-nextest-integration> field value
  279. 185.14 s gammaloop-nextest-integration> expr n-terms: 1, byte size: 223,expr:
  280. 185.14 s gammaloop-nextest-integration> 1/(denom(0,q₀,mUVexp²,-mUV²+(q₀.q₀))·denom(1,-q₀,mUVexp²,-mUV²+(q₀.q₀)))
  281. 185.14 s gammaloop-nextest-integration> span t{span_context=true current=subgraph=y, topo_order=1, dod=0 given=subgraph=0, topo_order=0, dod=0}
  282. 185.14 s gammaloop-nextest-integration> [2026-09-02 17:40:23.335] @approx::local_4d [{#profile, #uv, #gamma, #integrated, #start, #trace, #vakint}] DEBUG : After gamma simplification
  283. 185.14 s gammaloop-nextest-integration> field value
  284. 185.14 s gammaloop-nextest-integration> expr n-terms: 1, byte size: 223,expr:
  285. 185.14 s gammaloop-nextest-integration> 1/(denom(0,q₀,mUVexp²,-mUV²+(q₀.q₀))·denom(1,-q₀,mUVexp²,-mUV²+(q₀.q₀)))
  286. 185.14 s gammaloop-nextest-integration> span t{span_context=true current=subgraph=y, topo_order=1, dod=0 given=subgraph=0, topo_order=0, dod=0}
  287. 185.14 s gammaloop-nextest-integration> [2026-09-02 17:40:23.335] @approx::local_4d [{#profile, #uv, #integrated, #schoonschip, #start, #trace, #vakint}] DEBUG : After Schoonschip net
  288. 185.14 s gammaloop-nextest-integration> field value
  289. 185.14 s gammaloop-nextest-integration> expr n-terms: 1, byte size: 223,expr:
  290. 185.14 s gammaloop-nextest-integration> 1/(denom(0,q₀,mUVexp²,-mUV²+(q₀.q₀))·denom(1,-q₀,mUVexp²,-mUV²+(q₀.q₀)))
  291. 185.14 s gammaloop-nextest-integration> ... omitted 20090 more lines; see full nextest output above
  292. 185.14 s gammaloop-nextest-integration>
  293. 185.14 s gammaloop-nextest-integration> 9. gammaloop-integration-tests::uv::se1l_uv
  294. 185.14 s gammaloop-nextest-integration> failure: test failure with exit code 101
  295. 185.14 s gammaloop-nextest-integration> system-out
  296. 185.14 s gammaloop-nextest-integration> running 1 test
  297. 185.14 s gammaloop-nextest-integration> test se1l_uv has been running for over 60 seconds
  298. 185.14 s gammaloop-nextest-integration> +------+-----------------+---------+--------+----------+-----------------------------------------------------------------------------------------------------------------------+-------+
  299. 185.14 s gammaloop-nextest-integration> | case | check | graph | status | sigma | threshold | error |
  300. 185.14 s gammaloop-nextest-integration> +------+-----------------+---------+--------+----------+-----------------------------------------------------------------------------------------------------------------------+-------+
  301. 185.14 s gammaloop-nextest-integration> | se1l | uv_profile | - | FAIL | - | - | - |
  302. 185.14 s gammaloop-nextest-integration> +------+-----------------+---------+--------+----------+-----------------------------------------------------------------------------------------------------------------------+-------+
  303. 185.14 s gammaloop-nextest-integration> | se1l | m_uv.inspect | inspect | pass | - | best inspect relative delta 1.097e-1 >= 1000*accuracy 1.000e-7 (accuracy=1.000e-10, exponent=+2.0, seed=1, probes=10) | - |
  304. 185.14 s gammaloop-nextest-integration> +------+-----------------+---------+--------+----------+-----------------------------------------------------------------------------------------------------------------------+-------+
  305. 185.14 s gammaloop-nextest-integration> | se1l | m_uv.integrated | se1l | pass | 0.1sigma | compatible within 2sigma | - |
  306. 185.14 s gammaloop-nextest-integration> +------+-----------------+---------+--------+----------+-----------------------------------------------------------------------------------------------------------------------+-------+
  307. 185.14 s gammaloop-nextest-integration> | se1l | rls.inspect | inspect | pass | - | best inspect relative delta 4.499e-2 >= 1000*accuracy 1.000e-7 (accuracy=1.000e-10, exponent=+2.0, seed=1, probes=10) | - |
  308. 185.14 s gammaloop-nextest-integration> +------+-----------------+---------+--------+----------+-----------------------------------------------------------------------------------------------------------------------+-------+
  309. 185.14 s gammaloop-nextest-integration> | se1l | rls.integrated | se1l | pass | 0.0sigma | compatible within 2sigma | - |
  310. 185.14 s gammaloop-nextest-integration> +------+-----------------+---------+--------+----------+-----------------------------------------------------------------------------------------------------------------------+-------+
  311. 185.14 s gammaloop-nextest-integration> | se1l | mu_r.inspect | inspect | pass | - | best inspect relative delta 1.424e-1 >= 1000*accuracy 1.000e-7 (accuracy=1.000e-10, exponent=+2.0, seed=1, probes=10) | - |
  312. 185.14 s gammaloop-nextest-integration> +------+-----------------+---------+--------+----------+-----------------------------------------------------------------------------------------------------------------------+-------+
  313. 185.14 s gammaloop-nextest-integration> | se1l | target | - | pass | - | 2sigma | - |
  314. 185.14 s gammaloop-nextest-integration> +------+-----------------+---------+--------+----------+-----------------------------------------------------------------------------------------------------------------------+-------+
  315. 185.14 s gammaloop-nextest-integration> test se1l_uv ... FAILED
  316. 185.14 s gammaloop-nextest-integration>
  317. 185.14 s gammaloop-nextest-integration> failures:
  318. 185.14 s gammaloop-nextest-integration>
  319. 185.14 s gammaloop-nextest-integration> failures:
  320. 185.14 s gammaloop-nextest-integration> se1l_uv
  321. 185.14 s gammaloop-nextest-integration>
  322. 185.14 s gammaloop-nextest-integration> test result: FAILED. 0 passed; 1 failed; 0 ignored; 0 measured; 24 filtered out; finished in 95.37s
  323. 185.14 s gammaloop-nextest-integration> system-err
  324. 185.14 s gammaloop-nextest-integration> [2026-09-02 17:40:22.775] @gammaloop_api::se... INFO : Running command run generate
  325. 185.14 s gammaloop-nextest-integration> [2026-09-02 17:40:22.775] @gammaloop_api::se... INFO : Starting command block generate
  326. 185.14 s gammaloop-nextest-integration> [2026-09-02 17:40:22.776] @gammaloop_api::se... INFO : Running command import model sm-default
  327. 185.14 s gammaloop-nextest-integration> [2026-09-02 17:40:22.776] @import::model INFO : Loading built-in JSON model sm-default
  328. 185.14 s gammaloop-nextest-integration> [2026-09-02 17:40:22.801] @gammalooprs::model INFO : The following 11 external parameters were forced to zero by the restriction card:
  329. 185.14 s gammaloop-nextest-integration> lamWS, AWS, rhoWS, etaWS, ymc, yme, ymm, MC, Me, MM, WTau
  330. 185.14 s gammaloop-nextest-integration> [2026-09-02 17:40:22.802] @gammalooprs::model INFO : The following 34 vertex rules were removed by the restriction card:
  331. 185.14 s gammaloop-nextest-integration> V_82 -> (c~, d, G+) | V_83 -> (t~, d, G+) | V_84 -> (c~, s, G+) | V_85 -> (t~, s, G+) | V_86 -> (u~, b, G+) | V_87 -> (c~, b, G+) | V_90 -> (c~, d, W+) | V_91 -> (t~, d, W+) | V_92 -> (u~, s, W+) | V_94 -> (t~, s, W+) | V_95 -> (u~, b, W+) | V_96 -> (c~, b, W+) | V_101 -> (e+, e-, G0) | V_102 -> (mu+, mu-, G0) | V_104 -> (e+, e-, H) | V_105 -> (mu+, mu-, H) | V_110 -> (ve~, e-, G+) | V_111 -> (vm~, mu-, G+) | V_116 -> (b~, u, G-) | V_117 -> (d~, c, G-) | V_118 -> (s~, c, G-) | V_119 -> (b~, c, G-) | V_120 -> (d~, t, G-) | V_121 -> (s~, t, G-) | V_124 -> (s~, u, W-) | V_125 -> (b~, u, W-) | V_126 -> (d~, c, W-) | V_128 -> (b~, c, W-) | V_129 -> (d~, t, W-) | V_130 -> (s~, t, W-) | V_138 -> (c~, c, G0) | V_140 -> (c~, c, H) | V_145 -> (e+, ve, G-) | V_146 -> (mu+, vm, G-)
  332. 185.14 s gammaloop-nextest-integration> [2026-09-02 17:40:22.802] @gammalooprs::model INFO : The following 36 couplings were removed by the restriction card:
  333. 185.14 s gammaloop-nextest-integration> GC_13, GC_14, GC_16, GC_17, GC_18, GC_19, GC_20, GC_22, GC_23, GC_24, GC_25, GC_26, GC_28, GC_29, GC_42, GC_43, GC_44, GC_46, GC_47, GC_48, GC_84, GC_85, GC_86, GC_87, GC_88, GC_89, GC_90, GC_91, GC_92, GC_93, GC_101, GC_102, GC_103, GC_105, GC_106, GC_107
  334. 185.14 s gammaloop-nextest-integration> [2026-09-02 17:40:22.802] @gammaloop_api::se... INFO : Running command remove processes
  335. 185.14 s gammaloop-nextest-integration> [2026-09-02 17:40:22.802] @gammaloop_api::se... INFO : Running command set global kv global.generation.uv.generate_integrated=true
  336. 185.14 s gammaloop-nextest-integration> [2026-09-02 17:40:22.802] @gammaloop_api::se... INFO : Running command import graphs ./tests/resources/graphs/uv_tests/se1l.dot -p se1l -i se1l
  337. 185.14 s gammaloop-nextest-integration> [2026-09-02 17:40:22.803] @commands::import INFO : Loading graphs from '/build/source/tests/resources/graphs/uv_tests/se1l.dot'
  338. 185.14 s gammaloop-nextest-integration> [2026-09-02 17:40:22.805] @gammaloop_api::se... INFO : Running command generate existing -p se1l -i se1l
  339. 185.14 s gammaloop-nextest-integration> [2026-09-02 17:40:23.567] @commands::generate INFO :
  340. 185.14 s gammaloop-nextest-integration> Integrand generation summary
  341. 185.14 s gammaloop-nextest-integration> peak RAM 72.84 MiB | cores 1
  342. 185.14 s gammaloop-nextest-integration> ╭───────────┬───────┬─────────┬─────────────┬─────────────┬────────────────┬─────────────╮
  343. 185.14 s gammaloop-nextest-integration> │ integrand │ graph │ # evals │ expr build │ spenso │ symbolica eval │ compile │
  344. 185.14 s gammaloop-nextest-integration> ├───────────┼───────┼─────────┼─────────────┼─────────────┼────────────────┼─────────────┤
  345. 185.14 s gammaloop-nextest-integration> │ se1l │ se1l │ 5 │ 663ms (89%) │ 31ms (4.2%) │ 51ms (6.9%) │ 0ms (0.00%) │
  346. 185.14 s gammaloop-nextest-integration> ├───────────┼───────┼─────────┼─────────────┼─────────────┼────────────────┼─────────────┤
  347. 185.14 s gammaloop-nextest-integration> │ Total │ │ 5 │ 663ms (89%) │ 31ms (4.2%) │ 51ms (6.9%) │ 0ms (0.00%) │
  348. 185.14 s gammaloop-nextest-integration> ╰───────────┴───────┴─────────┴─────────────┴─────────────┴────────────────┴─────────────╯
  349. 185.14 s gammaloop-nextest-integration> [2026-09-02 17:40:23.568] @gammaloop_api::se... INFO : Running command set process -p se1l -i se1l kv general.m_uv=0.2
  350. 185.14 s gammaloop-nextest-integration> [2026-09-02 17:40:23.569] @gammaloop_api::se... INFO : Running command set process -p se1l -i se1l kv general.mu_r=0.2
  351. 185.14 s gammaloop-nextest-integration> [2026-09-02 17:40:23.570] @gammaloop_api::se... INFO : Running command set process -p se1l -i se1l kv general.renormalization_localization_scale=0.2
  352. 185.14 s gammaloop-nextest-integration> [2026-09-02 17:40:23.570] @gammaloop_api::se... INFO : Running command duplicate integrand -p se1l -i se1l --output_process_name se1l --output_integrand_name se1l_muv_shifted
  353. 185.14 s gammaloop-nextest-integration> [2026-09-02 17:40:23.571] @gammaloop_api::se... INFO : Running command set process -p se1l -i se1l_muv_shifted kv general.m_uv=0.5
  354. 185.14 s gammaloop-nextest-integration> [2026-09-02 17:40:23.572] @gammaloop_api::se... INFO : Running command duplicate integrand -p se1l -i se1l --output_process_name se1l --output_integrand_name se1l_rls_shifted
  355. 185.14 s gammaloop-nextest-integration> [2026-09-02 17:40:23.574] @gammaloop_api::se... INFO : Running command set process -p se1l -i se1l_rls_shifted kv general.renormalization_localization_scale=1
  356. 185.14 s gammaloop-nextest-integration> [2026-09-02 17:40:23.574] @gammaloop_api::se... INFO : Running command duplicate integrand -p se1l -i se1l --output_process_name se1l --output_integrand_name se1l_mur_shifted
  357. 185.14 s gammaloop-nextest-integration> [2026-09-02 17:40:23.576] @gammaloop_api::se... INFO : Running command set process -p se1l -i se1l_mur_shifted kv general.mu_r=0.8
  358. 185.14 s gammaloop-nextest-integration> [2026-09-02 17:40:23.581] @process::amplitude WARNING : External state 0 ('g', PDG 21, helicity +) is off shell: p^2 = +2.5e5, expected m^2 = +0e0 (|Δ| = +2.5e5). Fixed-helicity spinor/vector/tensor external states may be ill-defined at this kinematic point.
  359. 185.14 s gammaloop-nextest-integration> field value
  360. 185.14 s gammaloop-nextest-integration> span warm_up{integrand.name=se1l}
  361. 185.14 s gammaloop-nextest-integration> [2026-09-02 17:40:23.581] @process::amplitude WARNING : External state 1 ('g', PDG 21, helicity -) is off shell: p^2 = +2.5e5, expected m^2 = +0e0 (|Δ| = +2.5e5). Fixed-helicity spinor/vector/tensor external states may be ill-defined at this kinematic point.
  362. 185.14 s gammaloop-nextest-integration> field value
  363. 185.14 s gammaloop-nextest-integration> span warm_up{integrand.name=se1l}
  364. 185.14 s gammaloop-nextest-integration> [2026-09-02 17:40:23.581] @process::amplitude INFO : Input is above threshold: 1 existing threshold E-surfaces across 1/1 graph groups
  365. 185.14 s gammaloop-nextest-integration> field value
  366. 185.14 s gammaloop-nextest-integration> existing_esurfaces 1
  367. 185.14 s gammaloop-nextest-integration> group_count 1
  368. 185.14 s gammaloop-nextest-integration> groups_above_threshold 1
  369. 185.14 s gammaloop-nextest-integration> integrand se1l
  370. 185.14 s gammaloop-nextest-integration> span warm_up{integrand.name=se1l}
  371. 185.14 s gammaloop-nextest-integration> threshold_status above threshold
  372. 185.14 s gammaloop-nextest-integration> [2026-09-02 17:40:23.581] @process::amplitude INFO : overlap structure of group 0: [1: [0(2,3)]]
  373. 185.14 s gammaloop-nextest-integration> field value
  374. 185.14 s gammaloop-nextest-integration> span warm_up{integrand.name=se1l}
  375. 185.14 s gammaloop-nextest-integration> [2026-09-02 17:40:23.726] @commands::profile INFO :
  376. 185.14 s gammaloop-nextest-integration> ╭───────┬──────┬──────────┬───────┬─────┬──────────┬───────────╮
  377. 185.14 s gammaloop-nextest-integration> │ fixed │ → ∞ │ slope │ r2 │ DOD │ bare DOD │ inspect │
  378. 185.14 s gammaloop-nextest-integration> ├───────┼──────┼──────────┼───────┼─────┼──────────┼───────────┤
  379. 185.14 s gammaloop-nextest-integration> │ {} │ {e3} │ 1.639236 │ 0.904 │ 2 │ 2 │ arb retry │
  380. 185.14 s gammaloop-nextest-integration> │ {} │ {e2} │ 1.698834 │ 0.902 │ 2 │ 2 │ arb retry │
  381. 185.14 s gammaloop-nextest-integration> ╰───────┴──────┴──────────┴───────┴─────┴──────────┴───────────╯
  382. 185.14 s gammaloop-nextest-integration> [2026-09-02 17:40:23.726] @commands::profile INFO :
  383. 185.14 s gammaloop-nextest-integration> ╭───────┬──────┬─────────────┬──────────┬───────┬─────┬──────────┬───────────╮
  384. 185.14 s gammaloop-nextest-integration> │ fixed │ → ∞ │ orientation │ slope │ r2 │ DOD │ bare DOD │ inspect │
  385. 185.14 s gammaloop-nextest-integration> ├───────┼──────┼─────────────┼──────────┼───────┼─────┼──────────┼───────────┤
  386. 185.14 s gammaloop-nextest-integration> │ {} │ {e3} │ 00-+ │ 0.343429 │ 0.145 │ 0 │ 2 │ arb retry │
  387. 185.14 s gammaloop-nextest-integration> │ {} │ {e3} │ 00+- │ 0.342577 │ 0.135 │ 0 │ 2 │ arb retry │
  388. 185.14 s gammaloop-nextest-integration> │ {} │ {e2} │ 00-+ │ 0.385975 │ 0.161 │ 0 │ 2 │ arb retry │
  389. 185.14 s gammaloop-nextest-integration> │ {} │ {e2} │ 00+- │ 0.384920 │ 0.192 │ 0 │ 2 │ arb retry │
  390. 185.14 s gammaloop-nextest-integration> ╰───────┴──────┴─────────────┴──────────┴───────┴─────┴──────────┴───────────╯
  391. 185.14 s gammaloop-nextest-integration> [2026-09-02 17:40:23.727] @gammaloop_api::se... INFO : Running command set process kv integrator.target_relative_accuracy=0.001 integrator.n_increase=0 integrator.n_start=50000 integrator.n_max=400000 integrator.seed=1337
  392. 185.14 s gammaloop-nextest-integration> [2026-09-02 17:40:23.728] @commands::integrate INFO : Created workspace directory at /build/source/tests/artifacts/se1l/integration_workspace_se1l
  393. 185.14 s gammaloop-nextest-integration> [2026-09-02 17:40:23.745] @commands::integrate INFO : No integration state found, starting new integration
  394. 185.14 s gammaloop-nextest-integration> [2026-09-02 17:40:23.745] @commands::integrate INFO : Gammaloop now integrates se1l@se1l, se1l@se1l_muv_shifted, se1l@se1l_rls_shifted
  395. 185.14 s gammaloop-nextest-integration> [2026-09-02 17:40:23.745] @process::amplitude WARNING : External state 0 ('g', PDG 21, helicity +) is off shell: p^2 = +2.5e5, expected m^2 = +0e0 (|Δ| = +2.5e5). Fixed-helicity spinor/vector/tensor external states may be ill-defined at this kinematic point.
  396. 185.14 s gammaloop-nextest-integration> field value
  397. 185.14 s gammaloop-nextest-integration> span warm_up{integrand.name=se1l}
  398. 185.14 s gammaloop-nextest-integration> [2026-09-02 17:40:23.745] @process::amplitude WARNING : External state 1 ('g', PDG 21, helicity -) is off shell: p^2 = +2.5e5, expected m^2 = +0e0 (|Δ| = +2.5e5). Fixed-helicity spinor/vector/tensor external states may be ill-defined at this kinematic point.
  399. 185.14 s gammaloop-nextest-integration> field value
  400. 185.14 s gammaloop-nextest-integration> span warm_up{integrand.name=se1l}
  401. 185.14 s gammaloop-nextest-integration> [2026-09-02 17:40:23.746] @process::amplitude INFO : Input is above threshold: 1 existing threshold E-surfaces across 1/1 graph groups
  402. 185.14 s gammaloop-nextest-integration> field value
  403. 185.14 s gammaloop-nextest-integration> existing_esurfaces 1
  404. 185.14 s gammaloop-nextest-integration> group_count 1
  405. 185.14 s gammaloop-nextest-integration> groups_above_threshold 1
  406. 185.14 s gammaloop-nextest-integration> integrand se1l
  407. 185.14 s gammaloop-nextest-integration> span warm_up{integrand.name=se1l}
  408. 185.14 s gammaloop-nextest-integration> threshold_status above threshold
  409. 185.14 s gammaloop-nextest-integration> [2026-09-02 17:40:23.746] @process::amplitude INFO : overlap structure of group 0: [1: [0(2,3)]]
  410. 185.14 s gammaloop-nextest-integration> field value
  411. 185.14 s gammaloop-nextest-integration> span warm_up{integrand.name=se1l}
  412. 185.14 s gammaloop-nextest-integration> [2026-09-02 17:40:23.746] @process::amplitude WARNING : External state 0 ('g', PDG 21, helicity +) is off shell: p^2 = +2.5e5, expected m^2 = +0e0 (|Δ| = +2.5e5). Fixed-helicity spinor/vector/tensor external states may be ill-defined at this kinematic point.
  413. 185.14 s gammaloop-nextest-integration> field value
  414. 185.14 s gammaloop-nextest-integration> span warm_up{integrand.name=se1l_muv_shifted}
  415. 185.14 s gammaloop-nextest-integration> [2026-09-02 17:40:23.746] @process::amplitude WARNING : External state 1 ('g', PDG 21, helicity -) is off shell: p^2 = +2.5e5, expected m^2 = +0e0 (|Δ| = +2.5e5). Fixed-helicity spinor/vector/tensor external states may be ill-defined at this kinematic point.
  416. 185.14 s gammaloop-nextest-integration> field value
  417. 185.14 s gammaloop-nextest-integration> span warm_up{integrand.name=se1l_muv_shifted}
  418. 185.14 s gammaloop-nextest-integration> [2026-09-02 17:40:23.747] @process::amplitude INFO : Input is above threshold: 1 existing threshold E-surfaces across 1/1 graph groups
  419. 185.14 s gammaloop-nextest-integration> field value
  420. 185.14 s gammaloop-nextest-integration> existing_esurfaces 1
  421. 185.14 s gammaloop-nextest-integration> group_count 1
  422. 185.14 s gammaloop-nextest-integration> groups_above_threshold 1
  423. 185.14 s gammaloop-nextest-integration> integrand se1l_muv_shifted
  424. 185.14 s gammaloop-nextest-integration> span warm_up{integrand.name=se1l_muv_shifted}
  425. 185.14 s gammaloop-nextest-integration> threshold_status above threshold
  426. 185.14 s gammaloop-nextest-integration> [2026-09-02 17:40:23.747] @process::amplitude INFO : overlap structure of group 0: [1: [0(2,3)]]
  427. 185.14 s gammaloop-nextest-integration> field value
  428. 185.14 s gammaloop-nextest-integration> span warm_up{integrand.name=se1l_muv_shifted}
  429. 185.14 s gammaloop-nextest-integration> [2026-09-02 17:40:23.748] @process::amplitude WARNING : External state 0 ('g', PDG 21, helicity +) is off shell: p^2 = +2.5e5, expected m^2 = +0e0 (|Δ| = +2.5e5). Fixed-helicity spinor/vector/tensor external states may be ill-defined at this kinematic point.
  430. 185.14 s gammaloop-nextest-integration> field value
  431. 185.14 s gammaloop-nextest-integration> span warm_up{integrand.name=se1l_rls_shifted}
  432. 185.14 s gammaloop-nextest-integration> [2026-09-02 17:40:23.748] @process::amplitude WARNING : External state 1 ('g', PDG 21, helicity -) is off shell: p^2 = +2.5e5, expected m^2 = +0e0 (|Δ| = +2.5e5). Fixed-helicity spinor/vector/tensor external states may be ill-defined at this kinematic point.
  433. 185.14 s gammaloop-nextest-integration> field value
  434. 185.14 s gammaloop-nextest-integration> span warm_up{integrand.name=se1l_rls_shifted}
  435. 185.14 s gammaloop-nextest-integration> [2026-09-02 17:40:23.748] @process::amplitude INFO : Input is above threshold: 1 existing threshold E-surfaces across 1/1 graph groups
  436. 185.14 s gammaloop-nextest-integration> field value
  437. 185.14 s gammaloop-nextest-integration> existing_esurfaces 1
  438. 185.14 s gammaloop-nextest-integration> group_count 1
  439. 185.14 s gammaloop-nextest-integration> groups_above_threshold 1
  440. 185.14 s gammaloop-nextest-integration> integrand se1l_rls_shifted
  441. 185.14 s gammaloop-nextest-integration> span warm_up{integrand.name=se1l_rls_shifted}
  442. 185.14 s gammaloop-nextest-integration> threshold_status above threshold
  443. 185.14 s gammaloop-nextest-integration> ... omitted 1410 more lines; see full nextest output above
  444. 185.14 s gammaloop-nextest-integration> =========================================
  445. 185.35 s error: Cannot build '/nix/store/zpyfjihmv7i6ghxwmb5sjv51y6brg4wy-gammaloop-nextest-integration.drv'.
  446. 185.35 s Reason: builder failed with exit code 100.
  447. 185.35 s Output paths:
  448. 185.35 s /nix/store/k1knsdpdly6yc14pxdqxjbszfxpz040p-gammaloop-nextest-integration
  449. 185.35 s Last 2048 log lines:
  450. 185.35 s > span warm_up{integrand.name=se1l_muv_shifted}
  451. 185.35 s > threshold_status above threshold
  452. 185.35 s > [2026-09-02 17:41:57.751] @process::amplitude INFO : overlap structure of group 0: [1: [0(2,3)]]
  453. 185.35 s > field value
  454. 185.35 s > span warm_up{integrand.name=se1l_muv_shifted}
  455. 185.35 s > [2026-09-02 17:41:57.754] @process::amplitude WARNING : External state 0 ('g', PDG 21, helicity +) is off shell: p^2 = +2.5e5, expected m^2 = +0e0 (|Δ| = +2.5e5). Fixed-helicity spinor/vector/tensor external states may be ill-defined at this kinematic point.
  456. 185.35 s > field value
  457. 185.35 s > span warm_up{integrand.name=se1l}
  458. 185.35 s > [2026-09-02 17:41:57.754] @process::amplitude WARNING : External state 1 ('g', PDG 21, helicity -) is off shell: p^2 = +2.5e5, expected m^2 = +0e0 (|Δ| = +2.5e5). Fixed-helicity spinor/vector/tensor external states may be ill-defined at this kinematic point.
  459. 185.35 s > field value
  460. 185.35 s > span warm_up{integrand.name=se1l}
  461. 185.35 s > [2026-09-02 17:41:57.754] @process::amplitude INFO : Input is above threshold: 1 existing threshold E-surfaces across 1/1 graph groups
  462. 185.35 s > field value
  463. 185.35 s > existing_esurfaces 1
  464. 185.35 s > group_count 1
  465. 185.35 s > groups_above_threshold 1
  466. 185.35 s > integrand se1l
  467. 185.35 s > span warm_up{integrand.name=se1l}
  468. 185.35 s > threshold_status above threshold
  469. 185.35 s > [2026-09-02 17:41:57.754] @process::amplitude INFO : overlap structure of group 0: [1: [0(2,3)]]
  470. 185.35 s > field value
  471. 185.35 s > span warm_up{integrand.name=se1l}
  472. 185.35 s > [2026-09-02 17:41:57.757] @process::amplitude WARNING : External state 0 ('g', PDG 21, helicity +) is off shell: p^2 = +2.5e5, expected m^2 = +0e0 (|Δ| = +2.5e5). Fixed-helicity spinor/vector/tensor external states may be ill-defined at this kinematic point.
  473. 185.35 s > field value
  474. 185.35 s > span warm_up{integrand.name=se1l_muv_shifted}
  475. 185.35 s > [2026-09-02 17:41:57.758] @process::amplitude WARNING : External state 1 ('g', PDG 21, helicity -) is off shell: p^2 = +2.5e5, expected m^2 = +0e0 (|Δ| = +2.5e5). Fixed-helicity spinor/vector/tensor external states may be ill-defined at this kinematic point.
  476. 185.35 s > field value
  477. 185.35 s > span warm_up{integrand.name=se1l_muv_shifted}
  478. 185.35 s > [2026-09-02 17:41:57.758] @process::amplitude INFO : Input is above threshold: 1 existing threshold E-surfaces across 1/1 graph groups
  479. 185.35 s > field value
  480. 185.35 s > existing_esurfaces 1
  481. 185.35 s > group_count 1
  482. 185.35 s > groups_above_threshold 1
  483. 185.35 s > integrand se1l_muv_shifted
  484. 185.35 s > span warm_up{integrand.name=se1l_muv_shifted}
  485. 185.35 s > threshold_status above threshold
  486. 185.35 s > [2026-09-02 17:41:57.758] @process::amplitude INFO : overlap structure of group 0: [1: [0(2,3)]]
  487. 185.35 s > field value
  488. 185.35 s > span warm_up{integrand.name=se1l_muv_shifted}
  489. 185.35 s > [2026-09-02 17:41:57.761] @process::amplitude WARNING : External state 0 ('g', PDG 21, helicity +) is off shell: p^2 = +2.5e5, expected m^2 = +0e0 (|Δ| = +2.5e5). Fixed-helicity spinor/vector/tensor external states may be ill-defined at this kinematic point.
  490. 185.35 s > field value
  491. 185.35 s > span warm_up{integrand.name=se1l}
  492. 185.35 s > [2026-09-02 17:41:57.761] @process::amplitude WARNING : External state 1 ('g', PDG 21, helicity -) is off shell: p^2 = +2.5e5, expected m^2 = +0e0 (|Δ| = +2.5e5). Fixed-helicity spinor/vector/tensor external states may be ill-defined at this kinematic point.
  493. 185.35 s > field value
  494. 185.35 s > span warm_up{integrand.name=se1l}
  495. 185.35 s > [2026-09-02 17:41:57.761] @process::amplitude INFO : Input is above threshold: 1 existing threshold E-surfaces across 1/1 graph groups
  496. 185.35 s > field value
  497. 185.35 s > existing_esurfaces 1
  498. 185.35 s > group_count 1
  499. 185.35 s > groups_above_threshold 1
  500. 185.35 s > integrand se1l
  501. 185.35 s > span warm_up{integrand.name=se1l}
  502. 185.35 s > threshold_status above threshold
  503. 185.35 s > [2026-09-02 17:41:57.761] @process::amplitude INFO : overlap structure of group 0: [1: [0(2,3)]]
  504. 185.35 s > field value
  505. 185.35 s > span warm_up{integrand.name=se1l}
  506. 185.35 s > [2026-09-02 17:41:57.764] @process::amplitude WARNING : External state 0 ('g', PDG 21, helicity +) is off shell: p^2 = +2.5e5, expected m^2 = +0e0 (|Δ| = +2.5e5). Fixed-helicity spinor/vector/tensor external states may be ill-defined at this kinematic point.
  507. 185.35 s > field value
  508. 185.35 s > span warm_up{integrand.name=se1l_muv_shifted}
  509. 185.35 s > [2026-09-02 17:41:57.764] @process::amplitude WARNING : External state 1 ('g', PDG 21, helicity -) is off shell: p^2 = +2.5e5, expected m^2 = +0e0 (|Δ| = +2.5e5). Fixed-helicity spinor/vector/tensor external states may be ill-defined at this kinematic point.
  510. 185.35 s > field value
  511. 185.35 s > span warm_up{integrand.name=se1l_muv_shifted}
  512. 185.35 s > [2026-09-02 17:41:57.764] @process::amplitude INFO : Input is above threshold: 1 existing threshold E-surfaces across 1/1 graph groups
  513. 185.35 s > field value
  514. 185.35 s > existing_esurfaces 1
  515. 185.35 s > group_count 1
  516. 185.35 s > groups_above_threshold 1
  517. 185.35 s > integrand se1l_muv_shifted
  518. 185.35 s > span warm_up{integrand.name=se1l_muv_shifted}
  519. 185.35 s > threshold_status above threshold
  520. 185.35 s > [2026-09-02 17:41:57.764] @process::amplitude INFO : overlap structure of group 0: [1: [0(2,3)]]
  521. 185.35 s > field value
  522. 185.35 s > span warm_up{integrand.name=se1l_muv_shifted}
  523. 185.35 s > [2026-09-02 17:41:57.768] @process::amplitude WARNING : External state 0 ('g', PDG 21, helicity +) is off shell: p^2 = +2.5e5, expected m^2 = +0e0 (|Δ| = +2.5e5). Fixed-helicity spinor/vector/tensor external states may be ill-defined at this kinematic point.
  524. 185.35 s > field value
  525. 185.35 s > span warm_up{integrand.name=se1l}
  526. 185.35 s > [2026-09-02 17:41:57.768] @process::amplitude WARNING : External state 1 ('g', PDG 21, helicity -) is off shell: p^2 = +2.5e5, expected m^2 = +0e0 (|Δ| = +2.5e5). Fixed-helicity spinor/vector/tensor external states may be ill-defined at this kinematic point.
  527. 185.35 s > field value
  528. 185.35 s > span warm_up{integrand.name=se1l}
  529. 185.35 s > [2026-09-02 17:41:57.768] @process::amplitude INFO : Input is above threshold: 1 existing threshold E-surfaces across 1/1 graph groups
  530. 185.35 s > field value
  531. 185.35 s > existing_esurfaces 1
  532. 185.35 s > group_count 1
  533. 185.35 s > groups_above_threshold 1
  534. 185.35 s > integrand se1l
  535. 185.35 s > span warm_up{integrand.name=se1l}
  536. 185.35 s > threshold_status above threshold
  537. 185.35 s > [2026-09-02 17:41:57.768] @process::amplitude INFO : overlap structure of group 0: [1: [0(2,3)]]
  538. 185.35 s > field value
  539. 185.35 s > span warm_up{integrand.name=se1l}
  540. 185.35 s > [2026-09-02 17:41:57.771] @process::amplitude WARNING : External state 0 ('g', PDG 21, helicity +) is off shell: p^2 = +2.5e5, expected m^2 = +0e0 (|Δ| = +2.5e5). Fixed-helicity spinor/vector/tensor external states may be ill-defined at this kinematic point.
  541. 185.35 s > field value
  542. 185.35 s > span warm_up{integrand.name=se1l_muv_shifted}
  543. 185.35 s > [2026-09-02 17:41:57.771] @process::amplitude WARNING : External state 1 ('g', PDG 21, helicity -) is off shell: p^2 = +2.5e5, expected m^2 = +0e0 (|Δ| = +2.5e5). Fixed-helicity spinor/vector/tensor external states may be ill-defined at this kinematic point.
  544. 185.35 s > field value
  545. 185.35 s > span warm_up{integrand.name=se1l_muv_shifted}
  546. 185.35 s > [2026-09-02 17:41:57.771] @process::amplitude INFO : Input is above threshold: 1 existing threshold E-surfaces across 1/1 graph groups
  547. 185.35 s > field value
  548. 185.35 s > existing_esurfaces 1
  549. 185.35 s > group_count 1
  550. 185.35 s > groups_above_threshold 1
  551. 185.35 s > integrand se1l_muv_shifted
  552. 185.35 s > span warm_up{integrand.name=se1l_muv_shifted}
  553. 185.35 s > threshold_status above threshold
  554. 185.35 s > [2026-09-02 17:41:57.771] @process::amplitude INFO : overlap structure of group 0: [1: [0(2,3)]]
  555. 185.35 s > field value
  556. 185.35 s > span warm_up{integrand.name=se1l_muv_shifted}
  557. 185.35 s > [2026-09-02 17:41:57.774] @process::amplitude WARNING : External state 0 ('g', PDG 21, helicity +) is off shell: p^2 = +2.5e5, expected m^2 = +0e0 (|Δ| = +2.5e5). Fixed-helicity spinor/vector/tensor external states may be ill-defined at this kinematic point.
  558. 185.35 s > field value
  559. 185.35 s > span warm_up{integrand.name=se1l}
  560. 185.35 s > [2026-09-02 17:41:57.774] @process::amplitude WARNING : External state 1 ('g', PDG 21, helicity -) is off shell: p^2 = +2.5e5, expected m^2 = +0e0 (|Δ| = +2.5e5). Fixed-helicity spinor/vector/tensor external states may be ill-defined at this kinematic point.
  561. 185.35 s > field value
  562. 185.35 s > span warm_up{integrand.name=se1l}
  563. 185.35 s > [2026-09-02 17:41:57.774] @process::amplitude INFO : Input is above threshold: 1 existing threshold E-surfaces across 1/1 graph groups
  564. 185.35 s > field value
  565. 185.35 s > existing_esurfaces 1
  566. 185.35 s > group_count 1
  567. 185.35 s > groups_above_threshold 1
  568. 185.35 s > integrand se1l
  569. 185.35 s > span warm_up{integrand.name=se1l}
  570. 185.35 s > threshold_status above threshold
  571. 185.35 s > [2026-09-02 17:41:57.774] @process::amplitude INFO : overlap structure of group 0: [1: [0(2,3)]]
  572. 185.35 s > field value
  573. 185.35 s > span warm_up{integrand.name=se1l}
  574. 185.35 s > [2026-09-02 17:41:57.778] @process::amplitude WARNING : External state 0 ('g', PDG 21, helicity +) is off shell: p^2 = +2.5e5, expected m^2 = +0e0 (|Δ| = +2.5e5). Fixed-helicity spinor/vector/tensor external states may be ill-defined at this kinematic point.
  575. 185.35 s > field value
  576. 185.35 s > span warm_up{integrand.name=se1l_rls_shifted}
  577. 185.35 s > [2026-09-02 17:41:57.778] @process::amplitude WARNING : External state 1 ('g', PDG 21, helicity -) is off shell: p^2 = +2.5e5, expected m^2 = +0e0 (|Δ| = +2.5e5). Fixed-helicity spinor/vector/tensor external states may be ill-defined at this kinematic point.
  578. 185.35 s > field value
  579. 185.35 s > span warm_up{integrand.name=se1l_rls_shifted}
  580. 185.35 s > [2026-09-02 17:41:57.778] @process::amplitude INFO : Input is above threshold: 1 existing threshold E-surfaces across 1/1 graph groups
  581. 185.35 s > field value
  582. 185.35 s > existing_esurfaces 1
  583. 185.35 s > group_count 1
  584. 185.35 s > groups_above_threshold 1
  585. 185.35 s > integrand se1l_rls_shifted
  586. 185.35 s > span warm_up{integrand.name=se1l_rls_shifted}
  587. 185.35 s > threshold_status above threshold
  588. 185.35 s > [2026-09-02 17:41:57.778] @process::amplitude INFO : overlap structure of group 0: [1: [0(2,3)]]
  589. 185.35 s > field value
  590. 185.35 s > span warm_up{integrand.name=se1l_rls_shifted}
  591. 185.35 s > [2026-09-02 17:41:57.781] @process::amplitude WARNING : External state 0 ('g', PDG 21, helicity +) is off shell: p^2 = +2.5e5, expected m^2 = +0e0 (|Δ| = +2.5e5). Fixed-helicity spinor/vector/tensor external states may be ill-defined at this kinematic point.
  592. 185.35 s > field value
  593. 185.35 s > span warm_up{integrand.name=se1l}
  594. 185.35 s > [2026-09-02 17:41:57.781] @process::amplitude WARNING : External state 1 ('g', PDG 21, helicity -) is off shell: p^2 = +2.5e5, expected m^2 = +0e0 (|Δ| = +2.5e5). Fixed-helicity spinor/vector/tensor external states may be ill-defined at this kinematic point.
  595. 185.35 s > field value
  596. 185.35 s > span warm_up{integrand.name=se1l}
  597. 185.35 s > [2026-09-02 17:41:57.781] @process::amplitude INFO : Input is above threshold: 1 existing threshold E-surfaces across 1/1 graph groups
  598. 185.35 s > field value
  599. 185.35 s > existing_esurfaces 1
  600. 185.35 s > group_count 1
  601. 185.35 s > groups_above_threshold 1
  602. 185.35 s > integrand se1l
  603. 185.35 s > span warm_up{integrand.name=se1l}
  604. 185.35 s > threshold_status above threshold
  605. 185.35 s > [2026-09-02 17:41:57.781] @process::amplitude INFO : overlap structure of group 0: [1: [0(2,3)]]
  606. 185.35 s > field value
  607. 185.35 s > span warm_up{integrand.name=se1l}
  608. 185.35 s > [2026-09-02 17:41:57.784] @process::amplitude WARNING : External state 0 ('g', PDG 21, helicity +) is off shell: p^2 = +2.5e5, expected m^2 = +0e0 (|Δ| = +2.5e5). Fixed-helicity spinor/vector/tensor external states may be ill-defined at this kinematic point.
  609. 185.35 s > field value
  610. 185.35 s > span warm_up{integrand.name=se1l_rls_shifted}
  611. 185.35 s > [2026-09-02 17:41:57.784] @process::amplitude WARNING : External state 1 ('g', PDG 21, helicity -) is off shell: p^2 = +2.5e5, expected m^2 = +0e0 (|Δ| = +2.5e5). Fixed-helicity spinor/vector/tensor external states may be ill-defined at this kinematic point.
  612. 185.35 s > field value
  613. 185.35 s > span warm_up{integrand.name=se1l_rls_shifted}
  614. 185.35 s > [2026-09-02 17:41:57.784] @process::amplitude INFO : Input is above threshold: 1 existing threshold E-surfaces across 1/1 graph groups
  615. 185.35 s > field value
  616. 185.35 s > existing_esurfaces 1
  617. 185.35 s > group_count 1
  618. 185.35 s > groups_above_threshold 1
  619. 185.35 s > integrand se1l_rls_shifted
  620. 185.35 s > span warm_up{integrand.name=se1l_rls_shifted}
  621. 185.35 s > threshold_status above threshold
  622. 185.35 s > [2026-09-02 17:41:57.784] @process::amplitude INFO : overlap structure of group 0: [1: [0(2,3)]]
  623. 185.35 s > field value
  624. 185.35 s > span warm_up{integrand.name=se1l_rls_shifted}
  625. 185.35 s > [2026-09-02 17:41:57.788] @process::amplitude WARNING : External state 0 ('g', PDG 21, helicity +) is off shell: p^2 = +2.5e5, expected m^2 = +0e0 (|Δ| = +2.5e5). Fixed-helicity spinor/vector/tensor external states may be ill-defined at this kinematic point.
  626. 185.35 s > field value
  627. 185.35 s > span warm_up{integrand.name=se1l}
  628. 185.35 s > [2026-09-02 17:41:57.788] @process::amplitude WARNING : External state 1 ('g', PDG 21, helicity -) is off shell: p^2 = +2.5e5, expected m^2 = +0e0 (|Δ| = +2.5e5). Fixed-helicity spinor/vector/tensor external states may be ill-defined at this kinematic point.
  629. 185.35 s > field value
  630. 185.35 s > span warm_up{integrand.name=se1l}
  631. 185.35 s > [2026-09-02 17:41:57.788] @process::amplitude INFO : Input is above threshold: 1 existing threshold E-surfaces across 1/1 graph groups
  632. 185.35 s > field value
  633. 185.35 s > existing_esurfaces 1
  634. 185.35 s > group_count 1
  635. 185.35 s > groups_above_threshold 1
  636. 185.35 s > integrand se1l
  637. 185.35 s > span warm_up{integrand.name=se1l}
  638. 185.35 s > threshold_status above threshold
  639. 185.35 s > [2026-09-02 17:41:57.788] @process::amplitude INFO : overlap structure of group 0: [1: [0(2,3)]]
  640. 185.35 s > field value
  641. 185.35 s > span warm_up{integrand.name=se1l}
  642. 185.35 s > [2026-09-02 17:41:57.791] @process::amplitude WARNING : External state 0 ('g', PDG 21, helicity +) is off shell: p^2 = +2.5e5, expected m^2 = +0e0 (|Δ| = +2.5e5). Fixed-helicity spinor/vector/tensor external states may be ill-defined at this kinematic point.
  643. 185.35 s > field value
  644. 185.35 s > span warm_up{integrand.name=se1l_rls_shifted}
  645. 185.35 s > [2026-09-02 17:41:57.791] @process::amplitude WARNING : External state 1 ('g', PDG 21, helicity -) is off shell: p^2 = +2.5e5, expected m^2 = +0e0 (|Δ| = +2.5e5). Fixed-helicity spinor/vector/tensor external states may be ill-defined at this kinematic point.
  646. 185.35 s > field value
  647. 185.35 s > span warm_up{integrand.name=se1l_rls_shifted}
  648. 185.35 s > [2026-09-02 17:41:57.791] @process::amplitude INFO : Input is above threshold: 1 existing threshold E-surfaces across 1/1 graph groups
  649. 185.35 s > field value
  650. 185.35 s > existing_esurfaces 1
  651. 185.35 s > group_count 1
  652. 185.35 s > groups_above_threshold 1
  653. 185.35 s > integrand se1l_rls_shifted
  654. 185.35 s > span warm_up{integrand.name=se1l_rls_shifted}
  655. 185.35 s > threshold_status above threshold
  656. 185.35 s > [2026-09-02 17:41:57.791] @process::amplitude INFO : overlap structure of group 0: [1: [0(2,3)]]
  657. 185.35 s > field value
  658. 185.35 s > span warm_up{integrand.name=se1l_rls_shifted}
  659. 185.35 s > [2026-09-02 17:41:57.794] @process::amplitude WARNING : External state 0 ('g', PDG 21, helicity +) is off shell: p^2 = +2.5e5, expected m^2 = +0e0 (|Δ| = +2.5e5). Fixed-helicity spinor/vector/tensor external states may be ill-defined at this kinematic point.
  660. 185.35 s > field value
  661. 185.35 s > span warm_up{integrand.name=se1l}
  662. 185.35 s > [2026-09-02 17:41:57.794] @process::amplitude WARNING : External state 1 ('g', PDG 21, helicity -) is off shell: p^2 = +2.5e5, expected m^2 = +0e0 (|Δ| = +2.5e5). Fixed-helicity spinor/vector/tensor external states may be ill-defined at this kinematic point.
  663. 185.35 s > field value
  664. 185.35 s > span warm_up{integrand.name=se1l}
  665. 185.35 s > [2026-09-02 17:41:57.794] @process::amplitude INFO : Input is above threshold: 1 existing threshold E-surfaces across 1/1 graph groups
  666. 185.35 s > field value
  667. 185.35 s > existing_esurfaces 1
  668. 185.35 s > group_count 1
  669. 185.35 s > groups_above_threshold 1
  670. 185.35 s > integrand se1l
  671. 185.35 s > span warm_up{integrand.name=se1l}
  672. 185.35 s > threshold_status above threshold
  673. 185.35 s > [2026-09-02 17:41:57.795] @process::amplitude INFO : overlap structure of group 0: [1: [0(2,3)]]
  674. 185.35 s > field value
  675. 185.35 s > span warm_up{integrand.name=se1l}
  676. 185.35 s > [2026-09-02 17:41:57.798] @process::amplitude WARNING : External state 0 ('g', PDG 21, helicity +) is off shell: p^2 = +2.5e5, expected m^2 = +0e0 (|Δ| = +2.5e5). Fixed-helicity spinor/vector/tensor external states may be ill-defined at this kinematic point.
  677. 185.35 s > field value
  678. 185.35 s > span warm_up{integrand.name=se1l_rls_shifted}
  679. 185.35 s > [2026-09-02 17:41:57.798] @process::amplitude WARNING : External state 1 ('g', PDG 21, helicity -) is off shell: p^2 = +2.5e5, expected m^2 = +0e0 (|Δ| = +2.5e5). Fixed-helicity spinor/vector/tensor external states may be ill-defined at this kinematic point.
  680. 185.35 s > field value
  681. 185.35 s > span warm_up{integrand.name=se1l_rls_shifted}
  682. 185.35 s > [2026-09-02 17:41:57.798] @process::amplitude INFO : Input is above threshold: 1 existing threshold E-surfaces across 1/1 graph groups
  683. 185.35 s > field value
  684. 185.35 s > existing_esurfaces 1
  685. 185.35 s > group_count 1
  686. 185.35 s > groups_above_threshold 1
  687. 185.35 s > integrand se1l_rls_shifted
  688. 185.35 s > span warm_up{integrand.name=se1l_rls_shifted}
  689. 185.35 s > threshold_status above threshold
  690. 185.35 s > [2026-09-02 17:41:57.798] @process::amplitude INFO : overlap structure of group 0: [1: [0(2,3)]]
  691. 185.35 s > field value
  692. 185.35 s > span warm_up{integrand.name=se1l_rls_shifted}
  693. 185.35 s > [2026-09-02 17:41:57.801] @process::amplitude WARNING : External state 0 ('g', PDG 21, helicity +) is off shell: p^2 = +2.5e5, expected m^2 = +0e0 (|Δ| = +2.5e5). Fixed-helicity spinor/vector/tensor external states may be ill-defined at this kinematic point.
  694. 185.35 s > field value
  695. 185.35 s > span warm_up{integrand.name=se1l}
  696. 185.35 s > [2026-09-02 17:41:57.801] @process::amplitude WARNING : External state 1 ('g', PDG 21, helicity -) is off shell: p^2 = +2.5e5, expected m^2 = +0e0 (|Δ| = +2.5e5). Fixed-helicity spinor/vector/tensor external states may be ill-defined at this kinematic point.
  697. 185.35 s > field value
  698. 185.35 s > span warm_up{integrand.name=se1l}
  699. 185.35 s > [2026-09-02 17:41:57.801] @process::amplitude INFO : Input is above threshold: 1 existing threshold E-surfaces across 1/1 graph groups
  700. 185.35 s > field value
  701. 185.35 s > existing_esurfaces 1
  702. 185.35 s > group_count 1
  703. 185.35 s > groups_above_threshold 1
  704. 185.35 s > integrand se1l
  705. 185.35 s > span warm_up{integrand.name=se1l}
  706. 185.35 s > threshold_status above threshold
  707. 185.35 s > [2026-09-02 17:41:57.801] @process::amplitude INFO : overlap structure of group 0: [1: [0(2,3)]]
  708. 185.35 s > field value
  709. 185.35 s > span warm_up{integrand.name=se1l}
  710. 185.35 s > [2026-09-02 17:41:57.804] @process::amplitude WARNING : External state 0 ('g', PDG 21, helicity +) is off shell: p^2 = +2.5e5, expected m^2 = +0e0 (|Δ| = +2.5e5). Fixed-helicity spinor/vector/tensor external states may be ill-defined at this kinematic point.
  711. 185.35 s > field value
  712. 185.35 s > span warm_up{integrand.name=se1l_rls_shifted}
  713. 185.35 s > [2026-09-02 17:41:57.804] @process::amplitude WARNING : External state 1 ('g', PDG 21, helicity -) is off shell: p^2 = +2.5e5, expected m^2 = +0e0 (|Δ| = +2.5e5). Fixed-helicity spinor/vector/tensor external states may be ill-defined at this kinematic point.
  714. 185.35 s > field value
  715. 185.35 s > span warm_up{integrand.name=se1l_rls_shifted}
  716. 185.35 s > [2026-09-02 17:41:57.804] @process::amplitude INFO : Input is above threshold: 1 existing threshold E-surfaces across 1/1 graph groups
  717. 185.35 s > field value
  718. 185.35 s > existing_esurfaces 1
  719. 185.35 s > group_count 1
  720. 185.35 s > groups_above_threshold 1
  721. 185.35 s > integrand se1l_rls_shifted
  722. 185.35 s > span warm_up{integrand.name=se1l_rls_shifted}
  723. 185.35 s > threshold_status above threshold
  724. 185.35 s > [2026-09-02 17:41:57.805] @process::amplitude INFO : overlap structure of group 0: [1: [0(2,3)]]
  725. 185.35 s > field value
  726. 185.35 s > span warm_up{integrand.name=se1l_rls_shifted}
  727. 185.35 s > [2026-09-02 17:41:57.808] @process::amplitude WARNING : External state 0 ('g', PDG 21, helicity +) is off shell: p^2 = +2.5e5, expected m^2 = +0e0 (|Δ| = +2.5e5). Fixed-helicity spinor/vector/tensor external states may be ill-defined at this kinematic point.
  728. 185.35 s > field value
  729. 185.35 s > span warm_up{integrand.name=se1l}
  730. 185.35 s > [2026-09-02 17:41:57.808] @process::amplitude WARNING : External state 1 ('g', PDG 21, helicity -) is off shell: p^2 = +2.5e5, expected m^2 = +0e0 (|Δ| = +2.5e5). Fixed-helicity spinor/vector/tensor external states may be ill-defined at this kinematic point.
  731. 185.35 s > field value
  732. 185.35 s > span warm_up{integrand.name=se1l}
  733. 185.35 s > [2026-09-02 17:41:57.808] @process::amplitude INFO : Input is above threshold: 1 existing threshold E-surfaces across 1/1 graph groups
  734. 185.35 s > field value
  735. 185.35 s > existing_esurfaces 1
  736. 185.35 s > group_count 1
  737. 185.35 s > groups_above_threshold 1
  738. 185.35 s > integrand se1l
  739. 185.35 s > span warm_up{integrand.name=se1l}
  740. 185.35 s > threshold_status above threshold
  741. 185.35 s > [2026-09-02 17:41:57.808] @process::amplitude INFO : overlap structure of group 0: [1: [0(2,3)]]
  742. 185.35 s > field value
  743. 185.35 s > span warm_up{integrand.name=se1l}
  744. 185.35 s > [2026-09-02 17:41:57.811] @process::amplitude WARNING : External state 0 ('g', PDG 21, helicity +) is off shell: p^2 = +2.5e5, expected m^2 = +0e0 (|Δ| = +2.5e5). Fixed-helicity spinor/vector/tensor external states may be ill-defined at this kinematic point.
  745. 185.35 s > field value
  746. 185.35 s > span warm_up{integrand.name=se1l_rls_shifted}
  747. 185.35 s > [2026-09-02 17:41:57.811] @process::amplitude WARNING : External state 1 ('g', PDG 21, helicity -) is off shell: p^2 = +2.5e5, expected m^2 = +0e0 (|Δ| = +2.5e5). Fixed-helicity spinor/vector/tensor external states may be ill-defined at this kinematic point.
  748. 185.35 s > field value
  749. 185.35 s > span warm_up{integrand.name=se1l_rls_shifted}
  750. 185.35 s > [2026-09-02 17:41:57.811] @process::amplitude INFO : Input is above threshold: 1 existing threshold E-surfaces across 1/1 graph groups
  751. 185.35 s > field value
  752. 185.35 s > existing_esurfaces 1
  753. 185.35 s > group_count 1
  754. 185.35 s > groups_above_threshold 1
  755. 185.35 s > integrand se1l_rls_shifted
  756. 185.35 s > span warm_up{integrand.name=se1l_rls_shifted}
  757. 185.35 s > threshold_status above threshold
  758. 185.35 s > [2026-09-02 17:41:57.811] @process::amplitude INFO : overlap structure of group 0: [1: [0(2,3)]]
  759. 185.35 s > field value
  760. 185.35 s > span warm_up{integrand.name=se1l_rls_shifted}
  761. 185.35 s > [2026-09-02 17:41:57.814] @process::amplitude WARNING : External state 0 ('g', PDG 21, helicity +) is off shell: p^2 = +2.5e5, expected m^2 = +0e0 (|Δ| = +2.5e5). Fixed-helicity spinor/vector/tensor external states may be ill-defined at this kinematic point.
  762. 185.35 s > field value
  763. 185.35 s > span warm_up{integrand.name=se1l}
  764. 185.35 s > [2026-09-02 17:41:57.814] @process::amplitude WARNING : External state 1 ('g', PDG 21, helicity -) is off shell: p^2 = +2.5e5, expected m^2 = +0e0 (|Δ| = +2.5e5). Fixed-helicity spinor/vector/tensor external states may be ill-defined at this kinematic point.
  765. 185.35 s > field value
  766. 185.35 s > span warm_up{integrand.name=se1l}
  767. 185.35 s > [2026-09-02 17:41:57.815] @process::amplitude INFO : Input is above threshold: 1 existing threshold E-surfaces across 1/1 graph groups
  768. 185.35 s > field value
  769. 185.35 s > existing_esurfaces 1
  770. 185.35 s > group_count 1
  771. 185.35 s > groups_above_threshold 1
  772. 185.35 s > integrand se1l
  773. 185.35 s > span warm_up{integrand.name=se1l}
  774. 185.35 s > threshold_status above threshold
  775. 185.35 s > [2026-09-02 17:41:57.815] @process::amplitude INFO : overlap structure of group 0: [1: [0(2,3)]]
  776. 185.35 s > field value
  777. 185.35 s > span warm_up{integrand.name=se1l}
  778. 185.35 s > [2026-09-02 17:41:57.818] @process::amplitude WARNING : External state 0 ('g', PDG 21, helicity +) is off shell: p^2 = +2.5e5, expected m^2 = +0e0 (|Δ| = +2.5e5). Fixed-helicity spinor/vector/tensor external states may be ill-defined at this kinematic point.
  779. 185.35 s > field value
  780. 185.35 s > span warm_up{integrand.name=se1l_rls_shifted}
  781. 185.35 s > [2026-09-02 17:41:57.818] @process::amplitude WARNING : External state 1 ('g', PDG 21, helicity -) is off shell: p^2 = +2.5e5, expected m^2 = +0e0 (|Δ| = +2.5e5). Fixed-helicity spinor/vector/tensor external states may be ill-defined at this kinematic point.
  782. 185.35 s > field value
  783. 185.35 s > span warm_up{integrand.name=se1l_rls_shifted}
  784. 185.35 s > [2026-09-02 17:41:57.818] @process::amplitude INFO : Input is above threshold: 1 existing threshold E-surfaces across 1/1 graph groups
  785. 185.35 s > field value
  786. 185.35 s > existing_esurfaces 1
  787. 185.35 s > group_count 1
  788. 185.35 s > groups_above_threshold 1
  789. 185.35 s > integrand se1l_rls_shifted
  790. 185.35 s > span warm_up{integrand.name=se1l_rls_shifted}
  791. 185.35 s > threshold_status above threshold
  792. 185.35 s > [2026-09-02 17:41:57.818] @process::amplitude INFO : overlap structure of group 0: [1: [0(2,3)]]
  793. 185.35 s > field value
  794. 185.35 s > span warm_up{integrand.name=se1l_rls_shifted}
  795. 185.35 s > [2026-09-02 17:41:57.821] @process::amplitude WARNING : External state 0 ('g', PDG 21, helicity +) is off shell: p^2 = +2.5e5, expected m^2 = +0e0 (|Δ| = +2.5e5). Fixed-helicity spinor/vector/tensor external states may be ill-defined at this kinematic point.
  796. 185.35 s > field value
  797. 185.35 s > span warm_up{integrand.name=se1l}
  798. 185.35 s > [2026-09-02 17:41:57.821] @process::amplitude WARNING : External state 1 ('g', PDG 21, helicity -) is off shell: p^2 = +2.5e5, expected m^2 = +0e0 (|Δ| = +2.5e5). Fixed-helicity spinor/vector/tensor external states may be ill-defined at this kinematic point.
  799. 185.35 s > field value
  800. 185.35 s > span warm_up{integrand.name=se1l}
  801. 185.35 s > [2026-09-02 17:41:57.821] @process::amplitude INFO : Input is above threshold: 1 existing threshold E-surfaces across 1/1 graph groups
  802. 185.35 s > field value
  803. 185.35 s > existing_esurfaces 1
  804. 185.35 s > group_count 1
  805. 185.35 s > groups_above_threshold 1
  806. 185.35 s > integrand se1l
  807. 185.35 s > span warm_up{integrand.name=se1l}
  808. 185.35 s > threshold_status above threshold
  809. 185.35 s > [2026-09-02 17:41:57.821] @process::amplitude INFO : overlap structure of group 0: [1: [0(2,3)]]
  810. 185.35 s > field value
  811. 185.35 s > span warm_up{integrand.name=se1l}
  812. 185.35 s > [2026-09-02 17:41:57.824] @process::amplitude WARNING : External state 0 ('g', PDG 21, helicity +) is off shell: p^2 = +2.5e5, expected m^2 = +0e0 (|Δ| = +2.5e5). Fixed-helicity spinor/vector/tensor external states may be ill-defined at this kinematic point.
  813. 185.35 s > field value
  814. 185.35 s > span warm_up{integrand.name=se1l_rls_shifted}
  815. 185.35 s > [2026-09-02 17:41:57.824] @process::amplitude WARNING : External state 1 ('g', PDG 21, helicity -) is off shell: p^2 = +2.5e5, expected m^2 = +0e0 (|Δ| = +2.5e5). Fixed-helicity spinor/vector/tensor external states may be ill-defined at this kinematic point.
  816. 185.35 s > field value
  817. 185.35 s > span warm_up{integrand.name=se1l_rls_shifted}
  818. 185.35 s > [2026-09-02 17:41:57.825] @process::amplitude INFO : Input is above threshold: 1 existing threshold E-surfaces across 1/1 graph groups
  819. 185.35 s > field value
  820. 185.35 s > existing_esurfaces 1
  821. 185.35 s > group_count 1
  822. 185.35 s > groups_above_threshold 1
  823. 185.35 s > integrand se1l_rls_shifted
  824. 185.35 s > span warm_up{integrand.name=se1l_rls_shifted}
  825. 185.35 s > threshold_status above threshold
  826. 185.35 s > [2026-09-02 17:41:57.825] @process::amplitude INFO : overlap structure of group 0: [1: [0(2,3)]]
  827. 185.35 s > field value
  828. 185.35 s > span warm_up{integrand.name=se1l_rls_shifted}
  829. 185.35 s > [2026-09-02 17:41:57.828] @process::amplitude WARNING : External state 0 ('g', PDG 21, helicity +) is off shell: p^2 = +2.5e5, expected m^2 = +0e0 (|Δ| = +2.5e5). Fixed-helicity spinor/vector/tensor external states may be ill-defined at this kinematic point.
  830. 185.35 s > field value
  831. 185.35 s > span warm_up{integrand.name=se1l}
  832. 185.35 s > [2026-09-02 17:41:57.828] @process::amplitude WARNING : External state 1 ('g', PDG 21, helicity -) is off shell: p^2 = +2.5e5, expected m^2 = +0e0 (|Δ| = +2.5e5). Fixed-helicity spinor/vector/tensor external states may be ill-defined at this kinematic point.
  833. 185.35 s > field value
  834. 185.35 s > span warm_up{integrand.name=se1l}
  835. 185.35 s > [2026-09-02 17:41:57.828] @process::amplitude INFO : Input is above threshold: 1 existing threshold E-surfaces across 1/1 graph groups
  836. 185.35 s > field value
  837. 185.35 s > existing_esurfaces 1
  838. 185.35 s > group_count 1
  839. 185.35 s > groups_above_threshold 1
  840. 185.35 s > integrand se1l
  841. 185.35 s > span warm_up{integrand.name=se1l}
  842. 185.35 s > threshold_status above threshold
  843. 185.35 s > [2026-09-02 17:41:57.828] @process::amplitude INFO : overlap structure of group 0: [1: [0(2,3)]]
  844. 185.35 s > field value
  845. 185.35 s > span warm_up{integrand.name=se1l}
  846. 185.35 s > [2026-09-02 17:41:57.831] @process::amplitude WARNING : External state 0 ('g', PDG 21, helicity +) is off shell: p^2 = +2.5e5, expected m^2 = +0e0 (|Δ| = +2.5e5). Fixed-helicity spinor/vector/tensor external states may be ill-defined at this kinematic point.
  847. 185.35 s > field value
  848. 185.35 s > span warm_up{integrand.name=se1l_rls_shifted}
  849. 185.35 s > [2026-09-02 17:41:57.831] @process::amplitude WARNING : External state 1 ('g', PDG 21, helicity -) is off shell: p^2 = +2.5e5, expected m^2 = +0e0 (|Δ| = +2.5e5). Fixed-helicity spinor/vector/tensor external states may be ill-defined at this kinematic point.
  850. 185.35 s > field value
  851. 185.35 s > span warm_up{integrand.name=se1l_rls_shifted}
  852. 185.35 s > [2026-09-02 17:41:57.831] @process::amplitude INFO : Input is above threshold: 1 existing threshold E-surfaces across 1/1 graph groups
  853. 185.35 s > field value
  854. 185.35 s > existing_esurfaces 1
  855. 185.35 s > group_count 1
  856. 185.35 s > groups_above_threshold 1
  857. 185.35 s > integrand se1l_rls_shifted
  858. 185.35 s > span warm_up{integrand.name=se1l_rls_shifted}
  859. 185.35 s > threshold_status above threshold
  860. 185.35 s > [2026-09-02 17:41:57.831] @process::amplitude INFO : overlap structure of group 0: [1: [0(2,3)]]
  861. 185.35 s > field value
  862. 185.35 s > span warm_up{integrand.name=se1l_rls_shifted}
  863. 185.35 s > [2026-09-02 17:41:57.834] @process::amplitude WARNING : External state 0 ('g', PDG 21, helicity +) is off shell: p^2 = +2.5e5, expected m^2 = +0e0 (|Δ| = +2.5e5). Fixed-helicity spinor/vector/tensor external states may be ill-defined at this kinematic point.
  864. 185.35 s > field value
  865. 185.35 s > span warm_up{integrand.name=se1l}
  866. 185.35 s > [2026-09-02 17:41:57.835] @process::amplitude WARNING : External state 1 ('g', PDG 21, helicity -) is off shell: p^2 = +2.5e5, expected m^2 = +0e0 (|Δ| = +2.5e5). Fixed-helicity spinor/vector/tensor external states may be ill-defined at this kinematic point.
  867. 185.35 s > field value
  868. 185.35 s > span warm_up{integrand.name=se1l}
  869. 185.35 s > [2026-09-02 17:41:57.835] @process::amplitude INFO : Input is above threshold: 1 existing threshold E-surfaces across 1/1 graph groups
  870. 185.35 s > field value
  871. 185.35 s > existing_esurfaces 1
  872. 185.35 s > group_count 1
  873. 185.35 s > groups_above_threshold 1
  874. 185.35 s > integrand se1l
  875. 185.35 s > span warm_up{integrand.name=se1l}
  876. 185.35 s > threshold_status above threshold
  877. 185.35 s > [2026-09-02 17:41:57.835] @process::amplitude INFO : overlap structure of group 0: [1: [0(2,3)]]
  878. 185.35 s > field value
  879. 185.35 s > span warm_up{integrand.name=se1l}
  880. 185.35 s > [2026-09-02 17:41:57.838] @process::amplitude WARNING : External state 0 ('g', PDG 21, helicity +) is off shell: p^2 = +2.5e5, expected m^2 = +0e0 (|Δ| = +2.5e5). Fixed-helicity spinor/vector/tensor external states may be ill-defined at this kinematic point.
  881. 185.35 s > field value
  882. 185.35 s > span warm_up{integrand.name=se1l_rls_shifted}
  883. 185.35 s > [2026-09-02 17:41:57.838] @process::amplitude WARNING : External state 1 ('g', PDG 21, helicity -) is off shell: p^2 = +2.5e5, expected m^2 = +0e0 (|Δ| = +2.5e5). Fixed-helicity spinor/vector/tensor external states may be ill-defined at this kinematic point.
  884. 185.35 s > field value
  885. 185.35 s > span warm_up{integrand.name=se1l_rls_shifted}
  886. 185.35 s > [2026-09-02 17:41:57.838] @process::amplitude INFO : Input is above threshold: 1 existing threshold E-surfaces across 1/1 graph groups
  887. 185.35 s > field value
  888. 185.35 s > existing_esurfaces 1
  889. 185.35 s > group_count 1
  890. 185.35 s > groups_above_threshold 1
  891. 185.35 s > integrand se1l_rls_shifted
  892. 185.35 s > span warm_up{integrand.name=se1l_rls_shifted}
  893. 185.35 s > threshold_status above threshold
  894. 185.35 s > [2026-09-02 17:41:57.838] @process::amplitude INFO : overlap structure of group 0: [1: [0(2,3)]]
  895. 185.35 s > field value
  896. 185.35 s > span warm_up{integrand.name=se1l_rls_shifted}
  897. 185.35 s > [2026-09-02 17:41:57.841] @process::amplitude WARNING : External state 0 ('g', PDG 21, helicity +) is off shell: p^2 = +2.5e5, expected m^2 = +0e0 (|Δ| = +2.5e5). Fixed-helicity spinor/vector/tensor external states may be ill-defined at this kinematic point.
  898. 185.35 s > field value
  899. 185.35 s > span warm_up{integrand.name=se1l}
  900. 185.35 s > [2026-09-02 17:41:57.841] @process::amplitude WARNING : External state 1 ('g', PDG 21, helicity -) is off shell: p^2 = +2.5e5, expected m^2 = +0e0 (|Δ| = +2.5e5). Fixed-helicity spinor/vector/tensor external states may be ill-defined at this kinematic point.
  901. 185.35 s > field value
  902. 185.35 s > span warm_up{integrand.name=se1l}
  903. 185.35 s > [2026-09-02 17:41:57.841] @process::amplitude INFO : Input is above threshold: 1 existing threshold E-surfaces across 1/1 graph groups
  904. 185.35 s > field value
  905. 185.35 s > existing_esurfaces 1
  906. 185.35 s > group_count 1
  907. 185.35 s > groups_above_threshold 1
  908. 185.35 s > integrand se1l
  909. 185.35 s > span warm_up{integrand.name=se1l}
  910. 185.35 s > threshold_status above threshold
  911. 185.35 s > [2026-09-02 17:41:57.841] @process::amplitude INFO : overlap structure of group 0: [1: [0(2,3)]]
  912. 185.35 s > field value
  913. 185.35 s > span warm_up{integrand.name=se1l}
  914. 185.35 s > [2026-09-02 17:41:57.845] @process::amplitude WARNING : External state 0 ('g', PDG 21, helicity +) is off shell: p^2 = +2.5e5, expected m^2 = +0e0 (|Δ| = +2.5e5). Fixed-helicity spinor/vector/tensor external states may be ill-defined at this kinematic point.
  915. 185.35 s > field value
  916. 185.35 s > span warm_up{integrand.name=se1l_mur_shifted}
  917. 185.35 s > [2026-09-02 17:41:57.845] @process::amplitude WARNING : External state 1 ('g', PDG 21, helicity -) is off shell: p^2 = +2.5e5, expected m^2 = +0e0 (|Δ| = +2.5e5). Fixed-helicity spinor/vector/tensor external states may be ill-defined at this kinematic point.
  918. 185.35 s > field value
  919. 185.35 s > span warm_up{integrand.name=se1l_mur_shifted}
  920. 185.35 s > [2026-09-02 17:41:57.845] @process::amplitude INFO : Input is above threshold: 1 existing threshold E-surfaces across 1/1 graph groups
  921. 185.35 s > field value
  922. 185.35 s > existing_esurfaces 1
  923. 185.35 s > group_count 1
  924. 185.35 s > groups_above_threshold 1
  925. 185.35 s > integrand se1l_mur_shifted
  926. 185.35 s > span warm_up{integrand.name=se1l_mur_shifted}
  927. 185.35 s > threshold_status above threshold
  928. 185.35 s > [2026-09-02 17:41:57.845] @process::amplitude INFO : overlap structure of group 0: [1: [0(2,3)]]
  929. 185.35 s > field value
  930. 185.35 s > span warm_up{integrand.name=se1l_mur_shifted}
  931. 185.35 s > [2026-09-02 17:41:57.848] @process::amplitude WARNING : External state 0 ('g', PDG 21, helicity +) is off shell: p^2 = +2.5e5, expected m^2 = +0e0 (|Δ| = +2.5e5). Fixed-helicity spinor/vector/tensor external states may be ill-defined at this kinematic point.
  932. 185.35 s > field value
  933. 185.35 s > span warm_up{integrand.name=se1l}
  934. 185.35 s > [2026-09-02 17:41:57.848] @process::amplitude WARNING : External state 1 ('g', PDG 21, helicity -) is off shell: p^2 = +2.5e5, expected m^2 = +0e0 (|Δ| = +2.5e5). Fixed-helicity spinor/vector/tensor external states may be ill-defined at this kinematic point.
  935. 185.35 s > field value
  936. 185.35 s > span warm_up{integrand.name=se1l}
  937. 185.35 s > [2026-09-02 17:41:57.848] @process::amplitude INFO : Input is above threshold: 1 existing threshold E-surfaces across 1/1 graph groups
  938. 185.35 s > field value
  939. 185.35 s > existing_esurfaces 1
  940. 185.35 s > group_count 1
  941. 185.35 s > groups_above_threshold 1
  942. 185.35 s > integrand se1l
  943. 185.35 s > span warm_up{integrand.name=se1l}
  944. 185.35 s > threshold_status above threshold
  945. 185.35 s > [2026-09-02 17:41:57.848] @process::amplitude INFO : overlap structure of group 0: [1: [0(2,3)]]
  946. 185.35 s > field value
  947. 185.35 s > span warm_up{integrand.name=se1l}
  948. 185.35 s > [2026-09-02 17:41:57.851] @process::amplitude WARNING : External state 0 ('g', PDG 21, helicity +) is off shell: p^2 = +2.5e5, expected m^2 = +0e0 (|Δ| = +2.5e5). Fixed-helicity spinor/vector/tensor external states may be ill-defined at this kinematic point.
  949. 185.35 s > field value
  950. 185.35 s > span warm_up{integrand.name=se1l_mur_shifted}
  951. 185.35 s > [2026-09-02 17:41:57.851] @process::amplitude WARNING : External state 1 ('g', PDG 21, helicity -) is off shell: p^2 = +2.5e5, expected m^2 = +0e0 (|Δ| = +2.5e5). Fixed-helicity spinor/vector/tensor external states may be ill-defined at this kinematic point.
  952. 185.35 s > field value
  953. 185.35 s > span warm_up{integrand.name=se1l_mur_shifted}
  954. 185.35 s > [2026-09-02 17:41:57.851] @process::amplitude INFO : Input is above threshold: 1 existing threshold E-surfaces across 1/1 graph groups
  955. 185.35 s > field value
  956. 185.35 s > existing_esurfaces 1
  957. 185.35 s > group_count 1
  958. 185.35 s > groups_above_threshold 1
  959. 185.35 s > integrand se1l_mur_shifted
  960. 185.35 s > span warm_up{integrand.name=se1l_mur_shifted}
  961. 185.35 s > threshold_status above threshold
  962. 185.35 s > [2026-09-02 17:41:57.851] @process::amplitude INFO : overlap structure of group 0: [1: [0(2,3)]]
  963. 185.35 s > field value
  964. 185.35 s > span warm_up{integrand.name=se1l_mur_shifted}
  965. 185.35 s > [2026-09-02 17:41:57.855] @process::amplitude WARNING : External state 0 ('g', PDG 21, helicity +) is off shell: p^2 = +2.5e5, expected m^2 = +0e0 (|Δ| = +2.5e5). Fixed-helicity spinor/vector/tensor external states may be ill-defined at this kinematic point.
  966. 185.35 s > field value
  967. 185.35 s > span warm_up{integrand.name=se1l}
  968. 185.35 s > [2026-09-02 17:41:57.855] @process::amplitude WARNING : External state 1 ('g', PDG 21, helicity -) is off shell: p^2 = +2.5e5, expected m^2 = +0e0 (|Δ| = +2.5e5). Fixed-helicity spinor/vector/tensor external states may be ill-defined at this kinematic point.
  969. 185.35 s > field value
  970. 185.35 s > span warm_up{integrand.name=se1l}
  971. 185.35 s > [2026-09-02 17:41:57.855] @process::amplitude INFO : Input is above threshold: 1 existing threshold E-surfaces across 1/1 graph groups
  972. 185.35 s > field value
  973. 185.35 s > existing_esurfaces 1
  974. 185.35 s > group_count 1
  975. 185.35 s > groups_above_threshold 1
  976. 185.35 s > integrand se1l
  977. 185.35 s > span warm_up{integrand.name=se1l}
  978. 185.35 s > threshold_status above threshold
  979. 185.35 s > [2026-09-02 17:41:57.855] @process::amplitude INFO : overlap structure of group 0: [1: [0(2,3)]]
  980. 185.35 s > field value
  981. 185.35 s > span warm_up{integrand.name=se1l}
  982. 185.35 s > [2026-09-02 17:41:57.858] @process::amplitude WARNING : External state 0 ('g', PDG 21, helicity +) is off shell: p^2 = +2.5e5, expected m^2 = +0e0 (|Δ| = +2.5e5). Fixed-helicity spinor/vector/tensor external states may be ill-defined at this kinematic point.
  983. 185.35 s > field value
  984. 185.35 s > span warm_up{integrand.name=se1l_mur_shifted}
  985. 185.35 s > [2026-09-02 17:41:57.858] @process::amplitude WARNING : External state 1 ('g', PDG 21, helicity -) is off shell: p^2 = +2.5e5, expected m^2 = +0e0 (|Δ| = +2.5e5). Fixed-helicity spinor/vector/tensor external states may be ill-defined at this kinematic point.
  986. 185.35 s > field value
  987. 185.35 s > span warm_up{integrand.name=se1l_mur_shifted}
  988. 185.35 s > [2026-09-02 17:41:57.858] @process::amplitude INFO : Input is above threshold: 1 existing threshold E-surfaces across 1/1 graph groups
  989. 185.35 s > field value
  990. 185.35 s > existing_esurfaces 1
  991. 185.35 s > group_count 1
  992. 185.35 s > groups_above_threshold 1
  993. 185.35 s > integrand se1l_mur_shifted
  994. 185.35 s > span warm_up{integrand.name=se1l_mur_shifted}
  995. 185.35 s > threshold_status above threshold
  996. 185.35 s > [2026-09-02 17:41:57.858] @process::amplitude INFO : overlap structure of group 0: [1: [0(2,3)]]
  997. 185.35 s > field value
  998. 185.35 s > span warm_up{integrand.name=se1l_mur_shifted}
  999. 185.35 s > [2026-09-02 17:41:57.861] @process::amplitude WARNING : External state 0 ('g', PDG 21, helicity +) is off shell: p^2 = +2.5e5, expected m^2 = +0e0 (|Δ| = +2.5e5). Fixed-helicity spinor/vector/tensor external states may be ill-defined at this kinematic point.
  1000. 185.35 s > field value
  1001. 185.35 s > span warm_up{integrand.name=se1l}
  1002. 185.35 s > [2026-09-02 17:41:57.861] @process::amplitude WARNING : External state 1 ('g', PDG 21, helicity -) is off shell: p^2 = +2.5e5, expected m^2 = +0e0 (|Δ| = +2.5e5). Fixed-helicity spinor/vector/tensor external states may be ill-defined at this kinematic point.
  1003. 185.35 s > field value
  1004. 185.35 s > span warm_up{integrand.name=se1l}
  1005. 185.35 s > [2026-09-02 17:41:57.861] @process::amplitude INFO : Input is above threshold: 1 existing threshold E-surfaces across 1/1 graph groups
  1006. 185.35 s > field value
  1007. 185.35 s > existing_esurfaces 1
  1008. 185.35 s > group_count 1
  1009. 185.35 s > groups_above_threshold 1
  1010. 185.35 s > integrand se1l
  1011. 185.35 s > span warm_up{integrand.name=se1l}
  1012. 185.35 s > threshold_status above threshold
  1013. 185.35 s > [2026-09-02 17:41:57.862] @process::amplitude INFO : overlap structure of group 0: [1: [0(2,3)]]
  1014. 185.35 s > field value
  1015. 185.35 s > span warm_up{integrand.name=se1l}
  1016. 185.35 s > [2026-09-02 17:41:57.865] @process::amplitude WARNING : External state 0 ('g', PDG 21, helicity +) is off shell: p^2 = +2.5e5, expected m^2 = +0e0 (|Δ| = +2.5e5). Fixed-helicity spinor/vector/tensor external states may be ill-defined at this kinematic point.
  1017. 185.35 s > field value
  1018. 185.35 s > span warm_up{integrand.name=se1l_mur_shifted}
  1019. 185.35 s > [2026-09-02 17:41:57.865] @process::amplitude WARNING : External state 1 ('g', PDG 21, helicity -) is off shell: p^2 = +2.5e5, expected m^2 = +0e0 (|Δ| = +2.5e5). Fixed-helicity spinor/vector/tensor external states may be ill-defined at this kinematic point.
  1020. 185.35 s > field value
  1021. 185.35 s > span warm_up{integrand.name=se1l_mur_shifted}
  1022. 185.35 s > [2026-09-02 17:41:57.865] @process::amplitude INFO : Input is above threshold: 1 existing threshold E-surfaces across 1/1 graph groups
  1023. 185.35 s > field value
  1024. 185.35 s > existing_esurfaces 1
  1025. 185.35 s > group_count 1
  1026. 185.35 s > groups_above_threshold 1
  1027. 185.35 s > integrand se1l_mur_shifted
  1028. 185.35 s > span warm_up{integrand.name=se1l_mur_shifted}
  1029. 185.35 s > threshold_status above threshold
  1030. 185.35 s > [2026-09-02 17:41:57.865] @process::amplitude INFO : overlap structure of group 0: [1: [0(2,3)]]
  1031. 185.35 s > field value
  1032. 185.35 s > span warm_up{integrand.name=se1l_mur_shifted}
  1033. 185.35 s > [2026-09-02 17:41:57.868] @process::amplitude WARNING : External state 0 ('g', PDG 21, helicity +) is off shell: p^2 = +2.5e5, expected m^2 = +0e0 (|Δ| = +2.5e5). Fixed-helicity spinor/vector/tensor external states may be ill-defined at this kinematic point.
  1034. 185.35 s > field value
  1035. 185.35 s > span warm_up{integrand.name=se1l}
  1036. 185.35 s > [2026-09-02 17:41:57.868] @process::amplitude WARNING : External state 1 ('g', PDG 21, helicity -) is off shell: p^2 = +2.5e5, expected m^2 = +0e0 (|Δ| = +2.5e5). Fixed-helicity spinor/vector/tensor external states may be ill-defined at this kinematic point.
  1037. 185.35 s > field value
  1038. 185.35 s > span warm_up{integrand.name=se1l}
  1039. 185.35 s > [2026-09-02 17:41:57.868] @process::amplitude INFO : Input is above threshold: 1 existing threshold E-surfaces across 1/1 graph groups
  1040. 185.35 s > field value
  1041. 185.35 s > existing_esurfaces 1
  1042. 185.35 s > group_count 1
  1043. 185.35 s > groups_above_threshold 1
  1044. 185.35 s > integrand se1l
  1045. 185.35 s > span warm_up{integrand.name=se1l}
  1046. 185.35 s > threshold_status above threshold
  1047. 185.35 s > [2026-09-02 17:41:57.868] @process::amplitude INFO : overlap structure of group 0: [1: [0(2,3)]]
  1048. 185.35 s > field value
  1049. 185.35 s > span warm_up{integrand.name=se1l}
  1050. 185.35 s > [2026-09-02 17:41:57.871] @process::amplitude WARNING : External state 0 ('g', PDG 21, helicity +) is off shell: p^2 = +2.5e5, expected m^2 = +0e0 (|Δ| = +2.5e5). Fixed-helicity spinor/vector/tensor external states may be ill-defined at this kinematic point.
  1051. 185.35 s > field value
  1052. 185.35 s > span warm_up{integrand.name=se1l_mur_shifted}
  1053. 185.35 s > [2026-09-02 17:41:57.871] @process::amplitude WARNING : External state 1 ('g', PDG 21, helicity -) is off shell: p^2 = +2.5e5, expected m^2 = +0e0 (|Δ| = +2.5e5). Fixed-helicity spinor/vector/tensor external states may be ill-defined at this kinematic point.
  1054. 185.35 s > field value
  1055. 185.35 s > span warm_up{integrand.name=se1l_mur_shifted}
  1056. 185.35 s > [2026-09-02 17:41:57.872] @process::amplitude INFO : Input is above threshold: 1 existing threshold E-surfaces across 1/1 graph groups
  1057. 185.35 s > field value
  1058. 185.35 s > existing_esurfaces 1
  1059. 185.35 s > group_count 1
  1060. 185.35 s > groups_above_threshold 1
  1061. 185.35 s > integrand se1l_mur_shifted
  1062. 185.35 s > span warm_up{integrand.name=se1l_mur_shifted}
  1063. 185.35 s > threshold_status above threshold
  1064. 185.35 s > [2026-09-02 17:41:57.872] @process::amplitude INFO : overlap structure of group 0: [1: [0(2,3)]]
  1065. 185.35 s > field value
  1066. 185.35 s > span warm_up{integrand.name=se1l_mur_shifted}
  1067. 185.35 s > [2026-09-02 17:41:57.875] @process::amplitude WARNING : External state 0 ('g', PDG 21, helicity +) is off shell: p^2 = +2.5e5, expected m^2 = +0e0 (|Δ| = +2.5e5). Fixed-helicity spinor/vector/tensor external states may be ill-defined at this kinematic point.
  1068. 185.35 s > field value
  1069. 185.35 s > span warm_up{integrand.name=se1l}
  1070. 185.35 s > [2026-09-02 17:41:57.875] @process::amplitude WARNING : External state 1 ('g', PDG 21, helicity -) is off shell: p^2 = +2.5e5, expected m^2 = +0e0 (|Δ| = +2.5e5). Fixed-helicity spinor/vector/tensor external states may be ill-defined at this kinematic point.
  1071. 185.35 s > field value
  1072. 185.35 s > span warm_up{integrand.name=se1l}
  1073. 185.35 s > [2026-09-02 17:41:57.875] @process::amplitude INFO : Input is above threshold: 1 existing threshold E-surfaces across 1/1 graph groups
  1074. 185.35 s > field value
  1075. 185.35 s > existing_esurfaces 1
  1076. 185.35 s > group_count 1
  1077. 185.35 s > groups_above_threshold 1
  1078. 185.35 s > integrand se1l
  1079. 185.35 s > span warm_up{integrand.name=se1l}
  1080. 185.35 s > threshold_status above threshold
  1081. 185.35 s > [2026-09-02 17:41:57.875] @process::amplitude INFO : overlap structure of group 0: [1: [0(2,3)]]
  1082. 185.35 s > field value
  1083. 185.35 s > span warm_up{integrand.name=se1l}
  1084. 185.35 s > [2026-09-02 17:41:57.878] @process::amplitude WARNING : External state 0 ('g', PDG 21, helicity +) is off shell: p^2 = +2.5e5, expected m^2 = +0e0 (|Δ| = +2.5e5). Fixed-helicity spinor/vector/tensor external states may be ill-defined at this kinematic point.
  1085. 185.35 s > field value
  1086. 185.35 s > span warm_up{integrand.name=se1l_mur_shifted}
  1087. 185.35 s > [2026-09-02 17:41:57.878] @process::amplitude WARNING : External state 1 ('g', PDG 21, helicity -) is off shell: p^2 = +2.5e5, expected m^2 = +0e0 (|Δ| = +2.5e5). Fixed-helicity spinor/vector/tensor external states may be ill-defined at this kinematic point.
  1088. 185.35 s > field value
  1089. 185.35 s > span warm_up{integrand.name=se1l_mur_shifted}
  1090. 185.35 s > [2026-09-02 17:41:57.878] @process::amplitude INFO : Input is above threshold: 1 existing threshold E-surfaces across 1/1 graph groups
  1091. 185.35 s > field value
  1092. 185.35 s > existing_esurfaces 1
  1093. 185.35 s > group_count 1
  1094. 185.35 s > groups_above_threshold 1
  1095. 185.35 s > integrand se1l_mur_shifted
  1096. 185.35 s > span warm_up{integrand.name=se1l_mur_shifted}
  1097. 185.35 s > threshold_status above threshold
  1098. 185.35 s > [2026-09-02 17:41:57.878] @process::amplitude INFO : overlap structure of group 0: [1: [0(2,3)]]
  1099. 185.35 s > field value
  1100. 185.35 s > span warm_up{integrand.name=se1l_mur_shifted}
  1101. 185.35 s > [2026-09-02 17:41:57.881] @process::amplitude WARNING : External state 0 ('g', PDG 21, helicity +) is off shell: p^2 = +2.5e5, expected m^2 = +0e0 (|Δ| = +2.5e5). Fixed-helicity spinor/vector/tensor external states may be ill-defined at this kinematic point.
  1102. 185.35 s > field value
  1103. 185.35 s > span warm_up{integrand.name=se1l}
  1104. 185.35 s > [2026-09-02 17:41:57.881] @process::amplitude WARNING : External state 1 ('g', PDG 21, helicity -) is off shell: p^2 = +2.5e5, expected m^2 = +0e0 (|Δ| = +2.5e5). Fixed-helicity spinor/vector/tensor external states may be ill-defined at this kinematic point.
  1105. 185.35 s > field value
  1106. 185.35 s > span warm_up{integrand.name=se1l}
  1107. 185.35 s > [2026-09-02 17:41:57.882] @process::amplitude INFO : Input is above threshold: 1 existing threshold E-surfaces across 1/1 graph groups
  1108. 185.35 s > field value
  1109. 185.35 s > existing_esurfaces 1
  1110. 185.35 s > group_count 1
  1111. 185.35 s > groups_above_threshold 1
  1112. 185.35 s > integrand se1l
  1113. 185.35 s > span warm_up{integrand.name=se1l}
  1114. 185.35 s > threshold_status above threshold
  1115. 185.35 s > [2026-09-02 17:41:57.882] @process::amplitude INFO : overlap structure of group 0: [1: [0(2,3)]]
  1116. 185.35 s > field value
  1117. 185.35 s > span warm_up{integrand.name=se1l}
  1118. 185.35 s > [2026-09-02 17:41:57.885] @process::amplitude WARNING : External state 0 ('g', PDG 21, helicity +) is off shell: p^2 = +2.5e5, expected m^2 = +0e0 (|Δ| = +2.5e5). Fixed-helicity spinor/vector/tensor external states may be ill-defined at this kinematic point.
  1119. 185.35 s > field value
  1120. 185.35 s > span warm_up{integrand.name=se1l_mur_shifted}
  1121. 185.35 s > [2026-09-02 17:41:57.885] @process::amplitude WARNING : External state 1 ('g', PDG 21, helicity -) is off shell: p^2 = +2.5e5, expected m^2 = +0e0 (|Δ| = +2.5e5). Fixed-helicity spinor/vector/tensor external states may be ill-defined at this kinematic point.
  1122. 185.35 s > field value
  1123. 185.35 s > span warm_up{integrand.name=se1l_mur_shifted}
  1124. 185.35 s > [2026-09-02 17:41:57.885] @process::amplitude INFO : Input is above threshold: 1 existing threshold E-surfaces across 1/1 graph groups
  1125. 185.35 s > field value
  1126. 185.35 s > existing_esurfaces 1
  1127. 185.35 s > group_count 1
  1128. 185.35 s > groups_above_threshold 1
  1129. 185.35 s > integrand se1l_mur_shifted
  1130. 185.35 s > span warm_up{integrand.name=se1l_mur_shifted}
  1131. 185.35 s > threshold_status above threshold
  1132. 185.35 s > [2026-09-02 17:41:57.885] @process::amplitude INFO : overlap structure of group 0: [1: [0(2,3)]]
  1133. 185.35 s > field value
  1134. 185.35 s > span warm_up{integrand.name=se1l_mur_shifted}
  1135. 185.35 s > [2026-09-02 17:41:57.888] @process::amplitude WARNING : External state 0 ('g', PDG 21, helicity +) is off shell: p^2 = +2.5e5, expected m^2 = +0e0 (|Δ| = +2.5e5). Fixed-helicity spinor/vector/tensor external states may be ill-defined at this kinematic point.
  1136. 185.35 s > field value
  1137. 185.35 s > span warm_up{integrand.name=se1l}
  1138. 185.35 s > [2026-09-02 17:41:57.888] @process::amplitude WARNING : External state 1 ('g', PDG 21, helicity -) is off shell: p^2 = +2.5e5, expected m^2 = +0e0 (|Δ| = +2.5e5). Fixed-helicity spinor/vector/tensor external states may be ill-defined at this kinematic point.
  1139. 185.35 s > field value
  1140. 185.35 s > span warm_up{integrand.name=se1l}
  1141. 185.35 s > [2026-09-02 17:41:57.888] @process::amplitude INFO : Input is above threshold: 1 existing threshold E-surfaces across 1/1 graph groups
  1142. 185.35 s > field value
  1143. 185.35 s > existing_esurfaces 1
  1144. 185.35 s > group_count 1
  1145. 185.35 s > groups_above_threshold 1
  1146. 185.35 s > integrand se1l
  1147. 185.35 s > span warm_up{integrand.name=se1l}
  1148. 185.35 s > threshold_status above threshold
  1149. 185.35 s > [2026-09-02 17:41:57.888] @process::amplitude INFO : overlap structure of group 0: [1: [0(2,3)]]
  1150. 185.35 s > field value
  1151. 185.35 s > span warm_up{integrand.name=se1l}
  1152. 185.35 s > [2026-09-02 17:41:57.892] @process::amplitude WARNING : External state 0 ('g', PDG 21, helicity +) is off shell: p^2 = +2.5e5, expected m^2 = +0e0 (|Δ| = +2.5e5). Fixed-helicity spinor/vector/tensor external states may be ill-defined at this kinematic point.
  1153. 185.35 s > field value
  1154. 185.35 s > span warm_up{integrand.name=se1l_mur_shifted}
  1155. 185.35 s > [2026-09-02 17:41:57.892] @process::amplitude WARNING : External state 1 ('g', PDG 21, helicity -) is off shell: p^2 = +2.5e5, expected m^2 = +0e0 (|Δ| = +2.5e5). Fixed-helicity spinor/vector/tensor external states may be ill-defined at this kinematic point.
  1156. 185.35 s > field value
  1157. 185.35 s > span warm_up{integrand.name=se1l_mur_shifted}
  1158. 185.35 s > [2026-09-02 17:41:57.892] @process::amplitude INFO : Input is above threshold: 1 existing threshold E-surfaces across 1/1 graph groups
  1159. 185.35 s > field value
  1160. 185.35 s > existing_esurfaces 1
  1161. 185.35 s > group_count 1
  1162. 185.35 s > groups_above_threshold 1
  1163. 185.35 s > integrand se1l_mur_shifted
  1164. 185.35 s > span warm_up{integrand.name=se1l_mur_shifted}
  1165. 185.35 s > threshold_status above threshold
  1166. 185.35 s > [2026-09-02 17:41:57.892] @process::amplitude INFO : overlap structure of group 0: [1: [0(2,3)]]
  1167. 185.35 s > field value
  1168. 185.35 s > span warm_up{integrand.name=se1l_mur_shifted}
  1169. 185.35 s > [2026-09-02 17:41:57.895] @process::amplitude WARNING : External state 0 ('g', PDG 21, helicity +) is off shell: p^2 = +2.5e5, expected m^2 = +0e0 (|Δ| = +2.5e5). Fixed-helicity spinor/vector/tensor external states may be ill-defined at this kinematic point.
  1170. 185.35 s > field value
  1171. 185.35 s > span warm_up{integrand.name=se1l}
  1172. 185.35 s > [2026-09-02 17:41:57.895] @process::amplitude WARNING : External state 1 ('g', PDG 21, helicity -) is off shell: p^2 = +2.5e5, expected m^2 = +0e0 (|Δ| = +2.5e5). Fixed-helicity spinor/vector/tensor external states may be ill-defined at this kinematic point.
  1173. 185.35 s > field value
  1174. 185.35 s > span warm_up{integrand.name=se1l}
  1175. 185.35 s > [2026-09-02 17:41:57.895] @process::amplitude INFO : Input is above threshold: 1 existing threshold E-surfaces across 1/1 graph groups
  1176. 185.35 s > field value
  1177. 185.35 s > existing_esurfaces 1
  1178. 185.35 s > group_count 1
  1179. 185.35 s > groups_above_threshold 1
  1180. 185.35 s > integrand se1l
  1181. 185.35 s > span warm_up{integrand.name=se1l}
  1182. 185.35 s > threshold_status above threshold
  1183. 185.35 s > [2026-09-02 17:41:57.895] @process::amplitude INFO : overlap structure of group 0: [1: [0(2,3)]]
  1184. 185.35 s > field value
  1185. 185.35 s > span warm_up{integrand.name=se1l}
  1186. 185.35 s > [2026-09-02 17:41:57.898] @process::amplitude WARNING : External state 0 ('g', PDG 21, helicity +) is off shell: p^2 = +2.5e5, expected m^2 = +0e0 (|Δ| = +2.5e5). Fixed-helicity spinor/vector/tensor external states may be ill-defined at this kinematic point.
  1187. 185.35 s > field value
  1188. 185.35 s > span warm_up{integrand.name=se1l_mur_shifted}
  1189. 185.35 s > [2026-09-02 17:41:57.898] @process::amplitude WARNING : External state 1 ('g', PDG 21, helicity -) is off shell: p^2 = +2.5e5, expected m^2 = +0e0 (|Δ| = +2.5e5). Fixed-helicity spinor/vector/tensor external states may be ill-defined at this kinematic point.
  1190. 185.35 s > field value
  1191. 185.35 s > span warm_up{integrand.name=se1l_mur_shifted}
  1192. 185.35 s > [2026-09-02 17:41:57.898] @process::amplitude INFO : Input is above threshold: 1 existing threshold E-surfaces across 1/1 graph groups
  1193. 185.35 s > field value
  1194. 185.35 s > existing_esurfaces 1
  1195. 185.35 s > group_count 1
  1196. 185.35 s > groups_above_threshold 1
  1197. 185.35 s > integrand se1l_mur_shifted
  1198. 185.35 s > span warm_up{integrand.name=se1l_mur_shifted}
  1199. 185.35 s > threshold_status above threshold
  1200. 185.35 s > [2026-09-02 17:41:57.898] @process::amplitude INFO : overlap structure of group 0: [1: [0(2,3)]]
  1201. 185.35 s > field value
  1202. 185.35 s > span warm_up{integrand.name=se1l_mur_shifted}
  1203. 185.35 s > [2026-09-02 17:41:57.902] @process::amplitude WARNING : External state 0 ('g', PDG 21, helicity +) is off shell: p^2 = +2.5e5, expected m^2 = +0e0 (|Δ| = +2.5e5). Fixed-helicity spinor/vector/tensor external states may be ill-defined at this kinematic point.
  1204. 185.35 s > field value
  1205. 185.35 s > span warm_up{integrand.name=se1l}
  1206. 185.35 s > [2026-09-02 17:41:57.902] @process::amplitude WARNING : External state 1 ('g', PDG 21, helicity -) is off shell: p^2 = +2.5e5, expected m^2 = +0e0 (|Δ| = +2.5e5). Fixed-helicity spinor/vector/tensor external states may be ill-defined at this kinematic point.
  1207. 185.35 s > field value
  1208. 185.35 s > span warm_up{integrand.name=se1l}
  1209. 185.35 s > [2026-09-02 17:41:57.902] @process::amplitude INFO : Input is above threshold: 1 existing threshold E-surfaces across 1/1 graph groups
  1210. 185.35 s > field value
  1211. 185.35 s > existing_esurfaces 1
  1212. 185.35 s > group_count 1
  1213. 185.35 s > groups_above_threshold 1
  1214. 185.35 s > integrand se1l
  1215. 185.35 s > span warm_up{integrand.name=se1l}
  1216. 185.35 s > threshold_status above threshold
  1217. 185.35 s > [2026-09-02 17:41:57.902] @process::amplitude INFO : overlap structure of group 0: [1: [0(2,3)]]
  1218. 185.35 s > field value
  1219. 185.35 s > span warm_up{integrand.name=se1l}
  1220. 185.35 s > [2026-09-02 17:41:57.905] @process::amplitude WARNING : External state 0 ('g', PDG 21, helicity +) is off shell: p^2 = +2.5e5, expected m^2 = +0e0 (|Δ| = +2.5e5). Fixed-helicity spinor/vector/tensor external states may be ill-defined at this kinematic point.
  1221. 185.35 s > field value
  1222. 185.35 s > span warm_up{integrand.name=se1l_mur_shifted}
  1223. 185.35 s > [2026-09-02 17:41:57.905] @process::amplitude WARNING : External state 1 ('g', PDG 21, helicity -) is off shell: p^2 = +2.5e5, expected m^2 = +0e0 (|Δ| = +2.5e5). Fixed-helicity spinor/vector/tensor external states may be ill-defined at this kinematic point.
  1224. 185.35 s > field value
  1225. 185.35 s > span warm_up{integrand.name=se1l_mur_shifted}
  1226. 185.35 s > [2026-09-02 17:41:57.905] @process::amplitude INFO : Input is above threshold: 1 existing threshold E-surfaces across 1/1 graph groups
  1227. 185.35 s > field value
  1228. 185.35 s > existing_esurfaces 1
  1229. 185.35 s > group_count 1
  1230. 185.35 s > groups_above_threshold 1
  1231. 185.35 s > integrand se1l_mur_shifted
  1232. 185.35 s > span warm_up{integrand.name=se1l_mur_shifted}
  1233. 185.35 s > threshold_status above threshold
  1234. 185.35 s > [2026-09-02 17:41:57.905] @process::amplitude INFO : overlap structure of group 0: [1: [0(2,3)]]
  1235. 185.35 s > field value
  1236. 185.35 s > span warm_up{integrand.name=se1l_mur_shifted}
  1237. 185.35 s > The application panicked (crashed).
  1238. 185.35 s > Message: Integrated UV case failed: se1l
  1239. 185.35 s > Location: tests/tests/uv.rs:1068
  1240. 185.35 s >
  1241. 185.35 s > ━━━━━━━━━━━━━━━━━━━━━━━━━━━━━━━━━━ BACKTRACE ━━━━━━━━━━━━━━━━━━━━━━━━━━━━━━━━━━━
  1242. 185.35 s > 1: <color_eyre[bb06c27fa12d52c3]::config::PanicHook>::panic_report<unknown>
  1243. 185.35 s > at <unknown source file>:<unknown line>
  1244. 185.35 s > 2: <color_eyre[bb06c27fa12d52c3]::config::PanicHook>::into_panic_hook::{closure#0}<unknown>
  1245. 185.35 s > at <unknown source file>:<unknown line>
  1246. 185.35 s > 3: std[5167731717db2e51]::panicking::panic_with_hook<unknown>
  1247. 185.35 s > at <unknown source file>:<unknown line>
  1248. 185.35 s > 4: std[5167731717db2e51]::panicking::panic_handler::{closure#0}<unknown>
  1249. 185.35 s > at <unknown source file>:<unknown line>
  1250. 185.35 s > 5: std[5167731717db2e51]::sys::backtrace::__rust_end_short_backtrace::<std[5167731717db2e51]::panicking::panic_handler::{closure#0}, !><unknown>
  1251. 185.35 s > at <unknown source file>:<unknown line>
  1252. 185.35 s > 6: __rustc[4b1ee1ef74718a7b]::rust_begin_unwind<unknown>
  1253. 185.35 s > at <unknown source file>:<unknown line>
  1254. 185.35 s > 7: core[8c5ac2f034688f9a]::panicking::panic_fmt<unknown>
  1255. 185.35 s > at <unknown source file>:<unknown line>
  1256. 185.35 s > 8: uv[654cd04bf7185af1]::run_single_integrated_uv_case<unknown>
  1257. 185.35 s > at <unknown source file>:<unknown line>
  1258. 185.35 s > 9: <uv[654cd04bf7185af1]::se1l_uv::{closure#0} as core[8c5ac2f034688f9a]::ops::function::FnOnce<()>>::call_once<unknown>
  1259. 185.35 s > at <unknown source file>:<unknown line>
  1260. 185.35 s > 10: test[7974841f8dbd3561]::__rust_begin_short_backtrace::<core[8c5ac2f034688f9a]::result::Result<(), alloc[93e694a8365d93dd]::string::String>, fn() -> core[8c5ac2f034688f9a]::result::Result<(), alloc[93e694a8365d93dd]::string::String>><unknown>
  1261. 185.35 s > at <unknown source file>:<unknown line>
  1262. 185.35 s > 11: test[7974841f8dbd3561]::run_test::{closure#0}<unknown>
  1263. 185.35 s > at <unknown source file>:<unknown line>
  1264. 185.35 s > 12: std[5167731717db2e51]::sys::backtrace::__rust_begin_short_backtrace::<test[7974841f8dbd3561]::run_test::{closure#1}, ()><unknown>
  1265. 185.35 s > at <unknown source file>:<unknown line>
  1266. 185.35 s > 13: <std[5167731717db2e51]::thread::lifecycle::spawn_unchecked<test[7974841f8dbd3561]::run_test::{closure#1}, ()>::{closure#1} as core[8c5ac2f034688f9a]::ops::function::FnOnce<()>>::call_once::{shim:vtable#0}<unknown>
  1267. 185.35 s > at <unknown source file>:<unknown line>
  1268. 185.35 s > 14: <std[5167731717db2e51]::sys::thread::unix::Thread>::new::thread_start<unknown>
  1269. 185.35 s > at <unknown source file>:<unknown line>
  1270. 185.35 s > 15: start_thread<unknown>
  1271. 185.35 s > at <unknown source file>:<unknown line>
  1272. 185.35 s > 16: __clone3<unknown>
  1273. 185.35 s > at <unknown source file>:<unknown line>
  1274. 185.35 s >
  1275. 185.35 s > Run with COLORBT_SHOW_HIDDEN=1 environment variable to disable frame filtering.
  1276. 185.35 s > Run with RUST_BACKTRACE=full to include source snippets.
  1277. 185.35 s >
  1278. 185.35 s > error: test run failed
  1279. 185.35 s >
  1280. 185.35 s > ========== nextest test summary ==========
  1281. 185.35 s > report: target/nextest/ci_gammaloop/junit.xml
  1282. 185.35 s > tests: 106, failures: 9, errors: 0
  1283. 185.35 s >
  1284. 185.35 s > 1. gammaloop-integration-tests::test_runs::approach::approach_momentum_space_reports_incomplete_triplet_cleanly
  1285. 185.35 s > failure: test failure with exit code 101
  1286. 185.35 s > system-out
  1287. 185.35 s > running 1 test
  1288. 185.35 s > test approach::approach_momentum_space_reports_incomplete_triplet_cleanly ... FAILED
  1289. 185.35 s >
  1290. 185.35 s > failures:
  1291. 185.35 s >
  1292. 185.35 s > failures:
  1293. 185.35 s > approach::approach_momentum_space_reports_incomplete_triplet_cleanly
  1294. 185.35 s >
  1295. 185.35 s > test result: FAILED. 0 passed; 1 failed; 0 ignored; 0 measured; 82 filtered out; finished in 0.74s
  1296. 185.35 s > system-err
  1297. 185.35 s > [2026-09-02 17:40:14.378] @gammaloop_api::se... INFO : Running command import model scalars-default.json
  1298. 185.35 s > [2026-09-02 17:40:14.378] @import::model INFO : Loading built-in JSON model scalars-default
  1299. 185.35 s > [2026-09-02 17:40:14.384] @gammalooprs::model INFO : The following 2 external parameters were forced to zero by the restriction card:
  1300. 185.35 s > width_scalar_1, width_scalar_2
  1301. 185.35 s > [2026-09-02 17:40:14.386] @gammaloop_api::se... INFO : Running command remove processes
  1302. 185.35 s > [2026-09-02 17:40:14.387] @gammaloop_api::se... INFO : Running command generate amp scalar_1 > scalar_0 scalar_0 [{1}] --allowed-vertex-interactions V_3_SCALAR_022 V_3_SCALAR_122 -p triangle -i scalar_tri
  1303. 185.35 s > [2026-09-02 17:40:14.388] @feyngen::diagram_... INFO : 0s | Δ=0s | Starting Feynman graph generation with Symbolica...
  1304. 185.35 s > [2026-09-02 17:40:14.390] @feyngen::diagram_... INFO : 0s | Δ=0s | Number of graphs resulting from Symbolica generation: 1
  1305. 185.35 s > [2026-09-02 17:40:14.392] @feyngen::diagram_... INFO : 0s | Δ=0s | Number of graphs retained after removal of vetoed topologies: 1
  1306. 185.35 s > [2026-09-02 17:40:14.394] @feyngen::diagram_... INFO : 0s | Δ=0s | Number of graphs after vertex info assignment: 1
  1307. 185.35 s > [2026-09-02 17:40:14.394] @feyngen::diagram_... INFO : 0s | Δ=0s | Number of graphs after all complete graphs filters are applied: 1
  1308. 185.35 s > [2026-09-02 17:40:14.394] @feyngen::diagram_... INFO : 0s | Δ=0s | Number of graphs after closed fermion chains analysis: 1
  1309. 185.35 s > [2026-09-02 17:40:14.394] @feyngen::diagram_... INFO : 0s | Δ=0s | Number of graphs after symmetrization of external states: 1
  1310. 185.35 s > [2026-09-02 17:40:14.394] @feyngen::diagram_... INFO : 0s | Δ=0s | Number of graphs after canonization of vertices, edges and flows (graph labels assigned here): 1
  1311. 185.35 s > [2026-09-02 17:40:14.402] @feyngen::diagram_... INFO : 0s | Δ=0s | Number of graphs after numerator-aware grouping with strategy 'up to a scalar rescaling': 1 (1 isomorphically unique graph, 0 color zero, 0 lorentz zero, 0 grouped and 0 cancellation)
  1312. 185.35 s > [2026-09-02 17:40:14.402] @feyngen::diagram_... INFO : ( Sum of the symmetry factors from each graph generated = 1 )
  1313. 185.35 s > [2026-09-02 17:40:14.402] @commands::generate INFO : Generated amplitude 1 graphs.
  1314. 185.35 s > [2026-09-02 17:40:14.467] @settings::runtime WARNING : No external kinematics were provided; using default-generated external momenta and helicities.
  1315. 185.35 s > [2026-09-02 17:40:14.508] @commands::generate INFO :
  1316. 185.35 s > Integrand generation summary
  1317. 185.35 s > peak RAM 65.35 MiB | cores 1
  1318. 185.35 s > ╭────────────┬───────┬─────────┬────────────┬─────────────┬────────────────┬─────────────╮
  1319. 185.35 s > │ integrand │ graph │ # evals │ expr build │ spenso │ symbolica eval │ compile │
  1320. 185.35 s > ├────────────┼───────┼─────────┼────────────┼─────────────┼────────────────┼─────────────┤
  1321. 185.35 s > │ scalar_tri │ GL0 │ 9 │ 36ms (61%) │ 5ms (10.0%) │ 17ms (29%) │ 0ms (0.00%) │
  1322. 185.35 s > ├────────────┼───────┼─────────┼────────────┼─────────────┼────────────────┼─────────────┤
  1323. 185.35 s > │ Total │ │ 9 │ 36ms (61%) │ 5ms (10.0%) │ 17ms (29%) │ 0ms (0.00%) │
  1324. 185.35 s > ╰────────────┴───────┴─────────┴────────────┴─────────────┴────────────────┴─────────────╯
  1325. 185.35 s > [2026-09-02 17:40:14.509] @gammaloop_api::se... INFO : Running command generate amp scalar_0 scalar_0 > scalar_0 scalar_0 [{1}] --allowed-vertex-interactions V_3_SCALAR_022 -p box -i scalar_box --select-graphs GL0
  1326. 185.35 s > [2026-09-02 17:40:14.511] @feyngen::diagram_... INFO : 0s | Δ=0s | Starting Feynman graph generation with Symbolica...
  1327. 185.35 s > [2026-09-02 17:40:14.511] @feyngen::diagram_... INFO : 0s | Δ=0s | Number of graphs resulting from Symbolica generation: 3
  1328. 185.35 s > [2026-09-02 17:40:14.518] @feyngen::diagram_... INFO : 0s | Δ=0s | Number of graphs retained after removal of vetoed topologies: 3
  1329. 185.35 s > [2026-09-02 17:40:14.522] @feyngen::diagram_... INFO : 0s | Δ=0s | Number of graphs after vertex info assignment: 3
  1330. 185.35 s > [2026-09-02 17:40:14.522] @feyngen::diagram_... INFO : 0s | Δ=0s | Number of graphs after all complete graphs filters are applied: 3
  1331. 185.35 s > [2026-09-02 17:40:14.525] @feyngen::diagram_... INFO : 0s | Δ=0s | Number of graphs after closed fermion chains analysis: 3
  1332. 185.35 s > [2026-09-02 17:40:14.525] @feyngen::diagram_... INFO : 0s | Δ=0s | Number of graphs after symmetrization of external states: 3
  1333. 185.35 s > [2026-09-02 17:40:14.526] @feyngen::diagram_... INFO : 0s | Δ=0s | Number of graphs after canonization of vertices, edges and flows (graph labels assigned here): 3
  1334. 185.35 s > [2026-09-02 17:40:14.542] @feyngen::diagram_... INFO : 0s | Δ=0s | Number of graphs after numerator-aware grouping with strategy 'up to a scalar rescaling': 1 (1 isomorphically unique graph, 0 color zero, 0 lorentz zero, 0 grouped and 0 cancellation)
  1335. 185.35 s > [2026-09-02 17:40:14.542] @feyngen::diagram_... INFO : ( Sum of the symmetry factors from each graph generated = 1 )
  1336. 185.35 s > [2026-09-02 17:40:14.542] @commands::generate INFO : Generated amplitude 1 graphs.
  1337. 185.35 s > [2026-09-02 17:40:14.678] @settings::runtime WARNING : No external kinematics were provided; using default-generated external momenta and helicities.
  1338. 185.35 s > [2026-09-02 17:40:14.761] @commands::generate INFO :
  1339. 185.35 s > Integrand generation summary
  1340. 185.35 s > peak RAM 69.54 MiB | cores 1
  1341. 185.35 s > ╭────────────┬───────┬─────────┬────────────┬─────────────┬────────────────┬─────────────╮
  1342. 185.35 s > │ integrand │ graph │ # evals │ expr build │ spenso │ symbolica eval │ compile │
  1343. 185.35 s > ├────────────┼───────┼─────────┼────────────┼─────────────┼────────────────┼─────────────┤
  1344. 185.35 s > │ scalar_box │ GL0 │ 13 │ 76ms (57%) │ 12ms (9.5%) │ 44ms (33%) │ 0ms (0.00%) │
  1345. 185.35 s > ├────────────┼───────┼─────────┼────────────┼─────────────┼────────────────┼─────────────┤
  1346. 185.35 s > │ Total │ │ 13 │ 76ms (57%) │ 12ms (9.5%) │ 44ms (33%) │ 0ms (0.00%) │
  1347. 185.35 s > ╰────────────┴───────┴─────────┴────────────┴─────────────┴────────────────┴─────────────╯
  1348. 185.35 s > [2026-09-02 17:40:14.763] @gammaloop_api::se... INFO : Running command generate
  1349. 185.35 s > [2026-09-02 17:40:14.891] @settings::runtime WARNING : No external kinematics were provided; using default-generated external momenta and helicities.
  1350. 185.35 s > [2026-09-02 17:40:14.939] @settings::runtime WARNING : No external kinematics were provided; using default-generated external momenta and helicities.
  1351. 185.35 s > [2026-09-02 17:40:14.976] @commands::generate INFO :
  1352. 185.35 s > Integrand generation summary
  1353. 185.35 s > peak RAM 70.64 MiB | cores 1
  1354. 185.35 s > ╭────────────┬───────┬─────────┬─────────────┬─────────────┬────────────────┬─────────────╮
  1355. 185.35 s > │ integrand │ graph │ # evals │ expr build │ spenso │ symbolica eval │ compile │
  1356. 185.35 s > ├────────────┼───────┼─────────┼─────────────┼─────────────┼────────────────┼─────────────┤
  1357. 185.35 s > │ scalar_tri │ GL0 │ 9 │ 31ms (76%) │ 2ms (5.4%) │ 7ms (18%) │ 0ms (0.00%) │
  1358. 185.35 s > │ scalar_box │ GL0 │ 13 │ 76ms (62%) │ 10ms (8.3%) │ 36ms (30%) │ 0ms (0.00%) │
  1359. 185.36 s > ├────────────┼───────┼─────────┼─────────────┼─────────────┼────────────────┼─────────────┤
  1360. 185.36 s > │ Total │ │ 22 │ 108ms (66%) │ 12ms (7.5%) │ 44ms (27%) │ 0ms (0.00%) │
  1361. 185.36 s > ╰────────────┴───────┴─────────┴─────────────┴─────────────┴────────────────┴─────────────╯
  1362. 185.36 s > [2026-09-02 17:40:14.977] @gammaloop_api::se... INFO : Running command set model mass_scalar_2=2.0
  1363. 185.36 s > [2026-09-02 17:40:14.979] @gammaloop_api::se... INFO : Running command set model mass_scalar_1=1.0
  1364. 185.36 s > [2026-09-02 17:40:14.980] @gammaloop_api::se... INFO : Running command set process -p triangle -i scalar_tri string '
  1365. 185.36 s > [kinematics.externals]
  1366. 185.36 s > type = "constant"
  1367. 185.36 s >
  1368. 185.36 s > [kinematics.externals.data]
  1369. 185.36 s > [...]
  1370. 185.36 s > [2026-09-02 17:40:14.981] @gammaloop_api::se... INFO : Running command set process -p box -i scalar_box string '
  1371. 185.36 s > [kinematics.externals]
  1372. 185.36 s > type = "constant"
  1373. 185.36 s >
  1374. 185.36 s > [kinematics.externals.data]
  1375. 185.36 s > [...]
  1376. 185.36 s > [2026-09-02 17:40:14.982] @gammaloop_api::se... INFO : Running command approach -x 1.0000000000000001e-1,2.0000000000000001e-1,2.9999999999999999e-1,4.0000000000000002e-1 --approach-axis 1.0000000000000000e-3,0.0000000000000000e0,0.0000000000000000e0,0.0000000000000000e0 --n-points 1 --n-cores 1 --output-results /build/source/tests/artifacts/scalar_box_invalid_momentum_approach/approach_momentum.json --momentum-space --graph-id 0
  1377. 185.36 s > The application panicked (crashed).
  1378. 185.36 s > Message: There are 2 processes available. Please specify a process.
  1379. 185.36 s > Location: tests/tests/test_runs/approach.rs:332
  1380. 185.36 s >
  1381. 185.36 s > ━━━━━━━━━━━━━━━━━━━━━━━━━━━━━━━━━━ BACKTRACE ━━━━━━━━━━━━━━━━━━━━━━━━━━━━━━━━━━━
  1382. 185.36 s > 1: <color_eyre[bb06c27fa12d52c3]::config::PanicHook>::panic_report<unknown>
  1383. 185.36 s > at <unknown source file>:<unknown line>
  1384. 185.36 s > 2: <color_eyre[bb06c27fa12d52c3]::config::PanicHook>::into_panic_hook::{closure#0}<unknown>
  1385. 185.36 s > at <unknown source file>:<unknown line>
  1386. 185.36 s > 3: std[5167731717db2e51]::panicking::panic_with_hook<unknown>
  1387. 185.36 s > at <unknown source file>:<unknown line>
  1388. 185.36 s > 4: std[5167731717db2e51]::panicking::panic_handler::{closure#0}<unknown>
  1389. 185.36 s > at <unknown source file>:<unknown line>
  1390. 185.36 s > 5: std[5167731717db2e51]::sys::backtrace::__rust_end_short_backtrace::<std[5167731717db2e51]::panicking::panic_handler::{closure#0}, !><unknown>
  1391. 185.36 s > at <unknown source file>:<unknown line>
  1392. 185.36 s > 6: __rustc[4b1ee1ef74718a7b]::rust_begin_unwind<unknown>
  1393. 185.36 s > at <unknown source file>:<unknown line>
  1394. 185.36 s > 7: core[8c5ac2f034688f9a]::panicking::panic_fmt<unknown>
  1395. 185.36 s > at <unknown source file>:<unknown line>
  1396. 185.36 s > 8: test_runs[928b8788563090d0]::approach::approach_momentum_space_reports_incomplete_triplet_cleanly<unknown>
  1397. 185.36 s > at <unknown source file>:<unknown line>
  1398. 185.36 s > 9: <test_runs[928b8788563090d0]::approach::approach_momentum_space_reports_incomplete_triplet_cleanly::{closure#0} as core[8c5ac2f034688f9a]::ops::function::FnOnce<()>>::call_once<unknown>
  1399. 185.36 s > at <unknown source file>:<unknown line>
  1400. 185.36 s > 10: test[7974841f8dbd3561]::__rust_begin_short_backtrace::<core[8c5ac2f034688f9a]::result::Result<(), alloc[93e694a8365d93dd]::string::String>, fn() -> core[8c5ac2f034688f9a]::result::Result<(), alloc[93e694a8365d93dd]::string::String>><unknown>
  1401. 185.36 s > at <unknown source file>:<unknown line>
  1402. 185.36 s > 11: test[7974841f8dbd3561]::run_test::{closure#0}<unknown>
  1403. 185.36 s > at <unknown source file>:<unknown line>
  1404. 185.36 s > 12: std[5167731717db2e51]::sys::backtrace::__rust_begin_short_backtrace::<test[7974841f8dbd3561]::run_test::{closure#1}, ()><unknown>
  1405. 185.36 s > at <unknown source file>:<unknown line>
  1406. 185.36 s > 13: <std[5167731717db2e51]::thread::lifecycle::spawn_unchecked<test[7974841f8dbd3561]::run_test::{closure#1}, ()>::{closure#1} as core[8c5ac2f034688f9a]::ops::function::FnOnce<()>>::call_once::{shim:vtable#0}<unknown>
  1407. 185.36 s > at <unknown source file>:<unknown line>
  1408. 185.36 s > 14: <std[5167731717db2e51]::sys::thread::unix::Thread>::new::thread_start<unknown>
  1409. 185.36 s > at <unknown source file>:<unknown line>
  1410. 185.36 s > 15: start_thread<unknown>
  1411. 185.36 s > at <unknown source file>:<unknown line>
  1412. 185.36 s > 16: __clone3<unknown>
  1413. 185.36 s > at <unknown source file>:<unknown line>
  1414. 185.36 s >
  1415. 185.36 s > Run with COLORBT_SHOW_HIDDEN=1 environment variable to disable frame filtering.
  1416. 185.36 s > ... omitted 1 more lines; see full nextest output above
  1417. 185.36 s >
  1418. 185.36 s > 2. gammaloop-integration-tests::test_runs::profile_bulk::dotted_bubble_amp_bulk_profile_passes
  1419. 185.36 s > failure: test failure with exit code 101
  1420. 185.36 s > Error:
  1421. 185.36 s > 0: IR profiling requested arbitrary precision but received a quad-precision result
  1422. 185.36 s >
  1423. 185.36 s > Location:
  1424. 185.36 s > crates/gammalooprs/src/integrands/process/ir.rs:2123
  1425. 185.36 s >
  1426. 185.36 s > ━━━━━━━━━━━━━━━━━━━━━━━━━━━━━━━━━━ BACKTRACE ━━━━━━━━━━━━━━━━━━━━━━━━━━━━━━━━━━━
  1427. 185.36 s > 1: <color_eyre[bb06c27fa12d52c3]::config::EyreHook>::into_eyre_hook::{closure#0}<unknown>
  1428. 185.36 s > at <unknown source file>:<unknown line>
  1429. 185.36 s > 2: eyre[9f660d63ab6a72c5]::capture_handler<unknown>
  1430. 185.36 s > at <unknown source file>:<unknown line>
  1431. 185.36 s > 3: eyre[9f660d63ab6a72c5]::private::format_err<unknown>
  1432. 185.36 s > at <unknown source file>:<unknown line>
  1433. 185.36 s > 4: gammalooprs[1b273202b0029755]::integrands::process::ir::evaluate_profile_momentum_point_arb::<gammalooprs[1b273202b0029755]::integrands::process::amplitude::AmplitudeIntegrand><unknown>
  1434. 185.36 s > at <unknown source file>:<unknown line>
  1435. 185.36 s > 5: <gammalooprs[1b273202b0029755]::integrands::process::amplitude::AmplitudeIntegrand>::test_single_ir_limit_impl<unknown>
  1436. 185.36 s > at <unknown source file>:<unknown line>
  1437. 185.36 s > 6: gammalooprs[1b273202b0029755]::integrands::process::ir::run_ir_profile::<gammalooprs[1b273202b0029755]::integrands::process::amplitude::AmplitudeIntegrand, <gammalooprs[1b273202b0029755]::integrands::process::amplitude::AmplitudeIntegrand>::enumerate_ir_limits, <gammalooprs[1b273202b0029755]::integrands::process::amplitude::AmplitudeIntegrand>::graph_cut_definitions, <gammalooprs[1b273202b0029755]::integrands::process::amplitude::AmplitudeIntegrand>::test_single_ir_limit_impl><unknown>
  1438. 185.36 s > at <unknown source file>:<unknown line>
  1439. 185.36 s > 7: <gammalooprs[1b273202b0029755]::integrands::process::amplitude::AmplitudeIntegrand>::test_ir<unknown>
  1440. 185.36 s > at <unknown source file>:<unknown line>
  1441. 185.36 s > 8: <gammaloop_api[9fdde70dfc7501ea]::commands::profile::Profile>::run<unknown>
  1442. 185.36 s > at <unknown source file>:<unknown line>
  1443. 185.36 s > 9: test_runs[928b8788563090d0]::profile_bulk::dotted_bubble_amp_bulk_profile_passes<unknown>
  1444. 185.36 s > at <unknown source file>:<unknown line>
  1445. 185.36 s > 10: <test_runs[928b8788563090d0]::profile_bulk::dotted_bubble_amp_bulk_profile_passes::{closure#0} as core[8c5ac2f034688f9a]::ops::function::FnOnce<()>>::call_once<unknown>
  1446. 185.36 s > at <unknown source file>:<unknown line>
  1447. 185.36 s > 11: test[7974841f8dbd3561]::__rust_begin_short_backtrace::<core[8c5ac2f034688f9a]::result::Result<(), alloc[93e694a8365d93dd]::string::String>, fn() -> core[8c5ac2f034688f9a]::result::Result<(), alloc[93e694a8365d93dd]::string::String>><unknown>
  1448. 185.36 s > at <unknown source file>:<unknown line>
  1449. 185.36 s > 12: test[7974841f8dbd3561]::run_test::{closure#0}<unknown>
  1450. 185.36 s > at <unknown source file>:<unknown line>
  1451. 185.36 s > 13: std[5167731717db2e51]::sys::backtrace::__rust_begin_short_backtrace::<test[7974841f8dbd3561]::run_test::{closure#1}, ()><unknown>
  1452. 185.36 s > at <unknown source file>:<unknown line>
  1453. 185.36 s > 14: <std[5167731717db2e51]::thread::lifecycle::spawn_unchecked<test[7974841f8dbd3561]::run_test::{closure#1}, ()>::{closure#1} as core[8c5ac2f034688f9a]::ops::function::FnOnce<()>>::call_once::{shim:vtable#0}<unknown>
  1454. 185.36 s > at <unknown source file>:<unknown line>
  1455. 185.36 s > 15: <std[5167731717db2e51]::sys::thread::unix::Thread>::new::thread_start<unknown>
  1456. 185.36 s > at <unknown source file>:<unknown line>
  1457. 185.36 s > 16: start_thread<unknown>
  1458. 185.36 s > at <unknown source file>:<unknown line>
  1459. 185.36 s > 17: __clone3<unknown>
  1460. 185.36 s > at <unknown source file>:<unknown line>
  1461. 185.36 s >
  1462. 185.36 s > Run with COLORBT_SHOW_HIDDEN=1 environment variable to disable frame filtering.
  1463. 185.36 s > Run with RUST_BACKTRACE=full to include source snippets.
  1464. 185.36 s > Warning: SpanTrace capture is Unsupported.
  1465. 185.36 s > Ensure that you've setup a tracing-error ErrorLayer and the semver versions are compatible
  1466. 185.36 s > system-out
  1467. 185.36 s > running 1 test
  1468. 185.36 s > test profile_bulk::dotted_bubble_amp_bulk_profile_passes ... FAILED
  1469. 185.36 s >
  1470. 185.36 s > failures:
  1471. 185.36 s >
  1472. 185.36 s > failures:
  1473. 185.36 s > profile_bulk::dotted_bubble_amp_bulk_profile_passes
  1474. 185.36 s >
  1475. 185.36 s > test result: FAILED. 0 passed; 1 failed; 0 ignored; 0 measured; 82 filtered out; finished in 0.30s
  1476. 185.36 s > system-err
  1477. 185.36 s > [2026-09-02 17:40:16.671] @gammaloop_api::se... INFO : Running command import model ./assets/models/json/scalars/scalars_2p_3p.json
  1478. 185.36 s > [2026-09-02 17:40:16.672] @import::model INFO : Loading JSON model scalars_2p_3p-default from /build/source/assets/models/json/scalars/scalars_2p_3p
  1479. 185.36 s > [2026-09-02 17:40:16.673] @gammaloop_api::se... INFO : Running command import graphs ./tests/resources/graphs/dotted_bubble_amp.dot
  1480. 185.36 s > [2026-09-02 17:40:16.673] @commands::import INFO : Loading graphs from '/build/source/tests/resources/graphs/dotted_bubble_amp.dot'
  1481. 185.36 s > [2026-09-02 17:40:16.676] @gammaloop_api::se... INFO : Running command generate
  1482. 185.36 s > [2026-09-02 17:40:16.791] @commands::generate INFO :
  1483. 185.36 s > Integrand generation summary
  1484. 185.36 s > peak RAM 62.22 MiB | cores 1
  1485. 185.36 s > ╭───────────┬───────────────────┬─────────┬────────────┬────────────┬────────────────┬─────────────╮
  1486. 185.36 s > │ integrand │ graph │ # evals │ expr build │ spenso │ symbolica eval │ compile │
  1487. 185.36 s > ├───────────┼───────────────────┼─────────┼────────────┼────────────┼────────────────┼─────────────┤
  1488. 185.36 s > │ default │ dotted_bubble_amp │ 8 │ 33ms (68%) │ 1ms (3.0%) │ 14ms (29%) │ 0ms (0.00%) │
  1489. 185.36 s > ├───────────┼───────────────────┼─────────┼────────────┼────────────┼────────────────┼─────────────┤
  1490. 185.36 s > │ Total │ │ 8 │ 33ms (68%) │ 1ms (3.0%) │ 14ms (29%) │ 0ms (0.00%) │
  1491. 185.36 s > ╰───────────┴───────────────────┴─────────┴────────────┴────────────┴────────────────┴─────────────╯
  1492. 185.36 s > [2026-09-02 17:40:16.793] @process::amplitude INFO : Input is above threshold: 1 existing threshold E-surfaces across 1/1 graph groups
  1493. 185.36 s > [2026-09-02 17:40:16.793] @process::amplitude INFO : overlap structure of group 0: [1: [1(1,3)]]
  1494. 185.36 s > Error:
  1495. 185.36 s > 0: IR profiling requested arbitrary precision but received a quad-precision result
  1496. 185.36 s >
  1497. 185.36 s > Location:
  1498. 185.36 s > crates/gammalooprs/src/integrands/process/ir.rs:2123
  1499. 185.36 s >
  1500. 185.36 s > ━━━━━━━━━━━━━━━━━━━━━━━━━━━━━━━━━━ BACKTRACE ━━━━━━━━━━━━━━━━━━━━━━━━━━━━━━━━━━━
  1501. 185.36 s > 1: <color_eyre[bb06c27fa12d52c3]::config::EyreHook>::into_eyre_hook::{closure#0}<unknown>
  1502. 185.36 s > at <unknown source file>:<unknown line>
  1503. 185.36 s > 2: eyre[9f660d63ab6a72c5]::capture_handler<unknown>
  1504. 185.36 s > at <unknown source file>:<unknown line>
  1505. 185.36 s > 3: eyre[9f660d63ab6a72c5]::private::format_err<unknown>
  1506. 185.36 s > at <unknown source file>:<unknown line>
  1507. 185.36 s > 4: gammalooprs[1b273202b0029755]::integrands::process::ir::evaluate_profile_momentum_point_arb::<gammalooprs[1b273202b0029755]::integrands::process::amplitude::AmplitudeIntegrand><unknown>
  1508. 185.36 s > at <unknown source file>:<unknown line>
  1509. 185.36 s > 5: <gammalooprs[1b273202b0029755]::integrands::process::amplitude::AmplitudeIntegrand>::test_single_ir_limit_impl<unknown>
  1510. 185.36 s > at <unknown source file>:<unknown line>
  1511. 185.36 s > 6: gammalooprs[1b273202b0029755]::integrands::process::ir::run_ir_profile::<gammalooprs[1b273202b0029755]::integrands::process::amplitude::AmplitudeIntegrand, <gammalooprs[1b273202b0029755]::integrands::process::amplitude::AmplitudeIntegrand>::enumerate_ir_limits, <gammalooprs[1b273202b0029755]::integrands::process::amplitude::AmplitudeIntegrand>::graph_cut_definitions, <gammalooprs[1b273202b0029755]::integrands::process::amplitude::AmplitudeIntegrand>::test_single_ir_limit_impl><unknown>
  1512. 185.36 s > at <unknown source file>:<unknown line>
  1513. 185.36 s > 7: <gammalooprs[1b273202b0029755]::integrands::process::amplitude::AmplitudeIntegrand>::test_ir<unknown>
  1514. 185.36 s > at <unknown source file>:<unknown line>
  1515. 185.36 s > 8: <gammaloop_api[9fdde70dfc7501ea]::commands::profile::Profile>::run<unknown>
  1516. 185.36 s > at <unknown source file>:<unknown line>
  1517. 185.36 s > 9: test_runs[928b8788563090d0]::profile_bulk::dotted_bubble_amp_bulk_profile_passes<unknown>
  1518. 185.36 s > at <unknown source file>:<unknown line>
  1519. 185.36 s > 10: <test_runs[928b8788563090d0]::profile_bulk::dotted_bubble_amp_bulk_profile_passes::{closure#0} as core[8c5ac2f034688f9a]::ops::function::FnOnce<()>>::call_once<unknown>
  1520. 185.36 s > at <unknown source file>:<unknown line>
  1521. 185.36 s > 11: test[7974841f8dbd3561]::__rust_begin_short_backtrace::<core[8c5ac2f034688f9a]::result::Result<(), alloc[93e694a8365d93dd]::string::String>, fn() -> core[8c5ac2f034688f9a]::result::Result<(), alloc[93e694a8365d93dd]::string::String>><unknown>
  1522. 185.36 s > at <unknown source file>:<unknown line>
  1523. 185.36 s > 12: test[7974841f8dbd3561]::run_test::{closure#0}<unknown>
  1524. 185.36 s > at <unknown source file>:<unknown line>
  1525. 185.36 s > 13: std[5167731717db2e51]::sys::backtrace::__rust_begin_short_backtrace::<test[7974841f8dbd3561]::run_test::{closure#1}, ()><unknown>
  1526. 185.36 s > at <unknown source file>:<unknown line>
  1527. 185.36 s > 14: <std[5167731717db2e51]::thread::lifecycle::spawn_unchecked<test[7974841f8dbd3561]::run_test::{closure#1}, ()>::{closure#1} as core[8c5ac2f034688f9a]::ops::function::FnOnce<()>>::call_once::{shim:vtable#0}<unknown>
  1528. 185.36 s > at <unknown source file>:<unknown line>
  1529. 185.36 s > 15: <std[5167731717db2e51]::sys::thread::unix::Thread>::new::thread_start<unknown>
  1530. 185.36 s > at <unknown source file>:<unknown line>
  1531. 185.36 s > 16: start_thread<unknown>
  1532. 185.36 s > at <unknown source file>:<unknown line>
  1533. 185.36 s > 17: __clone3<unknown>
  1534. 185.36 s > at <unknown source file>:<unknown line>
  1535. 185.36 s >
  1536. 185.36 s > Run with COLORBT_SHOW_HIDDEN=1 environment variable to disable frame filtering.
  1537. 185.36 s > Run with RUST_BACKTRACE=full to include source snippets.
  1538. 185.36 s > Warning: SpanTrace capture is Unsupported.
  1539. 185.36 s > Ensure that you've setup a tracing-error ErrorLayer and the semver versions are compatible
  1540. 185.36 s >
  1541. 185.36 s > 3. gammaloop-integration-tests::test_runs::profile_bulk::box_4e_bulk_profile_passes
  1542. 185.36 s > failure: test failure with exit code 101
  1543. 185.36 s > Error:
  1544. 185.36 s > 0: IR profiling requested arbitrary precision but received a quad-precision result
  1545. 185.36 s >
  1546. 185.36 s > Location:
  1547. 185.36 s > crates/gammalooprs/src/integrands/process/ir.rs:2123
  1548. 185.36 s >
  1549. 185.36 s > ━━━━━━━━━━━━━━━━━━━━━━━━━━━━━━━━━━ BACKTRACE ━━━━━━━━━━━━━━━━━━━━━━━━━━━━━━━━━━━
  1550. 185.36 s > 1: <color_eyre[bb06c27fa12d52c3]::config::EyreHook>::into_eyre_hook::{closure#0}<unknown>
  1551. 185.36 s > at <unknown source file>:<unknown line>
  1552. 185.36 s > 2: eyre[9f660d63ab6a72c5]::capture_handler<unknown>
  1553. 185.36 s > at <unknown source file>:<unknown line>
  1554. 185.36 s > 3: eyre[9f660d63ab6a72c5]::private::format_err<unknown>
  1555. 185.36 s > at <unknown source file>:<unknown line>
  1556. 185.36 s > 4: gammalooprs[1b273202b0029755]::integrands::process::ir::evaluate_profile_momentum_point_arb::<gammalooprs[1b273202b0029755]::integrands::process::amplitude::AmplitudeIntegrand><unknown>
  1557. 185.36 s > at <unknown source file>:<unknown line>
  1558. 185.36 s > 5: <gammalooprs[1b273202b0029755]::integrands::process::amplitude::AmplitudeIntegrand>::test_single_ir_limit_impl<unknown>
  1559. 185.36 s > at <unknown source file>:<unknown line>
  1560. 185.36 s > 6: gammalooprs[1b273202b0029755]::integrands::process::ir::run_ir_profile::<gammalooprs[1b273202b0029755]::integrands::process::amplitude::AmplitudeIntegrand, <gammalooprs[1b273202b0029755]::integrands::process::amplitude::AmplitudeIntegrand>::enumerate_ir_limits, <gammalooprs[1b273202b0029755]::integrands::process::amplitude::AmplitudeIntegrand>::graph_cut_definitions, <gammalooprs[1b273202b0029755]::integrands::process::amplitude::AmplitudeIntegrand>::test_single_ir_limit_impl><unknown>
  1561. 185.36 s > at <unknown source file>:<unknown line>
  1562. 185.36 s > 7: <gammalooprs[1b273202b0029755]::integrands::process::amplitude::AmplitudeIntegrand>::test_ir<unknown>
  1563. 185.36 s > at <unknown source file>:<unknown line>
  1564. 185.36 s > 8: <gammaloop_api[9fdde70dfc7501ea]::commands::profile::Profile>::run<unknown>
  1565. 185.36 s > at <unknown source file>:<unknown line>
  1566. 185.36 s > 9: test_runs[928b8788563090d0]::profile_bulk::box_4e_bulk_profile_passes<unknown>
  1567. 185.36 s > at <unknown source file>:<unknown line>
  1568. 185.36 s > 10: <test_runs[928b8788563090d0]::profile_bulk::box_4e_bulk_profile_passes::{closure#0} as core[8c5ac2f034688f9a]::ops::function::FnOnce<()>>::call_once<unknown>
  1569. 185.36 s > at <unknown source file>:<unknown line>
  1570. 185.36 s > 11: test[7974841f8dbd3561]::__rust_begin_short_backtrace::<core[8c5ac2f034688f9a]::result::Result<(), alloc[93e694a8365d93dd]::string::String>, fn() -> core[8c5ac2f034688f9a]::result::Result<(), alloc[93e694a8365d93dd]::string::String>><unknown>
  1571. 185.36 s > at <unknown source file>:<unknown line>
  1572. 185.36 s > 12: test[7974841f8dbd3561]::run_test::{closure#0}<unknown>
  1573. 185.36 s > at <unknown source file>:<unknown line>
  1574. 185.36 s > 13: std[5167731717db2e51]::sys::backtrace::__rust_begin_short_backtrace::<test[7974841f8dbd3561]::run_test::{closure#1}, ()><unknown>
  1575. 185.36 s > at <unknown source file>:<unknown line>
  1576. 185.36 s > 14: <std[5167731717db2e51]::thread::lifecycle::spawn_unchecked<test[7974841f8dbd3561]::run_test::{closure#1}, ()>::{closure#1} as core[8c5ac2f034688f9a]::ops::function::FnOnce<()>>::call_once::{shim:vtable#0}<unknown>
  1577. 185.36 s > at <unknown source file>:<unknown line>
  1578. 185.36 s > 15: <std[5167731717db2e51]::sys::thread::unix::Thread>::new::thread_start<unknown>
  1579. 185.36 s > at <unknown source file>:<unknown line>
  1580. 185.36 s > 16: start_thread<unknown>
  1581. 185.36 s > at <unknown source file>:<unknown line>
  1582. 185.36 s > 17: __clone3<unknown>
  1583. 185.36 s > at <unknown source file>:<unknown line>
  1584. 185.36 s >
  1585. 185.36 s > Run with COLORBT_SHOW_HIDDEN=1 environment variable to disable frame filtering.
  1586. 185.36 s > Run with RUST_BACKTRACE=full to include source snippets.
  1587. 185.36 s > Warning: SpanTrace capture is Unsupported.
  1588. 185.36 s > Ensure that you've setup a tracing-error ErrorLayer and the semver versions are compatible
  1589. 185.36 s > system-out
  1590. 185.36 s > running 1 test
  1591. 185.36 s > test profile_bulk::box_4e_bulk_profile_passes ... FAILED
  1592. 185.36 s >
  1593. 185.36 s > failures:
  1594. 185.36 s >
  1595. 185.36 s > failures:
  1596. 185.36 s > profile_bulk::box_4e_bulk_profile_passes
  1597. 185.36 s >
  1598. 185.36 s > test result: FAILED. 0 passed; 1 failed; 0 ignored; 0 measured; 82 filtered out; finished in 0.71s
  1599. 185.36 s > system-err
  1600. 185.36 s > [2026-09-02 17:40:16.725] @gammaloop_api::se... INFO : Running command import model ./assets/models/json/scalars/scalars.json
  1601. 185.36 s > [2026-09-02 17:40:16.725] @import::model INFO : Loading JSON model scalars-default from /build/source/assets/models/json/scalars/scalars
  1602. 185.36 s > [2026-09-02 17:40:16.748] @gammalooprs::model INFO : The following 2 external parameters were forced to zero by the restriction card:
  1603. 185.36 s > width_scalar_1, width_scalar_2
  1604. 185.36 s > [2026-09-02 17:40:16.750] @gammaloop_api::se... INFO : Running command import graphs ./tests/resources/graphs/massless_box.dot
  1605. 185.36 s > [2026-09-02 17:40:16.750] @commands::import INFO : Loading graphs from '/build/source/tests/resources/graphs/massless_box.dot'
  1606. 185.36 s > [2026-09-02 17:40:16.773] @gammaloop_api::se... INFO : Running command generate
  1607. 185.36 s > [2026-09-02 17:40:16.984] @commands::generate INFO :
  1608. 185.36 s > Integrand generation summary
  1609. 185.36 s > peak RAM 67.04 MiB | cores 1
  1610. 185.36 s > ╭───────────┬────────────────┬─────────┬────────────┬────────────┬────────────────┬─────────────╮
  1611. 185.36 s > │ integrand │ graph │ # evals │ expr build │ spenso │ symbolica eval │ compile │
  1612. 185.36 s > ├───────────┼────────────────┼─────────┼────────────┼────────────┼────────────────┼─────────────┤
  1613. 185.36 s > │ default │ massless_box_0 │ 14 │ 77ms (41%) │ 60ms (32%) │ 49ms (27%) │ 0ms (0.00%) │
  1614. 185.36 s > ├───────────┼────────────────┼─────────┼────────────┼────────────┼────────────────┼─────────────┤
  1615. 185.36 s > │ Total │ │ 14 │ 77ms (41%) │ 60ms (32%) │ 49ms (27%) │ 0ms (0.00%) │
  1616. 185.36 s > ╰───────────┴────────────────┴─────────┴────────────┴────────────┴────────────────┴─────────────╯
  1617. 185.36 s > [2026-09-02 17:40:16.998] @process::amplitude INFO : Input is above threshold: 4 existing threshold E-surfaces across 1/1 graph groups
  1618. 185.36 s > [2026-09-02 17:40:16.999] @process::amplitude INFO : overlap structure of group 0: [2: [4(3,4), 8(4,6)], 2: [4(3,4), 9(3,5)], 2: [9(3,5), 11(5,6)], 2: [8(4,6), 11(5,6)]]
  1619. 185.36 s > Error:
  1620. 185.36 s > 0: IR profiling requested arbitrary precision but received a quad-precision result
  1621. 185.36 s >
  1622. 185.36 s > Location:
  1623. 185.36 s > crates/gammalooprs/src/integrands/process/ir.rs:2123
  1624. 185.36 s >
  1625. 185.36 s > ━━━━━━━━━━━━━━━━━━━━━━━━━━━━━━━━━━ BACKTRACE ━━━━━━━━━━━━━━━━━━━━━━━━━━━━━━━━━━━
  1626. 185.36 s > 1: <color_eyre[bb06c27fa12d52c3]::config::EyreHook>::into_eyre_hook::{closure#0}<unknown>
  1627. 185.36 s > at <unknown source file>:<unknown line>
  1628. 185.36 s > 2: eyre[9f660d63ab6a72c5]::capture_handler<unknown>
  1629. 185.36 s > at <unknown source file>:<unknown line>
  1630. 185.36 s > 3: eyre[9f660d63ab6a72c5]::private::format_err<unknown>
  1631. 185.36 s > at <unknown source file>:<unknown line>
  1632. 185.36 s > 4: gammalooprs[1b273202b0029755]::integrands::process::ir::evaluate_profile_momentum_point_arb::<gammalooprs[1b273202b0029755]::integrands::process::amplitude::AmplitudeIntegrand><unknown>
  1633. 185.36 s > at <unknown source file>:<unknown line>
  1634. 185.36 s > 5: <gammalooprs[1b273202b0029755]::integrands::process::amplitude::AmplitudeIntegrand>::test_single_ir_limit_impl<unknown>
  1635. 185.36 s > at <unknown source file>:<unknown line>
  1636. 185.36 s > 6: gammalooprs[1b273202b0029755]::integrands::process::ir::run_ir_profile::<gammalooprs[1b273202b0029755]::integrands::process::amplitude::AmplitudeIntegrand, <gammalooprs[1b273202b0029755]::integrands::process::amplitude::AmplitudeIntegrand>::enumerate_ir_limits, <gammalooprs[1b273202b0029755]::integrands::process::amplitude::AmplitudeIntegrand>::graph_cut_definitions, <gammalooprs[1b273202b0029755]::integrands::process::amplitude::AmplitudeIntegrand>::test_single_ir_limit_impl><unknown>
  1637. 185.36 s > at <unknown source file>:<unknown line>
  1638. 185.36 s > 7: <gammalooprs[1b273202b0029755]::integrands::process::amplitude::AmplitudeIntegrand>::test_ir<unknown>
  1639. 185.36 s > at <unknown source file>:<unknown line>
  1640. 185.36 s > 8: <gammaloop_api[9fdde70dfc7501ea]::commands::profile::Profile>::run<unknown>
  1641. 185.36 s > at <unknown source file>:<unknown line>
  1642. 185.36 s > 9: test_runs[928b8788563090d0]::profile_bulk::box_4e_bulk_profile_passes<unknown>
  1643. 185.36 s > at <unknown source file>:<unknown line>
  1644. 185.36 s > 10: <test_runs[928b8788563090d0]::profile_bulk::box_4e_bulk_profile_passes::{closure#0} as core[8c5ac2f034688f9a]::ops::function::FnOnce<()>>::call_once<unknown>
  1645. 185.36 s > at <unknown source file>:<unknown line>
  1646. 185.36 s > 11: test[7974841f8dbd3561]::__rust_begin_short_backtrace::<core[8c5ac2f034688f9a]::result::Result<(), alloc[93e694a8365d93dd]::string::String>, fn() -> core[8c5ac2f034688f9a]::result::Result<(), alloc[93e694a8365d93dd]::string::String>><unknown>
  1647. 185.36 s > at <unknown source file>:<unknown line>
  1648. 185.36 s > 12: test[7974841f8dbd3561]::run_test::{closure#0}<unknown>
  1649. 185.36 s > at <unknown source file>:<unknown line>
  1650. 185.36 s > 13: std[5167731717db2e51]::sys::backtrace::__rust_begin_short_backtrace::<test[7974841f8dbd3561]::run_test::{closure#1}, ()><unknown>
  1651. 185.36 s > at <unknown source file>:<unknown line>
  1652. 185.36 s > 14: <std[5167731717db2e51]::thread::lifecycle::spawn_unchecked<test[7974841f8dbd3561]::run_test::{closure#1}, ()>::{closure#1} as core[8c5ac2f034688f9a]::ops::function::FnOnce<()>>::call_once::{shim:vtable#0}<unknown>
  1653. 185.36 s > at <unknown source file>:<unknown line>
  1654. 185.36 s > 15: <std[5167731717db2e51]::sys::thread::unix::Thread>::new::thread_start<unknown>
  1655. 185.36 s > at <unknown source file>:<unknown line>
  1656. 185.36 s > 16: start_thread<unknown>
  1657. 185.36 s > at <unknown source file>:<unknown line>
  1658. 185.36 s > 17: __clone3<unknown>
  1659. 185.36 s > at <unknown source file>:<unknown line>
  1660. 185.36 s >
  1661. 185.36 s > Run with COLORBT_SHOW_HIDDEN=1 environment variable to disable frame filtering.
  1662. 185.36 s > Run with RUST_BACKTRACE=full to include source snippets.
  1663. 185.36 s > Warning: SpanTrace capture is Unsupported.
  1664. 185.36 s > Ensure that you've setup a tracing-error ErrorLayer and the semver versions are compatible
  1665. 185.36 s >
  1666. 185.36 s > 4. gammaloop-integration-tests::test_runs::profile_bulk::double_dotted_bubble_amp_bulk_profile_passes
  1667. 185.36 s > failure: test failure with exit code 101
  1668. 185.36 s > Error:
  1669. 185.36 s > 0: IR profiling requested arbitrary precision but received a quad-precision result
  1670. 185.36 s >
  1671. 185.36 s > Location:
  1672. 185.36 s > crates/gammalooprs/src/integrands/process/ir.rs:2123
  1673. 185.36 s >
  1674. 185.36 s > ━━━━━━━━━━━━━━━━━━━━━━━━━━━━━━━━━━ BACKTRACE ━━━━━━━━━━━━━━━━━━━━━━━━━━━━━━━━━━━
  1675. 185.36 s > 1: <color_eyre[bb06c27fa12d52c3]::config::EyreHook>::into_eyre_hook::{closure#0}<unknown>
  1676. 185.36 s > at <unknown source file>:<unknown line>
  1677. 185.36 s > 2: eyre[9f660d63ab6a72c5]::capture_handler<unknown>
  1678. 185.36 s > at <unknown source file>:<unknown line>
  1679. 185.36 s > 3: eyre[9f660d63ab6a72c5]::private::format_err<unknown>
  1680. 185.36 s > at <unknown source file>:<unknown line>
  1681. 185.36 s > 4: gammalooprs[1b273202b0029755]::integrands::process::ir::evaluate_profile_momentum_point_arb::<gammalooprs[1b273202b0029755]::integrands::process::amplitude::AmplitudeIntegrand><unknown>
  1682. 185.36 s > at <unknown source file>:<unknown line>
  1683. 185.36 s > 5: <gammalooprs[1b273202b0029755]::integrands::process::amplitude::AmplitudeIntegrand>::test_single_ir_limit_impl<unknown>
  1684. 185.36 s > at <unknown source file>:<unknown line>
  1685. 185.36 s > 6: gammalooprs[1b273202b0029755]::integrands::process::ir::run_ir_profile::<gammalooprs[1b273202b0029755]::integrands::process::amplitude::AmplitudeIntegrand, <gammalooprs[1b273202b0029755]::integrands::process::amplitude::AmplitudeIntegrand>::enumerate_ir_limits, <gammalooprs[1b273202b0029755]::integrands::process::amplitude::AmplitudeIntegrand>::graph_cut_definitions, <gammalooprs[1b273202b0029755]::integrands::process::amplitude::AmplitudeIntegrand>::test_single_ir_limit_impl><unknown>
  1686. 185.36 s > at <unknown source file>:<unknown line>
  1687. 185.36 s > 7: <gammalooprs[1b273202b0029755]::integrands::process::amplitude::AmplitudeIntegrand>::test_ir<unknown>
  1688. 185.36 s > at <unknown source file>:<unknown line>
  1689. 185.36 s > 8: <gammaloop_api[9fdde70dfc7501ea]::commands::profile::Profile>::run<unknown>
  1690. 185.36 s > at <unknown source file>:<unknown line>
  1691. 185.36 s > 9: test_runs[928b8788563090d0]::profile_bulk::double_dotted_bubble_amp_bulk_profile_passes<unknown>
  1692. 185.36 s > at <unknown source file>:<unknown line>
  1693. 185.36 s > 10: <test_runs[928b8788563090d0]::profile_bulk::double_dotted_bubble_amp_bulk_profile_passes::{closure#0} as core[8c5ac2f034688f9a]::ops::function::FnOnce<()>>::call_once<unknown>
  1694. 185.36 s > at <unknown source file>:<unknown line>
  1695. 185.36 s > 11: test[7974841f8dbd3561]::__rust_begin_short_backtrace::<core[8c5ac2f034688f9a]::result::Result<(), alloc[93e694a8365d93dd]::string::String>, fn() -> core[8c5ac2f034688f9a]::result::Result<(), alloc[93e694a8365d93dd]::string::String>><unknown>
  1696. 185.36 s > at <unknown source file>:<unknown line>
  1697. 185.36 s > 12: test[7974841f8dbd3561]::run_test::{closure#0}<unknown>
  1698. 185.36 s > at <unknown source file>:<unknown line>
  1699. 185.36 s > 13: std[5167731717db2e51]::sys::backtrace::__rust_begin_short_backtrace::<test[7974841f8dbd3561]::run_test::{closure#1}, ()><unknown>
  1700. 185.36 s > at <unknown source file>:<unknown line>
  1701. 185.36 s > 14: <std[5167731717db2e51]::thread::lifecycle::spawn_unchecked<test[7974841f8dbd3561]::run_test::{closure#1}, ()>::{closure#1} as core[8c5ac2f034688f9a]::ops::function::FnOnce<()>>::call_once::{shim:vtable#0}<unknown>
  1702. 185.36 s > at <unknown source file>:<unknown line>
  1703. 185.36 s > 15: <std[5167731717db2e51]::sys::thread::unix::Thread>::new::thread_start<unknown>
  1704. 185.36 s > at <unknown source file>:<unknown line>
  1705. 185.36 s > 16: start_thread<unknown>
  1706. 185.36 s > at <unknown source file>:<unknown line>
  1707. 185.36 s > 17: __clone3<unknown>
  1708. 185.36 s > at <unknown source file>:<unknown line>
  1709. 185.36 s >
  1710. 185.36 s > Run with COLORBT_SHOW_HIDDEN=1 environment variable to disable frame filtering.
  1711. 185.36 s > Run with RUST_BACKTRACE=full to include source snippets.
  1712. 185.36 s > Warning: SpanTrace capture is Unsupported.
  1713. 185.36 s > Ensure that you've setup a tracing-error ErrorLayer and the semver versions are compatible
  1714. 185.36 s > system-out
  1715. 185.36 s > running 1 test
  1716. 185.36 s > test profile_bulk::double_dotted_bubble_amp_bulk_profile_passes ... FAILED
  1717. 185.36 s >
  1718. 185.36 s > failures:
  1719. 185.36 s >
  1720. 185.36 s > failures:
  1721. 185.36 s > profile_bulk::double_dotted_bubble_amp_bulk_profile_passes
  1722. 185.36 s >
  1723. 185.36 s > test result: FAILED. 0 passed; 1 failed; 0 ignored; 0 measured; 82 filtered out; finished in 0.42s
  1724. 185.36 s > system-err
  1725. 185.36 s > [2026-09-02 17:40:17.019] @gammaloop_api::se... INFO : Running command import model ./assets/models/json/scalars/scalars_2p_3p.json
  1726. 185.36 s > [2026-09-02 17:40:17.019] @import::model INFO : Loading JSON model scalars_2p_3p-default from /build/source/assets/models/json/scalars/scalars_2p_3p
  1727. 185.36 s > [2026-09-02 17:40:17.021] @gammaloop_api::se... INFO : Running command import graphs ./tests/resources/graphs/double_dotted_bubble_amp.dot
  1728. 185.36 s > [2026-09-02 17:40:17.021] @commands::import INFO : Loading graphs from '/build/source/tests/resources/graphs/double_dotted_bubble_amp.dot'
  1729. 185.36 s > [2026-09-02 17:40:17.026] @gammaloop_api::se... INFO : Running command generate
  1730. 185.36 s > [2026-09-02 17:40:17.131] @commands::generate INFO :
  1731. 185.36 s > Integrand generation summary
  1732. 185.36 s > peak RAM 63.23 MiB | cores 1
  1733. 185.36 s > ╭───────────┬──────────────────────────┬─────────┬────────────┬────────────┬────────────────┬─────────────╮
  1734. 185.36 s > │ integrand │ graph │ # evals │ expr build │ spenso │ symbolica eval │ compile │
  1735. 185.36 s > ├───────────┼──────────────────────────┼─────────┼────────────┼────────────┼────────────────┼─────────────┤
  1736. 185.36 s > │ default │ double_dotted_bubble_amp │ 11 │ 37ms (41%) │ 10ms (12%) │ 44ms (48%) │ 0ms (0.00%) │
  1737. 185.36 s > ├───────────┼──────────────────────────┼─────────┼────────────┼────────────┼────────────────┼─────────────┤
  1738. 185.36 s > │ Total │ │ 11 │ 37ms (41%) │ 10ms (12%) │ 44ms (48%) │ 0ms (0.00%) │
  1739. 185.36 s > ╰───────────┴──────────────────────────┴─────────┴────────────┴────────────┴────────────────┴─────────────╯
  1740. 185.36 s > [2026-09-02 17:40:17.134] @process::amplitude INFO : Input is above threshold: 1 existing threshold E-surfaces across 1/1 graph groups
  1741. 185.36 s > [2026-09-02 17:40:17.134] @process::amplitude INFO : overlap structure of group 0: [1: [1(1,4)]]
  1742. 185.36 s > Error:
  1743. 185.36 s > 0: IR profiling requested arbitrary precision but received a quad-precision result
  1744. 185.36 s >
  1745. 185.36 s > Location:
  1746. 185.36 s > crates/gammalooprs/src/integrands/process/ir.rs:2123
  1747. 185.36 s >
  1748. 185.36 s > ━━━━━━━━━━━━━━━━━━━━━━━━━━━━━━━━━━ BACKTRACE ━━━━━━━━━━━━━━━━━━━━━━━━━━━━━━━━━━━
  1749. 185.36 s > 1: <color_eyre[bb06c27fa12d52c3]::config::EyreHook>::into_eyre_hook::{closure#0}<unknown>
  1750. 185.36 s > at <unknown source file>:<unknown line>
  1751. 185.36 s > 2: eyre[9f660d63ab6a72c5]::capture_handler<unknown>
  1752. 185.36 s > at <unknown source file>:<unknown line>
  1753. 185.36 s > 3: eyre[9f660d63ab6a72c5]::private::format_err<unknown>
  1754. 185.36 s > at <unknown source file>:<unknown line>
  1755. 185.36 s > 4: gammalooprs[1b273202b0029755]::integrands::process::ir::evaluate_profile_momentum_point_arb::<gammalooprs[1b273202b0029755]::integrands::process::amplitude::AmplitudeIntegrand><unknown>
  1756. 185.36 s > at <unknown source file>:<unknown line>
  1757. 185.36 s > 5: <gammalooprs[1b273202b0029755]::integrands::process::amplitude::AmplitudeIntegrand>::test_single_ir_limit_impl<unknown>
  1758. 185.36 s > at <unknown source file>:<unknown line>
  1759. 185.36 s > 6: gammalooprs[1b273202b0029755]::integrands::process::ir::run_ir_profile::<gammalooprs[1b273202b0029755]::integrands::process::amplitude::AmplitudeIntegrand, <gammalooprs[1b273202b0029755]::integrands::process::amplitude::AmplitudeIntegrand>::enumerate_ir_limits, <gammalooprs[1b273202b0029755]::integrands::process::amplitude::AmplitudeIntegrand>::graph_cut_definitions, <gammalooprs[1b273202b0029755]::integrands::process::amplitude::AmplitudeIntegrand>::test_single_ir_limit_impl><unknown>
  1760. 185.36 s > at <unknown source file>:<unknown line>
  1761. 185.36 s > 7: <gammalooprs[1b273202b0029755]::integrands::process::amplitude::AmplitudeIntegrand>::test_ir<unknown>
  1762. 185.36 s > at <unknown source file>:<unknown line>
  1763. 185.36 s > 8: <gammaloop_api[9fdde70dfc7501ea]::commands::profile::Profile>::run<unknown>
  1764. 185.36 s > at <unknown source file>:<unknown line>
  1765. 185.36 s > 9: test_runs[928b8788563090d0]::profile_bulk::double_dotted_bubble_amp_bulk_profile_passes<unknown>
  1766. 185.36 s > at <unknown source file>:<unknown line>
  1767. 185.36 s > 10: <test_runs[928b8788563090d0]::profile_bulk::double_dotted_bubble_amp_bulk_profile_passes::{closure#0} as core[8c5ac2f034688f9a]::ops::function::FnOnce<()>>::call_once<unknown>
  1768. 185.36 s > at <unknown source file>:<unknown line>
  1769. 185.36 s > 11: test[7974841f8dbd3561]::__rust_begin_short_backtrace::<core[8c5ac2f034688f9a]::result::Result<(), alloc[93e694a8365d93dd]::string::String>, fn() -> core[8c5ac2f034688f9a]::result::Result<(), alloc[93e694a8365d93dd]::string::String>><unknown>
  1770. 185.36 s > at <unknown source file>:<unknown line>
  1771. 185.36 s > 12: test[7974841f8dbd3561]::run_test::{closure#0}<unknown>
  1772. 185.36 s > at <unknown source file>:<unknown line>
  1773. 185.36 s > 13: std[5167731717db2e51]::sys::backtrace::__rust_begin_short_backtrace::<test[7974841f8dbd3561]::run_test::{closure#1}, ()><unknown>
  1774. 185.36 s > at <unknown source file>:<unknown line>
  1775. 185.36 s > 14: <std[5167731717db2e51]::thread::lifecycle::spawn_unchecked<test[7974841f8dbd3561]::run_test::{closure#1}, ()>::{closure#1} as core[8c5ac2f034688f9a]::ops::function::FnOnce<()>>::call_once::{shim:vtable#0}<unknown>
  1776. 185.36 s > at <unknown source file>:<unknown line>
  1777. 185.36 s > 15: <std[5167731717db2e51]::sys::thread::unix::Thread>::new::thread_start<unknown>
  1778. 185.36 s > at <unknown source file>:<unknown line>
  1779. 185.36 s > 16: start_thread<unknown>
  1780. 185.36 s > at <unknown source file>:<unknown line>
  1781. 185.36 s > 17: __clone3<unknown>
  1782. 185.36 s > at <unknown source file>:<unknown line>
  1783. 185.36 s >
  1784. 185.36 s > Run with COLORBT_SHOW_HIDDEN=1 environment variable to disable frame filtering.
  1785. 185.36 s > Run with RUST_BACKTRACE=full to include source snippets.
  1786. 185.36 s > Warning: SpanTrace capture is Unsupported.
  1787. 185.36 s > Ensure that you've setup a tracing-error ErrorLayer and the semver versions are compatible
  1788. 185.36 s >
  1789. 185.36 s > 5. gammaloop-integration-tests::test_runs::profile_bulk::massless_triangle_bulk_profile_passes
  1790. 185.36 s > failure: test failure with exit code 101
  1791. 185.36 s > Error:
  1792. 185.36 s > 0: IR profiling requested arbitrary precision but received a quad-precision result
  1793. 185.36 s >
  1794. 185.36 s > Location:
  1795. 185.36 s > crates/gammalooprs/src/integrands/process/ir.rs:2123
  1796. 185.36 s >
  1797. 185.36 s > ━━━━━━━━━━━━━━━━━━━━━━━━━━━━━━━━━━ BACKTRACE ━━━━━━━━━━━━━━━━━━━━━━━━━━━━━━━━━━━
  1798. 185.36 s > 1: <color_eyre[bb06c27fa12d52c3]::config::EyreHook>::into_eyre_hook::{closure#0}<unknown>
  1799. 185.36 s > at <unknown source file>:<unknown line>
  1800. 185.36 s > 2: eyre[9f660d63ab6a72c5]::capture_handler<unknown>
  1801. 185.36 s > at <unknown source file>:<unknown line>
  1802. 185.36 s > 3: eyre[9f660d63ab6a72c5]::private::format_err<unknown>
  1803. 185.36 s > at <unknown source file>:<unknown line>
  1804. 185.36 s > 4: gammalooprs[1b273202b0029755]::integrands::process::ir::evaluate_profile_momentum_point_arb::<gammalooprs[1b273202b0029755]::integrands::process::amplitude::AmplitudeIntegrand><unknown>
  1805. 185.36 s > at <unknown source file>:<unknown line>
  1806. 185.36 s > 5: <gammalooprs[1b273202b0029755]::integrands::process::amplitude::AmplitudeIntegrand>::test_single_ir_limit_impl<unknown>
  1807. 185.36 s > at <unknown source file>:<unknown line>
  1808. 185.36 s > 6: gammalooprs[1b273202b0029755]::integrands::process::ir::run_ir_profile::<gammalooprs[1b273202b0029755]::integrands::process::amplitude::AmplitudeIntegrand, <gammalooprs[1b273202b0029755]::integrands::process::amplitude::AmplitudeIntegrand>::enumerate_ir_limits, <gammalooprs[1b273202b0029755]::integrands::process::amplitude::AmplitudeIntegrand>::graph_cut_definitions, <gammalooprs[1b273202b0029755]::integrands::process::amplitude::AmplitudeIntegrand>::test_single_ir_limit_impl><unknown>
  1809. 185.36 s > at <unknown source file>:<unknown line>
  1810. 185.36 s > 7: <gammalooprs[1b273202b0029755]::integrands::process::amplitude::AmplitudeIntegrand>::test_ir<unknown>
  1811. 185.36 s > at <unknown source file>:<unknown line>
  1812. 185.36 s > 8: <gammaloop_api[9fdde70dfc7501ea]::commands::profile::Profile>::run<unknown>
  1813. 185.36 s > at <unknown source file>:<unknown line>
  1814. 185.36 s > 9: test_runs[928b8788563090d0]::profile_bulk::massless_triangle_bulk_profile_passes<unknown>
  1815. 185.36 s > at <unknown source file>:<unknown line>
  1816. 185.36 s > 10: <test_runs[928b8788563090d0]::profile_bulk::massless_triangle_bulk_profile_passes::{closure#0} as core[8c5ac2f034688f9a]::ops::function::FnOnce<()>>::call_once<unknown>
  1817. 185.36 s > at <unknown source file>:<unknown line>
  1818. 185.36 s > 11: test[7974841f8dbd3561]::__rust_begin_short_backtrace::<core[8c5ac2f034688f9a]::result::Result<(), alloc[93e694a8365d93dd]::string::String>, fn() -> core[8c5ac2f034688f9a]::result::Result<(), alloc[93e694a8365d93dd]::string::String>><unknown>
  1819. 185.36 s > at <unknown source file>:<unknown line>
  1820. 185.36 s > 12: test[7974841f8dbd3561]::run_test::{closure#0}<unknown>
  1821. 185.36 s > at <unknown source file>:<unknown line>
  1822. 185.36 s > 13: std[5167731717db2e51]::sys::backtrace::__rust_begin_short_backtrace::<test[7974841f8dbd3561]::run_test::{closure#1}, ()><unknown>
  1823. 185.36 s > at <unknown source file>:<unknown line>
  1824. 185.36 s > 14: <std[5167731717db2e51]::thread::lifecycle::spawn_unchecked<test[7974841f8dbd3561]::run_test::{closure#1}, ()>::{closure#1} as core[8c5ac2f034688f9a]::ops::function::FnOnce<()>>::call_once::{shim:vtable#0}<unknown>
  1825. 185.36 s > at <unknown source file>:<unknown line>
  1826. 185.36 s > 15: <std[5167731717db2e51]::sys::thread::unix::Thread>::new::thread_start<unknown>
  1827. 185.36 s > at <unknown source file>:<unknown line>
  1828. 185.36 s > 16: start_thread<unknown>
  1829. 185.36 s > at <unknown source file>:<unknown line>
  1830. 185.36 s > 17: __clone3<unknown>
  1831. 185.36 s > at <unknown source file>:<unknown line>
  1832. 185.36 s >
  1833. 185.36 s > Run with COLORBT_SHOW_HIDDEN=1 environment variable to disable frame filtering.
  1834. 185.36 s > Run with RUST_BACKTRACE=full to include source snippets.
  1835. 185.36 s > Warning: SpanTrace capture is Unsupported.
  1836. 185.36 s > Ensure that you've setup a tracing-error ErrorLayer and the semver versions are compatible
  1837. 185.36 s > system-out
  1838. 185.36 s > running 1 test
  1839. 185.36 s > test profile_bulk::massless_triangle_bulk_profile_passes ... FAILED
  1840. 185.36 s >
  1841. 185.36 s > failures:
  1842. 185.36 s >
  1843. 185.36 s > failures:
  1844. 185.36 s > profile_bulk::massless_triangle_bulk_profile_passes
  1845. 185.36 s >
  1846. 185.36 s > test result: FAILED. 0 passed; 1 failed; 0 ignored; 0 measured; 82 filtered out; finished in 0.46s
  1847. 185.36 s > system-err
  1848. 185.36 s > [2026-09-02 17:40:17.083] @gammaloop_api::se... INFO : Running command import model scalars
  1849. 185.36 s > [2026-09-02 17:40:17.083] @import::model INFO : Loading built-in JSON model scalars-default
  1850. 185.36 s > [2026-09-02 17:40:17.087] @gammalooprs::model INFO : The following 2 external parameters were forced to zero by the restriction card:
  1851. 185.36 s > width_scalar_1, width_scalar_2
  1852. 185.36 s > [2026-09-02 17:40:17.088] @gammaloop_api::se... INFO : Running command import graphs ./tests/resources/graphs/massless_triangle.dot
  1853. 185.36 s > [2026-09-02 17:40:17.088] @commands::import INFO : Loading graphs from '/build/source/tests/resources/graphs/massless_triangle.dot'
  1854. 185.36 s > [2026-09-02 17:40:17.091] @gammaloop_api::se... INFO : Running command generate
  1855. 185.36 s > [2026-09-02 17:40:17.199] @commands::generate INFO :
  1856. 185.36 s > Integrand generation summary
  1857. 185.36 s > peak RAM 63.72 MiB | cores 1
  1858. 185.36 s > ╭───────────┬─────────────────────┬─────────┬────────────┬────────────┬────────────────┬─────────────╮
  1859. 185.36 s > │ integrand │ graph │ # evals │ expr build │ spenso │ symbolica eval │ compile │
  1860. 185.36 s > ├───────────┼─────────────────────┼─────────┼────────────┼────────────┼────────────────┼─────────────┤
  1861. 185.36 s > │ default │ massless_triangle_0 │ 9 │ 14ms (52%) │ 2ms (8.5%) │ 11ms (40%) │ 0ms (0.00%) │
  1862. 185.36 s > ├───────────┼─────────────────────┼─────────┼────────────┼────────────┼────────────────┼─────────────┤
  1863. 185.36 s > │ Total │ │ 9 │ 14ms (52%) │ 2ms (8.5%) │ 11ms (40%) │ 0ms (0.00%) │
  1864. 185.36 s > ╰───────────┴─────────────────────┴─────────┴────────────┴────────────┴────────────────┴─────────────╯
  1865. 185.36 s > [2026-09-02 17:40:17.201] @process::amplitude INFO : Input is above threshold: 2 existing threshold E-surfaces across 1/1 graph groups
  1866. 185.36 s > [2026-09-02 17:40:17.201] @process::amplitude INFO : overlap structure of group 0: [2: [0(1,5), 1(1,3)]]
  1867. 185.36 s > Error:
  1868. 185.36 s > 0: IR profiling requested arbitrary precision but received a quad-precision result
  1869. 185.36 s >
  1870. 185.36 s > Location:
  1871. 185.36 s > crates/gammalooprs/src/integrands/process/ir.rs:2123
  1872. 185.36 s >
  1873. 185.36 s > ━━━━━━━━━━━━━━━━━━━━━━━━━━━━━━━━━━ BACKTRACE ━━━━━━━━━━━━━━━━━━━━━━━━━━━━━━━━━━━
  1874. 185.36 s > 1: <color_eyre[bb06c27fa12d52c3]::config::EyreHook>::into_eyre_hook::{closure#0}<unknown>
  1875. 185.36 s > at <unknown source file>:<unknown line>
  1876. 185.36 s > 2: eyre[9f660d63ab6a72c5]::capture_handler<unknown>
  1877. 185.36 s > at <unknown source file>:<unknown line>
  1878. 185.36 s > 3: eyre[9f660d63ab6a72c5]::private::format_err<unknown>
  1879. 185.36 s > at <unknown source file>:<unknown line>
  1880. 185.36 s > 4: gammalooprs[1b273202b0029755]::integrands::process::ir::evaluate_profile_momentum_point_arb::<gammalooprs[1b273202b0029755]::integrands::process::amplitude::AmplitudeIntegrand><unknown>
  1881. 185.36 s > at <unknown source file>:<unknown line>
  1882. 185.36 s > 5: <gammalooprs[1b273202b0029755]::integrands::process::amplitude::AmplitudeIntegrand>::test_single_ir_limit_impl<unknown>
  1883. 185.36 s > at <unknown source file>:<unknown line>
  1884. 185.36 s > 6: gammalooprs[1b273202b0029755]::integrands::process::ir::run_ir_profile::<gammalooprs[1b273202b0029755]::integrands::process::amplitude::AmplitudeIntegrand, <gammalooprs[1b273202b0029755]::integrands::process::amplitude::AmplitudeIntegrand>::enumerate_ir_limits, <gammalooprs[1b273202b0029755]::integrands::process::amplitude::AmplitudeIntegrand>::graph_cut_definitions, <gammalooprs[1b273202b0029755]::integrands::process::amplitude::AmplitudeIntegrand>::test_single_ir_limit_impl><unknown>
  1885. 185.36 s > at <unknown source file>:<unknown line>
  1886. 185.36 s > 7: <gammalooprs[1b273202b0029755]::integrands::process::amplitude::AmplitudeIntegrand>::test_ir<unknown>
  1887. 185.36 s > at <unknown source file>:<unknown line>
  1888. 185.36 s > 8: <gammaloop_api[9fdde70dfc7501ea]::commands::profile::Profile>::run<unknown>
  1889. 185.36 s > at <unknown source file>:<unknown line>
  1890. 185.36 s > 9: test_runs[928b8788563090d0]::profile_bulk::massless_triangle_bulk_profile_passes<unknown>
  1891. 185.36 s > at <unknown source file>:<unknown line>
  1892. 185.36 s > 10: <test_runs[928b8788563090d0]::profile_bulk::massless_triangle_bulk_profile_passes::{closure#0} as core[8c5ac2f034688f9a]::ops::function::FnOnce<()>>::call_once<unknown>
  1893. 185.36 s > at <unknown source file>:<unknown line>
  1894. 185.36 s > 11: test[7974841f8dbd3561]::__rust_begin_short_backtrace::<core[8c5ac2f034688f9a]::result::Result<(), alloc[93e694a8365d93dd]::string::String>, fn() -> core[8c5ac2f034688f9a]::result::Result<(), alloc[93e694a8365d93dd]::string::String>><unknown>
  1895. 185.36 s > at <unknown source file>:<unknown line>
  1896. 185.36 s > 12: test[7974841f8dbd3561]::run_test::{closure#0}<unknown>
  1897. 185.36 s > at <unknown source file>:<unknown line>
  1898. 185.36 s > 13: std[5167731717db2e51]::sys::backtrace::__rust_begin_short_backtrace::<test[7974841f8dbd3561]::run_test::{closure#1}, ()><unknown>
  1899. 185.36 s > at <unknown source file>:<unknown line>
  1900. 185.36 s > 14: <std[5167731717db2e51]::thread::lifecycle::spawn_unchecked<test[7974841f8dbd3561]::run_test::{closure#1}, ()>::{closure#1} as core[8c5ac2f034688f9a]::ops::function::FnOnce<()>>::call_once::{shim:vtable#0}<unknown>
  1901. 185.36 s > at <unknown source file>:<unknown line>
  1902. 185.36 s > 15: <std[5167731717db2e51]::sys::thread::unix::Thread>::new::thread_start<unknown>
  1903. 185.36 s > at <unknown source file>:<unknown line>
  1904. 185.36 s > 16: start_thread<unknown>
  1905. 185.36 s > at <unknown source file>:<unknown line>
  1906. 185.36 s > 17: __clone3<unknown>
  1907. 185.36 s > at <unknown source file>:<unknown line>
  1908. 185.36 s >
  1909. 185.36 s > Run with COLORBT_SHOW_HIDDEN=1 environment variable to disable frame filtering.
  1910. 185.36 s > Run with RUST_BACKTRACE=full to include source snippets.
  1911. 185.36 s > Warning: SpanTrace capture is Unsupported.
  1912. 185.36 s > Ensure that you've setup a tracing-error ErrorLayer and the semver versions are compatible
  1913. 185.36 s >
  1914. 185.36 s > 6. gammaloop-integration-tests::test_runs::profile_bulk::scalar_self_energy_amp_bulk_profile_passes
  1915. 185.36 s > failure: test failure with exit code 101
  1916. 185.36 s > Error:
  1917. 185.36 s > 0: IR profiling requested arbitrary precision but received a quad-precision result
  1918. 185.36 s >
  1919. 185.36 s > Location:
  1920. 185.36 s > crates/gammalooprs/src/integrands/process/ir.rs:2123
  1921. 185.36 s >
  1922. 185.36 s > ━━━━━━━━━━━━━━━━━━━━━━━━━━━━━━━━━━ BACKTRACE ━━━━━━━━━━━━━━━━━━━━━━━━━━━━━━━━━━━
  1923. 185.36 s > 1: <color_eyre[bb06c27fa12d52c3]::config::EyreHook>::into_eyre_hook::{closure#0}<unknown>
  1924. 185.36 s > at <unknown source file>:<unknown line>
  1925. 185.36 s > 2: eyre[9f660d63ab6a72c5]::capture_handler<unknown>
  1926. 185.36 s > at <unknown source file>:<unknown line>
  1927. 185.36 s > 3: eyre[9f660d63ab6a72c5]::private::format_err<unknown>
  1928. 185.36 s > at <unknown source file>:<unknown line>
  1929. 185.36 s > 4: gammalooprs[1b273202b0029755]::integrands::process::ir::evaluate_profile_momentum_point_arb::<gammalooprs[1b273202b0029755]::integrands::process::amplitude::AmplitudeIntegrand><unknown>
  1930. 185.36 s > at <unknown source file>:<unknown line>
  1931. 185.36 s > 5: <gammalooprs[1b273202b0029755]::integrands::process::amplitude::AmplitudeIntegrand>::test_single_ir_limit_impl<unknown>
  1932. 185.36 s > at <unknown source file>:<unknown line>
  1933. 185.36 s > 6: gammalooprs[1b273202b0029755]::integrands::process::ir::run_ir_profile::<gammalooprs[1b273202b0029755]::integrands::process::amplitude::AmplitudeIntegrand, <gammalooprs[1b273202b0029755]::integrands::process::amplitude::AmplitudeIntegrand>::enumerate_ir_limits, <gammalooprs[1b273202b0029755]::integrands::process::amplitude::AmplitudeIntegrand>::graph_cut_definitions, <gammalooprs[1b273202b0029755]::integrands::process::amplitude::AmplitudeIntegrand>::test_single_ir_limit_impl><unknown>
  1934. 185.36 s > at <unknown source file>:<unknown line>
  1935. 185.36 s > 7: <gammalooprs[1b273202b0029755]::integrands::process::amplitude::AmplitudeIntegrand>::test_ir<unknown>
  1936. 185.36 s > at <unknown source file>:<unknown line>
  1937. 185.36 s > 8: <gammaloop_api[9fdde70dfc7501ea]::commands::profile::Profile>::run<unknown>
  1938. 185.36 s > at <unknown source file>:<unknown line>
  1939. 185.36 s > 9: test_runs[928b8788563090d0]::profile_bulk::scalar_self_energy_amp_bulk_profile_passes<unknown>
  1940. 185.36 s > at <unknown source file>:<unknown line>
  1941. 185.36 s > 10: <test_runs[928b8788563090d0]::profile_bulk::scalar_self_energy_amp_bulk_profile_passes::{closure#0} as core[8c5ac2f034688f9a]::ops::function::FnOnce<()>>::call_once<unknown>
  1942. 185.36 s > at <unknown source file>:<unknown line>
  1943. 185.36 s > 11: test[7974841f8dbd3561]::__rust_begin_short_backtrace::<core[8c5ac2f034688f9a]::result::Result<(), alloc[93e694a8365d93dd]::string::String>, fn() -> core[8c5ac2f034688f9a]::result::Result<(), alloc[93e694a8365d93dd]::string::String>><unknown>
  1944. 185.36 s > at <unknown source file>:<unknown line>
  1945. 185.36 s > 12: test[7974841f8dbd3561]::run_test::{closure#0}<unknown>
  1946. 185.36 s > at <unknown source file>:<unknown line>
  1947. 185.36 s > 13: std[5167731717db2e51]::sys::backtrace::__rust_begin_short_backtrace::<test[7974841f8dbd3561]::run_test::{closure#1}, ()><unknown>
  1948. 185.36 s > at <unknown source file>:<unknown line>
  1949. 185.36 s > 14: <std[5167731717db2e51]::thread::lifecycle::spawn_unchecked<test[7974841f8dbd3561]::run_test::{closure#1}, ()>::{closure#1} as core[8c5ac2f034688f9a]::ops::function::FnOnce<()>>::call_once::{shim:vtable#0}<unknown>
  1950. 185.36 s > at <unknown source file>:<unknown line>
  1951. 185.36 s > 15: <std[5167731717db2e51]::sys::thread::unix::Thread>::new::thread_start<unknown>
  1952. 185.36 s > at <unknown source file>:<unknown line>
  1953. 185.36 s > 16: start_thread<unknown>
  1954. 185.36 s > at <unknown source file>:<unknown line>
  1955. 185.36 s > 17: __clone3<unknown>
  1956. 185.36 s > at <unknown source file>:<unknown line>
  1957. 185.36 s >
  1958. 185.36 s > Run with COLORBT_SHOW_HIDDEN=1 environment variable to disable frame filtering.
  1959. 185.36 s > Run with RUST_BACKTRACE=full to include source snippets.
  1960. 185.36 s > Warning: SpanTrace capture is Unsupported.
  1961. 185.36 s > Ensure that you've setup a tracing-error ErrorLayer and the semver versions are compatible
  1962. 185.36 s > system-out
  1963. 185.36 s > running 1 test
  1964. 185.36 s > test profile_bulk::scalar_self_energy_amp_bulk_profile_passes ... FAILED
  1965. 185.36 s >
  1966. 185.36 s > failures:
  1967. 185.36 s >
  1968. 185.36 s > failures:
  1969. 185.36 s > profile_bulk::scalar_self_energy_amp_bulk_profile_passes
  1970. 185.36 s >
  1971. 185.36 s > test result: FAILED. 0 passed; 1 failed; 0 ignored; 0 measured; 82 filtered out; finished in 0.59s
  1972. 185.36 s > system-err
  1973. 185.36 s > [2026-09-02 17:40:17.049] @gammaloop_api::se... INFO : Running command import model ./assets/models/json/scalars/scalars.json
  1974. 185.36 s > [2026-09-02 17:40:17.049] @import::model INFO : Loading JSON model scalars-default from /build/source/assets/models/json/scalars/scalars
  1975. 185.36 s > [2026-09-02 17:40:17.054] @gammalooprs::model INFO : The following 2 external parameters were forced to zero by the restriction card:
  1976. 185.36 s > width_scalar_1, width_scalar_2
  1977. 185.36 s > [2026-09-02 17:40:17.055] @gammaloop_api::se... INFO : Running command import graphs ./tests/resources/graphs/scalar_self_energy_amp.dot
  1978. 185.36 s > [2026-09-02 17:40:17.055] @commands::import INFO : Loading graphs from '/build/source/tests/resources/graphs/scalar_self_energy_amp.dot'
  1979. 185.36 s > [2026-09-02 17:40:17.060] @gammaloop_api::se... INFO : Running command generate
  1980. 185.36 s > [2026-09-02 17:40:17.393] @commands::generate INFO :
  1981. 185.36 s > Integrand generation summary
  1982. 185.36 s > peak RAM 70.38 MiB | cores 1
  1983. 185.36 s > ╭───────────┬────────────────────────┬─────────┬─────────────┬────────────┬────────────────┬─────────────╮
  1984. 185.36 s > │ integrand │ graph │ # evals │ expr build │ spenso │ symbolica eval │ compile │
  1985. 185.36 s > ├───────────┼────────────────────────┼─────────┼─────────────┼────────────┼────────────────┼─────────────┤
  1986. 185.36 s > │ default │ scalar_self_energy_amp │ 6 │ 284ms (95%) │ 8ms (2.8%) │ 6ms (2.1%) │ 0ms (0.00%) │
  1987. 185.36 s > ├───────────┼────────────────────────┼─────────┼─────────────┼────────────┼────────────────┼─────────────┤
  1988. 185.36 s > │ Total │ │ 6 │ 284ms (95%) │ 8ms (2.8%) │ 6ms (2.1%) │ 0ms (0.00%) │
  1989. 185.36 s > ╰───────────┴────────────────────────┴─────────┴─────────────┴────────────┴────────────────┴─────────────╯
  1990. 185.36 s > [2026-09-02 17:40:17.395] @process::amplitude INFO : Input is above threshold: 2 existing threshold E-surfaces across 1/1 graph groups
  1991. 185.36 s > [2026-09-02 17:40:17.396] @process::amplitude INFO : overlap structure of group 0: [2: [2(1,5), 4(2,3,5)]]
  1992. 185.36 s > Error:
  1993. 185.36 s > 0: IR profiling requested arbitrary precision but received a quad-precision result
  1994. 185.36 s >
  1995. 185.36 s > Location:
  1996. 185.36 s > crates/gammalooprs/src/integrands/process/ir.rs:2123
  1997. 185.36 s >
  1998. 185.36 s > ━━━━━━━━━━━━━━━━━━━━━━━━━━━━━━━━━━ BACKTRACE ━━━━━━━━━━━━━━━━━━━━━━━━━━━━━━━━━━━
  1999. 185.36 s > 1: <color_eyre[bb06c27fa12d52c3]::config::EyreHook>::into_eyre_hook::{closure#0}<unknown>
  2000. 185.36 s > at <unknown source file>:<unknown line>
  2001. 185.36 s > 2: eyre[9f660d63ab6a72c5]::capture_handler<unknown>
  2002. 185.36 s > at <unknown source file>:<unknown line>
  2003. 185.36 s > 3: eyre[9f660d63ab6a72c5]::private::format_err<unknown>
  2004. 185.36 s > at <unknown source file>:<unknown line>
  2005. 185.36 s > 4: gammalooprs[1b273202b0029755]::integrands::process::ir::evaluate_profile_momentum_point_arb::<gammalooprs[1b273202b0029755]::integrands::process::amplitude::AmplitudeIntegrand><unknown>
  2006. 185.36 s > at <unknown source file>:<unknown line>
  2007. 185.36 s > 5: <gammalooprs[1b273202b0029755]::integrands::process::amplitude::AmplitudeIntegrand>::test_single_ir_limit_impl<unknown>
  2008. 185.36 s > at <unknown source file>:<unknown line>
  2009. 185.36 s > 6: gammalooprs[1b273202b0029755]::integrands::process::ir::run_ir_profile::<gammalooprs[1b273202b0029755]::integrands::process::amplitude::AmplitudeIntegrand, <gammalooprs[1b273202b0029755]::integrands::process::amplitude::AmplitudeIntegrand>::enumerate_ir_limits, <gammalooprs[1b273202b0029755]::integrands::process::amplitude::AmplitudeIntegrand>::graph_cut_definitions, <gammalooprs[1b273202b0029755]::integrands::process::amplitude::AmplitudeIntegrand>::test_single_ir_limit_impl><unknown>
  2010. 185.36 s > at <unknown source file>:<unknown line>
  2011. 185.36 s > 7: <gammalooprs[1b273202b0029755]::integrands::process::amplitude::AmplitudeIntegrand>::test_ir<unknown>
  2012. 185.36 s > at <unknown source file>:<unknown line>
  2013. 185.36 s > 8: <gammaloop_api[9fdde70dfc7501ea]::commands::profile::Profile>::run<unknown>
  2014. 185.36 s > at <unknown source file>:<unknown line>
  2015. 185.36 s > 9: test_runs[928b8788563090d0]::profile_bulk::scalar_self_energy_amp_bulk_profile_passes<unknown>
  2016. 185.36 s > at <unknown source file>:<unknown line>
  2017. 185.36 s > 10: <test_runs[928b8788563090d0]::profile_bulk::scalar_self_energy_amp_bulk_profile_passes::{closure#0} as core[8c5ac2f034688f9a]::ops::function::FnOnce<()>>::call_once<unknown>
  2018. 185.36 s > at <unknown source file>:<unknown line>
  2019. 185.36 s > 11: test[7974841f8dbd3561]::__rust_begin_short_backtrace::<core[8c5ac2f034688f9a]::result::Result<(), alloc[93e694a8365d93dd]::string::String>, fn() -> core[8c5ac2f034688f9a]::result::Result<(), alloc[93e694a8365d93dd]::string::String>><unknown>
  2020. 185.36 s > at <unknown source file>:<unknown line>
  2021. 185.36 s > 12: test[7974841f8dbd3561]::run_test::{closure#0}<unknown>
  2022. 185.36 s > at <unknown source file>:<unknown line>
  2023. 185.36 s > 13: std[5167731717db2e51]::sys::backtrace::__rust_begin_short_backtrace::<test[7974841f8dbd3561]::run_test::{closure#1}, ()><unknown>
  2024. 185.36 s > at <unknown source file>:<unknown line>
  2025. 185.36 s > 14: <std[5167731717db2e51]::thread::lifecycle::spawn_unchecked<test[7974841f8dbd3561]::run_test::{closure#1}, ()>::{closure#1} as core[8c5ac2f034688f9a]::ops::function::FnOnce<()>>::call_once::{shim:vtable#0}<unknown>
  2026. 185.36 s > at <unknown source file>:<unknown line>
  2027. 185.36 s > 15: <std[5167731717db2e51]::sys::thread::unix::Thread>::new::thread_start<unknown>
  2028. 185.36 s > at <unknown source file>:<unknown line>
  2029. 185.36 s > 16: start_thread<unknown>
  2030. 185.36 s > at <unknown source file>:<unknown line>
  2031. 185.36 s > 17: __clone3<unknown>
  2032. 185.36 s > at <unknown source file>:<unknown line>
  2033. 185.36 s >
  2034. 185.36 s > Run with COLORBT_SHOW_HIDDEN=1 environment variable to disable frame filtering.
  2035. 185.36 s > Run with RUST_BACKTRACE=full to include source snippets.
  2036. 185.36 s > Warning: SpanTrace capture is Unsupported.
  2037. 185.36 s > Ensure that you've setup a tracing-error ErrorLayer and the semver versions are compatible
  2038. 185.36 s >
  2039. 185.36 s > 7. gammaloop-integration-tests::uv::dod2_bubble_uv
  2040. 185.36 s > failure: test failure with exit code 101
  2041. 185.36 s > system-out
  2042. 185.36 s > running 1 test
  2043. 185.36 s > +-------------+-----------------+---------+--------+----------+-----------------------------------------------------------------------------------------------------------------------+-------+
  2044. 185.36 s > | case | check | graph | status | sigma | threshold | error |
  2045. 185.36 s > +-------------+-----------------+---------+--------+----------+-----------------------------------------------------------------------------------------------------------------------+-------+
  2046. 185.36 s > | dod2_bubble | uv_profile | - | FAIL | - | - | - |
  2047. 185.36 s > +-------------+-----------------+---------+--------+----------+-----------------------------------------------------------------------------------------------------------------------+-------+
  2048. 185.36 s > | dod2_bubble | m_uv.inspect | inspect | pass | - | best inspect relative delta 1.000e0 >= 1000*accuracy 1.000e-7 (accuracy=1.000e-10, exponent=+8.0, seed=0, probes=10) | - |
  2049. 185.36 s > +-------------+-----------------+---------+--------+----------+-----------------------------------------------------------------------------------------------------------------------+-------+
  2050. 185.36 s > | dod2_bubble | m_uv.integrated | GL0 | pass | 0.0sigma | compatible within 2sigma | - |
  2051. 185.36 s > +-------------+-----------------+---------+--------+----------+-----------------------------------------------------------------------------------------------------------------------+-------+
  2052. 185.36 s > | dod2_bubble | rls.inspect | inspect | pass | - | best inspect relative delta 2.822e-3 >= 1000*accuracy 1.000e-7 (accuracy=1.000e-10, exponent=+2.0, seed=1, probes=10) | - |
  2053. 185.36 s > +-------------+-----------------+---------+--------+----------+-----------------------------------------------------------------------------------------------------------------------+-------+
  2054. 185.36 s > | dod2_bubble | rls.integrated | GL0 | pass | 0.0sigma | compatible within 2sigma | - |
  2055. 185.36 s > +-------------+-----------------+---------+--------+----------+-----------------------------------------------------------------------------------------------------------------------+-------+
  2056. 185.36 s > | dod2_bubble | mu_r.inspect | inspect | pass | - | best inspect relative delta 6.951e-1 >= 1000*accuracy 1.000e-7 (accuracy=1.000e-10, exponent=+0.0, seed=0, probes=10) | - |
  2057. 185.36 s > +-------------+-----------------+---------+--------+----------+-----------------------------------------------------------------------------------------------------------------------+-------+
  2058. 185.36 s > | dod2_bubble | target | - | pass | - | 2sigma | - |
  2059. 185.36 s > +-------------+-----------------+---------+--------+----------+-----------------------------------------------------------------------------------------------------------------------+-------+
  2060. 185.36 s > test dod2_bubble_uv ... FAILED
  2061. 185.36 s >
  2062. 185.36 s > failures:
  2063. 185.36 s >
  2064. 185.36 s > failures:
  2065. 185.36 s > dod2_bubble_uv
  2066. 185.36 s >
  2067. 185.36 s > test result: FAILED. 0 passed; 1 failed; 0 ignored; 0 measured; 24 filtered out; finished in 34.91s
  2068. 185.36 s > system-err
  2069. 185.36 s > [2026-09-02 17:40:18.893] @gammaloop_api::se... INFO : Running command run generate
  2070. 185.36 s > [2026-09-02 17:40:18.893] @gammaloop_api::se... INFO : Starting command block generate
  2071. 185.36 s > [2026-09-02 17:40:18.893] @gammaloop_api::se... INFO : Running command import model scalars-default.json
  2072. 185.36 s > [2026-09-02 17:40:18.893] @import::model INFO : Loading built-in JSON model scalars-default
  2073. 185.36 s > [2026-09-02 17:40:18.896] @gammalooprs::model INFO : The following 2 external parameters were forced to zero by the restriction card:
  2074. 185.36 s > width_scalar_1, width_scalar_2
  2075. 185.36 s > [2026-09-02 17:40:18.897] @gammaloop_api::se... INFO : Running command remove processes
  2076. 185.36 s > [2026-09-02 17:40:18.897] @gammaloop_api::se... INFO : Running command set global kv global.generation.uv.generate_integrated=true
  2077. 185.36 s > [2026-09-02 17:40:18.897] @gammaloop_api::se... INFO : Running command import graphs ./tests/resources/graphs/scalar/dod2_bubble.dot -p bubble_dod2 -i scalar_bubble_below_thres
  2078. 185.36 s > [2026-09-02 17:40:18.897] @commands::import INFO : Loading graphs from '/build/source/tests/resources/graphs/scalar/dod2_bubble.dot'
  2079. 185.36 s > [2026-09-02 17:40:18.899] @gammaloop_api::se... INFO : Running command generate existing -p bubble_dod2 -i scalar_bubble_below_thres
  2080. 185.36 s > [2026-09-02 17:40:18.901] @approx::local_4d [{#uv, #inspect, #integrated}] DEBUG : Rescaled momenta expanded
  2081. 185.36 s > field value
  2082. 185.36 s > res n-terms: 1, byte size: 585,expr:
  2083. 185.36 s > -SCALAR_COUPLING²·q₀(αᵉ².¹)·q₀(αᵉ³.¹)·q₂(αᵉ².¹)·q₂(αᵉ³.¹)
  2084. 185.36 s > /(t²·denom(3,-q₀-q₂/t,mass_scalar_2²,-mass_scalar_2²+2·(q₀.q₂)/t+(q₂.q₂)/t²+(q₀.q₀))
  2085. 185.36 s > ·denom(2,q₂/t,mass_scalar_2²,-mass_scalar_2²+(q₂.q₂)/t²))
  2086. 185.36 s > [2026-09-02 17:40:18.902] @approx::local_4d [{#uv, #inspect, #integrated}] DEBUG : Rescaled momenta expanded
  2087. 185.36 s > field value
  2088. 185.36 s > res n-terms: 1, byte size: 3,expr:
  2089. 185.36 s > 1
  2090. 185.36 s > [2026-09-02 17:40:18.902] @approx::final_integrand[{#generation, #profile, #uv, #graph, #summary}] DEBUG : Computed global numerator
  2091. 185.36 s > field value
  2092. 185.36 s > global_num n-terms: 1, byte size: 4,expr:
  2093. 185.36 s > 1/2
  2094. 185.36 s > span build_3d{span_context=true graph=GL0 current=subgraph=0, topo_order=0, dod=0}
  2095. 185.36 s > [2026-09-02 17:40:18.905] @uv::approx [{#generation, #uv, #fourd}] DEBUG : Computing 4D
  2096. 185.36 s > field value
  2097. 185.36 s > simple subgraph(S_11,S_y)*Approx(subgraph(S_y,0)) of GL0
  2098. 185.36 s > span compute_4d{span_context=true graph=GL0 current=subgraph=y, topo_order=1, dod=2 given=subgraph=0, topo_order=0, dod=0 reduced=SubSet { set: BitVec<usize, bitvec::order::Lsb0> { addr: 0x7fffec017290, head: 000000, bits: 6, capacity: 64 } [0, 0, 1, 1, 1, 1], id: PhantomData<linnet::half_edge::involution::Hedge> }}
  2099. 185.36 s > [2026-09-02 17:40:18.905] @approx::local_4d [{#uv, #algebra, #integrated, #start}] DEBUG :
  2100. 185.36 s > field value
  2101. 185.36 s > integrand n-terms: 1, byte size: 409,expr:
  2102. 185.36 s > SCALAR_COUPLING²·(q₀(αᵉ³.¹)+q₃(αᵉ³.¹))·q₀(αᵉ².¹)·q₀(αᵉ³.¹)·q₂(αᵉ².¹)
  2103. 185.36 s > /(denom(2,q₂,mass_scalar_2²,-mass_scalar_2²+(q₂.q₂))·denom(3,q₃,mass_scalar_2²,-mass_scalar_2²+(q₃.q₃)))
  2104. 185.36 s > reduced y
  2105. 185.36 s > span grow{span_context=true current=subgraph=y, topo_order=1, dod=2 given=subgraph=0, topo_order=0, dod=0}
  2106. 185.36 s > [2026-09-02 17:40:18.905] @approx::local_4d [{#uv, #inspect, #integrated}] DEBUG : Rescaled momenta expanded
  2107. 185.36 s > field value
  2108. 185.36 s > res n-terms: 1, byte size: 585,expr:
  2109. 185.36 s > -SCALAR_COUPLING²·q₀(αᵉ².¹)·q₀(αᵉ³.¹)·q₂(αᵉ².¹)·q₂(αᵉ³.¹)
  2110. 185.36 s > /(t²·denom(3,-q₀-q₂/t,mass_scalar_2²,-mass_scalar_2²+2·(q₀.q₂)/t+(q₂.q₂)/t²+(q₀.q₀))
  2111. 185.36 s > ·denom(2,q₂/t,mass_scalar_2²,-mass_scalar_2²+(q₂.q₂)/t²))
  2112. 185.36 s > span t{span_context=true current=subgraph=y, topo_order=1, dod=2 given=subgraph=0, topo_order=0, dod=0}
  2113. 185.36 s > [2026-09-02 17:40:18.906] @approx::local_4d [{#uv, #integrated, #rescaled}] DEBUG : Rescaled expanded
  2114. 185.36 s > field value
  2115. 185.36 s > n_loops 1
  2116. 185.36 s > res n-terms: 1, byte size: 707,expr:
  2117. 185.36 s > -SCALAR_COUPLING²·q₀(αᵉ².¹)·q₀(αᵉ³.¹)·q₂(αᵉ².¹)·q₂(αᵉ³.¹)
  2118. 185.36 s > /(t²·denom(3,-q₂,mUVexp²+t²·mass_scalar_2²,-mUV²+t²·(-mass_scalar_2²+2·(q₀.q₂)/t+(q₂.q₂)/t²+(q₀.q₀))+t²·mUVexp²)
  2119. 185.36 s > ·denom(2,q₂,mUVexp²+t²·mass_scalar_2²,-mUV²+t²·(-mass_scalar_2²+(q₂.q₂)/t²)+t²·mUVexp²))
  2120. 185.36 s > span t{span_context=true current=subgraph=y, topo_order=1, dod=2 given=subgraph=0, topo_order=0, dod=0}
  2121. 185.36 s > [2026-09-02 17:40:18.906] @approx::local_4d [{#uv, #integrated, #series}] DEBUG : Series expanded
  2122. 185.36 s > field value
  2123. 185.36 s > res n-terms: 3, byte size: 1896,expr:
  2124. 185.36 s > (1/2·SCALAR_COUPLING²·(2·mUVexp²-2·mass_scalar_2²)/(denom(2,q₂,mUVexp²,-mUV²+(q₂.q₂))²·denom(3,-q₂,mUVexp²,-mUV²+(q₂.q₂)))
  2125. 185.36 s > -SCALAR_COUPLING²
  2126. 185.36 s > ·(-1/2·(2·mUVexp²-2·mass_scalar_2²+2·(q₀.q₀))/denom(3,-q₂,mUVexp²,-mUV²+(q₂.q₂))
  2127. 185.36 s > +4·(q₀.q₂)²/denom(3,-q₂,mUVexp²,-mUV²+(q₂.q₂))²
  2128. 185.36 s > )/(denom(2,q₂,mUVexp²,-mUV²+(q₂.q₂))·denom(3,-q₂,mUVexp²,-mUV²+(q₂.q₂)))
  2129. 185.36 s > )·q₀(αᵉ².¹)·q₀(αᵉ³.¹)·q₂(αᵉ².¹)·q₂(αᵉ³.¹)
  2130. 185.36 s > +2·SCALAR_COUPLING²·(q₀.q₂)·q₀(αᵉ².¹)·q₀(αᵉ³.¹)·q₂(αᵉ².¹)·q₂(αᵉ³.¹)
  2131. 185.36 s > /(t·denom(2,q₂,mUVexp²,-mUV²+(q₂.q₂))·denom(3,-q₂,mUVexp²,-mUV²+(q₂.q₂))²)
  2132. 185.36 s > -SCALAR_COUPLING²·q₀(αᵉ².¹)·q₀(αᵉ³.¹)·q₂(αᵉ².¹)·q₂(αᵉ³.¹)
  2133. 185.36 s > /(t²·denom(2,q₂,mUVexp²,-mUV²+(q₂.q₂))·denom(3,-q₂,mUVexp²,-mUV²+(q₂.q₂)))
  2134. 185.36 s > span t{span_context=true current=subgraph=y, topo_order=1, dod=2 given=subgraph=0, topo_order=0, dod=0}
  2135. 185.36 s > [2026-09-02 17:40:18.906] @approx::local_4d [{#uv, #integrated, #series}] DEBUG : Evaluated at t = 1
  2136. 185.36 s > field value
  2137. 185.36 s > res n-terms: 3, byte size: 1880,expr:
  2138. 185.36 s > (1/2·SCALAR_COUPLING²·(2·mUVexp²-2·mass_scalar_2²)/(denom(2,q₂,mUVexp²,-mUV²+(q₂.q₂))²·denom(3,-q₂,mUVexp²,-mUV²+(q₂.q₂)))
  2139. 185.36 s > -SCALAR_COUPLING²
  2140. 185.36 s > ·(-1/2·(2·mUVexp²-2·mass_scalar_2²+2·(q₀.q₀))/denom(3,-q₂,mUVexp²,-mUV²+(q₂.q₂))
  2141. 185.36 s > +4·(q₀.q₂)²/denom(3,-q₂,mUVexp²,-mUV²+(q₂.q₂))²
  2142. 185.36 s > )/(denom(2,q₂,mUVexp²,-mUV²+(q₂.q₂))·denom(3,-q₂,mUVexp²,-mUV²+(q₂.q₂)))
  2143. 185.36 s > )·q₀(αᵉ².¹)·q₀(αᵉ³.¹)·q₂(αᵉ².¹)·q₂(αᵉ³.¹)
  2144. 185.36 s > -SCALAR_COUPLING²·q₀(αᵉ².¹)·q₀(αᵉ³.¹)·q₂(αᵉ².¹)·q₂(αᵉ³.¹)
  2145. 185.36 s > /(denom(2,q₂,mUVexp²,-mUV²+(q₂.q₂))·denom(3,-q₂,mUVexp²,-mUV²+(q₂.q₂)))
  2146. 185.36 s > +2·SCALAR_COUPLING²·(q₀.q₂)·q₀(αᵉ².¹)·q₀(αᵉ³.¹)·q₂(αᵉ².¹)·q₂(αᵉ³.¹)
  2147. 185.36 s > /(denom(2,q₂,mUVexp²,-mUV²+(q₂.q₂))·denom(3,-q₂,mUVexp²,-mUV²+(q₂.q₂))²)
  2148. 185.36 s > span t{span_context=true current=subgraph=y, topo_order=1, dod=2 given=subgraph=0, topo_order=0, dod=0}
  2149. 185.36 s > [2026-09-02 17:40:18.908] @approx::local_4d [{#uv, #collect, #integrated}] DEBUG : After gamma chain collection
  2150. 185.36 s > field value
  2151. 185.36 s > expr n-terms: 3, byte size: 1880,expr:
  2152. 185.36 s > (1/2·SCALAR_COUPLING²·(2·mUVexp²-2·mass_scalar_2²)/(denom(2,q₂,mUVexp²,-mUV²+(q₂.q₂))²·denom(3,-q₂,mUVexp²,-mUV²+(q₂.q₂)))
  2153. 185.36 s > -SCALAR_COUPLING²
  2154. 185.36 s > ·(-1/2·(2·mUVexp²-2·mass_scalar_2²+2·(q₀.q₀))/denom(3,-q₂,mUVexp²,-mUV²+(q₂.q₂))
  2155. 185.36 s > +4·(q₀.q₂)²/denom(3,-q₂,mUVexp²,-mUV²+(q₂.q₂))²
  2156. 185.36 s > )/(denom(2,q₂,mUVexp²,-mUV²+(q₂.q₂))·denom(3,-q₂,mUVexp²,-mUV²+(q₂.q₂)))
  2157. 185.36 s > )·q₀(αᵉ².¹)·q₀(αᵉ³.¹)·q₂(αᵉ².¹)·q₂(αᵉ³.¹)
  2158. 185.36 s > -SCALAR_COUPLING²·q₀(αᵉ².¹)·q₀(αᵉ³.¹)·q₂(αᵉ².¹)·q₂(αᵉ³.¹)
  2159. 185.36 s > /(denom(2,q₂,mUVexp²,-mUV²+(q₂.q₂))·denom(3,-q₂,mUVexp²,-mUV²+(q₂.q₂)))
  2160. 185.36 s > +2·SCALAR_COUPLING²·(q₀.q₂)·q₀(αᵉ².¹)·q₀(αᵉ³.¹)·q₂(αᵉ².¹)·q₂(αᵉ³.¹)
  2161. 185.36 s > /(denom(2,q₂,mUVexp²,-mUV²+(q₂.q₂))·denom(3,-q₂,mUVexp²,-mUV²+(q₂.q₂))²)
  2162. 185.36 s > span t{span_context=true current=subgraph=y, topo_order=1, dod=2 given=subgraph=0, topo_order=0, dod=0}
  2163. 185.36 s > [2026-09-02 17:40:18.909] @approx::local_4d [{#profile, #uv, #collect, #integrated, #start, #trace}] DEBUG : After gamma schoonschip
  2164. 185.36 s > field value
  2165. 185.36 s > expr n-terms: 3, byte size: 1631,expr:
  2166. 185.36 s > (1/2·SCALAR_COUPLING²·(2·mUVexp²-2·mass_scalar_2²)/(denom(2,q₂,mUVexp²,-mUV²+(q₂.q₂))²·denom(3,-q₂,mUVexp²,-mUV²+(q₂.q₂)))
  2167. 185.36 s > -SCALAR_COUPLING²
  2168. 185.36 s > ·(-1/2·(2·mUVexp²-2·mass_scalar_2²+2·(q₀.q₀))/denom(3,-q₂,mUVexp²,-mUV²+(q₂.q₂))
  2169. 185.36 s > +4·(q₀.q₂)²/denom(3,-q₂,mUVexp²,-mUV²+(q₂.q₂))²
  2170. 185.36 s > )/(denom(2,q₂,mUVexp²,-mUV²+(q₂.q₂))·denom(3,-q₂,mUVexp²,-mUV²+(q₂.q₂)))
  2171. 185.36 s > )·(q₀.q₂)²
  2172. 185.36 s > -SCALAR_COUPLING²·(q₀.q₂)²/(denom(2,q₂,mUVexp²,-mUV²+(q₂.q₂))·denom(3,-q₂,mUVexp²,-mUV²+(q₂.q₂)))
  2173. 185.36 s > +2·SCALAR_COUPLING²·(q₀.q₂)·(q₀.q₂)²
  2174. 185.36 s > /(denom(2,q₂,mUVexp²,-mUV²+(q₂.q₂))·denom(3,-q₂,mUVexp²,-mUV²+(q₂.q₂))²)
  2175. 185.36 s > span t{span_context=true current=subgraph=y, topo_order=1, dod=2 given=subgraph=0, topo_order=0, dod=0}
  2176. 185.36 s > [2026-09-02 17:40:18.910] @approx::local_4d [{#profile, #uv, #collect, #integrated, #start, #trace}] DEBUG : After gamma collection
  2177. 185.36 s > field value
  2178. 185.36 s > expr n-terms: 1, byte size: 1347,expr:
  2179. 185.36 s > SCALAR_COUPLING²
  2180. 185.36 s > ·(-denom(2,q₂,mUVexp²,-mUV²+(q₂.q₂))·denom(3,-q₂,mUVexp²,-mUV²+(q₂.q₂))²
  2181. 185.36 s > +1/2·(2·mUVexp²-2·mass_scalar_2²)·denom(3,-q₂,mUVexp²,-mUV²+(q₂.q₂))²
  2182. 185.36 s > -(-1/2·(2·mUVexp²-2·mass_scalar_2²+2·(q₀.q₀))·denom(3,-q₂,mUVexp²,-mUV²+(q₂.q₂))+4·(q₀.q₂)²)
  2183. 185.36 s > ·denom(2,q₂,mUVexp²,-mUV²+(q₂.q₂))
  2184. 185.36 s > +2·(q₀.q₂)·denom(2,q₂,mUVexp²,-mUV²+(q₂.q₂))·denom(3,-q₂,mUVexp²,-mUV²+(q₂.q₂))
  2185. 185.36 s > )·(q₀.q₂)²/(denom(2,q₂,mUVexp²,-mUV²+(q₂.q₂))²·denom(3,-q₂,mUVexp²,-mUV²+(q₂.q₂))³)
  2186. 185.36 s > span t{span_context=true current=subgraph=y, topo_order=1, dod=2 given=subgraph=0, topo_order=0, dod=0}
  2187. 185.36 s > [2026-09-02 17:40:18.911] @approx::local_4d [{#profile, #uv, #gamma, #integrated, #start, #trace, #vakint}] DEBUG : After gamma simplification
  2188. 185.36 s > ... omitted 3263 more lines; see full nextest output above
  2189. 185.36 s >
  2190. 185.36 s > 8. gammaloop-integration-tests::uv::sunrise_scalar_1_uv
  2191. 185.36 s > failure: test failure with exit code 101
  2192. 185.36 s > system-out
  2193. 185.36 s > running 1 test
  2194. 185.36 s > test sunrise_scalar_1_uv has been running for over 60 seconds
  2195. 185.36 s > +------------------+------------------------+--------------+--------+----------+----------------------------------------------------------------------------------------------------------------------+-------+
  2196. 185.36 s > | case | check | graph | status | sigma | threshold | error |
  2197. 185.36 s > +------------------+------------------------+--------------+--------+----------+----------------------------------------------------------------------------------------------------------------------+-------+
  2198. 185.36 s > | sunrise_scalar_1 | uv_profile | - | FAIL | - | - | - |
  2199. 185.36 s > +------------------+------------------------+--------------+--------+----------+----------------------------------------------------------------------------------------------------------------------+-------+
  2200. 185.36 s > | sunrise_scalar_1 | m_uv.inspect | inspect | pass | - | best inspect relative delta 1.624e0 >= 1000*accuracy 1.000e-3 (accuracy=1.000e-6, exponent=+1.0, seed=1, probes=10) | - |
  2201. 185.36 s > +------------------+------------------------+--------------+--------+----------+----------------------------------------------------------------------------------------------------------------------+-------+
  2202. 185.36 s > | sunrise_scalar_1 | m_uv.integrated | sunrise | pass | 0.1sigma | compatible within 2sigma | - |
  2203. 185.36 s > +------------------+------------------------+--------------+--------+----------+----------------------------------------------------------------------------------------------------------------------+-------+
  2204. 185.36 s > | sunrise_scalar_1 | rls.inspect | inspect | pass | - | best inspect relative delta 8.682e-1 >= 1000*accuracy 1.000e-3 (accuracy=1.000e-6, exponent=+1.0, seed=1, probes=10) | - |
  2205. 185.36 s > +------------------+------------------------+--------------+--------+----------+----------------------------------------------------------------------------------------------------------------------+-------+
  2206. 185.36 s > | sunrise_scalar_1 | rls.integrated | sunrise | pass | 0.0sigma | compatible within 2sigma | - |
  2207. 185.36 s > +------------------+------------------------+--------------+--------+----------+----------------------------------------------------------------------------------------------------------------------+-------+
  2208. 185.36 s > | sunrise_scalar_1 | mu_r.inspect | inspect | pass | - | best inspect relative delta 1.752e0 >= 1000*accuracy 1.000e-3 (accuracy=1.000e-6, exponent=+1.0, seed=1, probes=10) | - |
  2209. 185.36 s > +------------------+------------------------+--------------+--------+----------+----------------------------------------------------------------------------------------------------------------------+-------+
  2210. 185.36 s > | sunrise_scalar_1 | integrated.relerr | integrated | pass | - | relative error 9.20% <= 10.00% | - |
  2211. 185.36 s > +------------------+------------------------+--------------+--------+----------+----------------------------------------------------------------------------------------------------------------------+-------+
  2212. 185.36 s > | sunrise_scalar_1 | m_uv.integrated.relerr | m_uv-shifted | pass | - | relative error 5.89% <= 10.00% | - |
  2213. 185.36 s > +------------------+------------------------+--------------+--------+----------+----------------------------------------------------------------------------------------------------------------------+-------+
  2214. 185.36 s > | sunrise_scalar_1 | target | - | pass | - | 2sigma | - |
  2215. 185.36 s > +------------------+------------------------+--------------+--------+----------+----------------------------------------------------------------------------------------------------------------------+-------+
  2216. 185.36 s > test sunrise_scalar_1_uv ... FAILED
  2217. 185.36 s >
  2218. 185.36 s > failures:
  2219. 185.36 s >
  2220. 185.36 s > failures:
  2221. 185.36 s > sunrise_scalar_1_uv
  2222. 185.36 s >
  2223. 185.36 s > test result: FAILED. 0 passed; 1 failed; 0 ignored; 0 measured; 24 filtered out; finished in 86.96s
  2224. 185.36 s > system-err
  2225. 185.36 s > [2026-09-02 17:40:23.306] @gammaloop_api::se... INFO : Running command run generate
  2226. 185.36 s > [2026-09-02 17:40:23.306] @gammaloop_api::se... INFO : Starting command block generate
  2227. 185.36 s > [2026-09-02 17:40:23.306] @gammaloop_api::se... INFO : Running command import model scalars-default.json
  2228. 185.36 s > [2026-09-02 17:40:23.306] @import::model INFO : Loading built-in JSON model scalars-default
  2229. 185.36 s > [2026-09-02 17:40:23.312] @gammalooprs::model INFO : The following 2 external parameters were forced to zero by the restriction card:
  2230. 185.36 s > width_scalar_1, width_scalar_2
  2231. 185.36 s > [2026-09-02 17:40:23.313] @gammaloop_api::se... INFO : Running command remove processes
  2232. 185.36 s > [2026-09-02 17:40:23.313] @gammaloop_api::se... INFO : Running command set global kv global.generation.uv.generate_integrated=true
  2233. 185.36 s > [2026-09-02 17:40:23.313] @gammaloop_api::se... INFO : Running command import graphs ./tests/resources/graphs/scalar_sunrise.dot -p sunrise_scalar_1 -i scalar_sunrise
  2234. 185.36 s > [2026-09-02 17:40:23.313] @commands::import INFO : Loading graphs from '/build/source/tests/resources/graphs/scalar_sunrise.dot'
  2235. 185.36 s > [2026-09-02 17:40:23.317] @gammaloop_api::se... INFO : Running command generate existing -p sunrise_scalar_1 -i scalar_sunrise
  2236. 185.36 s > [2026-09-02 17:40:23.319] @approx::local_4d [{#uv, #inspect, #integrated}] DEBUG : Rescaled momenta expanded
  2237. 185.36 s > field value
  2238. 185.36 s > res n-terms: 1, byte size: 611,expr:
  2239. 185.36 s > 1/(denom(0,q₀/t,mass_scalar_1²,-mass_scalar_1²+(q₀.q₀)/t²)
  2240. 185.36 s > ·denom(1,-q₂+q₃-q₀/t,mass_scalar_1²,
  2241. 185.36 s > -mass_scalar_1²+2·(q₀.q₂)/t-2·(q₀.q₃)/t+(q₀.q₀)/t²+(q₂.q₂)
  2242. 185.36 s > -2·(q₂.q₃)+(q₃.q₃)
  2243. 185.36 s > ))
  2244. 185.36 s > [2026-09-02 17:40:23.323] @approx::local_4d [{#uv, #inspect, #integrated}] DEBUG : Rescaled momenta expanded
  2245. 185.36 s > field value
  2246. 185.36 s > res n-terms: 1, byte size: 3,expr:
  2247. 185.36 s > 1
  2248. 185.36 s > [2026-09-02 17:40:23.324] @approx::local_4d [{#uv, #inspect, #integrated}] DEBUG : Rescaled momenta expanded
  2249. 185.36 s > field value
  2250. 185.36 s > res n-terms: 1, byte size: 611,expr:
  2251. 185.36 s > 1/(denom(1,q₁/t,mass_scalar_1²,-mass_scalar_1²+(q₁.q₁)/t²)
  2252. 185.36 s > ·denom(2,-q₀+q₃-q₁/t,mass_scalar_1²,
  2253. 185.36 s > -mass_scalar_1²+2·(q₀.q₁)/t-2·(q₁.q₃)/t+(q₁.q₁)/t²+(q₀.q₀)
  2254. 185.36 s > -2·(q₀.q₃)+(q₃.q₃)
  2255. 185.36 s > ))
  2256. 185.36 s > [2026-09-02 17:40:23.328] @approx::local_4d [{#uv, #inspect, #integrated}] DEBUG : Rescaled momenta expanded
  2257. 185.36 s > field value
  2258. 185.36 s > res n-terms: 1, byte size: 777,expr:
  2259. 185.36 s > 1/(denom(0,q₀/t,mass_scalar_1²,-mass_scalar_1²+(q₀.q₀)/t²)·denom(1,q₁/t,mass_scalar_1²,-mass_scalar_1²+(q₁.q₁)/t²)
  2260. 185.36 s > ·denom(2,q₄-q₀/t-q₁/t,mass_scalar_1²,
  2261. 185.36 s > -mass_scalar_1²-2·(q₀.q₄)/t-2·(q₁.q₄)/t+(q₀.q₀)/t²+2·(q₀.q₁)/t²
  2262. 185.36 s > +(q₁.q₁)/t²+(q₄.q₄)
  2263. 185.36 s > ))
  2264. 185.36 s > [2026-09-02 17:40:23.330] @approx::local_4d [{#uv, #inspect, #integrated}] DEBUG : Rescaled momenta expanded
  2265. 185.36 s > field value
  2266. 185.36 s > res n-terms: 1, byte size: 611,expr:
  2267. 185.36 s > 1/(denom(0,q₀/t,mass_scalar_1²,-mass_scalar_1²+(q₀.q₀)/t²)
  2268. 185.36 s > ·denom(2,-q₁+q₃-q₀/t,mass_scalar_1²,
  2269. 185.36 s > -mass_scalar_1²+2·(q₀.q₁)/t-2·(q₀.q₃)/t+(q₀.q₀)/t²+(q₁.q₁)
  2270. 185.36 s > -2·(q₁.q₃)+(q₃.q₃)
  2271. 185.36 s > ))
  2272. 185.36 s > [2026-09-02 17:40:23.331] @approx::final_integrand[{#generation, #profile, #uv, #graph, #summary}] DEBUG : Computed global numerator
  2273. 185.36 s > field value
  2274. 185.36 s > global_num n-terms: 1, byte size: 3,expr:
  2275. 185.36 s > 1
  2276. 185.36 s > span build_3d{span_context=true graph=sunrise current=subgraph=0, topo_order=0, dod=0}
  2277. 185.36 s > [2026-09-02 17:40:23.332] @uv::approx [{#generation, #uv, #fourd}] DEBUG : Computing 4D
  2278. 185.36 s > field value
  2279. 185.36 s > simple subgraph(S_47,S_y)*Approx(subgraph(S_y,0)) of sunrise
  2280. 185.36 s > span compute_4d{span_context=true graph=sunrise current=subgraph=y, topo_order=1, dod=0 given=subgraph=0, topo_order=0, dod=0 reduced=SubSet { set: BitVec<usize, bitvec::order::Lsb0> { addr: 0x7fffec00e420, head: 000000, bits: 8, capacity: 64 } [0, 0, 1, 1, 1, 1, 0, 0], id: PhantomData<linnet::half_edge::involution::Hedge> }}
  2281. 185.36 s > [2026-09-02 17:40:23.333] @approx::local_4d [{#uv, #algebra, #integrated, #start}] DEBUG :
  2282. 185.36 s > field value
  2283. 185.36 s > integrand n-terms: 1, byte size: 217,expr:
  2284. 185.36 s > 1/(denom(0,q₀,mass_scalar_1²,-mass_scalar_1²+(q₀.q₀))·denom(1,q₁,mass_scalar_1²,-mass_scalar_1²+(q₁.q₁)))
  2285. 185.36 s > reduced y
  2286. 185.36 s > span grow{span_context=true current=subgraph=y, topo_order=1, dod=0 given=subgraph=0, topo_order=0, dod=0}
  2287. 185.36 s > [2026-09-02 17:40:23.333] @approx::local_4d [{#uv, #inspect, #integrated}] DEBUG : Rescaled momenta expanded
  2288. 185.36 s > field value
  2289. 185.36 s > res n-terms: 1, byte size: 611,expr:
  2290. 185.36 s > 1/(denom(0,q₀/t,mass_scalar_1²,-mass_scalar_1²+(q₀.q₀)/t²)
  2291. 185.36 s > ·denom(1,-q₂+q₃-q₀/t,mass_scalar_1²,
  2292. 185.36 s > -mass_scalar_1²+2·(q₀.q₂)/t-2·(q₀.q₃)/t+(q₀.q₀)/t²+(q₂.q₂)
  2293. 185.36 s > -2·(q₂.q₃)+(q₃.q₃)
  2294. 185.36 s > ))
  2295. 185.36 s > span t{span_context=true current=subgraph=y, topo_order=1, dod=0 given=subgraph=0, topo_order=0, dod=0}
  2296. 185.36 s > [2026-09-02 17:40:23.333] @approx::local_4d [{#uv, #integrated, #rescaled}] DEBUG : Rescaled expanded
  2297. 185.36 s > field value
  2298. 185.36 s > n_loops 1
  2299. 185.36 s > res n-terms: 1, byte size: 723,expr:
  2300. 185.36 s > 1/(denom(0,q₀,mUVexp²+t²·mass_scalar_1²,-mUV²+t²·(-mass_scalar_1²+(q₀.q₀)/t²)+t²·mUVexp²)
  2301. 185.36 s > ·denom(1,-q₀,mUVexp²+t²·mass_scalar_1²,
  2302. 185.36 s > -mUV²
  2303. 185.36 s > +t²
  2304. 185.36 s > ·(-mass_scalar_1²+2·(q₀.q₂)/t-2·(q₀.q₃)/t+(q₀.q₀)/t²+(q₂.q₂)
  2305. 185.36 s > -2·(q₂.q₃)+(q₃.q₃)
  2306. 185.36 s > )
  2307. 185.36 s > +t²·mUVexp²
  2308. 185.36 s > ))
  2309. 185.36 s > span t{span_context=true current=subgraph=y, topo_order=1, dod=0 given=subgraph=0, topo_order=0, dod=0}
  2310. 185.36 s > [2026-09-02 17:40:23.333] @approx::local_4d [{#uv, #integrated, #series}] DEBUG : Series expanded
  2311. 185.36 s > field value
  2312. 185.36 s > res n-terms: 1, byte size: 223,expr:
  2313. 185.36 s > 1/(denom(0,q₀,mUVexp²,-mUV²+(q₀.q₀))·denom(1,-q₀,mUVexp²,-mUV²+(q₀.q₀)))
  2314. 185.36 s > span t{span_context=true current=subgraph=y, topo_order=1, dod=0 given=subgraph=0, topo_order=0, dod=0}
  2315. 185.36 s > [2026-09-02 17:40:23.333] @approx::local_4d [{#uv, #integrated, #series}] DEBUG : Evaluated at t = 1
  2316. 185.36 s > field value
  2317. 185.36 s > res n-terms: 1, byte size: 223,expr:
  2318. 185.36 s > 1/(denom(0,q₀,mUVexp²,-mUV²+(q₀.q₀))·denom(1,-q₀,mUVexp²,-mUV²+(q₀.q₀)))
  2319. 185.36 s > span t{span_context=true current=subgraph=y, topo_order=1, dod=0 given=subgraph=0, topo_order=0, dod=0}
  2320. 185.36 s > [2026-09-02 17:40:23.334] @approx::local_4d [{#uv, #collect, #integrated}] DEBUG : After gamma chain collection
  2321. 185.36 s > field value
  2322. 185.36 s > expr n-terms: 1, byte size: 223,expr:
  2323. 185.36 s > 1/(denom(0,q₀,mUVexp²,-mUV²+(q₀.q₀))·denom(1,-q₀,mUVexp²,-mUV²+(q₀.q₀)))
  2324. 185.36 s > span t{span_context=true current=subgraph=y, topo_order=1, dod=0 given=subgraph=0, topo_order=0, dod=0}
  2325. 185.36 s > [2026-09-02 17:40:23.334] @approx::local_4d [{#profile, #uv, #collect, #integrated, #start, #trace}] DEBUG : After gamma schoonschip
  2326. 185.36 s > field value
  2327. 185.36 s > expr n-terms: 1, byte size: 223,expr:
  2328. 185.36 s > 1/(denom(0,q₀,mUVexp²,-mUV²+(q₀.q₀))·denom(1,-q₀,mUVexp²,-mUV²+(q₀.q₀)))
  2329. 185.36 s > span t{span_context=true current=subgraph=y, topo_order=1, dod=0 given=subgraph=0, topo_order=0, dod=0}
  2330. 185.36 s > [2026-09-02 17:40:23.335] @approx::local_4d [{#profile, #uv, #collect, #integrated, #start, #trace}] DEBUG : After gamma collection
  2331. 185.36 s > field value
  2332. 185.36 s > expr n-terms: 1, byte size: 223,expr:
  2333. 185.36 s > 1/(denom(0,q₀,mUVexp²,-mUV²+(q₀.q₀))·denom(1,-q₀,mUVexp²,-mUV²+(q₀.q₀)))
  2334. 185.36 s > span t{span_context=true current=subgraph=y, topo_order=1, dod=0 given=subgraph=0, topo_order=0, dod=0}
  2335. 185.36 s > [2026-09-02 17:40:23.335] @approx::local_4d [{#profile, #uv, #gamma, #integrated, #start, #trace, #vakint}] DEBUG : After gamma simplification
  2336. 185.36 s > field value
  2337. 185.36 s > expr n-terms: 1, byte size: 223,expr:
  2338. 185.36 s > 1/(denom(0,q₀,mUVexp²,-mUV²+(q₀.q₀))·denom(1,-q₀,mUVexp²,-mUV²+(q₀.q₀)))
  2339. 185.36 s > span t{span_context=true current=subgraph=y, topo_order=1, dod=0 given=subgraph=0, topo_order=0, dod=0}
  2340. 185.36 s > [2026-09-02 17:40:23.335] @approx::local_4d [{#profile, #uv, #integrated, #schoonschip, #start, #trace, #vakint}] DEBUG : After Schoonschip net
  2341. 185.36 s > field value
  2342. 185.36 s > expr n-terms: 1, byte size: 223,expr:
  2343. 185.36 s > 1/(denom(0,q₀,mUVexp²,-mUV²+(q₀.q₀))·denom(1,-q₀,mUVexp²,-mUV²+(q₀.q₀)))
  2344. 185.36 s > ... omitted 20090 more lines; see full nextest output above
  2345. 185.36 s >
  2346. 185.36 s > 9. gammaloop-integration-tests::uv::se1l_uv
  2347. 185.36 s > failure: test failure with exit code 101
  2348. 185.36 s > system-out
  2349. 185.36 s > running 1 test
  2350. 185.36 s > test se1l_uv has been running for over 60 seconds
  2351. 185.36 s > +------+-----------------+---------+--------+----------+-----------------------------------------------------------------------------------------------------------------------+-------+
  2352. 185.36 s > | case | check | graph | status | sigma | threshold | error |
  2353. 185.36 s > +------+-----------------+---------+--------+----------+-----------------------------------------------------------------------------------------------------------------------+-------+
  2354. 185.36 s > | se1l | uv_profile | - | FAIL | - | - | - |
  2355. 185.36 s > +------+-----------------+---------+--------+----------+-----------------------------------------------------------------------------------------------------------------------+-------+
  2356. 185.36 s > | se1l | m_uv.inspect | inspect | pass | - | best inspect relative delta 1.097e-1 >= 1000*accuracy 1.000e-7 (accuracy=1.000e-10, exponent=+2.0, seed=1, probes=10) | - |
  2357. 185.36 s > +------+-----------------+---------+--------+----------+-----------------------------------------------------------------------------------------------------------------------+-------+
  2358. 185.36 s > | se1l | m_uv.integrated | se1l | pass | 0.1sigma | compatible within 2sigma | - |
  2359. 185.36 s > +------+-----------------+---------+--------+----------+-----------------------------------------------------------------------------------------------------------------------+-------+
  2360. 185.36 s > | se1l | rls.inspect | inspect | pass | - | best inspect relative delta 4.499e-2 >= 1000*accuracy 1.000e-7 (accuracy=1.000e-10, exponent=+2.0, seed=1, probes=10) | - |
  2361. 185.36 s > +------+-----------------+---------+--------+----------+-----------------------------------------------------------------------------------------------------------------------+-------+
  2362. 185.36 s > | se1l | rls.integrated | se1l | pass | 0.0sigma | compatible within 2sigma | - |
  2363. 185.36 s > +------+-----------------+---------+--------+----------+-----------------------------------------------------------------------------------------------------------------------+-------+
  2364. 185.36 s > | se1l | mu_r.inspect | inspect | pass | - | best inspect relative delta 1.424e-1 >= 1000*accuracy 1.000e-7 (accuracy=1.000e-10, exponent=+2.0, seed=1, probes=10) | - |
  2365. 185.36 s > +------+-----------------+---------+--------+----------+-----------------------------------------------------------------------------------------------------------------------+-------+
  2366. 185.36 s > | se1l | target | - | pass | - | 2sigma | - |
  2367. 185.36 s > +------+-----------------+---------+--------+----------+-----------------------------------------------------------------------------------------------------------------------+-------+
  2368. 185.36 s > test se1l_uv ... FAILED
  2369. 185.36 s >
  2370. 185.36 s > failures:
  2371. 185.36 s >
  2372. 185.36 s > failures:
  2373. 185.36 s > se1l_uv
  2374. 185.36 s >
  2375. 185.36 s > test result: FAILED. 0 passed; 1 failed; 0 ignored; 0 measured; 24 filtered out; finished in 95.37s
  2376. 185.36 s > system-err
  2377. 185.36 s > [2026-09-02 17:40:22.775] @gammaloop_api::se... INFO : Running command run generate
  2378. 185.36 s > [2026-09-02 17:40:22.775] @gammaloop_api::se... INFO : Starting command block generate
  2379. 185.36 s > [2026-09-02 17:40:22.776] @gammaloop_api::se... INFO : Running command import model sm-default
  2380. 185.36 s > [2026-09-02 17:40:22.776] @import::model INFO : Loading built-in JSON model sm-default
  2381. 185.36 s > [2026-09-02 17:40:22.801] @gammalooprs::model INFO : The following 11 external parameters were forced to zero by the restriction card:
  2382. 185.36 s > lamWS, AWS, rhoWS, etaWS, ymc, yme, ymm, MC, Me, MM, WTau
  2383. 185.36 s > [2026-09-02 17:40:22.802] @gammalooprs::model INFO : The following 34 vertex rules were removed by the restriction card:
  2384. 185.36 s > V_82 -> (c~, d, G+) | V_83 -> (t~, d, G+) | V_84 -> (c~, s, G+) | V_85 -> (t~, s, G+) | V_86 -> (u~, b, G+) | V_87 -> (c~, b, G+) | V_90 -> (c~, d, W+) | V_91 -> (t~, d, W+) | V_92 -> (u~, s, W+) | V_94 -> (t~, s, W+) | V_95 -> (u~, b, W+) | V_96 -> (c~, b, W+) | V_101 -> (e+, e-, G0) | V_102 -> (mu+, mu-, G0) | V_104 -> (e+, e-, H) | V_105 -> (mu+, mu-, H) | V_110 -> (ve~, e-, G+) | V_111 -> (vm~, mu-, G+) | V_116 -> (b~, u, G-) | V_117 -> (d~, c, G-) | V_118 -> (s~, c, G-) | V_119 -> (b~, c, G-) | V_120 -> (d~, t, G-) | V_121 -> (s~, t, G-) | V_124 -> (s~, u, W-) | V_125 -> (b~, u, W-) | V_126 -> (d~, c, W-) | V_128 -> (b~, c, W-) | V_129 -> (d~, t, W-) | V_130 -> (s~, t, W-) | V_138 -> (c~, c, G0) | V_140 -> (c~, c, H) | V_145 -> (e+, ve, G-) | V_146 -> (mu+, vm, G-)
  2385. 185.36 s > [2026-09-02 17:40:22.802] @gammalooprs::model INFO : The following 36 couplings were removed by the restriction card:
  2386. 185.36 s > GC_13, GC_14, GC_16, GC_17, GC_18, GC_19, GC_20, GC_22, GC_23, GC_24, GC_25, GC_26, GC_28, GC_29, GC_42, GC_43, GC_44, GC_46, GC_47, GC_48, GC_84, GC_85, GC_86, GC_87, GC_88, GC_89, GC_90, GC_91, GC_92, GC_93, GC_101, GC_102, GC_103, GC_105, GC_106, GC_107
  2387. 185.36 s > [2026-09-02 17:40:22.802] @gammaloop_api::se... INFO : Running command remove processes
  2388. 185.36 s > [2026-09-02 17:40:22.802] @gammaloop_api::se... INFO : Running command set global kv global.generation.uv.generate_integrated=true
  2389. 185.36 s > [2026-09-02 17:40:22.802] @gammaloop_api::se... INFO : Running command import graphs ./tests/resources/graphs/uv_tests/se1l.dot -p se1l -i se1l
  2390. 185.36 s > [2026-09-02 17:40:22.803] @commands::import INFO : Loading graphs from '/build/source/tests/resources/graphs/uv_tests/se1l.dot'
  2391. 185.36 s > [2026-09-02 17:40:22.805] @gammaloop_api::se... INFO : Running command generate existing -p se1l -i se1l
  2392. 185.36 s > [2026-09-02 17:40:23.567] @commands::generate INFO :
  2393. 185.36 s > Integrand generation summary
  2394. 185.36 s > peak RAM 72.84 MiB | cores 1
  2395. 185.36 s > ╭───────────┬───────┬─────────┬─────────────┬─────────────┬────────────────┬─────────────╮
  2396. 185.36 s > │ integrand │ graph │ # evals │ expr build │ spenso │ symbolica eval │ compile │
  2397. 185.36 s > ├───────────┼───────┼─────────┼─────────────┼─────────────┼────────────────┼─────────────┤
  2398. 185.36 s > │ se1l │ se1l │ 5 │ 663ms (89%) │ 31ms (4.2%) │ 51ms (6.9%) │ 0ms (0.00%) │
  2399. 185.36 s > ├───────────┼───────┼─────────┼─────────────┼─────────────┼────────────────┼─────────────┤
  2400. 185.36 s > │ Total │ │ 5 │ 663ms (89%) │ 31ms (4.2%) │ 51ms (6.9%) │ 0ms (0.00%) │
  2401. 185.36 s > ╰───────────┴───────┴─────────┴─────────────┴─────────────┴────────────────┴─────────────╯
  2402. 185.36 s > [2026-09-02 17:40:23.568] @gammaloop_api::se... INFO : Running command set process -p se1l -i se1l kv general.m_uv=0.2
  2403. 185.36 s > [2026-09-02 17:40:23.569] @gammaloop_api::se... INFO : Running command set process -p se1l -i se1l kv general.mu_r=0.2
  2404. 185.36 s > [2026-09-02 17:40:23.570] @gammaloop_api::se... INFO : Running command set process -p se1l -i se1l kv general.renormalization_localization_scale=0.2
  2405. 185.36 s > [2026-09-02 17:40:23.570] @gammaloop_api::se... INFO : Running command duplicate integrand -p se1l -i se1l --output_process_name se1l --output_integrand_name se1l_muv_shifted
  2406. 185.36 s > [2026-09-02 17:40:23.571] @gammaloop_api::se... INFO : Running command set process -p se1l -i se1l_muv_shifted kv general.m_uv=0.5
  2407. 185.36 s > [2026-09-02 17:40:23.572] @gammaloop_api::se... INFO : Running command duplicate integrand -p se1l -i se1l --output_process_name se1l --output_integrand_name se1l_rls_shifted
  2408. 185.36 s > [2026-09-02 17:40:23.574] @gammaloop_api::se... INFO : Running command set process -p se1l -i se1l_rls_shifted kv general.renormalization_localization_scale=1
  2409. 185.36 s > [2026-09-02 17:40:23.574] @gammaloop_api::se... INFO : Running command duplicate integrand -p se1l -i se1l --output_process_name se1l --output_integrand_name se1l_mur_shifted
  2410. 185.36 s > [2026-09-02 17:40:23.576] @gammaloop_api::se... INFO : Running command set process -p se1l -i se1l_mur_shifted kv general.mu_r=0.8
  2411. 185.36 s > [2026-09-02 17:40:23.581] @process::amplitude WARNING : External state 0 ('g', PDG 21, helicity +) is off shell: p^2 = +2.5e5, expected m^2 = +0e0 (|Δ| = +2.5e5). Fixed-helicity spinor/vector/tensor external states may be ill-defined at this kinematic point.
  2412. 185.36 s > field value
  2413. 185.36 s > span warm_up{integrand.name=se1l}
  2414. 185.36 s > [2026-09-02 17:40:23.581] @process::amplitude WARNING : External state 1 ('g', PDG 21, helicity -) is off shell: p^2 = +2.5e5, expected m^2 = +0e0 (|Δ| = +2.5e5). Fixed-helicity spinor/vector/tensor external states may be ill-defined at this kinematic point.
  2415. 185.36 s > field value
  2416. 185.36 s > span warm_up{integrand.name=se1l}
  2417. 185.36 s > [2026-09-02 17:40:23.581] @process::amplitude INFO : Input is above threshold: 1 existing threshold E-surfaces across 1/1 graph groups
  2418. 185.36 s > field value
  2419. 185.36 s > existing_esurfaces 1
  2420. 185.36 s > group_count 1
  2421. 185.36 s > groups_above_threshold 1
  2422. 185.36 s > integrand se1l
  2423. 185.36 s > span warm_up{integrand.name=se1l}
  2424. 185.36 s > threshold_status above threshold
  2425. 185.36 s > [2026-09-02 17:40:23.581] @process::amplitude INFO : overlap structure of group 0: [1: [0(2,3)]]
  2426. 185.36 s > field value
  2427. 185.36 s > span warm_up{integrand.name=se1l}
  2428. 185.36 s > [2026-09-02 17:40:23.726] @commands::profile INFO :
  2429. 185.36 s > ╭───────┬──────┬──────────┬───────┬─────┬──────────┬───────────╮
  2430. 185.36 s > │ fixed │ → ∞ │ slope │ r2 │ DOD │ bare DOD │ inspect │
  2431. 185.36 s > ├───────┼──────┼──────────┼───────┼─────┼──────────┼───────────┤
  2432. 185.36 s > │ {} │ {e3} │ 1.639236 │ 0.904 │ 2 │ 2 │ arb retry │
  2433. 185.36 s > │ {} │ {e2} │ 1.698834 │ 0.902 │ 2 │ 2 │ arb retry │
  2434. 185.36 s > ╰───────┴──────┴──────────┴───────┴─────┴──────────┴───────────╯
  2435. 185.36 s > [2026-09-02 17:40:23.726] @commands::profile INFO :
  2436. 185.36 s > ╭───────┬──────┬─────────────┬──────────┬───────┬─────┬──────────┬───────────╮
  2437. 185.36 s > │ fixed │ → ∞ │ orientation │ slope │ r2 │ DOD │ bare DOD │ inspect │
  2438. 185.36 s > ├───────┼──────┼─────────────┼──────────┼───────┼─────┼──────────┼───────────┤
  2439. 185.36 s > │ {} │ {e3} │ 00-+ │ 0.343429 │ 0.145 │ 0 │ 2 │ arb retry │
  2440. 185.36 s > │ {} │ {e3} │ 00+- │ 0.342577 │ 0.135 │ 0 │ 2 │ arb retry │
  2441. 185.36 s > │ {} │ {e2} │ 00-+ │ 0.385975 │ 0.161 │ 0 │ 2 │ arb retry │
  2442. 185.36 s > │ {} │ {e2} │ 00+- │ 0.384920 │ 0.192 │ 0 │ 2 │ arb retry │
  2443. 185.36 s > ╰───────┴──────┴─────────────┴──────────┴───────┴─────┴──────────┴───────────╯
  2444. 185.36 s > [2026-09-02 17:40:23.727] @gammaloop_api::se... INFO : Running command set process kv integrator.target_relative_accuracy=0.001 integrator.n_increase=0 integrator.n_start=50000 integrator.n_max=400000 integrator.seed=1337
  2445. 185.36 s > [2026-09-02 17:40:23.728] @commands::integrate INFO : Created workspace directory at /build/source/tests/artifacts/se1l/integration_workspace_se1l
  2446. 185.36 s > [2026-09-02 17:40:23.745] @commands::integrate INFO : No integration state found, starting new integration
  2447. 185.36 s > [2026-09-02 17:40:23.745] @commands::integrate INFO : Gammaloop now integrates se1l@se1l, se1l@se1l_muv_shifted, se1l@se1l_rls_shifted
  2448. 185.36 s > [2026-09-02 17:40:23.745] @process::amplitude WARNING : External state 0 ('g', PDG 21, helicity +) is off shell: p^2 = +2.5e5, expected m^2 = +0e0 (|Δ| = +2.5e5). Fixed-helicity spinor/vector/tensor external states may be ill-defined at this kinematic point.
  2449. 185.36 s > field value
  2450. 185.36 s > span warm_up{integrand.name=se1l}
  2451. 185.36 s > [2026-09-02 17:40:23.745] @process::amplitude WARNING : External state 1 ('g', PDG 21, helicity -) is off shell: p^2 = +2.5e5, expected m^2 = +0e0 (|Δ| = +2.5e5). Fixed-helicity spinor/vector/tensor external states may be ill-defined at this kinematic point.
  2452. 185.36 s > field value
  2453. 185.36 s > span warm_up{integrand.name=se1l}
  2454. 185.36 s > [2026-09-02 17:40:23.746] @process::amplitude INFO : Input is above threshold: 1 existing threshold E-surfaces across 1/1 graph groups
  2455. 185.36 s > field value
  2456. 185.36 s > existing_esurfaces 1
  2457. 185.36 s > group_count 1
  2458. 185.36 s > groups_above_threshold 1
  2459. 185.36 s > integrand se1l
  2460. 185.36 s > span warm_up{integrand.name=se1l}
  2461. 185.36 s > threshold_status above threshold
  2462. 185.36 s > [2026-09-02 17:40:23.746] @process::amplitude INFO : overlap structure of group 0: [1: [0(2,3)]]
  2463. 185.36 s > field value
  2464. 185.36 s > span warm_up{integrand.name=se1l}
  2465. 185.36 s > [2026-09-02 17:40:23.746] @process::amplitude WARNING : External state 0 ('g', PDG 21, helicity +) is off shell: p^2 = +2.5e5, expected m^2 = +0e0 (|Δ| = +2.5e5). Fixed-helicity spinor/vector/tensor external states may be ill-defined at this kinematic point.
  2466. 185.36 s > field value
  2467. 185.36 s > span warm_up{integrand.name=se1l_muv_shifted}
  2468. 185.36 s > [2026-09-02 17:40:23.746] @process::amplitude WARNING : External state 1 ('g', PDG 21, helicity -) is off shell: p^2 = +2.5e5, expected m^2 = +0e0 (|Δ| = +2.5e5). Fixed-helicity spinor/vector/tensor external states may be ill-defined at this kinematic point.
  2469. 185.36 s > field value
  2470. 185.36 s > span warm_up{integrand.name=se1l_muv_shifted}
  2471. 185.36 s > [2026-09-02 17:40:23.747] @process::amplitude INFO : Input is above threshold: 1 existing threshold E-surfaces across 1/1 graph groups
  2472. 185.36 s > field value
  2473. 185.36 s > existing_esurfaces 1
  2474. 185.36 s > group_count 1
  2475. 185.36 s > groups_above_threshold 1
  2476. 185.36 s > integrand se1l_muv_shifted
  2477. 185.36 s > span warm_up{integrand.name=se1l_muv_shifted}
  2478. 185.36 s > threshold_status above threshold
  2479. 185.36 s > [2026-09-02 17:40:23.747] @process::amplitude INFO : overlap structure of group 0: [1: [0(2,3)]]
  2480. 185.36 s > field value
  2481. 185.36 s > span warm_up{integrand.name=se1l_muv_shifted}
  2482. 185.36 s > [2026-09-02 17:40:23.748] @process::amplitude WARNING : External state 0 ('g', PDG 21, helicity +) is off shell: p^2 = +2.5e5, expected m^2 = +0e0 (|Δ| = +2.5e5). Fixed-helicity spinor/vector/tensor external states may be ill-defined at this kinematic point.
  2483. 185.36 s > field value
  2484. 185.36 s > span warm_up{integrand.name=se1l_rls_shifted}
  2485. 185.36 s > [2026-09-02 17:40:23.748] @process::amplitude WARNING : External state 1 ('g', PDG 21, helicity -) is off shell: p^2 = +2.5e5, expected m^2 = +0e0 (|Δ| = +2.5e5). Fixed-helicity spinor/vector/tensor external states may be ill-defined at this kinematic point.
  2486. 185.36 s > field value
  2487. 185.36 s > span warm_up{integrand.name=se1l_rls_shifted}
  2488. 185.36 s > [2026-09-02 17:40:23.748] @process::amplitude INFO : Input is above threshold: 1 existing threshold E-surfaces across 1/1 graph groups
  2489. 185.36 s > field value
  2490. 185.36 s > existing_esurfaces 1
  2491. 185.36 s > group_count 1
  2492. 185.36 s > groups_above_threshold 1
  2493. 185.36 s > integrand se1l_rls_shifted
  2494. 185.36 s > span warm_up{integrand.name=se1l_rls_shifted}
  2495. 185.36 s > threshold_status above threshold
  2496. 185.36 s > ... omitted 1410 more lines; see full nextest output above
  2497. 185.36 s > =========================================
  2498. 185.36 s For full logs, run:
  2499. 185.36 s nix log /nix/store/zpyfjihmv7i6ghxwmb5sjv51y6brg4wy-gammaloop-nextest-integration.drv
  2500. 185.44 s [5 built (1 failed), 64 Run failed.