test packages.x86_64-linux.nix-ci-check-gammaloop-nextest-integration

Reproduce this run
Retry Run
  1. 1148.30 s gammaloop-nextest-integration> | dod2_bubble | rls.integrated | GL0 | pass | 0.0sigma | compatible within 2sigma | - |
  2. 1148.30 s gammaloop-nextest-integration> +-------------+-----------------+---------+--------+----------+-----------------------------------------------------------------------------------------------------------------------+-------+
  3. 1148.30 s gammaloop-nextest-integration> | dod2_bubble | mu_r.inspect | inspect | pass | - | best inspect relative delta 6.951e-1 >= 1000*accuracy 1.000e-7 (accuracy=1.000e-10, exponent=+0.0, seed=0, probes=10) | - |
  4. 1148.30 s gammaloop-nextest-integration> +-------------+-----------------+---------+--------+----------+-----------------------------------------------------------------------------------------------------------------------+-------+
  5. 1148.30 s gammaloop-nextest-integration> | dod2_bubble | target | - | pass | - | 2sigma | - |
  6. 1148.30 s gammaloop-nextest-integration> +-------------+-----------------+---------+--------+----------+-----------------------------------------------------------------------------------------------------------------------+-------+
  7. 1148.30 s gammaloop-nextest-integration> test dod2_bubble_uv ... FAILED
  8. 1148.30 s gammaloop-nextest-integration>
  9. 1148.30 s gammaloop-nextest-integration> failures:
  10. 1148.30 s gammaloop-nextest-integration>
  11. 1148.30 s gammaloop-nextest-integration> failures:
  12. 1148.30 s gammaloop-nextest-integration> dod2_bubble_uv
  13. 1148.30 s gammaloop-nextest-integration>
  14. 1148.30 s gammaloop-nextest-integration> test result: FAILED. 0 passed; 1 failed; 0 ignored; 0 measured; 24 filtered out; finished in 37.46s
  15. 1148.30 s gammaloop-nextest-integration> system-err
  16. 1148.30 s gammaloop-nextest-integration> [2026-09-02 17:37:05.601] @gammaloop_api::se... INFO : Running command run generate
  17. 1148.30 s gammaloop-nextest-integration> [2026-09-02 17:37:05.601] @gammaloop_api::se... INFO : Starting command block generate
  18. 1148.30 s gammaloop-nextest-integration> [2026-09-02 17:37:05.601] @gammaloop_api::se... INFO : Running command import model scalars-default.json
  19. 1148.30 s gammaloop-nextest-integration> [2026-09-02 17:37:05.601] @import::model INFO : Loading built-in JSON model scalars-default
  20. 1148.30 s gammaloop-nextest-integration> [2026-09-02 17:37:05.605] @gammalooprs::model INFO : The following 2 external parameters were forced to zero by the restriction card:
  21. 1148.30 s gammaloop-nextest-integration> width_scalar_1, width_scalar_2
  22. 1148.30 s gammaloop-nextest-integration> [2026-09-02 17:37:05.605] @gammaloop_api::se... INFO : Running command remove processes
  23. 1148.30 s gammaloop-nextest-integration> [2026-09-02 17:37:05.605] @gammaloop_api::se... INFO : Running command set global kv global.generation.uv.generate_integrated=true
  24. 1148.30 s gammaloop-nextest-integration> [2026-09-02 17:37:05.605] @gammaloop_api::se... INFO : Running command import graphs ./tests/resources/graphs/scalar/dod2_bubble.dot -p bubble_dod2 -i scalar_bubble_below_thres
  25. 1148.30 s gammaloop-nextest-integration> [2026-09-02 17:37:05.606] @commands::import INFO : Loading graphs from '/build/source/tests/resources/graphs/scalar/dod2_bubble.dot'
  26. 1148.30 s gammaloop-nextest-integration> [2026-09-02 17:37:05.608] @gammaloop_api::se... INFO : Running command generate existing -p bubble_dod2 -i scalar_bubble_below_thres
  27. 1148.30 s gammaloop-nextest-integration> [2026-09-02 17:37:05.608] @approx::local_4d [{#uv, #inspect, #integrated}] DEBUG : Rescaled momenta expanded
  28. 1148.30 s gammaloop-nextest-integration> field value
  29. 1148.30 s gammaloop-nextest-integration> res n-terms: 1, byte size: 3,expr:
  30. 1148.30 s gammaloop-nextest-integration> 1
  31. 1148.30 s gammaloop-nextest-integration> [2026-09-02 17:37:05.610] @approx::local_4d [{#uv, #inspect, #integrated}] DEBUG : Rescaled momenta expanded
  32. 1148.30 s gammaloop-nextest-integration> field value
  33. 1148.30 s gammaloop-nextest-integration> res n-terms: 1, byte size: 585,expr:
  34. 1148.30 s gammaloop-nextest-integration> -SCALAR_COUPLING²·q₀(αᵉ².¹)·q₀(αᵉ³.¹)·q₂(αᵉ².¹)·q₂(αᵉ³.¹)
  35. 1148.30 s gammaloop-nextest-integration> /(t²·denom(3,-q₀-q₂/t,mass_scalar_2²,-mass_scalar_2²+2·(q₀.q₂)/t+(q₂.q₂)/t²+(q₀.q₀))
  36. 1148.30 s gammaloop-nextest-integration> ·denom(2,q₂/t,mass_scalar_2²,-mass_scalar_2²+(q₂.q₂)/t²))
  37. 1148.30 s gammaloop-nextest-integration> [2026-09-02 17:37:05.615] @approx::final_integrand[{#generation, #profile, #uv, #graph, #summary}] DEBUG : Computed global numerator
  38. 1148.30 s gammaloop-nextest-integration> field value
  39. 1148.30 s gammaloop-nextest-integration> global_num n-terms: 1, byte size: 4,expr:
  40. 1148.30 s gammaloop-nextest-integration> 1/2
  41. 1148.30 s gammaloop-nextest-integration> span build_3d{span_context=true graph=GL0 current=subgraph=0, topo_order=0, dod=0}
  42. 1148.30 s gammaloop-nextest-integration> [2026-09-02 17:37:05.624] @uv::approx [{#generation, #uv, #fourd}] DEBUG : Computing 4D
  43. 1148.30 s gammaloop-nextest-integration> field value
  44. 1148.30 s gammaloop-nextest-integration> simple subgraph(S_11,S_y)*Approx(subgraph(S_y,0)) of GL0
  45. 1148.30 s gammaloop-nextest-integration> span compute_4d{span_context=true graph=GL0 current=subgraph=y, topo_order=1, dod=2 given=subgraph=0, topo_order=0, dod=0 reduced=SubSet { set: BitVec<usize, bitvec::order::Lsb0> { addr: 0x7fffec027530, head: 000000, bits: 6, capacity: 64 } [0, 0, 1, 1, 1, 1], id: PhantomData<linnet::half_edge::involution::Hedge> }}
  46. 1148.30 s gammaloop-nextest-integration> [2026-09-02 17:37:05.624] @approx::local_4d [{#uv, #algebra, #integrated, #start}] DEBUG :
  47. 1148.30 s gammaloop-nextest-integration> field value
  48. 1148.30 s gammaloop-nextest-integration> integrand n-terms: 1, byte size: 409,expr:
  49. 1148.30 s gammaloop-nextest-integration> SCALAR_COUPLING²·(q₀(αᵉ³.¹)+q₃(αᵉ³.¹))·q₀(αᵉ².¹)·q₀(αᵉ³.¹)·q₂(αᵉ².¹)
  50. 1148.30 s gammaloop-nextest-integration> /(denom(2,q₂,mass_scalar_2²,-mass_scalar_2²+(q₂.q₂))·denom(3,q₃,mass_scalar_2²,-mass_scalar_2²+(q₃.q₃)))
  51. 1148.30 s gammaloop-nextest-integration> reduced y
  52. 1148.30 s gammaloop-nextest-integration> span grow{span_context=true current=subgraph=y, topo_order=1, dod=2 given=subgraph=0, topo_order=0, dod=0}
  53. 1148.30 s gammaloop-nextest-integration> [2026-09-02 17:37:05.625] @approx::local_4d [{#uv, #inspect, #integrated}] DEBUG : Rescaled momenta expanded
  54. 1148.30 s gammaloop-nextest-integration> field value
  55. 1148.30 s gammaloop-nextest-integration> res n-terms: 1, byte size: 585,expr:
  56. 1148.30 s gammaloop-nextest-integration> -SCALAR_COUPLING²·q₀(αᵉ².¹)·q₀(αᵉ³.¹)·q₂(αᵉ².¹)·q₂(αᵉ³.¹)
  57. 1148.30 s gammaloop-nextest-integration> /(t²·denom(3,-q₀-q₂/t,mass_scalar_2²,-mass_scalar_2²+2·(q₀.q₂)/t+(q₂.q₂)/t²+(q₀.q₀))
  58. 1148.30 s gammaloop-nextest-integration> ·denom(2,q₂/t,mass_scalar_2²,-mass_scalar_2²+(q₂.q₂)/t²))
  59. 1148.30 s gammaloop-nextest-integration> span t{span_context=true current=subgraph=y, topo_order=1, dod=2 given=subgraph=0, topo_order=0, dod=0}
  60. 1148.30 s gammaloop-nextest-integration> [2026-09-02 17:37:05.625] @approx::local_4d [{#uv, #integrated, #rescaled}] DEBUG : Rescaled expanded
  61. 1148.30 s gammaloop-nextest-integration> field value
  62. 1148.30 s gammaloop-nextest-integration> n_loops 1
  63. 1148.30 s gammaloop-nextest-integration> res n-terms: 1, byte size: 707,expr:
  64. 1148.30 s gammaloop-nextest-integration> -SCALAR_COUPLING²·q₀(αᵉ².¹)·q₀(αᵉ³.¹)·q₂(αᵉ².¹)·q₂(αᵉ³.¹)
  65. 1148.30 s gammaloop-nextest-integration> /(t²·denom(3,-q₂,mUVexp²+t²·mass_scalar_2²,-mUV²+t²·(-mass_scalar_2²+2·(q₀.q₂)/t+(q₂.q₂)/t²+(q₀.q₀))+t²·mUVexp²)
  66. 1148.30 s gammaloop-nextest-integration> ·denom(2,q₂,mUVexp²+t²·mass_scalar_2²,-mUV²+t²·(-mass_scalar_2²+(q₂.q₂)/t²)+t²·mUVexp²))
  67. 1148.30 s gammaloop-nextest-integration> span t{span_context=true current=subgraph=y, topo_order=1, dod=2 given=subgraph=0, topo_order=0, dod=0}
  68. 1148.30 s gammaloop-nextest-integration> [2026-09-02 17:37:05.626] @approx::local_4d [{#uv, #integrated, #series}] DEBUG : Series expanded
  69. 1148.30 s gammaloop-nextest-integration> field value
  70. 1148.30 s gammaloop-nextest-integration> res n-terms: 3, byte size: 1896,expr:
  71. 1148.30 s gammaloop-nextest-integration> (1/2·SCALAR_COUPLING²·(2·mUVexp²-2·mass_scalar_2²)/(denom(2,q₂,mUVexp²,-mUV²+(q₂.q₂))²·denom(3,-q₂,mUVexp²,-mUV²+(q₂.q₂)))
  72. 1148.30 s gammaloop-nextest-integration> -SCALAR_COUPLING²
  73. 1148.30 s gammaloop-nextest-integration> ·(-1/2·(2·mUVexp²-2·mass_scalar_2²+2·(q₀.q₀))/denom(3,-q₂,mUVexp²,-mUV²+(q₂.q₂))
  74. 1148.30 s gammaloop-nextest-integration> +4·(q₀.q₂)²/denom(3,-q₂,mUVexp²,-mUV²+(q₂.q₂))²
  75. 1148.30 s gammaloop-nextest-integration> )/(denom(2,q₂,mUVexp²,-mUV²+(q₂.q₂))·denom(3,-q₂,mUVexp²,-mUV²+(q₂.q₂)))
  76. 1148.30 s gammaloop-nextest-integration> )·q₀(αᵉ².¹)·q₀(αᵉ³.¹)·q₂(αᵉ².¹)·q₂(αᵉ³.¹)
  77. 1148.30 s gammaloop-nextest-integration> +2·SCALAR_COUPLING²·(q₀.q₂)·q₀(αᵉ².¹)·q₀(αᵉ³.¹)·q₂(αᵉ².¹)·q₂(αᵉ³.¹)
  78. 1148.30 s gammaloop-nextest-integration> /(t·denom(2,q₂,mUVexp²,-mUV²+(q₂.q₂))·denom(3,-q₂,mUVexp²,-mUV²+(q₂.q₂))²)
  79. 1148.30 s gammaloop-nextest-integration> -SCALAR_COUPLING²·q₀(αᵉ².¹)·q₀(αᵉ³.¹)·q₂(αᵉ².¹)·q₂(αᵉ³.¹)
  80. 1148.30 s gammaloop-nextest-integration> /(t²·denom(2,q₂,mUVexp²,-mUV²+(q₂.q₂))·denom(3,-q₂,mUVexp²,-mUV²+(q₂.q₂)))
  81. 1148.30 s gammaloop-nextest-integration> span t{span_context=true current=subgraph=y, topo_order=1, dod=2 given=subgraph=0, topo_order=0, dod=0}
  82. 1148.30 s gammaloop-nextest-integration> [2026-09-02 17:37:05.627] @approx::local_4d [{#uv, #integrated, #series}] DEBUG : Evaluated at t = 1
  83. 1148.30 s gammaloop-nextest-integration> field value
  84. 1148.30 s gammaloop-nextest-integration> res n-terms: 3, byte size: 1880,expr:
  85. 1148.30 s gammaloop-nextest-integration> (1/2·SCALAR_COUPLING²·(2·mUVexp²-2·mass_scalar_2²)/(denom(2,q₂,mUVexp²,-mUV²+(q₂.q₂))²·denom(3,-q₂,mUVexp²,-mUV²+(q₂.q₂)))
  86. 1148.30 s gammaloop-nextest-integration> -SCALAR_COUPLING²
  87. 1148.30 s gammaloop-nextest-integration> ·(-1/2·(2·mUVexp²-2·mass_scalar_2²+2·(q₀.q₀))/denom(3,-q₂,mUVexp²,-mUV²+(q₂.q₂))
  88. 1148.30 s gammaloop-nextest-integration> +4·(q₀.q₂)²/denom(3,-q₂,mUVexp²,-mUV²+(q₂.q₂))²
  89. 1148.30 s gammaloop-nextest-integration> )/(denom(2,q₂,mUVexp²,-mUV²+(q₂.q₂))·denom(3,-q₂,mUVexp²,-mUV²+(q₂.q₂)))
  90. 1148.30 s gammaloop-nextest-integration> )·q₀(αᵉ².¹)·q₀(αᵉ³.¹)·q₂(αᵉ².¹)·q₂(αᵉ³.¹)
  91. 1148.30 s gammaloop-nextest-integration> -SCALAR_COUPLING²·q₀(αᵉ².¹)·q₀(αᵉ³.¹)·q₂(αᵉ².¹)·q₂(αᵉ³.¹)
  92. 1148.30 s gammaloop-nextest-integration> /(denom(2,q₂,mUVexp²,-mUV²+(q₂.q₂))·denom(3,-q₂,mUVexp²,-mUV²+(q₂.q₂)))
  93. 1148.30 s gammaloop-nextest-integration> +2·SCALAR_COUPLING²·(q₀.q₂)·q₀(αᵉ².¹)·q₀(αᵉ³.¹)·q₂(αᵉ².¹)·q₂(αᵉ³.¹)
  94. 1148.30 s gammaloop-nextest-integration> /(denom(2,q₂,mUVexp²,-mUV²+(q₂.q₂))·denom(3,-q₂,mUVexp²,-mUV²+(q₂.q₂))²)
  95. 1148.30 s gammaloop-nextest-integration> span t{span_context=true current=subgraph=y, topo_order=1, dod=2 given=subgraph=0, topo_order=0, dod=0}
  96. 1148.30 s gammaloop-nextest-integration> [2026-09-02 17:37:05.629] @approx::local_4d [{#uv, #collect, #integrated}] DEBUG : After gamma chain collection
  97. 1148.30 s gammaloop-nextest-integration> field value
  98. 1148.30 s gammaloop-nextest-integration> expr n-terms: 3, byte size: 1880,expr:
  99. 1148.30 s gammaloop-nextest-integration> (1/2·SCALAR_COUPLING²·(2·mUVexp²-2·mass_scalar_2²)/(denom(2,q₂,mUVexp²,-mUV²+(q₂.q₂))²·denom(3,-q₂,mUVexp²,-mUV²+(q₂.q₂)))
  100. 1148.30 s gammaloop-nextest-integration> -SCALAR_COUPLING²
  101. 1148.30 s gammaloop-nextest-integration> ·(-1/2·(2·mUVexp²-2·mass_scalar_2²+2·(q₀.q₀))/denom(3,-q₂,mUVexp²,-mUV²+(q₂.q₂))
  102. 1148.30 s gammaloop-nextest-integration> +4·(q₀.q₂)²/denom(3,-q₂,mUVexp²,-mUV²+(q₂.q₂))²
  103. 1148.30 s gammaloop-nextest-integration> )/(denom(2,q₂,mUVexp²,-mUV²+(q₂.q₂))·denom(3,-q₂,mUVexp²,-mUV²+(q₂.q₂)))
  104. 1148.30 s gammaloop-nextest-integration> )·q₀(αᵉ².¹)·q₀(αᵉ³.¹)·q₂(αᵉ².¹)·q₂(αᵉ³.¹)
  105. 1148.30 s gammaloop-nextest-integration> -SCALAR_COUPLING²·q₀(αᵉ².¹)·q₀(αᵉ³.¹)·q₂(αᵉ².¹)·q₂(αᵉ³.¹)
  106. 1148.30 s gammaloop-nextest-integration> /(denom(2,q₂,mUVexp²,-mUV²+(q₂.q₂))·denom(3,-q₂,mUVexp²,-mUV²+(q₂.q₂)))
  107. 1148.30 s gammaloop-nextest-integration> +2·SCALAR_COUPLING²·(q₀.q₂)·q₀(αᵉ².¹)·q₀(αᵉ³.¹)·q₂(αᵉ².¹)·q₂(αᵉ³.¹)
  108. 1148.30 s gammaloop-nextest-integration> /(denom(2,q₂,mUVexp²,-mUV²+(q₂.q₂))·denom(3,-q₂,mUVexp²,-mUV²+(q₂.q₂))²)
  109. 1148.30 s gammaloop-nextest-integration> span t{span_context=true current=subgraph=y, topo_order=1, dod=2 given=subgraph=0, topo_order=0, dod=0}
  110. 1148.30 s gammaloop-nextest-integration> [2026-09-02 17:37:05.631] @approx::local_4d [{#profile, #uv, #collect, #integrated, #start, #trace}] DEBUG : After gamma schoonschip
  111. 1148.30 s gammaloop-nextest-integration> field value
  112. 1148.30 s gammaloop-nextest-integration> expr n-terms: 3, byte size: 1631,expr:
  113. 1148.30 s gammaloop-nextest-integration> (1/2·SCALAR_COUPLING²·(2·mUVexp²-2·mass_scalar_2²)/(denom(2,q₂,mUVexp²,-mUV²+(q₂.q₂))²·denom(3,-q₂,mUVexp²,-mUV²+(q₂.q₂)))
  114. 1148.30 s gammaloop-nextest-integration> -SCALAR_COUPLING²
  115. 1148.30 s gammaloop-nextest-integration> ·(-1/2·(2·mUVexp²-2·mass_scalar_2²+2·(q₀.q₀))/denom(3,-q₂,mUVexp²,-mUV²+(q₂.q₂))
  116. 1148.30 s gammaloop-nextest-integration> +4·(q₀.q₂)²/denom(3,-q₂,mUVexp²,-mUV²+(q₂.q₂))²
  117. 1148.30 s gammaloop-nextest-integration> )/(denom(2,q₂,mUVexp²,-mUV²+(q₂.q₂))·denom(3,-q₂,mUVexp²,-mUV²+(q₂.q₂)))
  118. 1148.30 s gammaloop-nextest-integration> )·(q₀.q₂)²
  119. 1148.30 s gammaloop-nextest-integration> -SCALAR_COUPLING²·(q₀.q₂)²/(denom(2,q₂,mUVexp²,-mUV²+(q₂.q₂))·denom(3,-q₂,mUVexp²,-mUV²+(q₂.q₂)))
  120. 1148.30 s gammaloop-nextest-integration> +2·SCALAR_COUPLING²·(q₀.q₂)·(q₀.q₂)²
  121. 1148.30 s gammaloop-nextest-integration> /(denom(2,q₂,mUVexp²,-mUV²+(q₂.q₂))·denom(3,-q₂,mUVexp²,-mUV²+(q₂.q₂))²)
  122. 1148.30 s gammaloop-nextest-integration> span t{span_context=true current=subgraph=y, topo_order=1, dod=2 given=subgraph=0, topo_order=0, dod=0}
  123. 1148.30 s gammaloop-nextest-integration> [2026-09-02 17:37:05.633] @approx::local_4d [{#profile, #uv, #collect, #integrated, #start, #trace}] DEBUG : After gamma collection
  124. 1148.30 s gammaloop-nextest-integration> field value
  125. 1148.30 s gammaloop-nextest-integration> expr n-terms: 1, byte size: 1347,expr:
  126. 1148.30 s gammaloop-nextest-integration> SCALAR_COUPLING²
  127. 1148.30 s gammaloop-nextest-integration> ·(-denom(2,q₂,mUVexp²,-mUV²+(q₂.q₂))·denom(3,-q₂,mUVexp²,-mUV²+(q₂.q₂))²
  128. 1148.30 s gammaloop-nextest-integration> +1/2·(2·mUVexp²-2·mass_scalar_2²)·denom(3,-q₂,mUVexp²,-mUV²+(q₂.q₂))²
  129. 1148.30 s gammaloop-nextest-integration> -(-1/2·(2·mUVexp²-2·mass_scalar_2²+2·(q₀.q₀))·denom(3,-q₂,mUVexp²,-mUV²+(q₂.q₂))+4·(q₀.q₂)²)
  130. 1148.30 s gammaloop-nextest-integration> ·denom(2,q₂,mUVexp²,-mUV²+(q₂.q₂))
  131. 1148.30 s gammaloop-nextest-integration> +2·(q₀.q₂)·denom(2,q₂,mUVexp²,-mUV²+(q₂.q₂))·denom(3,-q₂,mUVexp²,-mUV²+(q₂.q₂))
  132. 1148.30 s gammaloop-nextest-integration> )·(q₀.q₂)²/(denom(2,q₂,mUVexp²,-mUV²+(q₂.q₂))²·denom(3,-q₂,mUVexp²,-mUV²+(q₂.q₂))³)
  133. 1148.30 s gammaloop-nextest-integration> span t{span_context=true current=subgraph=y, topo_order=1, dod=2 given=subgraph=0, topo_order=0, dod=0}
  134. 1148.30 s gammaloop-nextest-integration> [2026-09-02 17:37:05.634] @approx::local_4d [{#profile, #uv, #gamma, #integrated, #start, #trace, #vakint}] DEBUG : After gamma simplification
  135. 1148.30 s gammaloop-nextest-integration> ... omitted 3263 more lines; see full nextest output above
  136. 1148.30 s gammaloop-nextest-integration>
  137. 1148.30 s gammaloop-nextest-integration> 8. gammaloop-integration-tests::uv::sunrise_scalar_1_uv
  138. 1148.32 s gammaloop-nextest-integration> failure: test failure with exit code 101
  139. 1148.32 s gammaloop-nextest-integration> system-out
  140. 1148.32 s gammaloop-nextest-integration> running 1 test
  141. 1148.32 s gammaloop-nextest-integration> test sunrise_scalar_1_uv has been running for over 60 seconds
  142. 1148.32 s gammaloop-nextest-integration> +------------------+------------------------+--------------+--------+----------+----------------------------------------------------------------------------------------------------------------------+-------+
  143. 1148.32 s gammaloop-nextest-integration> | case | check | graph | status | sigma | threshold | error |
  144. 1148.32 s gammaloop-nextest-integration> +------------------+------------------------+--------------+--------+----------+----------------------------------------------------------------------------------------------------------------------+-------+
  145. 1148.32 s gammaloop-nextest-integration> | sunrise_scalar_1 | uv_profile | - | FAIL | - | - | - |
  146. 1148.32 s gammaloop-nextest-integration> +------------------+------------------------+--------------+--------+----------+----------------------------------------------------------------------------------------------------------------------+-------+
  147. 1148.32 s gammaloop-nextest-integration> | sunrise_scalar_1 | m_uv.inspect | inspect | pass | - | best inspect relative delta 1.624e0 >= 1000*accuracy 1.000e-3 (accuracy=1.000e-6, exponent=+1.0, seed=1, probes=10) | - |
  148. 1148.32 s gammaloop-nextest-integration> +------------------+------------------------+--------------+--------+----------+----------------------------------------------------------------------------------------------------------------------+-------+
  149. 1148.32 s gammaloop-nextest-integration> | sunrise_scalar_1 | m_uv.integrated | sunrise | pass | 0.1sigma | compatible within 2sigma | - |
  150. 1148.32 s gammaloop-nextest-integration> +------------------+------------------------+--------------+--------+----------+----------------------------------------------------------------------------------------------------------------------+-------+
  151. 1148.32 s gammaloop-nextest-integration> | sunrise_scalar_1 | rls.inspect | inspect | pass | - | best inspect relative delta 8.682e-1 >= 1000*accuracy 1.000e-3 (accuracy=1.000e-6, exponent=+1.0, seed=1, probes=10) | - |
  152. 1148.32 s gammaloop-nextest-integration> +------------------+------------------------+--------------+--------+----------+----------------------------------------------------------------------------------------------------------------------+-------+
  153. 1148.32 s gammaloop-nextest-integration> | sunrise_scalar_1 | rls.integrated | sunrise | pass | 0.0sigma | compatible within 2sigma | - |
  154. 1148.32 s gammaloop-nextest-integration> +------------------+------------------------+--------------+--------+----------+----------------------------------------------------------------------------------------------------------------------+-------+
  155. 1148.32 s gammaloop-nextest-integration> | sunrise_scalar_1 | mu_r.inspect | inspect | pass | - | best inspect relative delta 1.752e0 >= 1000*accuracy 1.000e-3 (accuracy=1.000e-6, exponent=+1.0, seed=1, probes=10) | - |
  156. 1148.32 s gammaloop-nextest-integration> +------------------+------------------------+--------------+--------+----------+----------------------------------------------------------------------------------------------------------------------+-------+
  157. 1148.32 s gammaloop-nextest-integration> | sunrise_scalar_1 | integrated.relerr | integrated | pass | - | relative error 9.20% <= 10.00% | - |
  158. 1148.32 s gammaloop-nextest-integration> +------------------+------------------------+--------------+--------+----------+----------------------------------------------------------------------------------------------------------------------+-------+
  159. 1148.32 s gammaloop-nextest-integration> | sunrise_scalar_1 | m_uv.integrated.relerr | m_uv-shifted | pass | - | relative error 5.89% <= 10.00% | - |
  160. 1148.32 s gammaloop-nextest-integration> +------------------+------------------------+--------------+--------+----------+----------------------------------------------------------------------------------------------------------------------+-------+
  161. 1148.32 s gammaloop-nextest-integration> | sunrise_scalar_1 | target | - | pass | - | 2sigma | - |
  162. 1148.32 s gammaloop-nextest-integration> +------------------+------------------------+--------------+--------+----------+----------------------------------------------------------------------------------------------------------------------+-------+
  163. 1148.32 s gammaloop-nextest-integration> test sunrise_scalar_1_uv ... FAILED
  164. 1148.32 s gammaloop-nextest-integration>
  165. 1148.32 s gammaloop-nextest-integration> failures:
  166. 1148.32 s gammaloop-nextest-integration>
  167. 1148.32 s gammaloop-nextest-integration> failures:
  168. 1148.32 s gammaloop-nextest-integration> sunrise_scalar_1_uv
  169. 1148.32 s gammaloop-nextest-integration>
  170. 1148.32 s gammaloop-nextest-integration> test result: FAILED. 0 passed; 1 failed; 0 ignored; 0 measured; 24 filtered out; finished in 89.04s
  171. 1148.32 s gammaloop-nextest-integration> system-err
  172. 1148.32 s gammaloop-nextest-integration> [2026-09-02 17:37:09.726] @gammaloop_api::se... INFO : Running command run generate
  173. 1148.32 s gammaloop-nextest-integration> [2026-09-02 17:37:09.726] @gammaloop_api::se... INFO : Starting command block generate
  174. 1148.32 s gammaloop-nextest-integration> [2026-09-02 17:37:09.726] @gammaloop_api::se... INFO : Running command import model scalars-default.json
  175. 1148.32 s gammaloop-nextest-integration> [2026-09-02 17:37:09.726] @import::model INFO : Loading built-in JSON model scalars-default
  176. 1148.32 s gammaloop-nextest-integration> [2026-09-02 17:37:09.730] @gammalooprs::model INFO : The following 2 external parameters were forced to zero by the restriction card:
  177. 1148.32 s gammaloop-nextest-integration> width_scalar_1, width_scalar_2
  178. 1148.32 s gammaloop-nextest-integration> [2026-09-02 17:37:09.730] @gammaloop_api::se... INFO : Running command remove processes
  179. 1148.32 s gammaloop-nextest-integration> [2026-09-02 17:37:09.730] @gammaloop_api::se... INFO : Running command set global kv global.generation.uv.generate_integrated=true
  180. 1148.32 s gammaloop-nextest-integration> [2026-09-02 17:37:09.731] @gammaloop_api::se... INFO : Running command import graphs ./tests/resources/graphs/scalar_sunrise.dot -p sunrise_scalar_1 -i scalar_sunrise
  181. 1148.32 s gammaloop-nextest-integration> [2026-09-02 17:37:09.731] @commands::import INFO : Loading graphs from '/build/source/tests/resources/graphs/scalar_sunrise.dot'
  182. 1148.32 s gammaloop-nextest-integration> [2026-09-02 17:37:09.733] @gammaloop_api::se... INFO : Running command generate existing -p sunrise_scalar_1 -i scalar_sunrise
  183. 1148.32 s gammaloop-nextest-integration> [2026-09-02 17:37:09.735] @approx::local_4d [{#uv, #inspect, #integrated}] DEBUG : Rescaled momenta expanded
  184. 1148.32 s gammaloop-nextest-integration> field value
  185. 1148.32 s gammaloop-nextest-integration> res n-terms: 1, byte size: 777,expr:
  186. 1148.32 s gammaloop-nextest-integration> 1/(denom(0,q₀/t,mass_scalar_1²,-mass_scalar_1²+(q₀.q₀)/t²)·denom(1,q₁/t,mass_scalar_1²,-mass_scalar_1²+(q₁.q₁)/t²)
  187. 1148.32 s gammaloop-nextest-integration> ·denom(2,q₄-q₀/t-q₁/t,mass_scalar_1²,
  188. 1148.32 s gammaloop-nextest-integration> -mass_scalar_1²-2·(q₀.q₄)/t-2·(q₁.q₄)/t+(q₀.q₀)/t²+2·(q₀.q₁)/t²
  189. 1148.32 s gammaloop-nextest-integration> +(q₁.q₁)/t²+(q₄.q₄)
  190. 1148.32 s gammaloop-nextest-integration> ))
  191. 1148.32 s gammaloop-nextest-integration> [2026-09-02 17:37:09.749] @approx::local_4d [{#uv, #inspect, #integrated}] DEBUG : Rescaled momenta expanded
  192. 1148.32 s gammaloop-nextest-integration> field value
  193. 1148.32 s gammaloop-nextest-integration> res n-terms: 1, byte size: 611,expr:
  194. 1148.32 s gammaloop-nextest-integration> 1/(denom(0,q₀/t,mass_scalar_1²,-mass_scalar_1²+(q₀.q₀)/t²)
  195. 1148.32 s gammaloop-nextest-integration> ·denom(2,-q₁+q₃-q₀/t,mass_scalar_1²,
  196. 1148.32 s gammaloop-nextest-integration> -mass_scalar_1²+2·(q₀.q₁)/t-2·(q₀.q₃)/t+(q₀.q₀)/t²+(q₁.q₁)
  197. 1148.32 s gammaloop-nextest-integration> -2·(q₁.q₃)+(q₃.q₃)
  198. 1148.32 s gammaloop-nextest-integration> ))
  199. 1148.32 s gammaloop-nextest-integration> [2026-09-02 17:37:09.750] @approx::local_4d [{#uv, #inspect, #integrated}] DEBUG : Rescaled momenta expanded
  200. 1148.32 s gammaloop-nextest-integration> field value
  201. 1148.32 s gammaloop-nextest-integration> res n-terms: 1, byte size: 611,expr:
  202. 1148.32 s gammaloop-nextest-integration> 1/(denom(1,q₁/t,mass_scalar_1²,-mass_scalar_1²+(q₁.q₁)/t²)
  203. 1148.32 s gammaloop-nextest-integration> ·denom(2,-q₀+q₃-q₁/t,mass_scalar_1²,
  204. 1148.32 s gammaloop-nextest-integration> -mass_scalar_1²+2·(q₀.q₁)/t-2·(q₁.q₃)/t+(q₁.q₁)/t²+(q₀.q₀)
  205. 1148.32 s gammaloop-nextest-integration> -2·(q₀.q₃)+(q₃.q₃)
  206. 1148.32 s gammaloop-nextest-integration> ))
  207. 1148.32 s gammaloop-nextest-integration> [2026-09-02 17:37:09.751] @approx::local_4d [{#uv, #inspect, #integrated}] DEBUG : Rescaled momenta expanded
  208. 1148.33 s gammaloop-nextest-integration> field value
  209. 1148.33 s gammaloop-nextest-integration> res n-terms: 1, byte size: 3,expr:
  210. 1148.33 s gammaloop-nextest-integration> 1
  211. 1148.33 s gammaloop-nextest-integration> [2026-09-02 17:37:09.751] @approx::local_4d [{#uv, #inspect, #integrated}] DEBUG : Rescaled momenta expanded
  212. 1148.33 s gammaloop-nextest-integration> field value
  213. 1148.33 s gammaloop-nextest-integration> res n-terms: 1, byte size: 611,expr:
  214. 1148.33 s gammaloop-nextest-integration> 1/(denom(0,q₀/t,mass_scalar_1²,-mass_scalar_1²+(q₀.q₀)/t²)
  215. 1148.33 s gammaloop-nextest-integration> ·denom(1,-q₂+q₃-q₀/t,mass_scalar_1²,
  216. 1148.33 s gammaloop-nextest-integration> -mass_scalar_1²+2·(q₀.q₂)/t-2·(q₀.q₃)/t+(q₀.q₀)/t²+(q₂.q₂)
  217. 1148.33 s gammaloop-nextest-integration> -2·(q₂.q₃)+(q₃.q₃)
  218. 1148.33 s gammaloop-nextest-integration> ))
  219. 1148.33 s gammaloop-nextest-integration> [2026-09-02 17:37:09.752] @approx::final_integrand[{#generation, #profile, #uv, #graph, #summary}] DEBUG : Computed global numerator
  220. 1148.33 s gammaloop-nextest-integration> field value
  221. 1148.33 s gammaloop-nextest-integration> global_num n-terms: 1, byte size: 3,expr:
  222. 1148.33 s gammaloop-nextest-integration> 1
  223. 1148.33 s gammaloop-nextest-integration> span build_3d{span_context=true graph=sunrise current=subgraph=0, topo_order=0, dod=0}
  224. 1148.33 s gammaloop-nextest-integration> [2026-09-02 17:37:09.753] @uv::approx [{#generation, #uv, #fourd}] DEBUG : Computing 4D
  225. 1148.33 s gammaloop-nextest-integration> field value
  226. 1148.33 s gammaloop-nextest-integration> simple subgraph(S_47,S_44)*Approx(subgraph(S_44,0)) of sunrise
  227. 1148.33 s gammaloop-nextest-integration> span compute_4d{span_context=true graph=sunrise current=subgraph=44, topo_order=1, dod=2 given=subgraph=0, topo_order=0, dod=0 reduced=SubSet { set: BitVec<usize, bitvec::order::Lsb0> { addr: 0x7fffec00d8c0, head: 000000, bits: 8, capacity: 64 } [0, 0, 1, 1, 1, 1, 1, 1], id: PhantomData<linnet::half_edge::involution::Hedge> }}
  228. 1148.33 s gammaloop-nextest-integration> [2026-09-02 17:37:09.755] @approx::local_4d [{#uv, #algebra, #integrated, #start}] DEBUG :
  229. 1148.33 s gammaloop-nextest-integration> field value
  230. 1148.33 s gammaloop-nextest-integration> integrand n-terms: 1, byte size: 322,expr:
  231. 1148.33 s gammaloop-nextest-integration> 1/(denom(0,q₀,mass_scalar_1²,-mass_scalar_1²+(q₀.q₀))·denom(1,q₁,mass_scalar_1²,-mass_scalar_1²+(q₁.q₁))
  232. 1148.33 s gammaloop-nextest-integration> ·denom(2,q₂,mass_scalar_1²,-mass_scalar_1²+(q₂.q₂)))
  233. 1148.33 s gammaloop-nextest-integration> reduced 44
  234. 1148.33 s gammaloop-nextest-integration> span grow{span_context=true current=subgraph=44, topo_order=1, dod=2 given=subgraph=0, topo_order=0, dod=0}
  235. 1148.33 s gammaloop-nextest-integration> [2026-09-02 17:37:09.756] @approx::local_4d [{#uv, #inspect, #integrated}] DEBUG : Rescaled momenta expanded
  236. 1148.33 s gammaloop-nextest-integration> field value
  237. 1148.33 s gammaloop-nextest-integration> res n-terms: 1, byte size: 777,expr:
  238. 1148.33 s gammaloop-nextest-integration> 1/(denom(0,q₀/t,mass_scalar_1²,-mass_scalar_1²+(q₀.q₀)/t²)·denom(1,q₁/t,mass_scalar_1²,-mass_scalar_1²+(q₁.q₁)/t²)
  239. 1148.33 s gammaloop-nextest-integration> ·denom(2,q₄-q₀/t-q₁/t,mass_scalar_1²,
  240. 1148.33 s gammaloop-nextest-integration> -mass_scalar_1²-2·(q₀.q₄)/t-2·(q₁.q₄)/t+(q₀.q₀)/t²+2·(q₀.q₁)/t²
  241. 1148.33 s gammaloop-nextest-integration> +(q₁.q₁)/t²+(q₄.q₄)
  242. 1148.33 s gammaloop-nextest-integration> ))
  243. 1148.33 s gammaloop-nextest-integration> span t{span_context=true current=subgraph=44, topo_order=1, dod=2 given=subgraph=0, topo_order=0, dod=0}
  244. 1148.33 s gammaloop-nextest-integration> [2026-09-02 17:37:09.756] @approx::local_4d [{#uv, #integrated, #rescaled}] DEBUG : Rescaled expanded
  245. 1148.33 s gammaloop-nextest-integration> field value
  246. 1148.33 s gammaloop-nextest-integration> n_loops 2
  247. 1148.33 s gammaloop-nextest-integration> res n-terms: 1, byte size: 982,expr:
  248. 1148.33 s gammaloop-nextest-integration> 1/(t²
  249. 1148.33 s gammaloop-nextest-integration> ·denom(2,-q₀-q₁,mUVexp²+t²·mass_scalar_1²,
  250. 1148.33 s gammaloop-nextest-integration> -mUV²
  251. 1148.33 s gammaloop-nextest-integration> +t²
  252. 1148.33 s gammaloop-nextest-integration> ·(-mass_scalar_1²-2·(q₀.q₄)/t-2·(q₁.q₄)/t+(q₀.q₀)/t²+2·(q₀.q₁)/t²
  253. 1148.33 s gammaloop-nextest-integration> +(q₁.q₁)/t²+(q₄.q₄)
  254. 1148.33 s gammaloop-nextest-integration> )
  255. 1148.33 s gammaloop-nextest-integration> +t²·mUVexp²
  256. 1148.33 s gammaloop-nextest-integration> )
  257. 1148.33 s gammaloop-nextest-integration> ·denom(0,q₀,mUVexp²+t²·mass_scalar_1²,-mUV²+t²·(-mass_scalar_1²+(q₀.q₀)/t²)+t²·mUVexp²)
  258. 1148.33 s gammaloop-nextest-integration> ·denom(1,q₁,mUVexp²+t²·mass_scalar_1²,-mUV²+t²·(-mass_scalar_1²+(q₁.q₁)/t²)+t²·mUVexp²))
  259. 1148.33 s gammaloop-nextest-integration> span t{span_context=true current=subgraph=44, topo_order=1, dod=2 given=subgraph=0, topo_order=0, dod=0}
  260. 1148.33 s gammaloop-nextest-integration> [2026-09-02 17:37:09.757] @approx::local_4d [{#uv, #integrated, #series}] DEBUG : Series expanded
  261. 1148.33 s gammaloop-nextest-integration> field value
  262. 1148.33 s gammaloop-nextest-integration> res n-terms: 4, byte size: 3187,expr:
  263. 1148.33 s gammaloop-nextest-integration> -1/2·(2·mUVexp²-2·mass_scalar_1²)
  264. 1148.33 s gammaloop-nextest-integration> /(denom(0,q₀,mUVexp²,-mUV²+(q₀.q₀))·denom(1,q₁,mUVexp²,-mUV²+(q₁.q₁))²
  265. 1148.33 s gammaloop-nextest-integration> ·denom(2,-q₀-q₁,mUVexp²,-mUV²+(q₀.q₀)+2·(q₀.q₁)+(q₁.q₁)))
  266. 1148.33 s gammaloop-nextest-integration> +(-1/2·(2·mUVexp²-2·mass_scalar_1²)
  267. 1148.33 s gammaloop-nextest-integration> /(denom(0,q₀,mUVexp²,-mUV²+(q₀.q₀))²
  268. 1148.33 s gammaloop-nextest-integration> ·denom(2,-q₀-q₁,mUVexp²,-mUV²+(q₀.q₀)+2·(q₀.q₁)+(q₁.q₁)))
  269. 1148.33 s gammaloop-nextest-integration> +(-1/2·(2·mUVexp²-2·mass_scalar_1²+2·(q₄.q₄))
  270. 1148.33 s gammaloop-nextest-integration> /denom(2,-q₀-q₁,mUVexp²,-mUV²+(q₀.q₀)+2·(q₀.q₁)+(q₁.q₁))
  271. 1148.33 s gammaloop-nextest-integration> +(-2·(q₀.q₄)-2·(q₁.q₄))²
  272. 1148.33 s gammaloop-nextest-integration> /denom(2,-q₀-q₁,mUVexp²,-mUV²+(q₀.q₀)+2·(q₀.q₁)+(q₁.q₁))²
  273. 1148.33 s gammaloop-nextest-integration> )
  274. 1148.33 s gammaloop-nextest-integration> /(denom(0,q₀,mUVexp²,-mUV²+(q₀.q₀))
  275. 1148.33 s gammaloop-nextest-integration> ·denom(2,-q₀-q₁,mUVexp²,-mUV²+(q₀.q₀)+2·(q₀.q₁)+(q₁.q₁)))
  276. 1148.33 s gammaloop-nextest-integration> )/denom(1,q₁,mUVexp²,-mUV²+(q₁.q₁))
  277. 1148.33 s gammaloop-nextest-integration> -(-2·(q₀.q₄)-2·(q₁.q₄))
  278. 1148.33 s gammaloop-nextest-integration> /(t·denom(0,q₀,mUVexp²,-mUV²+(q₀.q₀))·denom(1,q₁,mUVexp²,-mUV²+(q₁.q₁))
  279. 1148.33 s gammaloop-nextest-integration> ·denom(2,-q₀-q₁,mUVexp²,-mUV²+(q₀.q₀)+2·(q₀.q₁)+(q₁.q₁))²)
  280. 1148.33 s gammaloop-nextest-integration> +1/(t²·denom(0,q₀,mUVexp²,-mUV²+(q₀.q₀))·denom(1,q₁,mUVexp²,-mUV²+(q₁.q₁))
  281. 1148.33 s gammaloop-nextest-integration> ·denom(2,-q₀-q₁,mUVexp²,-mUV²+(q₀.q₀)+2·(q₀.q₁)+(q₁.q₁)))
  282. 1148.33 s gammaloop-nextest-integration> span t{span_context=true current=subgraph=44, topo_order=1, dod=2 given=subgraph=0, topo_order=0, dod=0}
  283. 1148.33 s gammaloop-nextest-integration> [2026-09-02 17:37:09.757] @approx::local_4d [{#uv, #integrated, #series}] DEBUG : Evaluated at t = 1
  284. 1148.33 s gammaloop-nextest-integration> field value
  285. 1148.33 s gammaloop-nextest-integration> res n-terms: 4, byte size: 3171,expr:
  286. 1148.33 s gammaloop-nextest-integration> -1/2·(2·mUVexp²-2·mass_scalar_1²)
  287. 1148.33 s gammaloop-nextest-integration> /(denom(0,q₀,mUVexp²,-mUV²+(q₀.q₀))·denom(1,q₁,mUVexp²,-mUV²+(q₁.q₁))²
  288. 1148.33 s gammaloop-nextest-integration> ·denom(2,-q₀-q₁,mUVexp²,-mUV²+(q₀.q₀)+2·(q₀.q₁)+(q₁.q₁)))
  289. 1148.33 s gammaloop-nextest-integration> -(-2·(q₀.q₄)-2·(q₁.q₄))
  290. 1148.33 s gammaloop-nextest-integration> /(denom(0,q₀,mUVexp²,-mUV²+(q₀.q₀))·denom(1,q₁,mUVexp²,-mUV²+(q₁.q₁))
  291. 1148.33 s gammaloop-nextest-integration> ... omitted 20090 more lines; see full nextest output above
  292. 1148.33 s gammaloop-nextest-integration>
  293. 1148.33 s gammaloop-nextest-integration> 9. gammaloop-integration-tests::uv::se1l_uv
  294. 1148.33 s gammaloop-nextest-integration> failure: test failure with exit code 101
  295. 1148.33 s gammaloop-nextest-integration> system-out
  296. 1148.33 s gammaloop-nextest-integration> running 1 test
  297. 1148.33 s gammaloop-nextest-integration> test se1l_uv has been running for over 60 seconds
  298. 1148.33 s gammaloop-nextest-integration> +------+-----------------+---------+--------+----------+-----------------------------------------------------------------------------------------------------------------------+-------+
  299. 1148.33 s gammaloop-nextest-integration> | case | check | graph | status | sigma | threshold | error |
  300. 1148.33 s gammaloop-nextest-integration> +------+-----------------+---------+--------+----------+-----------------------------------------------------------------------------------------------------------------------+-------+
  301. 1148.33 s gammaloop-nextest-integration> | se1l | uv_profile | - | FAIL | - | - | - |
  302. 1148.33 s gammaloop-nextest-integration> +------+-----------------+---------+--------+----------+-----------------------------------------------------------------------------------------------------------------------+-------+
  303. 1148.33 s gammaloop-nextest-integration> | se1l | m_uv.inspect | inspect | pass | - | best inspect relative delta 1.097e-1 >= 1000*accuracy 1.000e-7 (accuracy=1.000e-10, exponent=+2.0, seed=1, probes=10) | - |
  304. 1148.33 s gammaloop-nextest-integration> +------+-----------------+---------+--------+----------+-----------------------------------------------------------------------------------------------------------------------+-------+
  305. 1148.33 s gammaloop-nextest-integration> | se1l | m_uv.integrated | se1l | pass | 0.1sigma | compatible within 2sigma | - |
  306. 1148.33 s gammaloop-nextest-integration> +------+-----------------+---------+--------+----------+-----------------------------------------------------------------------------------------------------------------------+-------+
  307. 1148.33 s gammaloop-nextest-integration> | se1l | rls.inspect | inspect | pass | - | best inspect relative delta 4.499e-2 >= 1000*accuracy 1.000e-7 (accuracy=1.000e-10, exponent=+2.0, seed=1, probes=10) | - |
  308. 1148.33 s gammaloop-nextest-integration> +------+-----------------+---------+--------+----------+-----------------------------------------------------------------------------------------------------------------------+-------+
  309. 1148.33 s gammaloop-nextest-integration> | se1l | rls.integrated | se1l | pass | 0.0sigma | compatible within 2sigma | - |
  310. 1148.33 s gammaloop-nextest-integration> +------+-----------------+---------+--------+----------+-----------------------------------------------------------------------------------------------------------------------+-------+
  311. 1148.33 s gammaloop-nextest-integration> | se1l | mu_r.inspect | inspect | pass | - | best inspect relative delta 1.424e-1 >= 1000*accuracy 1.000e-7 (accuracy=1.000e-10, exponent=+2.0, seed=1, probes=10) | - |
  312. 1148.33 s gammaloop-nextest-integration> +------+-----------------+---------+--------+----------+-----------------------------------------------------------------------------------------------------------------------+-------+
  313. 1148.33 s gammaloop-nextest-integration> | se1l | target | - | pass | - | 2sigma | - |
  314. 1148.33 s gammaloop-nextest-integration> +------+-----------------+---------+--------+----------+-----------------------------------------------------------------------------------------------------------------------+-------+
  315. 1148.33 s gammaloop-nextest-integration> test se1l_uv ... FAILED
  316. 1148.33 s gammaloop-nextest-integration>
  317. 1148.33 s gammaloop-nextest-integration> failures:
  318. 1148.33 s gammaloop-nextest-integration>
  319. 1148.33 s gammaloop-nextest-integration> failures:
  320. 1148.33 s gammaloop-nextest-integration> se1l_uv
  321. 1148.33 s gammaloop-nextest-integration>
  322. 1148.33 s gammaloop-nextest-integration> test result: FAILED. 0 passed; 1 failed; 0 ignored; 0 measured; 24 filtered out; finished in 98.90s
  323. 1148.33 s gammaloop-nextest-integration> system-err
  324. 1148.33 s gammaloop-nextest-integration> [2026-09-02 17:37:09.696] @gammaloop_api::se... INFO : Running command run generate
  325. 1148.33 s gammaloop-nextest-integration> [2026-09-02 17:37:09.696] @gammaloop_api::se... INFO : Starting command block generate
  326. 1148.33 s gammaloop-nextest-integration> [2026-09-02 17:37:09.696] @gammaloop_api::se... INFO : Running command import model sm-default
  327. 1148.33 s gammaloop-nextest-integration> [2026-09-02 17:37:09.697] @import::model INFO : Loading built-in JSON model sm-default
  328. 1148.33 s gammaloop-nextest-integration> [2026-09-02 17:37:09.719] @gammalooprs::model INFO : The following 11 external parameters were forced to zero by the restriction card:
  329. 1148.33 s gammaloop-nextest-integration> lamWS, AWS, rhoWS, etaWS, ymc, yme, ymm, MC, Me, MM, WTau
  330. 1148.33 s gammaloop-nextest-integration> [2026-09-02 17:37:09.719] @gammalooprs::model INFO : The following 34 vertex rules were removed by the restriction card:
  331. 1148.33 s gammaloop-nextest-integration> V_82 -> (c~, d, G+) | V_83 -> (t~, d, G+) | V_84 -> (c~, s, G+) | V_85 -> (t~, s, G+) | V_86 -> (u~, b, G+) | V_87 -> (c~, b, G+) | V_90 -> (c~, d, W+) | V_91 -> (t~, d, W+) | V_92 -> (u~, s, W+) | V_94 -> (t~, s, W+) | V_95 -> (u~, b, W+) | V_96 -> (c~, b, W+) | V_101 -> (e+, e-, G0) | V_102 -> (mu+, mu-, G0) | V_104 -> (e+, e-, H) | V_105 -> (mu+, mu-, H) | V_110 -> (ve~, e-, G+) | V_111 -> (vm~, mu-, G+) | V_116 -> (b~, u, G-) | V_117 -> (d~, c, G-) | V_118 -> (s~, c, G-) | V_119 -> (b~, c, G-) | V_120 -> (d~, t, G-) | V_121 -> (s~, t, G-) | V_124 -> (s~, u, W-) | V_125 -> (b~, u, W-) | V_126 -> (d~, c, W-) | V_128 -> (b~, c, W-) | V_129 -> (d~, t, W-) | V_130 -> (s~, t, W-) | V_138 -> (c~, c, G0) | V_140 -> (c~, c, H) | V_145 -> (e+, ve, G-) | V_146 -> (mu+, vm, G-)
  332. 1148.33 s gammaloop-nextest-integration> [2026-09-02 17:37:09.719] @gammalooprs::model INFO : The following 36 couplings were removed by the restriction card:
  333. 1148.33 s gammaloop-nextest-integration> GC_13, GC_14, GC_16, GC_17, GC_18, GC_19, GC_20, GC_22, GC_23, GC_24, GC_25, GC_26, GC_28, GC_29, GC_42, GC_43, GC_44, GC_46, GC_47, GC_48, GC_84, GC_85, GC_86, GC_87, GC_88, GC_89, GC_90, GC_91, GC_92, GC_93, GC_101, GC_102, GC_103, GC_105, GC_106, GC_107
  334. 1148.33 s gammaloop-nextest-integration> [2026-09-02 17:37:09.720] @gammaloop_api::se... INFO : Running command remove processes
  335. 1148.33 s gammaloop-nextest-integration> [2026-09-02 17:37:09.720] @gammaloop_api::se... INFO : Running command set global kv global.generation.uv.generate_integrated=true
  336. 1148.33 s gammaloop-nextest-integration> [2026-09-02 17:37:09.720] @gammaloop_api::se... INFO : Running command import graphs ./tests/resources/graphs/uv_tests/se1l.dot -p se1l -i se1l
  337. 1148.33 s gammaloop-nextest-integration> [2026-09-02 17:37:09.720] @commands::import INFO : Loading graphs from '/build/source/tests/resources/graphs/uv_tests/se1l.dot'
  338. 1148.33 s gammaloop-nextest-integration> [2026-09-02 17:37:09.723] @gammaloop_api::se... INFO : Running command generate existing -p se1l -i se1l
  339. 1148.33 s gammaloop-nextest-integration> [2026-09-02 17:37:10.483] @commands::generate INFO :
  340. 1148.33 s gammaloop-nextest-integration> Integrand generation summary
  341. 1148.33 s gammaloop-nextest-integration> peak RAM 84.38 MiB | cores 1
  342. 1148.33 s gammaloop-nextest-integration> ╭───────────┬───────┬─────────┬─────────────┬─────────────┬────────────────┬─────────────╮
  343. 1148.33 s gammaloop-nextest-integration> │ integrand │ graph │ # evals │ expr build │ spenso │ symbolica eval │ compile │
  344. 1148.33 s gammaloop-nextest-integration> ├───────────┼───────┼─────────┼─────────────┼─────────────┼────────────────┼─────────────┤
  345. 1148.33 s gammaloop-nextest-integration> │ se1l │ se1l │ 5 │ 624ms (88%) │ 33ms (4.7%) │ 53ms (7.5%) │ 0ms (0.00%) │
  346. 1148.33 s gammaloop-nextest-integration> ├───────────┼───────┼─────────┼─────────────┼─────────────┼────────────────┼─────────────┤
  347. 1148.33 s gammaloop-nextest-integration> │ Total │ │ 5 │ 624ms (88%) │ 33ms (4.7%) │ 53ms (7.5%) │ 0ms (0.00%) │
  348. 1148.33 s gammaloop-nextest-integration> ╰───────────┴───────┴─────────┴─────────────┴─────────────┴────────────────┴─────────────╯
  349. 1148.33 s gammaloop-nextest-integration> [2026-09-02 17:37:10.484] @gammaloop_api::se... INFO : Running command set process -p se1l -i se1l kv general.m_uv=0.2
  350. 1148.33 s gammaloop-nextest-integration> [2026-09-02 17:37:10.485] @gammaloop_api::se... INFO : Running command set process -p se1l -i se1l kv general.mu_r=0.2
  351. 1148.33 s gammaloop-nextest-integration> [2026-09-02 17:37:10.485] @gammaloop_api::se... INFO : Running command set process -p se1l -i se1l kv general.renormalization_localization_scale=0.2
  352. 1148.33 s gammaloop-nextest-integration> [2026-09-02 17:37:10.490] @gammaloop_api::se... INFO : Running command duplicate integrand -p se1l -i se1l --output_process_name se1l --output_integrand_name se1l_muv_shifted
  353. 1148.33 s gammaloop-nextest-integration> [2026-09-02 17:37:10.492] @gammaloop_api::se... INFO : Running command set process -p se1l -i se1l_muv_shifted kv general.m_uv=0.5
  354. 1148.33 s gammaloop-nextest-integration> [2026-09-02 17:37:10.492] @gammaloop_api::se... INFO : Running command duplicate integrand -p se1l -i se1l --output_process_name se1l --output_integrand_name se1l_rls_shifted
  355. 1148.33 s gammaloop-nextest-integration> [2026-09-02 17:37:10.494] @gammaloop_api::se... INFO : Running command set process -p se1l -i se1l_rls_shifted kv general.renormalization_localization_scale=1
  356. 1148.33 s gammaloop-nextest-integration> [2026-09-02 17:37:10.495] @gammaloop_api::se... INFO : Running command duplicate integrand -p se1l -i se1l --output_process_name se1l --output_integrand_name se1l_mur_shifted
  357. 1148.33 s gammaloop-nextest-integration> [2026-09-02 17:37:10.498] @gammaloop_api::se... INFO : Running command set process -p se1l -i se1l_mur_shifted kv general.mu_r=0.8
  358. 1148.33 s gammaloop-nextest-integration> [2026-09-02 17:37:10.503] @process::amplitude WARNING : External state 0 ('g', PDG 21, helicity +) is off shell: p^2 = +2.5e5, expected m^2 = +0e0 (|Δ| = +2.5e5). Fixed-helicity spinor/vector/tensor external states may be ill-defined at this kinematic point.
  359. 1148.33 s gammaloop-nextest-integration> field value
  360. 1148.33 s gammaloop-nextest-integration> span warm_up{integrand.name=se1l}
  361. 1148.33 s gammaloop-nextest-integration> [2026-09-02 17:37:10.503] @process::amplitude WARNING : External state 1 ('g', PDG 21, helicity -) is off shell: p^2 = +2.5e5, expected m^2 = +0e0 (|Δ| = +2.5e5). Fixed-helicity spinor/vector/tensor external states may be ill-defined at this kinematic point.
  362. 1148.33 s gammaloop-nextest-integration> field value
  363. 1148.33 s gammaloop-nextest-integration> span warm_up{integrand.name=se1l}
  364. 1148.33 s gammaloop-nextest-integration> [2026-09-02 17:37:10.503] @process::amplitude INFO : Input is above threshold: 1 existing threshold E-surfaces across 1/1 graph groups
  365. 1148.33 s gammaloop-nextest-integration> field value
  366. 1148.33 s gammaloop-nextest-integration> existing_esurfaces 1
  367. 1148.33 s gammaloop-nextest-integration> group_count 1
  368. 1148.33 s gammaloop-nextest-integration> groups_above_threshold 1
  369. 1148.33 s gammaloop-nextest-integration> integrand se1l
  370. 1148.33 s gammaloop-nextest-integration> span warm_up{integrand.name=se1l}
  371. 1148.33 s gammaloop-nextest-integration> threshold_status above threshold
  372. 1148.33 s gammaloop-nextest-integration> [2026-09-02 17:37:10.503] @process::amplitude INFO : overlap structure of group 0: [1: [0(2,3)]]
  373. 1148.33 s gammaloop-nextest-integration> field value
  374. 1148.33 s gammaloop-nextest-integration> span warm_up{integrand.name=se1l}
  375. 1148.33 s gammaloop-nextest-integration> [2026-09-02 17:37:10.657] @commands::profile INFO :
  376. 1148.33 s gammaloop-nextest-integration> ╭───────┬──────┬──────────┬───────┬─────┬──────────┬───────────╮
  377. 1148.33 s gammaloop-nextest-integration> │ fixed │ → ∞ │ slope │ r2 │ DOD │ bare DOD │ inspect │
  378. 1148.33 s gammaloop-nextest-integration> ├───────┼──────┼──────────┼───────┼─────┼──────────┼───────────┤
  379. 1148.33 s gammaloop-nextest-integration> │ {} │ {e3} │ 1.639236 │ 0.904 │ 2 │ 2 │ arb retry │
  380. 1148.33 s gammaloop-nextest-integration> │ {} │ {e2} │ 1.698834 │ 0.902 │ 2 │ 2 │ arb retry │
  381. 1148.33 s gammaloop-nextest-integration> ╰───────┴──────┴──────────┴───────┴─────┴──────────┴───────────╯
  382. 1148.33 s gammaloop-nextest-integration> [2026-09-02 17:37:10.657] @commands::profile INFO :
  383. 1148.33 s gammaloop-nextest-integration> ╭───────┬──────┬─────────────┬──────────┬───────┬─────┬──────────┬───────────╮
  384. 1148.33 s gammaloop-nextest-integration> │ fixed │ → ∞ │ orientation │ slope │ r2 │ DOD │ bare DOD │ inspect │
  385. 1148.33 s gammaloop-nextest-integration> ├───────┼──────┼─────────────┼──────────┼───────┼─────┼──────────┼───────────┤
  386. 1148.33 s gammaloop-nextest-integration> │ {} │ {e3} │ 00-+ │ 0.343429 │ 0.145 │ 0 │ 2 │ arb retry │
  387. 1148.33 s gammaloop-nextest-integration> │ {} │ {e3} │ 00+- │ 0.342577 │ 0.135 │ 0 │ 2 │ arb retry │
  388. 1148.33 s gammaloop-nextest-integration> │ {} │ {e2} │ 00-+ │ 0.385975 │ 0.161 │ 0 │ 2 │ arb retry │
  389. 1148.33 s gammaloop-nextest-integration> │ {} │ {e2} │ 00+- │ 0.384920 │ 0.192 │ 0 │ 2 │ arb retry │
  390. 1148.33 s gammaloop-nextest-integration> ╰───────┴──────┴─────────────┴──────────┴───────┴─────┴──────────┴───────────╯
  391. 1148.33 s gammaloop-nextest-integration> [2026-09-02 17:37:10.658] @gammaloop_api::se... INFO : Running command set process kv integrator.target_relative_accuracy=0.001 integrator.n_increase=0 integrator.n_start=50000 integrator.n_max=400000 integrator.seed=1337
  392. 1148.33 s gammaloop-nextest-integration> [2026-09-02 17:37:10.659] @commands::integrate INFO : Created workspace directory at /build/source/tests/artifacts/se1l/integration_workspace_se1l
  393. 1148.33 s gammaloop-nextest-integration> [2026-09-02 17:37:10.680] @commands::integrate INFO : No integration state found, starting new integration
  394. 1148.33 s gammaloop-nextest-integration> [2026-09-02 17:37:10.680] @commands::integrate INFO : Gammaloop now integrates se1l@se1l, se1l@se1l_muv_shifted, se1l@se1l_rls_shifted
  395. 1148.33 s gammaloop-nextest-integration> [2026-09-02 17:37:10.681] @process::amplitude WARNING : External state 0 ('g', PDG 21, helicity +) is off shell: p^2 = +2.5e5, expected m^2 = +0e0 (|Δ| = +2.5e5). Fixed-helicity spinor/vector/tensor external states may be ill-defined at this kinematic point.
  396. 1148.33 s gammaloop-nextest-integration> field value
  397. 1148.33 s gammaloop-nextest-integration> span warm_up{integrand.name=se1l}
  398. 1148.33 s gammaloop-nextest-integration> [2026-09-02 17:37:10.681] @process::amplitude WARNING : External state 1 ('g', PDG 21, helicity -) is off shell: p^2 = +2.5e5, expected m^2 = +0e0 (|Δ| = +2.5e5). Fixed-helicity spinor/vector/tensor external states may be ill-defined at this kinematic point.
  399. 1148.33 s gammaloop-nextest-integration> field value
  400. 1148.33 s gammaloop-nextest-integration> span warm_up{integrand.name=se1l}
  401. 1148.33 s gammaloop-nextest-integration> [2026-09-02 17:37:10.681] @process::amplitude INFO : Input is above threshold: 1 existing threshold E-surfaces across 1/1 graph groups
  402. 1148.33 s gammaloop-nextest-integration> field value
  403. 1148.33 s gammaloop-nextest-integration> existing_esurfaces 1
  404. 1148.33 s gammaloop-nextest-integration> group_count 1
  405. 1148.33 s gammaloop-nextest-integration> groups_above_threshold 1
  406. 1148.33 s gammaloop-nextest-integration> integrand se1l
  407. 1148.33 s gammaloop-nextest-integration> span warm_up{integrand.name=se1l}
  408. 1148.33 s gammaloop-nextest-integration> threshold_status above threshold
  409. 1148.33 s gammaloop-nextest-integration> [2026-09-02 17:37:10.681] @process::amplitude INFO : overlap structure of group 0: [1: [0(2,3)]]
  410. 1148.33 s gammaloop-nextest-integration> field value
  411. 1148.33 s gammaloop-nextest-integration> span warm_up{integrand.name=se1l}
  412. 1148.33 s gammaloop-nextest-integration> [2026-09-02 17:37:10.682] @process::amplitude WARNING : External state 0 ('g', PDG 21, helicity +) is off shell: p^2 = +2.5e5, expected m^2 = +0e0 (|Δ| = +2.5e5). Fixed-helicity spinor/vector/tensor external states may be ill-defined at this kinematic point.
  413. 1148.33 s gammaloop-nextest-integration> field value
  414. 1148.33 s gammaloop-nextest-integration> span warm_up{integrand.name=se1l_muv_shifted}
  415. 1148.33 s gammaloop-nextest-integration> [2026-09-02 17:37:10.682] @process::amplitude WARNING : External state 1 ('g', PDG 21, helicity -) is off shell: p^2 = +2.5e5, expected m^2 = +0e0 (|Δ| = +2.5e5). Fixed-helicity spinor/vector/tensor external states may be ill-defined at this kinematic point.
  416. 1148.33 s gammaloop-nextest-integration> field value
  417. 1148.33 s gammaloop-nextest-integration> span warm_up{integrand.name=se1l_muv_shifted}
  418. 1148.33 s gammaloop-nextest-integration> [2026-09-02 17:37:10.682] @process::amplitude INFO : Input is above threshold: 1 existing threshold E-surfaces across 1/1 graph groups
  419. 1148.33 s gammaloop-nextest-integration> field value
  420. 1148.33 s gammaloop-nextest-integration> existing_esurfaces 1
  421. 1148.33 s gammaloop-nextest-integration> group_count 1
  422. 1148.33 s gammaloop-nextest-integration> groups_above_threshold 1
  423. 1148.33 s gammaloop-nextest-integration> integrand se1l_muv_shifted
  424. 1148.33 s gammaloop-nextest-integration> span warm_up{integrand.name=se1l_muv_shifted}
  425. 1148.33 s gammaloop-nextest-integration> threshold_status above threshold
  426. 1148.33 s gammaloop-nextest-integration> [2026-09-02 17:37:10.682] @process::amplitude INFO : overlap structure of group 0: [1: [0(2,3)]]
  427. 1148.33 s gammaloop-nextest-integration> field value
  428. 1148.33 s gammaloop-nextest-integration> span warm_up{integrand.name=se1l_muv_shifted}
  429. 1148.33 s gammaloop-nextest-integration> [2026-09-02 17:37:10.683] @process::amplitude WARNING : External state 0 ('g', PDG 21, helicity +) is off shell: p^2 = +2.5e5, expected m^2 = +0e0 (|Δ| = +2.5e5). Fixed-helicity spinor/vector/tensor external states may be ill-defined at this kinematic point.
  430. 1148.33 s gammaloop-nextest-integration> field value
  431. 1148.33 s gammaloop-nextest-integration> span warm_up{integrand.name=se1l_rls_shifted}
  432. 1148.33 s gammaloop-nextest-integration> [2026-09-02 17:37:10.683] @process::amplitude WARNING : External state 1 ('g', PDG 21, helicity -) is off shell: p^2 = +2.5e5, expected m^2 = +0e0 (|Δ| = +2.5e5). Fixed-helicity spinor/vector/tensor external states may be ill-defined at this kinematic point.
  433. 1148.33 s gammaloop-nextest-integration> field value
  434. 1148.33 s gammaloop-nextest-integration> span warm_up{integrand.name=se1l_rls_shifted}
  435. 1148.33 s gammaloop-nextest-integration> [2026-09-02 17:37:10.684] @process::amplitude INFO : Input is above threshold: 1 existing threshold E-surfaces across 1/1 graph groups
  436. 1148.33 s gammaloop-nextest-integration> field value
  437. 1148.33 s gammaloop-nextest-integration> existing_esurfaces 1
  438. 1148.33 s gammaloop-nextest-integration> group_count 1
  439. 1148.33 s gammaloop-nextest-integration> groups_above_threshold 1
  440. 1148.33 s gammaloop-nextest-integration> integrand se1l_rls_shifted
  441. 1148.33 s gammaloop-nextest-integration> span warm_up{integrand.name=se1l_rls_shifted}
  442. 1148.33 s gammaloop-nextest-integration> threshold_status above threshold
  443. 1148.33 s gammaloop-nextest-integration> ... omitted 1410 more lines; see full nextest output above
  444. 1148.33 s gammaloop-nextest-integration> =========================================
  445. 1148.57 s [0 built (1 failed), 1 cerror: Cannot build '/nix/store/zpyfjihmv7i6ghxwmb5sjv51y6brg4wy-gammaloop-nextest-integration.drv'.
  446. 1148.57 s Reason: builder failed with exit code 100.
  447. 1148.57 s Output paths:
  448. 1148.57 s /nix/store/k1knsdpdly6yc14pxdqxjbszfxpz040p-gammaloop-nextest-integration
  449. 1148.57 s Last 2048 log lines:
  450. 1148.57 s > span warm_up{integrand.name=se1l_muv_shifted}
  451. 1148.57 s > threshold_status above threshold
  452. 1148.57 s > [2026-09-02 17:38:48.268] @process::amplitude INFO : overlap structure of group 0: [1: [0(2,3)]]
  453. 1148.57 s > field value
  454. 1148.57 s > span warm_up{integrand.name=se1l_muv_shifted}
  455. 1148.57 s > [2026-09-02 17:38:48.272] @process::amplitude WARNING : External state 0 ('g', PDG 21, helicity +) is off shell: p^2 = +2.5e5, expected m^2 = +0e0 (|Δ| = +2.5e5). Fixed-helicity spinor/vector/tensor external states may be ill-defined at this kinematic point.
  456. 1148.57 s > field value
  457. 1148.57 s > span warm_up{integrand.name=se1l}
  458. 1148.57 s > [2026-09-02 17:38:48.272] @process::amplitude WARNING : External state 1 ('g', PDG 21, helicity -) is off shell: p^2 = +2.5e5, expected m^2 = +0e0 (|Δ| = +2.5e5). Fixed-helicity spinor/vector/tensor external states may be ill-defined at this kinematic point.
  459. 1148.57 s > field value
  460. 1148.57 s > span warm_up{integrand.name=se1l}
  461. 1148.57 s > [2026-09-02 17:38:48.272] @process::amplitude INFO : Input is above threshold: 1 existing threshold E-surfaces across 1/1 graph groups
  462. 1148.57 s > field value
  463. 1148.57 s > existing_esurfaces 1
  464. 1148.57 s > group_count 1
  465. 1148.57 s > groups_above_threshold 1
  466. 1148.57 s > integrand se1l
  467. 1148.57 s > span warm_up{integrand.name=se1l}
  468. 1148.57 s > threshold_status above threshold
  469. 1148.57 s > [2026-09-02 17:38:48.272] @process::amplitude INFO : overlap structure of group 0: [1: [0(2,3)]]
  470. 1148.57 s > field value
  471. 1148.57 s > span warm_up{integrand.name=se1l}
  472. 1148.57 s > [2026-09-02 17:38:48.275] @process::amplitude WARNING : External state 0 ('g', PDG 21, helicity +) is off shell: p^2 = +2.5e5, expected m^2 = +0e0 (|Δ| = +2.5e5). Fixed-helicity spinor/vector/tensor external states may be ill-defined at this kinematic point.
  473. 1148.57 s > field value
  474. 1148.57 s > span warm_up{integrand.name=se1l_muv_shifted}
  475. 1148.57 s > [2026-09-02 17:38:48.275] @process::amplitude WARNING : External state 1 ('g', PDG 21, helicity -) is off shell: p^2 = +2.5e5, expected m^2 = +0e0 (|Δ| = +2.5e5). Fixed-helicity spinor/vector/tensor external states may be ill-defined at this kinematic point.
  476. 1148.57 s > field value
  477. 1148.57 s > span warm_up{integrand.name=se1l_muv_shifted}
  478. 1148.57 s > [2026-09-02 17:38:48.275] @process::amplitude INFO : Input is above threshold: 1 existing threshold E-surfaces across 1/1 graph groups
  479. 1148.57 s > field value
  480. 1148.57 s > existing_esurfaces 1
  481. 1148.57 s > group_count 1
  482. 1148.57 s > groups_above_threshold 1
  483. 1148.57 s > integrand se1l_muv_shifted
  484. 1148.57 s > span warm_up{integrand.name=se1l_muv_shifted}
  485. 1148.57 s > threshold_status above threshold
  486. 1148.57 s > [2026-09-02 17:38:48.276] @process::amplitude INFO : overlap structure of group 0: [1: [0(2,3)]]
  487. 1148.57 s > field value
  488. 1148.57 s > span warm_up{integrand.name=se1l_muv_shifted}
  489. 1148.57 s > [2026-09-02 17:38:48.279] @process::amplitude WARNING : External state 0 ('g', PDG 21, helicity +) is off shell: p^2 = +2.5e5, expected m^2 = +0e0 (|Δ| = +2.5e5). Fixed-helicity spinor/vector/tensor external states may be ill-defined at this kinematic point.
  490. 1148.57 s > field value
  491. 1148.57 s > span warm_up{integrand.name=se1l}
  492. 1148.57 s > [2026-09-02 17:38:48.279] @process::amplitude WARNING : External state 1 ('g', PDG 21, helicity -) is off shell: p^2 = +2.5e5, expected m^2 = +0e0 (|Δ| = +2.5e5). Fixed-helicity spinor/vector/tensor external states may be ill-defined at this kinematic point.
  493. 1148.57 s > field value
  494. 1148.57 s > span warm_up{integrand.name=se1l}
  495. 1148.57 s > [2026-09-02 17:38:48.279] @process::amplitude INFO : Input is above threshold: 1 existing threshold E-surfaces across 1/1 graph groups
  496. 1148.57 s > field value
  497. 1148.57 s > existing_esurfaces 1
  498. 1148.57 s > group_count 1
  499. 1148.57 s > groups_above_threshold 1
  500. 1148.57 s > integrand se1l
  501. 1148.57 s > span warm_up{integrand.name=se1l}
  502. 1148.57 s > threshold_status above threshold
  503. 1148.57 s > [2026-09-02 17:38:48.279] @process::amplitude INFO : overlap structure of group 0: [1: [0(2,3)]]
  504. 1148.57 s > field value
  505. 1148.57 s > span warm_up{integrand.name=se1l}
  506. 1148.57 s > [2026-09-02 17:38:48.283] @process::amplitude WARNING : External state 0 ('g', PDG 21, helicity +) is off shell: p^2 = +2.5e5, expected m^2 = +0e0 (|Δ| = +2.5e5). Fixed-helicity spinor/vector/tensor external states may be ill-defined at this kinematic point.
  507. 1148.57 s > field value
  508. 1148.57 s > span warm_up{integrand.name=se1l_muv_shifted}
  509. 1148.57 s > [2026-09-02 17:38:48.283] @process::amplitude WARNING : External state 1 ('g', PDG 21, helicity -) is off shell: p^2 = +2.5e5, expected m^2 = +0e0 (|Δ| = +2.5e5). Fixed-helicity spinor/vector/tensor external states may be ill-defined at this kinematic point.
  510. 1148.57 s > field value
  511. 1148.57 s > span warm_up{integrand.name=se1l_muv_shifted}
  512. 1148.57 s > [2026-09-02 17:38:48.283] @process::amplitude INFO : Input is above threshold: 1 existing threshold E-surfaces across 1/1 graph groups
  513. 1148.57 s > field value
  514. 1148.57 s > existing_esurfaces 1
  515. 1148.57 s > group_count 1
  516. 1148.57 s > groups_above_threshold 1
  517. 1148.57 s > integrand se1l_muv_shifted
  518. 1148.57 s > span warm_up{integrand.name=se1l_muv_shifted}
  519. 1148.57 s > threshold_status above threshold
  520. 1148.57 s > [2026-09-02 17:38:48.283] @process::amplitude INFO : overlap structure of group 0: [1: [0(2,3)]]
  521. 1148.57 s > field value
  522. 1148.57 s > span warm_up{integrand.name=se1l_muv_shifted}
  523. 1148.57 s > [2026-09-02 17:38:48.286] @process::amplitude WARNING : External state 0 ('g', PDG 21, helicity +) is off shell: p^2 = +2.5e5, expected m^2 = +0e0 (|Δ| = +2.5e5). Fixed-helicity spinor/vector/tensor external states may be ill-defined at this kinematic point.
  524. 1148.57 s > field value
  525. 1148.57 s > span warm_up{integrand.name=se1l}
  526. 1148.57 s > [2026-09-02 17:38:48.286] @process::amplitude WARNING : External state 1 ('g', PDG 21, helicity -) is off shell: p^2 = +2.5e5, expected m^2 = +0e0 (|Δ| = +2.5e5). Fixed-helicity spinor/vector/tensor external states may be ill-defined at this kinematic point.
  527. 1148.57 s > field value
  528. 1148.57 s > span warm_up{integrand.name=se1l}
  529. 1148.57 s > [2026-09-02 17:38:48.286] @process::amplitude INFO : Input is above threshold: 1 existing threshold E-surfaces across 1/1 graph groups
  530. 1148.57 s > field value
  531. 1148.57 s > existing_esurfaces 1
  532. 1148.57 s > group_count 1
  533. 1148.57 s > groups_above_threshold 1
  534. 1148.57 s > integrand se1l
  535. 1148.57 s > span warm_up{integrand.name=se1l}
  536. 1148.57 s > threshold_status above threshold
  537. 1148.57 s > [2026-09-02 17:38:48.286] @process::amplitude INFO : overlap structure of group 0: [1: [0(2,3)]]
  538. 1148.57 s > field value
  539. 1148.57 s > span warm_up{integrand.name=se1l}
  540. 1148.57 s > [2026-09-02 17:38:48.290] @process::amplitude WARNING : External state 0 ('g', PDG 21, helicity +) is off shell: p^2 = +2.5e5, expected m^2 = +0e0 (|Δ| = +2.5e5). Fixed-helicity spinor/vector/tensor external states may be ill-defined at this kinematic point.
  541. 1148.57 s > field value
  542. 1148.57 s > span warm_up{integrand.name=se1l_muv_shifted}
  543. 1148.57 s > [2026-09-02 17:38:48.290] @process::amplitude WARNING : External state 1 ('g', PDG 21, helicity -) is off shell: p^2 = +2.5e5, expected m^2 = +0e0 (|Δ| = +2.5e5). Fixed-helicity spinor/vector/tensor external states may be ill-defined at this kinematic point.
  544. 1148.57 s > field value
  545. 1148.57 s > span warm_up{integrand.name=se1l_muv_shifted}
  546. 1148.57 s > [2026-09-02 17:38:48.290] @process::amplitude INFO : Input is above threshold: 1 existing threshold E-surfaces across 1/1 graph groups
  547. 1148.57 s > field value
  548. 1148.57 s > existing_esurfaces 1
  549. 1148.57 s > group_count 1
  550. 1148.57 s > groups_above_threshold 1
  551. 1148.57 s > integrand se1l_muv_shifted
  552. 1148.57 s > span warm_up{integrand.name=se1l_muv_shifted}
  553. 1148.57 s > threshold_status above threshold
  554. 1148.57 s > [2026-09-02 17:38:48.290] @process::amplitude INFO : overlap structure of group 0: [1: [0(2,3)]]
  555. 1148.57 s > field value
  556. 1148.57 s > span warm_up{integrand.name=se1l_muv_shifted}
  557. 1148.57 s > [2026-09-02 17:38:48.293] @process::amplitude WARNING : External state 0 ('g', PDG 21, helicity +) is off shell: p^2 = +2.5e5, expected m^2 = +0e0 (|Δ| = +2.5e5). Fixed-helicity spinor/vector/tensor external states may be ill-defined at this kinematic point.
  558. 1148.57 s > field value
  559. 1148.57 s > span warm_up{integrand.name=se1l}
  560. 1148.57 s > [2026-09-02 17:38:48.293] @process::amplitude WARNING : External state 1 ('g', PDG 21, helicity -) is off shell: p^2 = +2.5e5, expected m^2 = +0e0 (|Δ| = +2.5e5). Fixed-helicity spinor/vector/tensor external states may be ill-defined at this kinematic point.
  561. 1148.57 s > field value
  562. 1148.57 s > span warm_up{integrand.name=se1l}
  563. 1148.57 s > [2026-09-02 17:38:48.294] @process::amplitude INFO : Input is above threshold: 1 existing threshold E-surfaces across 1/1 graph groups
  564. 1148.57 s > field value
  565. 1148.57 s > existing_esurfaces 1
  566. 1148.57 s > group_count 1
  567. 1148.57 s > groups_above_threshold 1
  568. 1148.57 s > integrand se1l
  569. 1148.57 s > span warm_up{integrand.name=se1l}
  570. 1148.57 s > threshold_status above threshold
  571. 1148.57 s > [2026-09-02 17:38:48.294] @process::amplitude INFO : overlap structure of group 0: [1: [0(2,3)]]
  572. 1148.57 s > field value
  573. 1148.57 s > span warm_up{integrand.name=se1l}
  574. 1148.57 s > [2026-09-02 17:38:48.297] @process::amplitude WARNING : External state 0 ('g', PDG 21, helicity +) is off shell: p^2 = +2.5e5, expected m^2 = +0e0 (|Δ| = +2.5e5). Fixed-helicity spinor/vector/tensor external states may be ill-defined at this kinematic point.
  575. 1148.57 s > field value
  576. 1148.57 s > span warm_up{integrand.name=se1l_rls_shifted}
  577. 1148.57 s > [2026-09-02 17:38:48.297] @process::amplitude WARNING : External state 1 ('g', PDG 21, helicity -) is off shell: p^2 = +2.5e5, expected m^2 = +0e0 (|Δ| = +2.5e5). Fixed-helicity spinor/vector/tensor external states may be ill-defined at this kinematic point.
  578. 1148.57 s > field value
  579. 1148.57 s > span warm_up{integrand.name=se1l_rls_shifted}
  580. 1148.57 s > [2026-09-02 17:38:48.297] @process::amplitude INFO : Input is above threshold: 1 existing threshold E-surfaces across 1/1 graph groups
  581. 1148.57 s > field value
  582. 1148.57 s > existing_esurfaces 1
  583. 1148.57 s > group_count 1
  584. 1148.57 s > groups_above_threshold 1
  585. 1148.57 s > integrand se1l_rls_shifted
  586. 1148.57 s > span warm_up{integrand.name=se1l_rls_shifted}
  587. 1148.57 s > threshold_status above threshold
  588. 1148.57 s > [2026-09-02 17:38:48.297] @process::amplitude INFO : overlap structure of group 0: [1: [0(2,3)]]
  589. 1148.57 s > field value
  590. 1148.57 s > span warm_up{integrand.name=se1l_rls_shifted}
  591. 1148.57 s > [2026-09-02 17:38:48.301] @process::amplitude WARNING : External state 0 ('g', PDG 21, helicity +) is off shell: p^2 = +2.5e5, expected m^2 = +0e0 (|Δ| = +2.5e5). Fixed-helicity spinor/vector/tensor external states may be ill-defined at this kinematic point.
  592. 1148.57 s > field value
  593. 1148.57 s > span warm_up{integrand.name=se1l}
  594. 1148.57 s > [2026-09-02 17:38:48.301] @process::amplitude WARNING : External state 1 ('g', PDG 21, helicity -) is off shell: p^2 = +2.5e5, expected m^2 = +0e0 (|Δ| = +2.5e5). Fixed-helicity spinor/vector/tensor external states may be ill-defined at this kinematic point.
  595. 1148.57 s > field value
  596. 1148.57 s > span warm_up{integrand.name=se1l}
  597. 1148.57 s > [2026-09-02 17:38:48.301] @process::amplitude INFO : Input is above threshold: 1 existing threshold E-surfaces across 1/1 graph groups
  598. 1148.57 s > field value
  599. 1148.57 s > existing_esurfaces 1
  600. 1148.57 s > group_count 1
  601. 1148.57 s > groups_above_threshold 1
  602. 1148.57 s > integrand se1l
  603. 1148.57 s > span warm_up{integrand.name=se1l}
  604. 1148.57 s > threshold_status above threshold
  605. 1148.57 s > [2026-09-02 17:38:48.301] @process::amplitude INFO : overlap structure of group 0: [1: [0(2,3)]]
  606. 1148.57 s > field value
  607. 1148.57 s > span warm_up{integrand.name=se1l}
  608. 1148.57 s > [2026-09-02 17:38:48.304] @process::amplitude WARNING : External state 0 ('g', PDG 21, helicity +) is off shell: p^2 = +2.5e5, expected m^2 = +0e0 (|Δ| = +2.5e5). Fixed-helicity spinor/vector/tensor external states may be ill-defined at this kinematic point.
  609. 1148.57 s > field value
  610. 1148.57 s > span warm_up{integrand.name=se1l_rls_shifted}
  611. 1148.57 s > [2026-09-02 17:38:48.304] @process::amplitude WARNING : External state 1 ('g', PDG 21, helicity -) is off shell: p^2 = +2.5e5, expected m^2 = +0e0 (|Δ| = +2.5e5). Fixed-helicity spinor/vector/tensor external states may be ill-defined at this kinematic point.
  612. 1148.57 s > field value
  613. 1148.57 s > span warm_up{integrand.name=se1l_rls_shifted}
  614. 1148.57 s > [2026-09-02 17:38:48.305] @process::amplitude INFO : Input is above threshold: 1 existing threshold E-surfaces across 1/1 graph groups
  615. 1148.57 s > field value
  616. 1148.57 s > existing_esurfaces 1
  617. 1148.57 s > group_count 1
  618. 1148.57 s > groups_above_threshold 1
  619. 1148.57 s > integrand se1l_rls_shifted
  620. 1148.57 s > span warm_up{integrand.name=se1l_rls_shifted}
  621. 1148.57 s > threshold_status above threshold
  622. 1148.57 s > [2026-09-02 17:38:48.305] @process::amplitude INFO : overlap structure of group 0: [1: [0(2,3)]]
  623. 1148.57 s > field value
  624. 1148.57 s > span warm_up{integrand.name=se1l_rls_shifted}
  625. 1148.57 s > [2026-09-02 17:38:48.308] @process::amplitude WARNING : External state 0 ('g', PDG 21, helicity +) is off shell: p^2 = +2.5e5, expected m^2 = +0e0 (|Δ| = +2.5e5). Fixed-helicity spinor/vector/tensor external states may be ill-defined at this kinematic point.
  626. 1148.57 s > field value
  627. 1148.57 s > span warm_up{integrand.name=se1l}
  628. 1148.57 s > [2026-09-02 17:38:48.308] @process::amplitude WARNING : External state 1 ('g', PDG 21, helicity -) is off shell: p^2 = +2.5e5, expected m^2 = +0e0 (|Δ| = +2.5e5). Fixed-helicity spinor/vector/tensor external states may be ill-defined at this kinematic point.
  629. 1148.57 s > field value
  630. 1148.57 s > span warm_up{integrand.name=se1l}
  631. 1148.57 s > [2026-09-02 17:38:48.308] @process::amplitude INFO : Input is above threshold: 1 existing threshold E-surfaces across 1/1 graph groups
  632. 1148.57 s > field value
  633. 1148.57 s > existing_esurfaces 1
  634. 1148.57 s > group_count 1
  635. 1148.57 s > groups_above_threshold 1
  636. 1148.57 s > integrand se1l
  637. 1148.57 s > span warm_up{integrand.name=se1l}
  638. 1148.57 s > threshold_status above threshold
  639. 1148.57 s > [2026-09-02 17:38:48.308] @process::amplitude INFO : overlap structure of group 0: [1: [0(2,3)]]
  640. 1148.57 s > field value
  641. 1148.57 s > span warm_up{integrand.name=se1l}
  642. 1148.57 s > [2026-09-02 17:38:48.312] @process::amplitude WARNING : External state 0 ('g', PDG 21, helicity +) is off shell: p^2 = +2.5e5, expected m^2 = +0e0 (|Δ| = +2.5e5). Fixed-helicity spinor/vector/tensor external states may be ill-defined at this kinematic point.
  643. 1148.57 s > field value
  644. 1148.57 s > span warm_up{integrand.name=se1l_rls_shifted}
  645. 1148.57 s > [2026-09-02 17:38:48.312] @process::amplitude WARNING : External state 1 ('g', PDG 21, helicity -) is off shell: p^2 = +2.5e5, expected m^2 = +0e0 (|Δ| = +2.5e5). Fixed-helicity spinor/vector/tensor external states may be ill-defined at this kinematic point.
  646. 1148.57 s > field value
  647. 1148.57 s > span warm_up{integrand.name=se1l_rls_shifted}
  648. 1148.57 s > [2026-09-02 17:38:48.312] @process::amplitude INFO : Input is above threshold: 1 existing threshold E-surfaces across 1/1 graph groups
  649. 1148.57 s > field value
  650. 1148.57 s > existing_esurfaces 1
  651. 1148.57 s > group_count 1
  652. 1148.57 s > groups_above_threshold 1
  653. 1148.57 s > integrand se1l_rls_shifted
  654. 1148.57 s > span warm_up{integrand.name=se1l_rls_shifted}
  655. 1148.57 s > threshold_status above threshold
  656. 1148.57 s > [2026-09-02 17:38:48.312] @process::amplitude INFO : overlap structure of group 0: [1: [0(2,3)]]
  657. 1148.57 s > field value
  658. 1148.57 s > span warm_up{integrand.name=se1l_rls_shifted}
  659. 1148.57 s > [2026-09-02 17:38:48.315] @process::amplitude WARNING : External state 0 ('g', PDG 21, helicity +) is off shell: p^2 = +2.5e5, expected m^2 = +0e0 (|Δ| = +2.5e5). Fixed-helicity spinor/vector/tensor external states may be ill-defined at this kinematic point.
  660. 1148.57 s > field value
  661. 1148.57 s > span warm_up{integrand.name=se1l}
  662. 1148.57 s > [2026-09-02 17:38:48.315] @process::amplitude WARNING : External state 1 ('g', PDG 21, helicity -) is off shell: p^2 = +2.5e5, expected m^2 = +0e0 (|Δ| = +2.5e5). Fixed-helicity spinor/vector/tensor external states may be ill-defined at this kinematic point.
  663. 1148.57 s > field value
  664. 1148.57 s > span warm_up{integrand.name=se1l}
  665. 1148.57 s > [2026-09-02 17:38:48.316] @process::amplitude INFO : Input is above threshold: 1 existing threshold E-surfaces across 1/1 graph groups
  666. 1148.57 s > field value
  667. 1148.57 s > existing_esurfaces 1
  668. 1148.57 s > group_count 1
  669. 1148.57 s > groups_above_threshold 1
  670. 1148.57 s > integrand se1l
  671. 1148.57 s > span warm_up{integrand.name=se1l}
  672. 1148.57 s > threshold_status above threshold
  673. 1148.57 s > [2026-09-02 17:38:48.316] @process::amplitude INFO : overlap structure of group 0: [1: [0(2,3)]]
  674. 1148.57 s > field value
  675. 1148.57 s > span warm_up{integrand.name=se1l}
  676. 1148.57 s > [2026-09-02 17:38:48.319] @process::amplitude WARNING : External state 0 ('g', PDG 21, helicity +) is off shell: p^2 = +2.5e5, expected m^2 = +0e0 (|Δ| = +2.5e5). Fixed-helicity spinor/vector/tensor external states may be ill-defined at this kinematic point.
  677. 1148.57 s > field value
  678. 1148.57 s > span warm_up{integrand.name=se1l_rls_shifted}
  679. 1148.57 s > [2026-09-02 17:38:48.319] @process::amplitude WARNING : External state 1 ('g', PDG 21, helicity -) is off shell: p^2 = +2.5e5, expected m^2 = +0e0 (|Δ| = +2.5e5). Fixed-helicity spinor/vector/tensor external states may be ill-defined at this kinematic point.
  680. 1148.57 s > field value
  681. 1148.57 s > span warm_up{integrand.name=se1l_rls_shifted}
  682. 1148.57 s > [2026-09-02 17:38:48.319] @process::amplitude INFO : Input is above threshold: 1 existing threshold E-surfaces across 1/1 graph groups
  683. 1148.57 s > field value
  684. 1148.57 s > existing_esurfaces 1
  685. 1148.57 s > group_count 1
  686. 1148.57 s > groups_above_threshold 1
  687. 1148.57 s > integrand se1l_rls_shifted
  688. 1148.57 s > span warm_up{integrand.name=se1l_rls_shifted}
  689. 1148.57 s > threshold_status above threshold
  690. 1148.57 s > [2026-09-02 17:38:48.319] @process::amplitude INFO : overlap structure of group 0: [1: [0(2,3)]]
  691. 1148.57 s > field value
  692. 1148.57 s > span warm_up{integrand.name=se1l_rls_shifted}
  693. 1148.57 s > [2026-09-02 17:38:48.323] @process::amplitude WARNING : External state 0 ('g', PDG 21, helicity +) is off shell: p^2 = +2.5e5, expected m^2 = +0e0 (|Δ| = +2.5e5). Fixed-helicity spinor/vector/tensor external states may be ill-defined at this kinematic point.
  694. 1148.57 s > field value
  695. 1148.57 s > span warm_up{integrand.name=se1l}
  696. 1148.57 s > [2026-09-02 17:38:48.323] @process::amplitude WARNING : External state 1 ('g', PDG 21, helicity -) is off shell: p^2 = +2.5e5, expected m^2 = +0e0 (|Δ| = +2.5e5). Fixed-helicity spinor/vector/tensor external states may be ill-defined at this kinematic point.
  697. 1148.57 s > field value
  698. 1148.57 s > span warm_up{integrand.name=se1l}
  699. 1148.57 s > [2026-09-02 17:38:48.323] @process::amplitude INFO : Input is above threshold: 1 existing threshold E-surfaces across 1/1 graph groups
  700. 1148.57 s > field value
  701. 1148.57 s > existing_esurfaces 1
  702. 1148.57 s > group_count 1
  703. 1148.57 s > groups_above_threshold 1
  704. 1148.57 s > integrand se1l
  705. 1148.57 s > span warm_up{integrand.name=se1l}
  706. 1148.57 s > threshold_status above threshold
  707. 1148.57 s > [2026-09-02 17:38:48.323] @process::amplitude INFO : overlap structure of group 0: [1: [0(2,3)]]
  708. 1148.57 s > field value
  709. 1148.57 s > span warm_up{integrand.name=se1l}
  710. 1148.57 s > [2026-09-02 17:38:48.326] @process::amplitude WARNING : External state 0 ('g', PDG 21, helicity +) is off shell: p^2 = +2.5e5, expected m^2 = +0e0 (|Δ| = +2.5e5). Fixed-helicity spinor/vector/tensor external states may be ill-defined at this kinematic point.
  711. 1148.57 s > field value
  712. 1148.57 s > span warm_up{integrand.name=se1l_rls_shifted}
  713. 1148.57 s > [2026-09-02 17:38:48.326] @process::amplitude WARNING : External state 1 ('g', PDG 21, helicity -) is off shell: p^2 = +2.5e5, expected m^2 = +0e0 (|Δ| = +2.5e5). Fixed-helicity spinor/vector/tensor external states may be ill-defined at this kinematic point.
  714. 1148.57 s > field value
  715. 1148.57 s > span warm_up{integrand.name=se1l_rls_shifted}
  716. 1148.57 s > [2026-09-02 17:38:48.327] @process::amplitude INFO : Input is above threshold: 1 existing threshold E-surfaces across 1/1 graph groups
  717. 1148.57 s > field value
  718. 1148.57 s > existing_esurfaces 1
  719. 1148.57 s > group_count 1
  720. 1148.57 s > groups_above_threshold 1
  721. 1148.57 s > integrand se1l_rls_shifted
  722. 1148.57 s > span warm_up{integrand.name=se1l_rls_shifted}
  723. 1148.57 s > threshold_status above threshold
  724. 1148.57 s > [2026-09-02 17:38:48.327] @process::amplitude INFO : overlap structure of group 0: [1: [0(2,3)]]
  725. 1148.57 s > field value
  726. 1148.57 s > span warm_up{integrand.name=se1l_rls_shifted}
  727. 1148.57 s > [2026-09-02 17:38:48.330] @process::amplitude WARNING : External state 0 ('g', PDG 21, helicity +) is off shell: p^2 = +2.5e5, expected m^2 = +0e0 (|Δ| = +2.5e5). Fixed-helicity spinor/vector/tensor external states may be ill-defined at this kinematic point.
  728. 1148.57 s > field value
  729. 1148.57 s > span warm_up{integrand.name=se1l}
  730. 1148.57 s > [2026-09-02 17:38:48.330] @process::amplitude WARNING : External state 1 ('g', PDG 21, helicity -) is off shell: p^2 = +2.5e5, expected m^2 = +0e0 (|Δ| = +2.5e5). Fixed-helicity spinor/vector/tensor external states may be ill-defined at this kinematic point.
  731. 1148.57 s > field value
  732. 1148.57 s > span warm_up{integrand.name=se1l}
  733. 1148.57 s > [2026-09-02 17:38:48.330] @process::amplitude INFO : Input is above threshold: 1 existing threshold E-surfaces across 1/1 graph groups
  734. 1148.57 s > field value
  735. 1148.57 s > existing_esurfaces 1
  736. 1148.57 s > group_count 1
  737. 1148.57 s > groups_above_threshold 1
  738. 1148.57 s > integrand se1l
  739. 1148.57 s > span warm_up{integrand.name=se1l}
  740. 1148.57 s > threshold_status above threshold
  741. 1148.57 s > [2026-09-02 17:38:48.330] @process::amplitude INFO : overlap structure of group 0: [1: [0(2,3)]]
  742. 1148.57 s > field value
  743. 1148.57 s > span warm_up{integrand.name=se1l}
  744. 1148.57 s > [2026-09-02 17:38:48.334] @process::amplitude WARNING : External state 0 ('g', PDG 21, helicity +) is off shell: p^2 = +2.5e5, expected m^2 = +0e0 (|Δ| = +2.5e5). Fixed-helicity spinor/vector/tensor external states may be ill-defined at this kinematic point.
  745. 1148.57 s > field value
  746. 1148.57 s > span warm_up{integrand.name=se1l_rls_shifted}
  747. 1148.57 s > [2026-09-02 17:38:48.334] @process::amplitude WARNING : External state 1 ('g', PDG 21, helicity -) is off shell: p^2 = +2.5e5, expected m^2 = +0e0 (|Δ| = +2.5e5). Fixed-helicity spinor/vector/tensor external states may be ill-defined at this kinematic point.
  748. 1148.57 s > field value
  749. 1148.57 s > span warm_up{integrand.name=se1l_rls_shifted}
  750. 1148.57 s > [2026-09-02 17:38:48.334] @process::amplitude INFO : Input is above threshold: 1 existing threshold E-surfaces across 1/1 graph groups
  751. 1148.57 s > field value
  752. 1148.57 s > existing_esurfaces 1
  753. 1148.57 s > group_count 1
  754. 1148.57 s > groups_above_threshold 1
  755. 1148.57 s > integrand se1l_rls_shifted
  756. 1148.57 s > span warm_up{integrand.name=se1l_rls_shifted}
  757. 1148.57 s > threshold_status above threshold
  758. 1148.57 s > [2026-09-02 17:38:48.334] @process::amplitude INFO : overlap structure of group 0: [1: [0(2,3)]]
  759. 1148.57 s > field value
  760. 1148.57 s > span warm_up{integrand.name=se1l_rls_shifted}
  761. 1148.57 s > [2026-09-02 17:38:48.337] @process::amplitude WARNING : External state 0 ('g', PDG 21, helicity +) is off shell: p^2 = +2.5e5, expected m^2 = +0e0 (|Δ| = +2.5e5). Fixed-helicity spinor/vector/tensor external states may be ill-defined at this kinematic point.
  762. 1148.57 s > field value
  763. 1148.57 s > span warm_up{integrand.name=se1l}
  764. 1148.57 s > [2026-09-02 17:38:48.337] @process::amplitude WARNING : External state 1 ('g', PDG 21, helicity -) is off shell: p^2 = +2.5e5, expected m^2 = +0e0 (|Δ| = +2.5e5). Fixed-helicity spinor/vector/tensor external states may be ill-defined at this kinematic point.
  765. 1148.57 s > field value
  766. 1148.57 s > span warm_up{integrand.name=se1l}
  767. 1148.57 s > [2026-09-02 17:38:48.337] @process::amplitude INFO : Input is above threshold: 1 existing threshold E-surfaces across 1/1 graph groups
  768. 1148.57 s > field value
  769. 1148.57 s > existing_esurfaces 1
  770. 1148.57 s > group_count 1
  771. 1148.57 s > groups_above_threshold 1
  772. 1148.57 s > integrand se1l
  773. 1148.57 s > span warm_up{integrand.name=se1l}
  774. 1148.57 s > threshold_status above threshold
  775. 1148.57 s > [2026-09-02 17:38:48.338] @process::amplitude INFO : overlap structure of group 0: [1: [0(2,3)]]
  776. 1148.57 s > field value
  777. 1148.57 s > span warm_up{integrand.name=se1l}
  778. 1148.57 s > [2026-09-02 17:38:48.341] @process::amplitude WARNING : External state 0 ('g', PDG 21, helicity +) is off shell: p^2 = +2.5e5, expected m^2 = +0e0 (|Δ| = +2.5e5). Fixed-helicity spinor/vector/tensor external states may be ill-defined at this kinematic point.
  779. 1148.57 s > field value
  780. 1148.57 s > span warm_up{integrand.name=se1l_rls_shifted}
  781. 1148.57 s > [2026-09-02 17:38:48.341] @process::amplitude WARNING : External state 1 ('g', PDG 21, helicity -) is off shell: p^2 = +2.5e5, expected m^2 = +0e0 (|Δ| = +2.5e5). Fixed-helicity spinor/vector/tensor external states may be ill-defined at this kinematic point.
  782. 1148.57 s > field value
  783. 1148.57 s > span warm_up{integrand.name=se1l_rls_shifted}
  784. 1148.57 s > [2026-09-02 17:38:48.341] @process::amplitude INFO : Input is above threshold: 1 existing threshold E-surfaces across 1/1 graph groups
  785. 1148.57 s > field value
  786. 1148.57 s > existing_esurfaces 1
  787. 1148.57 s > group_count 1
  788. 1148.57 s > groups_above_threshold 1
  789. 1148.57 s > integrand se1l_rls_shifted
  790. 1148.57 s > span warm_up{integrand.name=se1l_rls_shifted}
  791. 1148.57 s > threshold_status above threshold
  792. 1148.57 s > [2026-09-02 17:38:48.341] @process::amplitude INFO : overlap structure of group 0: [1: [0(2,3)]]
  793. 1148.57 s > field value
  794. 1148.57 s > span warm_up{integrand.name=se1l_rls_shifted}
  795. 1148.57 s > [2026-09-02 17:38:48.345] @process::amplitude WARNING : External state 0 ('g', PDG 21, helicity +) is off shell: p^2 = +2.5e5, expected m^2 = +0e0 (|Δ| = +2.5e5). Fixed-helicity spinor/vector/tensor external states may be ill-defined at this kinematic point.
  796. 1148.57 s > field value
  797. 1148.57 s > span warm_up{integrand.name=se1l}
  798. 1148.57 s > [2026-09-02 17:38:48.345] @process::amplitude WARNING : External state 1 ('g', PDG 21, helicity -) is off shell: p^2 = +2.5e5, expected m^2 = +0e0 (|Δ| = +2.5e5). Fixed-helicity spinor/vector/tensor external states may be ill-defined at this kinematic point.
  799. 1148.57 s > field value
  800. 1148.57 s > span warm_up{integrand.name=se1l}
  801. 1148.57 s > [2026-09-02 17:38:48.345] @process::amplitude INFO : Input is above threshold: 1 existing threshold E-surfaces across 1/1 graph groups
  802. 1148.57 s > field value
  803. 1148.57 s > existing_esurfaces 1
  804. 1148.57 s > group_count 1
  805. 1148.57 s > groups_above_threshold 1
  806. 1148.57 s > integrand se1l
  807. 1148.57 s > span warm_up{integrand.name=se1l}
  808. 1148.57 s > threshold_status above threshold
  809. 1148.57 s > [2026-09-02 17:38:48.345] @process::amplitude INFO : overlap structure of group 0: [1: [0(2,3)]]
  810. 1148.57 s > field value
  811. 1148.57 s > span warm_up{integrand.name=se1l}
  812. 1148.57 s > [2026-09-02 17:38:48.348] @process::amplitude WARNING : External state 0 ('g', PDG 21, helicity +) is off shell: p^2 = +2.5e5, expected m^2 = +0e0 (|Δ| = +2.5e5). Fixed-helicity spinor/vector/tensor external states may be ill-defined at this kinematic point.
  813. 1148.57 s > field value
  814. 1148.57 s > span warm_up{integrand.name=se1l_rls_shifted}
  815. 1148.57 s > [2026-09-02 17:38:48.348] @process::amplitude WARNING : External state 1 ('g', PDG 21, helicity -) is off shell: p^2 = +2.5e5, expected m^2 = +0e0 (|Δ| = +2.5e5). Fixed-helicity spinor/vector/tensor external states may be ill-defined at this kinematic point.
  816. 1148.57 s > field value
  817. 1148.57 s > span warm_up{integrand.name=se1l_rls_shifted}
  818. 1148.57 s > [2026-09-02 17:38:48.348] @process::amplitude INFO : Input is above threshold: 1 existing threshold E-surfaces across 1/1 graph groups
  819. 1148.57 s > field value
  820. 1148.57 s > existing_esurfaces 1
  821. 1148.57 s > group_count 1
  822. 1148.57 s > groups_above_threshold 1
  823. 1148.57 s > integrand se1l_rls_shifted
  824. 1148.57 s > span warm_up{integrand.name=se1l_rls_shifted}
  825. 1148.57 s > threshold_status above threshold
  826. 1148.57 s > [2026-09-02 17:38:48.349] @process::amplitude INFO : overlap structure of group 0: [1: [0(2,3)]]
  827. 1148.57 s > field value
  828. 1148.57 s > span warm_up{integrand.name=se1l_rls_shifted}
  829. 1148.57 s > [2026-09-02 17:38:48.352] @process::amplitude WARNING : External state 0 ('g', PDG 21, helicity +) is off shell: p^2 = +2.5e5, expected m^2 = +0e0 (|Δ| = +2.5e5). Fixed-helicity spinor/vector/tensor external states may be ill-defined at this kinematic point.
  830. 1148.57 s > field value
  831. 1148.57 s > span warm_up{integrand.name=se1l}
  832. 1148.57 s > [2026-09-02 17:38:48.352] @process::amplitude WARNING : External state 1 ('g', PDG 21, helicity -) is off shell: p^2 = +2.5e5, expected m^2 = +0e0 (|Δ| = +2.5e5). Fixed-helicity spinor/vector/tensor external states may be ill-defined at this kinematic point.
  833. 1148.57 s > field value
  834. 1148.57 s > span warm_up{integrand.name=se1l}
  835. 1148.57 s > [2026-09-02 17:38:48.352] @process::amplitude INFO : Input is above threshold: 1 existing threshold E-surfaces across 1/1 graph groups
  836. 1148.57 s > field value
  837. 1148.57 s > existing_esurfaces 1
  838. 1148.57 s > group_count 1
  839. 1148.57 s > groups_above_threshold 1
  840. 1148.57 s > integrand se1l
  841. 1148.57 s > span warm_up{integrand.name=se1l}
  842. 1148.57 s > threshold_status above threshold
  843. 1148.57 s > [2026-09-02 17:38:48.352] @process::amplitude INFO : overlap structure of group 0: [1: [0(2,3)]]
  844. 1148.57 s > field value
  845. 1148.57 s > span warm_up{integrand.name=se1l}
  846. 1148.57 s > [2026-09-02 17:38:48.356] @process::amplitude WARNING : External state 0 ('g', PDG 21, helicity +) is off shell: p^2 = +2.5e5, expected m^2 = +0e0 (|Δ| = +2.5e5). Fixed-helicity spinor/vector/tensor external states may be ill-defined at this kinematic point.
  847. 1148.57 s > field value
  848. 1148.57 s > span warm_up{integrand.name=se1l_rls_shifted}
  849. 1148.57 s > [2026-09-02 17:38:48.356] @process::amplitude WARNING : External state 1 ('g', PDG 21, helicity -) is off shell: p^2 = +2.5e5, expected m^2 = +0e0 (|Δ| = +2.5e5). Fixed-helicity spinor/vector/tensor external states may be ill-defined at this kinematic point.
  850. 1148.57 s > field value
  851. 1148.57 s > span warm_up{integrand.name=se1l_rls_shifted}
  852. 1148.57 s > [2026-09-02 17:38:48.356] @process::amplitude INFO : Input is above threshold: 1 existing threshold E-surfaces across 1/1 graph groups
  853. 1148.57 s > field value
  854. 1148.57 s > existing_esurfaces 1
  855. 1148.57 s > group_count 1
  856. 1148.57 s > groups_above_threshold 1
  857. 1148.57 s > integrand se1l_rls_shifted
  858. 1148.57 s > span warm_up{integrand.name=se1l_rls_shifted}
  859. 1148.57 s > threshold_status above threshold
  860. 1148.57 s > [2026-09-02 17:38:48.356] @process::amplitude INFO : overlap structure of group 0: [1: [0(2,3)]]
  861. 1148.57 s > field value
  862. 1148.57 s > span warm_up{integrand.name=se1l_rls_shifted}
  863. 1148.57 s > [2026-09-02 17:38:48.359] @process::amplitude WARNING : External state 0 ('g', PDG 21, helicity +) is off shell: p^2 = +2.5e5, expected m^2 = +0e0 (|Δ| = +2.5e5). Fixed-helicity spinor/vector/tensor external states may be ill-defined at this kinematic point.
  864. 1148.57 s > field value
  865. 1148.57 s > span warm_up{integrand.name=se1l}
  866. 1148.57 s > [2026-09-02 17:38:48.359] @process::amplitude WARNING : External state 1 ('g', PDG 21, helicity -) is off shell: p^2 = +2.5e5, expected m^2 = +0e0 (|Δ| = +2.5e5). Fixed-helicity spinor/vector/tensor external states may be ill-defined at this kinematic point.
  867. 1148.57 s > field value
  868. 1148.57 s > span warm_up{integrand.name=se1l}
  869. 1148.57 s > [2026-09-02 17:38:48.359] @process::amplitude INFO : Input is above threshold: 1 existing threshold E-surfaces across 1/1 graph groups
  870. 1148.57 s > field value
  871. 1148.57 s > existing_esurfaces 1
  872. 1148.57 s > group_count 1
  873. 1148.57 s > groups_above_threshold 1
  874. 1148.57 s > integrand se1l
  875. 1148.57 s > span warm_up{integrand.name=se1l}
  876. 1148.57 s > threshold_status above threshold
  877. 1148.57 s > [2026-09-02 17:38:48.359] @process::amplitude INFO : overlap structure of group 0: [1: [0(2,3)]]
  878. 1148.57 s > field value
  879. 1148.57 s > span warm_up{integrand.name=se1l}
  880. 1148.57 s > [2026-09-02 17:38:48.363] @process::amplitude WARNING : External state 0 ('g', PDG 21, helicity +) is off shell: p^2 = +2.5e5, expected m^2 = +0e0 (|Δ| = +2.5e5). Fixed-helicity spinor/vector/tensor external states may be ill-defined at this kinematic point.
  881. 1148.57 s > field value
  882. 1148.57 s > span warm_up{integrand.name=se1l_rls_shifted}
  883. 1148.57 s > [2026-09-02 17:38:48.363] @process::amplitude WARNING : External state 1 ('g', PDG 21, helicity -) is off shell: p^2 = +2.5e5, expected m^2 = +0e0 (|Δ| = +2.5e5). Fixed-helicity spinor/vector/tensor external states may be ill-defined at this kinematic point.
  884. 1148.57 s > field value
  885. 1148.57 s > span warm_up{integrand.name=se1l_rls_shifted}
  886. 1148.57 s > [2026-09-02 17:38:48.363] @process::amplitude INFO : Input is above threshold: 1 existing threshold E-surfaces across 1/1 graph groups
  887. 1148.57 s > field value
  888. 1148.57 s > existing_esurfaces 1
  889. 1148.57 s > group_count 1
  890. 1148.57 s > groups_above_threshold 1
  891. 1148.57 s > integrand se1l_rls_shifted
  892. 1148.57 s > span warm_up{integrand.name=se1l_rls_shifted}
  893. 1148.57 s > threshold_status above threshold
  894. 1148.57 s > [2026-09-02 17:38:48.363] @process::amplitude INFO : overlap structure of group 0: [1: [0(2,3)]]
  895. 1148.57 s > field value
  896. 1148.57 s > span warm_up{integrand.name=se1l_rls_shifted}
  897. 1148.57 s > [2026-09-02 17:38:48.367] @process::amplitude WARNING : External state 0 ('g', PDG 21, helicity +) is off shell: p^2 = +2.5e5, expected m^2 = +0e0 (|Δ| = +2.5e5). Fixed-helicity spinor/vector/tensor external states may be ill-defined at this kinematic point.
  898. 1148.57 s > field value
  899. 1148.57 s > span warm_up{integrand.name=se1l}
  900. 1148.57 s > [2026-09-02 17:38:48.367] @process::amplitude WARNING : External state 1 ('g', PDG 21, helicity -) is off shell: p^2 = +2.5e5, expected m^2 = +0e0 (|Δ| = +2.5e5). Fixed-helicity spinor/vector/tensor external states may be ill-defined at this kinematic point.
  901. 1148.57 s > field value
  902. 1148.57 s > span warm_up{integrand.name=se1l}
  903. 1148.57 s > [2026-09-02 17:38:48.367] @process::amplitude INFO : Input is above threshold: 1 existing threshold E-surfaces across 1/1 graph groups
  904. 1148.57 s > field value
  905. 1148.57 s > existing_esurfaces 1
  906. 1148.57 s > group_count 1
  907. 1148.57 s > groups_above_threshold 1
  908. 1148.57 s > integrand se1l
  909. 1148.57 s > span warm_up{integrand.name=se1l}
  910. 1148.57 s > threshold_status above threshold
  911. 1148.57 s > [2026-09-02 17:38:48.367] @process::amplitude INFO : overlap structure of group 0: [1: [0(2,3)]]
  912. 1148.57 s > field value
  913. 1148.57 s > span warm_up{integrand.name=se1l}
  914. 1148.57 s > [2026-09-02 17:38:48.370] @process::amplitude WARNING : External state 0 ('g', PDG 21, helicity +) is off shell: p^2 = +2.5e5, expected m^2 = +0e0 (|Δ| = +2.5e5). Fixed-helicity spinor/vector/tensor external states may be ill-defined at this kinematic point.
  915. 1148.57 s > field value
  916. 1148.57 s > span warm_up{integrand.name=se1l_mur_shifted}
  917. 1148.57 s > [2026-09-02 17:38:48.370] @process::amplitude WARNING : External state 1 ('g', PDG 21, helicity -) is off shell: p^2 = +2.5e5, expected m^2 = +0e0 (|Δ| = +2.5e5). Fixed-helicity spinor/vector/tensor external states may be ill-defined at this kinematic point.
  918. 1148.57 s > field value
  919. 1148.57 s > span warm_up{integrand.name=se1l_mur_shifted}
  920. 1148.57 s > [2026-09-02 17:38:48.370] @process::amplitude INFO : Input is above threshold: 1 existing threshold E-surfaces across 1/1 graph groups
  921. 1148.57 s > field value
  922. 1148.57 s > existing_esurfaces 1
  923. 1148.57 s > group_count 1
  924. 1148.57 s > groups_above_threshold 1
  925. 1148.57 s > integrand se1l_mur_shifted
  926. 1148.57 s > span warm_up{integrand.name=se1l_mur_shifted}
  927. 1148.57 s > threshold_status above threshold
  928. 1148.57 s > [2026-09-02 17:38:48.370] @process::amplitude INFO : overlap structure of group 0: [1: [0(2,3)]]
  929. 1148.57 s > field value
  930. 1148.57 s > span warm_up{integrand.name=se1l_mur_shifted}
  931. 1148.57 s > [2026-09-02 17:38:48.374] @process::amplitude WARNING : External state 0 ('g', PDG 21, helicity +) is off shell: p^2 = +2.5e5, expected m^2 = +0e0 (|Δ| = +2.5e5). Fixed-helicity spinor/vector/tensor external states may be ill-defined at this kinematic point.
  932. 1148.57 s > field value
  933. 1148.57 s > span warm_up{integrand.name=se1l}
  934. 1148.57 s > [2026-09-02 17:38:48.374] @process::amplitude WARNING : External state 1 ('g', PDG 21, helicity -) is off shell: p^2 = +2.5e5, expected m^2 = +0e0 (|Δ| = +2.5e5). Fixed-helicity spinor/vector/tensor external states may be ill-defined at this kinematic point.
  935. 1148.57 s > field value
  936. 1148.57 s > span warm_up{integrand.name=se1l}
  937. 1148.57 s > [2026-09-02 17:38:48.374] @process::amplitude INFO : Input is above threshold: 1 existing threshold E-surfaces across 1/1 graph groups
  938. 1148.57 s > field value
  939. 1148.57 s > existing_esurfaces 1
  940. 1148.57 s > group_count 1
  941. 1148.57 s > groups_above_threshold 1
  942. 1148.57 s > integrand se1l
  943. 1148.57 s > span warm_up{integrand.name=se1l}
  944. 1148.57 s > threshold_status above threshold
  945. 1148.57 s > [2026-09-02 17:38:48.374] @process::amplitude INFO : overlap structure of group 0: [1: [0(2,3)]]
  946. 1148.57 s > field value
  947. 1148.57 s > span warm_up{integrand.name=se1l}
  948. 1148.57 s > [2026-09-02 17:38:48.377] @process::amplitude WARNING : External state 0 ('g', PDG 21, helicity +) is off shell: p^2 = +2.5e5, expected m^2 = +0e0 (|Δ| = +2.5e5). Fixed-helicity spinor/vector/tensor external states may be ill-defined at this kinematic point.
  949. 1148.57 s > field value
  950. 1148.57 s > span warm_up{integrand.name=se1l_mur_shifted}
  951. 1148.57 s > [2026-09-02 17:38:48.377] @process::amplitude WARNING : External state 1 ('g', PDG 21, helicity -) is off shell: p^2 = +2.5e5, expected m^2 = +0e0 (|Δ| = +2.5e5). Fixed-helicity spinor/vector/tensor external states may be ill-defined at this kinematic point.
  952. 1148.57 s > field value
  953. 1148.57 s > span warm_up{integrand.name=se1l_mur_shifted}
  954. 1148.57 s > [2026-09-02 17:38:48.378] @process::amplitude INFO : Input is above threshold: 1 existing threshold E-surfaces across 1/1 graph groups
  955. 1148.57 s > field value
  956. 1148.57 s > existing_esurfaces 1
  957. 1148.57 s > group_count 1
  958. 1148.57 s > groups_above_threshold 1
  959. 1148.57 s > integrand se1l_mur_shifted
  960. 1148.57 s > span warm_up{integrand.name=se1l_mur_shifted}
  961. 1148.57 s > threshold_status above threshold
  962. 1148.57 s > [2026-09-02 17:38:48.378] @process::amplitude INFO : overlap structure of group 0: [1: [0(2,3)]]
  963. 1148.57 s > field value
  964. 1148.57 s > span warm_up{integrand.name=se1l_mur_shifted}
  965. 1148.57 s > [2026-09-02 17:38:48.381] @process::amplitude WARNING : External state 0 ('g', PDG 21, helicity +) is off shell: p^2 = +2.5e5, expected m^2 = +0e0 (|Δ| = +2.5e5). Fixed-helicity spinor/vector/tensor external states may be ill-defined at this kinematic point.
  966. 1148.57 s > field value
  967. 1148.57 s > span warm_up{integrand.name=se1l}
  968. 1148.57 s > [2026-09-02 17:38:48.381] @process::amplitude WARNING : External state 1 ('g', PDG 21, helicity -) is off shell: p^2 = +2.5e5, expected m^2 = +0e0 (|Δ| = +2.5e5). Fixed-helicity spinor/vector/tensor external states may be ill-defined at this kinematic point.
  969. 1148.57 s > field value
  970. 1148.57 s > span warm_up{integrand.name=se1l}
  971. 1148.57 s > [2026-09-02 17:38:48.381] @process::amplitude INFO : Input is above threshold: 1 existing threshold E-surfaces across 1/1 graph groups
  972. 1148.57 s > field value
  973. 1148.57 s > existing_esurfaces 1
  974. 1148.57 s > group_count 1
  975. 1148.57 s > groups_above_threshold 1
  976. 1148.57 s > integrand se1l
  977. 1148.57 s > span warm_up{integrand.name=se1l}
  978. 1148.57 s > threshold_status above threshold
  979. 1148.57 s > [2026-09-02 17:38:48.381] @process::amplitude INFO : overlap structure of group 0: [1: [0(2,3)]]
  980. 1148.57 s > field value
  981. 1148.57 s > span warm_up{integrand.name=se1l}
  982. 1148.57 s > [2026-09-02 17:38:48.385] @process::amplitude WARNING : External state 0 ('g', PDG 21, helicity +) is off shell: p^2 = +2.5e5, expected m^2 = +0e0 (|Δ| = +2.5e5). Fixed-helicity spinor/vector/tensor external states may be ill-defined at this kinematic point.
  983. 1148.57 s > field value
  984. 1148.57 s > span warm_up{integrand.name=se1l_mur_shifted}
  985. 1148.57 s > [2026-09-02 17:38:48.385] @process::amplitude WARNING : External state 1 ('g', PDG 21, helicity -) is off shell: p^2 = +2.5e5, expected m^2 = +0e0 (|Δ| = +2.5e5). Fixed-helicity spinor/vector/tensor external states may be ill-defined at this kinematic point.
  986. 1148.57 s > field value
  987. 1148.57 s > span warm_up{integrand.name=se1l_mur_shifted}
  988. 1148.57 s > [2026-09-02 17:38:48.385] @process::amplitude INFO : Input is above threshold: 1 existing threshold E-surfaces across 1/1 graph groups
  989. 1148.57 s > field value
  990. 1148.57 s > existing_esurfaces 1
  991. 1148.57 s > group_count 1
  992. 1148.57 s > groups_above_threshold 1
  993. 1148.57 s > integrand se1l_mur_shifted
  994. 1148.57 s > span warm_up{integrand.name=se1l_mur_shifted}
  995. 1148.57 s > threshold_status above threshold
  996. 1148.57 s > [2026-09-02 17:38:48.385] @process::amplitude INFO : overlap structure of group 0: [1: [0(2,3)]]
  997. 1148.57 s > field value
  998. 1148.57 s > span warm_up{integrand.name=se1l_mur_shifted}
  999. 1148.57 s > [2026-09-02 17:38:48.388] @process::amplitude WARNING : External state 0 ('g', PDG 21, helicity +) is off shell: p^2 = +2.5e5, expected m^2 = +0e0 (|Δ| = +2.5e5). Fixed-helicity spinor/vector/tensor external states may be ill-defined at this kinematic point.
  1000. 1148.57 s > field value
  1001. 1148.57 s > span warm_up{integrand.name=se1l}
  1002. 1148.57 s > [2026-09-02 17:38:48.388] @process::amplitude WARNING : External state 1 ('g', PDG 21, helicity -) is off shell: p^2 = +2.5e5, expected m^2 = +0e0 (|Δ| = +2.5e5). Fixed-helicity spinor/vector/tensor external states may be ill-defined at this kinematic point.
  1003. 1148.57 s > field value
  1004. 1148.57 s > span warm_up{integrand.name=se1l}
  1005. 1148.57 s > [2026-09-02 17:38:48.388] @process::amplitude INFO : Input is above threshold: 1 existing threshold E-surfaces across 1/1 graph groups
  1006. 1148.57 s > field value
  1007. 1148.57 s > existing_esurfaces 1
  1008. 1148.57 s > group_count 1
  1009. 1148.57 s > groups_above_threshold 1
  1010. 1148.57 s > integrand se1l
  1011. 1148.57 s > span warm_up{integrand.name=se1l}
  1012. 1148.57 s > threshold_status above threshold
  1013. 1148.57 s > [2026-09-02 17:38:48.388] @process::amplitude INFO : overlap structure of group 0: [1: [0(2,3)]]
  1014. 1148.57 s > field value
  1015. 1148.57 s > span warm_up{integrand.name=se1l}
  1016. 1148.57 s > [2026-09-02 17:38:48.392] @process::amplitude WARNING : External state 0 ('g', PDG 21, helicity +) is off shell: p^2 = +2.5e5, expected m^2 = +0e0 (|Δ| = +2.5e5). Fixed-helicity spinor/vector/tensor external states may be ill-defined at this kinematic point.
  1017. 1148.57 s > field value
  1018. 1148.57 s > span warm_up{integrand.name=se1l_mur_shifted}
  1019. 1148.57 s > [2026-09-02 17:38:48.392] @process::amplitude WARNING : External state 1 ('g', PDG 21, helicity -) is off shell: p^2 = +2.5e5, expected m^2 = +0e0 (|Δ| = +2.5e5). Fixed-helicity spinor/vector/tensor external states may be ill-defined at this kinematic point.
  1020. 1148.57 s > field value
  1021. 1148.57 s > span warm_up{integrand.name=se1l_mur_shifted}
  1022. 1148.57 s > [2026-09-02 17:38:48.392] @process::amplitude INFO : Input is above threshold: 1 existing threshold E-surfaces across 1/1 graph groups
  1023. 1148.57 s > field value
  1024. 1148.57 s > existing_esurfaces 1
  1025. 1148.57 s > group_count 1
  1026. 1148.57 s > groups_above_threshold 1
  1027. 1148.57 s > integrand se1l_mur_shifted
  1028. 1148.57 s > span warm_up{integrand.name=se1l_mur_shifted}
  1029. 1148.57 s > threshold_status above threshold
  1030. 1148.57 s > [2026-09-02 17:38:48.392] @process::amplitude INFO : overlap structure of group 0: [1: [0(2,3)]]
  1031. 1148.57 s > field value
  1032. 1148.57 s > span warm_up{integrand.name=se1l_mur_shifted}
  1033. 1148.57 s > [2026-09-02 17:38:48.395] @process::amplitude WARNING : External state 0 ('g', PDG 21, helicity +) is off shell: p^2 = +2.5e5, expected m^2 = +0e0 (|Δ| = +2.5e5). Fixed-helicity spinor/vector/tensor external states may be ill-defined at this kinematic point.
  1034. 1148.57 s > field value
  1035. 1148.57 s > span warm_up{integrand.name=se1l}
  1036. 1148.57 s > [2026-09-02 17:38:48.395] @process::amplitude WARNING : External state 1 ('g', PDG 21, helicity -) is off shell: p^2 = +2.5e5, expected m^2 = +0e0 (|Δ| = +2.5e5). Fixed-helicity spinor/vector/tensor external states may be ill-defined at this kinematic point.
  1037. 1148.57 s > field value
  1038. 1148.57 s > span warm_up{integrand.name=se1l}
  1039. 1148.57 s > [2026-09-02 17:38:48.395] @process::amplitude INFO : Input is above threshold: 1 existing threshold E-surfaces across 1/1 graph groups
  1040. 1148.57 s > field value
  1041. 1148.57 s > existing_esurfaces 1
  1042. 1148.57 s > group_count 1
  1043. 1148.57 s > groups_above_threshold 1
  1044. 1148.57 s > integrand se1l
  1045. 1148.57 s > span warm_up{integrand.name=se1l}
  1046. 1148.57 s > threshold_status above threshold
  1047. 1148.57 s > [2026-09-02 17:38:48.396] @process::amplitude INFO : overlap structure of group 0: [1: [0(2,3)]]
  1048. 1148.57 s > field value
  1049. 1148.57 s > span warm_up{integrand.name=se1l}
  1050. 1148.57 s > [2026-09-02 17:38:48.399] @process::amplitude WARNING : External state 0 ('g', PDG 21, helicity +) is off shell: p^2 = +2.5e5, expected m^2 = +0e0 (|Δ| = +2.5e5). Fixed-helicity spinor/vector/tensor external states may be ill-defined at this kinematic point.
  1051. 1148.57 s > field value
  1052. 1148.57 s > span warm_up{integrand.name=se1l_mur_shifted}
  1053. 1148.57 s > [2026-09-02 17:38:48.399] @process::amplitude WARNING : External state 1 ('g', PDG 21, helicity -) is off shell: p^2 = +2.5e5, expected m^2 = +0e0 (|Δ| = +2.5e5). Fixed-helicity spinor/vector/tensor external states may be ill-defined at this kinematic point.
  1054. 1148.57 s > field value
  1055. 1148.57 s > span warm_up{integrand.name=se1l_mur_shifted}
  1056. 1148.57 s > [2026-09-02 17:38:48.399] @process::amplitude INFO : Input is above threshold: 1 existing threshold E-surfaces across 1/1 graph groups
  1057. 1148.57 s > field value
  1058. 1148.57 s > existing_esurfaces 1
  1059. 1148.57 s > group_count 1
  1060. 1148.57 s > groups_above_threshold 1
  1061. 1148.57 s > integrand se1l_mur_shifted
  1062. 1148.57 s > span warm_up{integrand.name=se1l_mur_shifted}
  1063. 1148.57 s > threshold_status above threshold
  1064. 1148.57 s > [2026-09-02 17:38:48.399] @process::amplitude INFO : overlap structure of group 0: [1: [0(2,3)]]
  1065. 1148.57 s > field value
  1066. 1148.57 s > span warm_up{integrand.name=se1l_mur_shifted}
  1067. 1148.57 s > [2026-09-02 17:38:48.402] @process::amplitude WARNING : External state 0 ('g', PDG 21, helicity +) is off shell: p^2 = +2.5e5, expected m^2 = +0e0 (|Δ| = +2.5e5). Fixed-helicity spinor/vector/tensor external states may be ill-defined at this kinematic point.
  1068. 1148.57 s > field value
  1069. 1148.57 s > span warm_up{integrand.name=se1l}
  1070. 1148.57 s > [2026-09-02 17:38:48.403] @process::amplitude WARNING : External state 1 ('g', PDG 21, helicity -) is off shell: p^2 = +2.5e5, expected m^2 = +0e0 (|Δ| = +2.5e5). Fixed-helicity spinor/vector/tensor external states may be ill-defined at this kinematic point.
  1071. 1148.57 s > field value
  1072. 1148.57 s > span warm_up{integrand.name=se1l}
  1073. 1148.57 s > [2026-09-02 17:38:48.403] @process::amplitude INFO : Input is above threshold: 1 existing threshold E-surfaces across 1/1 graph groups
  1074. 1148.57 s > field value
  1075. 1148.57 s > existing_esurfaces 1
  1076. 1148.57 s > group_count 1
  1077. 1148.57 s > groups_above_threshold 1
  1078. 1148.57 s > integrand se1l
  1079. 1148.57 s > span warm_up{integrand.name=se1l}
  1080. 1148.57 s > threshold_status above threshold
  1081. 1148.57 s > [2026-09-02 17:38:48.403] @process::amplitude INFO : overlap structure of group 0: [1: [0(2,3)]]
  1082. 1148.57 s > field value
  1083. 1148.57 s > span warm_up{integrand.name=se1l}
  1084. 1148.57 s > [2026-09-02 17:38:48.406] @process::amplitude WARNING : External state 0 ('g', PDG 21, helicity +) is off shell: p^2 = +2.5e5, expected m^2 = +0e0 (|Δ| = +2.5e5). Fixed-helicity spinor/vector/tensor external states may be ill-defined at this kinematic point.
  1085. 1148.57 s > field value
  1086. 1148.57 s > span warm_up{integrand.name=se1l_mur_shifted}
  1087. 1148.57 s > [2026-09-02 17:38:48.406] @process::amplitude WARNING : External state 1 ('g', PDG 21, helicity -) is off shell: p^2 = +2.5e5, expected m^2 = +0e0 (|Δ| = +2.5e5). Fixed-helicity spinor/vector/tensor external states may be ill-defined at this kinematic point.
  1088. 1148.57 s > field value
  1089. 1148.57 s > span warm_up{integrand.name=se1l_mur_shifted}
  1090. 1148.57 s > [2026-09-02 17:38:48.406] @process::amplitude INFO : Input is above threshold: 1 existing threshold E-surfaces across 1/1 graph groups
  1091. 1148.57 s > field value
  1092. 1148.57 s > existing_esurfaces 1
  1093. 1148.57 s > group_count 1
  1094. 1148.57 s > groups_above_threshold 1
  1095. 1148.57 s > integrand se1l_mur_shifted
  1096. 1148.57 s > span warm_up{integrand.name=se1l_mur_shifted}
  1097. 1148.57 s > threshold_status above threshold
  1098. 1148.57 s > [2026-09-02 17:38:48.406] @process::amplitude INFO : overlap structure of group 0: [1: [0(2,3)]]
  1099. 1148.57 s > field value
  1100. 1148.57 s > span warm_up{integrand.name=se1l_mur_shifted}
  1101. 1148.57 s > [2026-09-02 17:38:48.410] @process::amplitude WARNING : External state 0 ('g', PDG 21, helicity +) is off shell: p^2 = +2.5e5, expected m^2 = +0e0 (|Δ| = +2.5e5). Fixed-helicity spinor/vector/tensor external states may be ill-defined at this kinematic point.
  1102. 1148.57 s > field value
  1103. 1148.57 s > span warm_up{integrand.name=se1l}
  1104. 1148.57 s > [2026-09-02 17:38:48.410] @process::amplitude WARNING : External state 1 ('g', PDG 21, helicity -) is off shell: p^2 = +2.5e5, expected m^2 = +0e0 (|Δ| = +2.5e5). Fixed-helicity spinor/vector/tensor external states may be ill-defined at this kinematic point.
  1105. 1148.57 s > field value
  1106. 1148.57 s > span warm_up{integrand.name=se1l}
  1107. 1148.57 s > [2026-09-02 17:38:48.410] @process::amplitude INFO : Input is above threshold: 1 existing threshold E-surfaces across 1/1 graph groups
  1108. 1148.57 s > field value
  1109. 1148.57 s > existing_esurfaces 1
  1110. 1148.57 s > group_count 1
  1111. 1148.57 s > groups_above_threshold 1
  1112. 1148.57 s > integrand se1l
  1113. 1148.57 s > span warm_up{integrand.name=se1l}
  1114. 1148.57 s > threshold_status above threshold
  1115. 1148.57 s > [2026-09-02 17:38:48.410] @process::amplitude INFO : overlap structure of group 0: [1: [0(2,3)]]
  1116. 1148.57 s > field value
  1117. 1148.57 s > span warm_up{integrand.name=se1l}
  1118. 1148.57 s > [2026-09-02 17:38:48.413] @process::amplitude WARNING : External state 0 ('g', PDG 21, helicity +) is off shell: p^2 = +2.5e5, expected m^2 = +0e0 (|Δ| = +2.5e5). Fixed-helicity spinor/vector/tensor external states may be ill-defined at this kinematic point.
  1119. 1148.57 s > field value
  1120. 1148.57 s > span warm_up{integrand.name=se1l_mur_shifted}
  1121. 1148.57 s > [2026-09-02 17:38:48.413] @process::amplitude WARNING : External state 1 ('g', PDG 21, helicity -) is off shell: p^2 = +2.5e5, expected m^2 = +0e0 (|Δ| = +2.5e5). Fixed-helicity spinor/vector/tensor external states may be ill-defined at this kinematic point.
  1122. 1148.57 s > field value
  1123. 1148.57 s > span warm_up{integrand.name=se1l_mur_shifted}
  1124. 1148.57 s > [2026-09-02 17:38:48.414] @process::amplitude INFO : Input is above threshold: 1 existing threshold E-surfaces across 1/1 graph groups
  1125. 1148.57 s > field value
  1126. 1148.57 s > existing_esurfaces 1
  1127. 1148.57 s > group_count 1
  1128. 1148.57 s > groups_above_threshold 1
  1129. 1148.57 s > integrand se1l_mur_shifted
  1130. 1148.57 s > span warm_up{integrand.name=se1l_mur_shifted}
  1131. 1148.57 s > threshold_status above threshold
  1132. 1148.57 s > [2026-09-02 17:38:48.414] @process::amplitude INFO : overlap structure of group 0: [1: [0(2,3)]]
  1133. 1148.57 s > field value
  1134. 1148.57 s > span warm_up{integrand.name=se1l_mur_shifted}
  1135. 1148.57 s > [2026-09-02 17:38:48.417] @process::amplitude WARNING : External state 0 ('g', PDG 21, helicity +) is off shell: p^2 = +2.5e5, expected m^2 = +0e0 (|Δ| = +2.5e5). Fixed-helicity spinor/vector/tensor external states may be ill-defined at this kinematic point.
  1136. 1148.57 s > field value
  1137. 1148.57 s > span warm_up{integrand.name=se1l}
  1138. 1148.57 s > [2026-09-02 17:38:48.417] @process::amplitude WARNING : External state 1 ('g', PDG 21, helicity -) is off shell: p^2 = +2.5e5, expected m^2 = +0e0 (|Δ| = +2.5e5). Fixed-helicity spinor/vector/tensor external states may be ill-defined at this kinematic point.
  1139. 1148.57 s > field value
  1140. 1148.57 s > span warm_up{integrand.name=se1l}
  1141. 1148.57 s > [2026-09-02 17:38:48.417] @process::amplitude INFO : Input is above threshold: 1 existing threshold E-surfaces across 1/1 graph groups
  1142. 1148.57 s > field value
  1143. 1148.57 s > existing_esurfaces 1
  1144. 1148.57 s > group_count 1
  1145. 1148.57 s > groups_above_threshold 1
  1146. 1148.57 s > integrand se1l
  1147. 1148.57 s > span warm_up{integrand.name=se1l}
  1148. 1148.57 s > threshold_status above threshold
  1149. 1148.57 s > [2026-09-02 17:38:48.417] @process::amplitude INFO : overlap structure of group 0: [1: [0(2,3)]]
  1150. 1148.57 s > field value
  1151. 1148.57 s > span warm_up{integrand.name=se1l}
  1152. 1148.57 s > [2026-09-02 17:38:48.421] @process::amplitude WARNING : External state 0 ('g', PDG 21, helicity +) is off shell: p^2 = +2.5e5, expected m^2 = +0e0 (|Δ| = +2.5e5). Fixed-helicity spinor/vector/tensor external states may be ill-defined at this kinematic point.
  1153. 1148.57 s > field value
  1154. 1148.57 s > span warm_up{integrand.name=se1l_mur_shifted}
  1155. 1148.57 s > [2026-09-02 17:38:48.421] @process::amplitude WARNING : External state 1 ('g', PDG 21, helicity -) is off shell: p^2 = +2.5e5, expected m^2 = +0e0 (|Δ| = +2.5e5). Fixed-helicity spinor/vector/tensor external states may be ill-defined at this kinematic point.
  1156. 1148.57 s > field value
  1157. 1148.57 s > span warm_up{integrand.name=se1l_mur_shifted}
  1158. 1148.57 s > [2026-09-02 17:38:48.421] @process::amplitude INFO : Input is above threshold: 1 existing threshold E-surfaces across 1/1 graph groups
  1159. 1148.57 s > field value
  1160. 1148.57 s > existing_esurfaces 1
  1161. 1148.57 s > group_count 1
  1162. 1148.57 s > groups_above_threshold 1
  1163. 1148.57 s > integrand se1l_mur_shifted
  1164. 1148.57 s > span warm_up{integrand.name=se1l_mur_shifted}
  1165. 1148.57 s > threshold_status above threshold
  1166. 1148.57 s > [2026-09-02 17:38:48.421] @process::amplitude INFO : overlap structure of group 0: [1: [0(2,3)]]
  1167. 1148.57 s > field value
  1168. 1148.57 s > span warm_up{integrand.name=se1l_mur_shifted}
  1169. 1148.57 s > [2026-09-02 17:38:48.424] @process::amplitude WARNING : External state 0 ('g', PDG 21, helicity +) is off shell: p^2 = +2.5e5, expected m^2 = +0e0 (|Δ| = +2.5e5). Fixed-helicity spinor/vector/tensor external states may be ill-defined at this kinematic point.
  1170. 1148.57 s > field value
  1171. 1148.57 s > span warm_up{integrand.name=se1l}
  1172. 1148.57 s > [2026-09-02 17:38:48.424] @process::amplitude WARNING : External state 1 ('g', PDG 21, helicity -) is off shell: p^2 = +2.5e5, expected m^2 = +0e0 (|Δ| = +2.5e5). Fixed-helicity spinor/vector/tensor external states may be ill-defined at this kinematic point.
  1173. 1148.57 s > field value
  1174. 1148.57 s > span warm_up{integrand.name=se1l}
  1175. 1148.57 s > [2026-09-02 17:38:48.424] @process::amplitude INFO : Input is above threshold: 1 existing threshold E-surfaces across 1/1 graph groups
  1176. 1148.57 s > field value
  1177. 1148.57 s > existing_esurfaces 1
  1178. 1148.57 s > group_count 1
  1179. 1148.57 s > groups_above_threshold 1
  1180. 1148.57 s > integrand se1l
  1181. 1148.57 s > span warm_up{integrand.name=se1l}
  1182. 1148.57 s > threshold_status above threshold
  1183. 1148.57 s > [2026-09-02 17:38:48.424] @process::amplitude INFO : overlap structure of group 0: [1: [0(2,3)]]
  1184. 1148.57 s > field value
  1185. 1148.57 s > span warm_up{integrand.name=se1l}
  1186. 1148.57 s > [2026-09-02 17:38:48.428] @process::amplitude WARNING : External state 0 ('g', PDG 21, helicity +) is off shell: p^2 = +2.5e5, expected m^2 = +0e0 (|Δ| = +2.5e5). Fixed-helicity spinor/vector/tensor external states may be ill-defined at this kinematic point.
  1187. 1148.57 s > field value
  1188. 1148.57 s > span warm_up{integrand.name=se1l_mur_shifted}
  1189. 1148.57 s > [2026-09-02 17:38:48.428] @process::amplitude WARNING : External state 1 ('g', PDG 21, helicity -) is off shell: p^2 = +2.5e5, expected m^2 = +0e0 (|Δ| = +2.5e5). Fixed-helicity spinor/vector/tensor external states may be ill-defined at this kinematic point.
  1190. 1148.57 s > field value
  1191. 1148.57 s > span warm_up{integrand.name=se1l_mur_shifted}
  1192. 1148.57 s > [2026-09-02 17:38:48.428] @process::amplitude INFO : Input is above threshold: 1 existing threshold E-surfaces across 1/1 graph groups
  1193. 1148.57 s > field value
  1194. 1148.57 s > existing_esurfaces 1
  1195. 1148.57 s > group_count 1
  1196. 1148.57 s > groups_above_threshold 1
  1197. 1148.57 s > integrand se1l_mur_shifted
  1198. 1148.57 s > span warm_up{integrand.name=se1l_mur_shifted}
  1199. 1148.57 s > threshold_status above threshold
  1200. 1148.57 s > [2026-09-02 17:38:48.428] @process::amplitude INFO : overlap structure of group 0: [1: [0(2,3)]]
  1201. 1148.57 s > field value
  1202. 1148.57 s > span warm_up{integrand.name=se1l_mur_shifted}
  1203. 1148.57 s > [2026-09-02 17:38:48.431] @process::amplitude WARNING : External state 0 ('g', PDG 21, helicity +) is off shell: p^2 = +2.5e5, expected m^2 = +0e0 (|Δ| = +2.5e5). Fixed-helicity spinor/vector/tensor external states may be ill-defined at this kinematic point.
  1204. 1148.57 s > field value
  1205. 1148.57 s > span warm_up{integrand.name=se1l}
  1206. 1148.57 s > [2026-09-02 17:38:48.431] @process::amplitude WARNING : External state 1 ('g', PDG 21, helicity -) is off shell: p^2 = +2.5e5, expected m^2 = +0e0 (|Δ| = +2.5e5). Fixed-helicity spinor/vector/tensor external states may be ill-defined at this kinematic point.
  1207. 1148.57 s > field value
  1208. 1148.57 s > span warm_up{integrand.name=se1l}
  1209. 1148.57 s > [2026-09-02 17:38:48.431] @process::amplitude INFO : Input is above threshold: 1 existing threshold E-surfaces across 1/1 graph groups
  1210. 1148.57 s > field value
  1211. 1148.57 s > existing_esurfaces 1
  1212. 1148.57 s > group_count 1
  1213. 1148.57 s > groups_above_threshold 1
  1214. 1148.57 s > integrand se1l
  1215. 1148.57 s > span warm_up{integrand.name=se1l}
  1216. 1148.57 s > threshold_status above threshold
  1217. 1148.57 s > [2026-09-02 17:38:48.432] @process::amplitude INFO : overlap structure of group 0: [1: [0(2,3)]]
  1218. 1148.57 s > field value
  1219. 1148.57 s > span warm_up{integrand.name=se1l}
  1220. 1148.57 s > [2026-09-02 17:38:48.435] @process::amplitude WARNING : External state 0 ('g', PDG 21, helicity +) is off shell: p^2 = +2.5e5, expected m^2 = +0e0 (|Δ| = +2.5e5). Fixed-helicity spinor/vector/tensor external states may be ill-defined at this kinematic point.
  1221. 1148.57 s > field value
  1222. 1148.57 s > span warm_up{integrand.name=se1l_mur_shifted}
  1223. 1148.57 s > [2026-09-02 17:38:48.435] @process::amplitude WARNING : External state 1 ('g', PDG 21, helicity -) is off shell: p^2 = +2.5e5, expected m^2 = +0e0 (|Δ| = +2.5e5). Fixed-helicity spinor/vector/tensor external states may be ill-defined at this kinematic point.
  1224. 1148.57 s > field value
  1225. 1148.57 s > span warm_up{integrand.name=se1l_mur_shifted}
  1226. 1148.57 s > [2026-09-02 17:38:48.435] @process::amplitude INFO : Input is above threshold: 1 existing threshold E-surfaces across 1/1 graph groups
  1227. 1148.57 s > field value
  1228. 1148.57 s > existing_esurfaces 1
  1229. 1148.57 s > group_count 1
  1230. 1148.57 s > groups_above_threshold 1
  1231. 1148.57 s > integrand se1l_mur_shifted
  1232. 1148.57 s > span warm_up{integrand.name=se1l_mur_shifted}
  1233. 1148.57 s > threshold_status above threshold
  1234. 1148.57 s > [2026-09-02 17:38:48.435] @process::amplitude INFO : overlap structure of group 0: [1: [0(2,3)]]
  1235. 1148.57 s > field value
  1236. 1148.57 s > span warm_up{integrand.name=se1l_mur_shifted}
  1237. 1148.57 s > The application panicked (crashed).
  1238. 1148.57 s > Message: Integrated UV case failed: se1l
  1239. 1148.57 s > Location: tests/tests/uv.rs:1068
  1240. 1148.57 s >
  1241. 1148.57 s > ━━━━━━━━━━━━━━━━━━━━━━━━━━━━━━━━━━ BACKTRACE ━━━━━━━━━━━━━━━━━━━━━━━━━━━━━━━━━━━
  1242. 1148.57 s > 1: <color_eyre[bb06c27fa12d52c3]::config::PanicHook>::panic_report<unknown>
  1243. 1148.57 s > at <unknown source file>:<unknown line>
  1244. 1148.57 s > 2: <color_eyre[bb06c27fa12d52c3]::config::PanicHook>::into_panic_hook::{closure#0}<unknown>
  1245. 1148.57 s > at <unknown source file>:<unknown line>
  1246. 1148.57 s > 3: std[5167731717db2e51]::panicking::panic_with_hook<unknown>
  1247. 1148.57 s > at <unknown source file>:<unknown line>
  1248. 1148.57 s > 4: std[5167731717db2e51]::panicking::panic_handler::{closure#0}<unknown>
  1249. 1148.57 s > at <unknown source file>:<unknown line>
  1250. 1148.57 s > 5: std[5167731717db2e51]::sys::backtrace::__rust_end_short_backtrace::<std[5167731717db2e51]::panicking::panic_handler::{closure#0}, !><unknown>
  1251. 1148.57 s > at <unknown source file>:<unknown line>
  1252. 1148.57 s > 6: __rustc[4b1ee1ef74718a7b]::rust_begin_unwind<unknown>
  1253. 1148.57 s > at <unknown source file>:<unknown line>
  1254. 1148.57 s > 7: core[8c5ac2f034688f9a]::panicking::panic_fmt<unknown>
  1255. 1148.57 s > at <unknown source file>:<unknown line>
  1256. 1148.57 s > 8: uv[654cd04bf7185af1]::run_single_integrated_uv_case<unknown>
  1257. 1148.57 s > at <unknown source file>:<unknown line>
  1258. 1148.57 s > 9: <uv[654cd04bf7185af1]::se1l_uv::{closure#0} as core[8c5ac2f034688f9a]::ops::function::FnOnce<()>>::call_once<unknown>
  1259. 1148.57 s > at <unknown source file>:<unknown line>
  1260. 1148.57 s > 10: test[7974841f8dbd3561]::__rust_begin_short_backtrace::<core[8c5ac2f034688f9a]::result::Result<(), alloc[93e694a8365d93dd]::string::String>, fn() -> core[8c5ac2f034688f9a]::result::Result<(), alloc[93e694a8365d93dd]::string::String>><unknown>
  1261. 1148.57 s > at <unknown source file>:<unknown line>
  1262. 1148.57 s > 11: test[7974841f8dbd3561]::run_test::{closure#0}<unknown>
  1263. 1148.57 s > at <unknown source file>:<unknown line>
  1264. 1148.57 s > 12: std[5167731717db2e51]::sys::backtrace::__rust_begin_short_backtrace::<test[7974841f8dbd3561]::run_test::{closure#1}, ()><unknown>
  1265. 1148.57 s > at <unknown source file>:<unknown line>
  1266. 1148.57 s > 13: <std[5167731717db2e51]::thread::lifecycle::spawn_unchecked<test[7974841f8dbd3561]::run_test::{closure#1}, ()>::{closure#1} as core[8c5ac2f034688f9a]::ops::function::FnOnce<()>>::call_once::{shim:vtable#0}<unknown>
  1267. 1148.57 s > at <unknown source file>:<unknown line>
  1268. 1148.57 s > 14: <std[5167731717db2e51]::sys::thread::unix::Thread>::new::thread_start<unknown>
  1269. 1148.57 s > at <unknown source file>:<unknown line>
  1270. 1148.57 s > 15: start_thread<unknown>
  1271. 1148.57 s > at <unknown source file>:<unknown line>
  1272. 1148.57 s > 16: __clone3<unknown>
  1273. 1148.57 s > at <unknown source file>:<unknown line>
  1274. 1148.57 s >
  1275. 1148.57 s > Run with COLORBT_SHOW_HIDDEN=1 environment variable to disable frame filtering.
  1276. 1148.57 s > Run with RUST_BACKTRACE=full to include source snippets.
  1277. 1148.57 s >
  1278. 1148.57 s > error: test run failed
  1279. 1148.57 s >
  1280. 1148.57 s > ========== nextest test summary ==========
  1281. 1148.57 s > report: target/nextest/ci_gammaloop/junit.xml
  1282. 1148.57 s > tests: 106, failures: 9, errors: 0
  1283. 1148.57 s >
  1284. 1148.57 s > 1. gammaloop-integration-tests::test_runs::approach::approach_momentum_space_reports_incomplete_triplet_cleanly
  1285. 1148.57 s > failure: test failure with exit code 101
  1286. 1148.57 s > system-out
  1287. 1148.57 s > running 1 test
  1288. 1148.57 s > test approach::approach_momentum_space_reports_incomplete_triplet_cleanly ... FAILED
  1289. 1148.57 s >
  1290. 1148.57 s > failures:
  1291. 1148.57 s >
  1292. 1148.57 s > failures:
  1293. 1148.57 s > approach::approach_momentum_space_reports_incomplete_triplet_cleanly
  1294. 1148.57 s >
  1295. 1148.57 s > test result: FAILED. 0 passed; 1 failed; 0 ignored; 0 measured; 82 filtered out; finished in 0.48s
  1296. 1148.57 s > system-err
  1297. 1148.57 s > [2026-09-02 17:37:01.876] @gammaloop_api::se... INFO : Running command import model scalars-default.json
  1298. 1148.57 s > [2026-09-02 17:37:01.876] @import::model INFO : Loading built-in JSON model scalars-default
  1299. 1148.57 s > [2026-09-02 17:37:01.879] @gammalooprs::model INFO : The following 2 external parameters were forced to zero by the restriction card:
  1300. 1148.57 s > width_scalar_1, width_scalar_2
  1301. 1148.57 s > [2026-09-02 17:37:01.880] @gammaloop_api::se... INFO : Running command remove processes
  1302. 1148.57 s > [2026-09-02 17:37:01.881] @gammaloop_api::se... INFO : Running command generate amp scalar_1 > scalar_0 scalar_0 [{1}] --allowed-vertex-interactions V_3_SCALAR_022 V_3_SCALAR_122 -p triangle -i scalar_tri
  1303. 1148.57 s > [2026-09-02 17:37:01.882] @feyngen::diagram_... INFO : 0s | Δ=0s | Starting Feynman graph generation with Symbolica...
  1304. 1148.57 s > [2026-09-02 17:37:01.882] @feyngen::diagram_... INFO : 0s | Δ=0s | Number of graphs resulting from Symbolica generation: 1
  1305. 1148.57 s > [2026-09-02 17:37:01.883] @feyngen::diagram_... INFO : 0s | Δ=0s | Number of graphs retained after removal of vetoed topologies: 1
  1306. 1148.57 s > [2026-09-02 17:37:01.883] @feyngen::diagram_... INFO : 0s | Δ=0s | Number of graphs after vertex info assignment: 1
  1307. 1148.57 s > [2026-09-02 17:37:01.883] @feyngen::diagram_... INFO : 0s | Δ=0s | Number of graphs after all complete graphs filters are applied: 1
  1308. 1148.57 s > [2026-09-02 17:37:01.883] @feyngen::diagram_... INFO : 0s | Δ=0s | Number of graphs after closed fermion chains analysis: 1
  1309. 1148.57 s > [2026-09-02 17:37:01.883] @feyngen::diagram_... INFO : 0s | Δ=0s | Number of graphs after symmetrization of external states: 1
  1310. 1148.57 s > [2026-09-02 17:37:01.883] @feyngen::diagram_... INFO : 0s | Δ=0s | Number of graphs after canonization of vertices, edges and flows (graph labels assigned here): 1
  1311. 1148.57 s > [2026-09-02 17:37:01.888] @feyngen::diagram_... INFO : 0s | Δ=0s | Number of graphs after numerator-aware grouping with strategy 'up to a scalar rescaling': 1 (1 isomorphically unique graph, 0 color zero, 0 lorentz zero, 0 grouped and 0 cancellation)
  1312. 1148.57 s > [2026-09-02 17:37:01.888] @feyngen::diagram_... INFO : ( Sum of the symmetry factors from each graph generated = 1 )
  1313. 1148.57 s > [2026-09-02 17:37:01.889] @commands::generate INFO : Generated amplitude 1 graphs.
  1314. 1148.57 s > [2026-09-02 17:37:01.909] @settings::runtime WARNING : No external kinematics were provided; using default-generated external momenta and helicities.
  1315. 1148.57 s > [2026-09-02 17:37:01.995] @commands::generate INFO :
  1316. 1148.57 s > Integrand generation summary
  1317. 1148.57 s > peak RAM 65.45 MiB | cores 1
  1318. 1148.57 s > ╭────────────┬───────┬─────────┬────────────┬───────────┬────────────────┬─────────────╮
  1319. 1148.57 s > │ integrand │ graph │ # evals │ expr build │ spenso │ symbolica eval │ compile │
  1320. 1148.57 s > ├────────────┼───────┼─────────┼────────────┼───────────┼────────────────┼─────────────┤
  1321. 1148.57 s > │ scalar_tri │ GL0 │ 9 │ 10ms (57%) │ 1ms (10%) │ 6ms (33%) │ 0ms (0.00%) │
  1322. 1148.57 s > ├────────────┼───────┼─────────┼────────────┼───────────┼────────────────┼─────────────┤
  1323. 1148.57 s > │ Total │ │ 9 │ 10ms (57%) │ 1ms (10%) │ 6ms (33%) │ 0ms (0.00%) │
  1324. 1148.57 s > ╰────────────┴───────┴─────────┴────────────┴───────────┴────────────────┴─────────────╯
  1325. 1148.57 s > [2026-09-02 17:37:01.996] @gammaloop_api::se... INFO : Running command generate amp scalar_0 scalar_0 > scalar_0 scalar_0 [{1}] --allowed-vertex-interactions V_3_SCALAR_022 -p box -i scalar_box --select-graphs GL0
  1326. 1148.57 s > [2026-09-02 17:37:01.998] @feyngen::diagram_... INFO : 0s | Δ=0s | Starting Feynman graph generation with Symbolica...
  1327. 1148.57 s > [2026-09-02 17:37:01.998] @feyngen::diagram_... INFO : 0s | Δ=0s | Number of graphs resulting from Symbolica generation: 3
  1328. 1148.57 s > [2026-09-02 17:37:02.002] @feyngen::diagram_... INFO : 0s | Δ=0s | Number of graphs retained after removal of vetoed topologies: 3
  1329. 1148.57 s > [2026-09-02 17:37:02.005] @feyngen::diagram_... INFO : 0s | Δ=0s | Number of graphs after vertex info assignment: 3
  1330. 1148.57 s > [2026-09-02 17:37:02.005] @feyngen::diagram_... INFO : 0s | Δ=0s | Number of graphs after all complete graphs filters are applied: 3
  1331. 1148.57 s > [2026-09-02 17:37:02.007] @feyngen::diagram_... INFO : 0s | Δ=0s | Number of graphs after closed fermion chains analysis: 3
  1332. 1148.57 s > [2026-09-02 17:37:02.007] @feyngen::diagram_... INFO : 0s | Δ=0s | Number of graphs after symmetrization of external states: 3
  1333. 1148.57 s > [2026-09-02 17:37:02.010] @feyngen::diagram_... INFO : 0s | Δ=0s | Number of graphs after canonization of vertices, edges and flows (graph labels assigned here): 3
  1334. 1148.57 s > [2026-09-02 17:37:02.023] @feyngen::diagram_... INFO : 0s | Δ=0s | Number of graphs after numerator-aware grouping with strategy 'up to a scalar rescaling': 1 (1 isomorphically unique graph, 0 color zero, 0 lorentz zero, 0 grouped and 0 cancellation)
  1335. 1148.57 s > [2026-09-02 17:37:02.023] @feyngen::diagram_... INFO : ( Sum of the symmetry factors from each graph generated = 1 )
  1336. 1148.57 s > [2026-09-02 17:37:02.023] @commands::generate INFO : Generated amplitude 1 graphs.
  1337. 1148.57 s > [2026-09-02 17:37:02.110] @settings::runtime WARNING : No external kinematics were provided; using default-generated external momenta and helicities.
  1338. 1148.57 s > [2026-09-02 17:37:02.134] @commands::generate INFO :
  1339. 1148.57 s > Integrand generation summary
  1340. 1148.57 s > peak RAM 68.58 MiB | cores 1
  1341. 1148.57 s > ╭────────────┬───────┬─────────┬────────────┬────────────┬────────────────┬─────────────╮
  1342. 1148.57 s > │ integrand │ graph │ # evals │ expr build │ spenso │ symbolica eval │ compile │
  1343. 1148.57 s > ├────────────┼───────┼─────────┼────────────┼────────────┼────────────────┼─────────────┤
  1344. 1148.57 s > │ scalar_box │ GL0 │ 13 │ 49ms (59%) │ 7ms (8.9%) │ 26ms (32%) │ 0ms (0.00%) │
  1345. 1148.57 s > ├────────────┼───────┼─────────┼────────────┼────────────┼────────────────┼─────────────┤
  1346. 1148.57 s > │ Total │ │ 13 │ 49ms (59%) │ 7ms (8.9%) │ 26ms (32%) │ 0ms (0.00%) │
  1347. 1148.57 s > ╰────────────┴───────┴─────────┴────────────┴────────────┴────────────────┴─────────────╯
  1348. 1148.57 s > [2026-09-02 17:37:02.135] @gammaloop_api::se... INFO : Running command generate
  1349. 1148.57 s > [2026-09-02 17:37:02.199] @settings::runtime WARNING : No external kinematics were provided; using default-generated external momenta and helicities.
  1350. 1148.57 s > [2026-09-02 17:37:02.233] @settings::runtime WARNING : No external kinematics were provided; using default-generated external momenta and helicities.
  1351. 1148.57 s > [2026-09-02 17:37:02.243] @commands::generate INFO :
  1352. 1148.57 s > Integrand generation summary
  1353. 1148.57 s > peak RAM 70.27 MiB | cores 1
  1354. 1148.57 s > ╭────────────┬───────┬─────────┬────────────┬────────────┬────────────────┬─────────────╮
  1355. 1148.57 s > │ integrand │ graph │ # evals │ expr build │ spenso │ symbolica eval │ compile │
  1356. 1148.57 s > ├────────────┼───────┼─────────┼────────────┼────────────┼────────────────┼─────────────┤
  1357. 1148.57 s > │ scalar_tri │ GL0 │ 9 │ 11ms (62%) │ 1ms (8.2%) │ 5ms (29%) │ 0ms (0.00%) │
  1358. 1148.57 s > │ scalar_box │ GL0 │ 13 │ 40ms (55%) │ 6ms (9.0%) │ 27ms (36%) │ 0ms (0.00%) │
  1359. 1148.57 s > ├────────────┼───────┼─────────┼────────────┼────────────┼────────────────┼─────────────┤
  1360. 1148.57 s > │ Total │ │ 22 │ 52ms (56%) │ 8ms (8.8%) │ 32ms (35%) │ 0ms (0.00%) │
  1361. 1148.57 s > ╰────────────┴───────┴─────────┴────────────┴────────────┴────────────────┴─────────────╯
  1362. 1148.57 s > [2026-09-02 17:37:02.244] @gammaloop_api::se... INFO : Running command set model mass_scalar_2=2.0
  1363. 1148.57 s > [2026-09-02 17:37:02.244] @gammaloop_api::se... INFO : Running command set model mass_scalar_1=1.0
  1364. 1148.57 s > [2026-09-02 17:37:02.245] @gammaloop_api::se... INFO : Running command set process -p triangle -i scalar_tri string '
  1365. 1148.57 s > [kinematics.externals]
  1366. 1148.57 s > type = "constant"
  1367. 1148.57 s >
  1368. 1148.57 s > [kinematics.externals.data]
  1369. 1148.57 s > [...]
  1370. 1148.57 s > [2026-09-02 17:37:02.249] @gammaloop_api::se... INFO : Running command set process -p box -i scalar_box string '
  1371. 1148.57 s > [kinematics.externals]
  1372. 1148.57 s > type = "constant"
  1373. 1148.57 s >
  1374. 1148.57 s > [kinematics.externals.data]
  1375. 1148.57 s > [...]
  1376. 1148.57 s > [2026-09-02 17:37:02.250] @gammaloop_api::se... INFO : Running command approach -x 1.0000000000000001e-1,2.0000000000000001e-1,2.9999999999999999e-1,4.0000000000000002e-1 --approach-axis 1.0000000000000000e-3,0.0000000000000000e0,0.0000000000000000e0,0.0000000000000000e0 --n-points 1 --n-cores 1 --output-results /build/source/tests/artifacts/scalar_box_invalid_momentum_approach/approach_momentum.json --momentum-space --graph-id 0
  1377. 1148.57 s > The application panicked (crashed).
  1378. 1148.57 s > Message: There are 2 processes available. Please specify a process.
  1379. 1148.57 s > Location: tests/tests/test_runs/approach.rs:332
  1380. 1148.57 s >
  1381. 1148.57 s > ━━━━━━━━━━━━━━━━━━━━━━━━━━━━━━━━━━ BACKTRACE ━━━━━━━━━━━━━━━━━━━━━━━━━━━━━━━━━━━
  1382. 1148.57 s > 1: <color_eyre[bb06c27fa12d52c3]::config::PanicHook>::panic_report<unknown>
  1383. 1148.57 s > at <unknown source file>:<unknown line>
  1384. 1148.57 s > 2: <color_eyre[bb06c27fa12d52c3]::config::PanicHook>::into_panic_hook::{closure#0}<unknown>
  1385. 1148.57 s > at <unknown source file>:<unknown line>
  1386. 1148.57 s > 3: std[5167731717db2e51]::panicking::panic_with_hook<unknown>
  1387. 1148.57 s > at <unknown source file>:<unknown line>
  1388. 1148.57 s > 4: std[5167731717db2e51]::panicking::panic_handler::{closure#0}<unknown>
  1389. 1148.57 s > at <unknown source file>:<unknown line>
  1390. 1148.57 s > 5: std[5167731717db2e51]::sys::backtrace::__rust_end_short_backtrace::<std[5167731717db2e51]::panicking::panic_handler::{closure#0}, !><unknown>
  1391. 1148.57 s > at <unknown source file>:<unknown line>
  1392. 1148.57 s > 6: __rustc[4b1ee1ef74718a7b]::rust_begin_unwind<unknown>
  1393. 1148.57 s > at <unknown source file>:<unknown line>
  1394. 1148.57 s > 7: core[8c5ac2f034688f9a]::panicking::panic_fmt<unknown>
  1395. 1148.57 s > at <unknown source file>:<unknown line>
  1396. 1148.57 s > 8: test_runs[928b8788563090d0]::approach::approach_momentum_space_reports_incomplete_triplet_cleanly<unknown>
  1397. 1148.57 s > at <unknown source file>:<unknown line>
  1398. 1148.57 s > 9: <test_runs[928b8788563090d0]::approach::approach_momentum_space_reports_incomplete_triplet_cleanly::{closure#0} as core[8c5ac2f034688f9a]::ops::function::FnOnce<()>>::call_once<unknown>
  1399. 1148.57 s > at <unknown source file>:<unknown line>
  1400. 1148.57 s > 10: test[7974841f8dbd3561]::__rust_begin_short_backtrace::<core[8c5ac2f034688f9a]::result::Result<(), alloc[93e694a8365d93dd]::string::String>, fn() -> core[8c5ac2f034688f9a]::result::Result<(), alloc[93e694a8365d93dd]::string::String>><unknown>
  1401. 1148.57 s > at <unknown source file>:<unknown line>
  1402. 1148.57 s > 11: test[7974841f8dbd3561]::run_test::{closure#0}<unknown>
  1403. 1148.57 s > at <unknown source file>:<unknown line>
  1404. 1148.57 s > 12: std[5167731717db2e51]::sys::backtrace::__rust_begin_short_backtrace::<test[7974841f8dbd3561]::run_test::{closure#1}, ()><unknown>
  1405. 1148.57 s > at <unknown source file>:<unknown line>
  1406. 1148.57 s > 13: <std[5167731717db2e51]::thread::lifecycle::spawn_unchecked<test[7974841f8dbd3561]::run_test::{closure#1}, ()>::{closure#1} as core[8c5ac2f034688f9a]::ops::function::FnOnce<()>>::call_once::{shim:vtable#0}<unknown>
  1407. 1148.57 s > at <unknown source file>:<unknown line>
  1408. 1148.57 s > 14: <std[5167731717db2e51]::sys::thread::unix::Thread>::new::thread_start<unknown>
  1409. 1148.57 s > at <unknown source file>:<unknown line>
  1410. 1148.57 s > 15: start_thread<unknown>
  1411. 1148.57 s > at <unknown source file>:<unknown line>
  1412. 1148.57 s > 16: __clone3<unknown>
  1413. 1148.57 s > at <unknown source file>:<unknown line>
  1414. 1148.57 s >
  1415. 1148.57 s > Run with COLORBT_SHOW_HIDDEN=1 environment variable to disable frame filtering.
  1416. 1148.57 s > ... omitted 1 more lines; see full nextest output above
  1417. 1148.57 s >
  1418. 1148.57 s > 2. gammaloop-integration-tests::test_runs::profile_bulk::box_4e_bulk_profile_passes
  1419. 1148.57 s > failure: test failure with exit code 101
  1420. 1148.57 s > Error:
  1421. 1148.57 s > 0: IR profiling requested arbitrary precision but received a quad-precision result
  1422. 1148.57 s >
  1423. 1148.57 s > Location:
  1424. 1148.57 s > crates/gammalooprs/src/integrands/process/ir.rs:2123
  1425. 1148.57 s >
  1426. 1148.57 s > ━━━━━━━━━━━━━━━━━━━━━━━━━━━━━━━━━━ BACKTRACE ━━━━━━━━━━━━━━━━━━━━━━━━━━━━━━━━━━━
  1427. 1148.57 s > 1: <color_eyre[bb06c27fa12d52c3]::config::EyreHook>::into_eyre_hook::{closure#0}<unknown>
  1428. 1148.57 s > at <unknown source file>:<unknown line>
  1429. 1148.57 s > 2: eyre[9f660d63ab6a72c5]::capture_handler<unknown>
  1430. 1148.57 s > at <unknown source file>:<unknown line>
  1431. 1148.57 s > 3: eyre[9f660d63ab6a72c5]::private::format_err<unknown>
  1432. 1148.57 s > at <unknown source file>:<unknown line>
  1433. 1148.57 s > 4: gammalooprs[1b273202b0029755]::integrands::process::ir::evaluate_profile_momentum_point_arb::<gammalooprs[1b273202b0029755]::integrands::process::amplitude::AmplitudeIntegrand><unknown>
  1434. 1148.57 s > at <unknown source file>:<unknown line>
  1435. 1148.57 s > 5: <gammalooprs[1b273202b0029755]::integrands::process::amplitude::AmplitudeIntegrand>::test_single_ir_limit_impl<unknown>
  1436. 1148.57 s > at <unknown source file>:<unknown line>
  1437. 1148.57 s > 6: gammalooprs[1b273202b0029755]::integrands::process::ir::run_ir_profile::<gammalooprs[1b273202b0029755]::integrands::process::amplitude::AmplitudeIntegrand, <gammalooprs[1b273202b0029755]::integrands::process::amplitude::AmplitudeIntegrand>::enumerate_ir_limits, <gammalooprs[1b273202b0029755]::integrands::process::amplitude::AmplitudeIntegrand>::graph_cut_definitions, <gammalooprs[1b273202b0029755]::integrands::process::amplitude::AmplitudeIntegrand>::test_single_ir_limit_impl><unknown>
  1438. 1148.57 s > at <unknown source file>:<unknown line>
  1439. 1148.57 s > 7: <gammalooprs[1b273202b0029755]::integrands::process::amplitude::AmplitudeIntegrand>::test_ir<unknown>
  1440. 1148.57 s > at <unknown source file>:<unknown line>
  1441. 1148.57 s > 8: <gammaloop_api[9fdde70dfc7501ea]::commands::profile::Profile>::run<unknown>
  1442. 1148.57 s > at <unknown source file>:<unknown line>
  1443. 1148.57 s > 9: test_runs[928b8788563090d0]::profile_bulk::box_4e_bulk_profile_passes<unknown>
  1444. 1148.57 s > at <unknown source file>:<unknown line>
  1445. 1148.57 s > 10: <test_runs[928b8788563090d0]::profile_bulk::box_4e_bulk_profile_passes::{closure#0} as core[8c5ac2f034688f9a]::ops::function::FnOnce<()>>::call_once<unknown>
  1446. 1148.57 s > at <unknown source file>:<unknown line>
  1447. 1148.57 s > 11: test[7974841f8dbd3561]::__rust_begin_short_backtrace::<core[8c5ac2f034688f9a]::result::Result<(), alloc[93e694a8365d93dd]::string::String>, fn() -> core[8c5ac2f034688f9a]::result::Result<(), alloc[93e694a8365d93dd]::string::String>><unknown>
  1448. 1148.57 s > at <unknown source file>:<unknown line>
  1449. 1148.57 s > 12: test[7974841f8dbd3561]::run_test::{closure#0}<unknown>
  1450. 1148.57 s > at <unknown source file>:<unknown line>
  1451. 1148.57 s > 13: std[5167731717db2e51]::sys::backtrace::__rust_begin_short_backtrace::<test[7974841f8dbd3561]::run_test::{closure#1}, ()><unknown>
  1452. 1148.57 s > at <unknown source file>:<unknown line>
  1453. 1148.57 s > 14: <std[5167731717db2e51]::thread::lifecycle::spawn_unchecked<test[7974841f8dbd3561]::run_test::{closure#1}, ()>::{closure#1} as core[8c5ac2f034688f9a]::ops::function::FnOnce<()>>::call_once::{shim:vtable#0}<unknown>
  1454. 1148.57 s > at <unknown source file>:<unknown line>
  1455. 1148.57 s > 15: <std[5167731717db2e51]::sys::thread::unix::Thread>::new::thread_start<unknown>
  1456. 1148.57 s > at <unknown source file>:<unknown line>
  1457. 1148.57 s > 16: start_thread<unknown>
  1458. 1148.57 s > at <unknown source file>:<unknown line>
  1459. 1148.57 s > 17: __clone3<unknown>
  1460. 1148.57 s > at <unknown source file>:<unknown line>
  1461. 1148.57 s >
  1462. 1148.57 s > Run with COLORBT_SHOW_HIDDEN=1 environment variable to disable frame filtering.
  1463. 1148.57 s > Run with RUST_BACKTRACE=full to include source snippets.
  1464. 1148.57 s > Warning: SpanTrace capture is Unsupported.
  1465. 1148.57 s > Ensure that you've setup a tracing-error ErrorLayer and the semver versions are compatible
  1466. 1148.57 s > system-out
  1467. 1148.57 s > running 1 test
  1468. 1148.57 s > test profile_bulk::box_4e_bulk_profile_passes ... FAILED
  1469. 1148.57 s >
  1470. 1148.57 s > failures:
  1471. 1148.57 s >
  1472. 1148.57 s > failures:
  1473. 1148.57 s > profile_bulk::box_4e_bulk_profile_passes
  1474. 1148.57 s >
  1475. 1148.57 s > test result: FAILED. 0 passed; 1 failed; 0 ignored; 0 measured; 82 filtered out; finished in 0.40s
  1476. 1148.57 s > system-err
  1477. 1148.57 s > [2026-09-02 17:37:03.735] @gammaloop_api::se... INFO : Running command import model ./assets/models/json/scalars/scalars.json
  1478. 1148.57 s > [2026-09-02 17:37:03.735] @import::model INFO : Loading JSON model scalars-default from /build/source/assets/models/json/scalars/scalars
  1479. 1148.57 s > [2026-09-02 17:37:03.738] @gammalooprs::model INFO : The following 2 external parameters were forced to zero by the restriction card:
  1480. 1148.57 s > width_scalar_1, width_scalar_2
  1481. 1148.57 s > [2026-09-02 17:37:03.739] @gammaloop_api::se... INFO : Running command import graphs ./tests/resources/graphs/massless_box.dot
  1482. 1148.57 s > [2026-09-02 17:37:03.739] @commands::import INFO : Loading graphs from '/build/source/tests/resources/graphs/massless_box.dot'
  1483. 1148.57 s > [2026-09-02 17:37:03.748] @gammaloop_api::se... INFO : Running command generate
  1484. 1148.57 s > [2026-09-02 17:37:03.862] @commands::generate INFO :
  1485. 1148.57 s > Integrand generation summary
  1486. 1148.57 s > peak RAM 65.00 MiB | cores 1
  1487. 1148.57 s > ╭───────────┬────────────────┬─────────┬────────────┬────────────┬────────────────┬─────────────╮
  1488. 1148.57 s > │ integrand │ graph │ # evals │ expr build │ spenso │ symbolica eval │ compile │
  1489. 1148.57 s > ├───────────┼────────────────┼─────────┼────────────┼────────────┼────────────────┼─────────────┤
  1490. 1148.57 s > │ default │ massless_box_0 │ 14 │ 81ms (76%) │ 15ms (15%) │ 10ms (9.4%) │ 0ms (0.00%) │
  1491. 1148.57 s > ├───────────┼────────────────┼─────────┼────────────┼────────────┼────────────────┼─────────────┤
  1492. 1148.57 s > │ Total │ │ 14 │ 81ms (76%) │ 15ms (15%) │ 10ms (9.4%) │ 0ms (0.00%) │
  1493. 1148.57 s > ╰───────────┴────────────────┴─────────┴────────────┴────────────┴────────────────┴─────────────╯
  1494. 1148.57 s > [2026-09-02 17:37:03.864] @process::amplitude INFO : Input is above threshold: 4 existing threshold E-surfaces across 1/1 graph groups
  1495. 1148.57 s > [2026-09-02 17:37:03.871] @process::amplitude INFO : overlap structure of group 0: [2: [8(4,6), 11(5,6)], 2: [4(3,4), 9(3,5)], 2: [4(3,4), 8(4,6)], 2: [9(3,5), 11(5,6)]]
  1496. 1148.57 s > Error:
  1497. 1148.57 s > 0: IR profiling requested arbitrary precision but received a quad-precision result
  1498. 1148.57 s >
  1499. 1148.57 s > Location:
  1500. 1148.57 s > crates/gammalooprs/src/integrands/process/ir.rs:2123
  1501. 1148.57 s >
  1502. 1148.57 s > ━━━━━━━━━━━━━━━━━━━━━━━━━━━━━━━━━━ BACKTRACE ━━━━━━━━━━━━━━━━━━━━━━━━━━━━━━━━━━━
  1503. 1148.57 s > 1: <color_eyre[bb06c27fa12d52c3]::config::EyreHook>::into_eyre_hook::{closure#0}<unknown>
  1504. 1148.57 s > at <unknown source file>:<unknown line>
  1505. 1148.57 s > 2: eyre[9f660d63ab6a72c5]::capture_handler<unknown>
  1506. 1148.57 s > at <unknown source file>:<unknown line>
  1507. 1148.57 s > 3: eyre[9f660d63ab6a72c5]::private::format_err<unknown>
  1508. 1148.57 s > at <unknown source file>:<unknown line>
  1509. 1148.57 s > 4: gammalooprs[1b273202b0029755]::integrands::process::ir::evaluate_profile_momentum_point_arb::<gammalooprs[1b273202b0029755]::integrands::process::amplitude::AmplitudeIntegrand><unknown>
  1510. 1148.57 s > at <unknown source file>:<unknown line>
  1511. 1148.57 s > 5: <gammalooprs[1b273202b0029755]::integrands::process::amplitude::AmplitudeIntegrand>::test_single_ir_limit_impl<unknown>
  1512. 1148.57 s > at <unknown source file>:<unknown line>
  1513. 1148.57 s > 6: gammalooprs[1b273202b0029755]::integrands::process::ir::run_ir_profile::<gammalooprs[1b273202b0029755]::integrands::process::amplitude::AmplitudeIntegrand, <gammalooprs[1b273202b0029755]::integrands::process::amplitude::AmplitudeIntegrand>::enumerate_ir_limits, <gammalooprs[1b273202b0029755]::integrands::process::amplitude::AmplitudeIntegrand>::graph_cut_definitions, <gammalooprs[1b273202b0029755]::integrands::process::amplitude::AmplitudeIntegrand>::test_single_ir_limit_impl><unknown>
  1514. 1148.57 s > at <unknown source file>:<unknown line>
  1515. 1148.57 s > 7: <gammalooprs[1b273202b0029755]::integrands::process::amplitude::AmplitudeIntegrand>::test_ir<unknown>
  1516. 1148.57 s > at <unknown source file>:<unknown line>
  1517. 1148.57 s > 8: <gammaloop_api[9fdde70dfc7501ea]::commands::profile::Profile>::run<unknown>
  1518. 1148.57 s > at <unknown source file>:<unknown line>
  1519. 1148.57 s > 9: test_runs[928b8788563090d0]::profile_bulk::box_4e_bulk_profile_passes<unknown>
  1520. 1148.57 s > at <unknown source file>:<unknown line>
  1521. 1148.57 s > 10: <test_runs[928b8788563090d0]::profile_bulk::box_4e_bulk_profile_passes::{closure#0} as core[8c5ac2f034688f9a]::ops::function::FnOnce<()>>::call_once<unknown>
  1522. 1148.57 s > at <unknown source file>:<unknown line>
  1523. 1148.57 s > 11: test[7974841f8dbd3561]::__rust_begin_short_backtrace::<core[8c5ac2f034688f9a]::result::Result<(), alloc[93e694a8365d93dd]::string::String>, fn() -> core[8c5ac2f034688f9a]::result::Result<(), alloc[93e694a8365d93dd]::string::String>><unknown>
  1524. 1148.57 s > at <unknown source file>:<unknown line>
  1525. 1148.57 s > 12: test[7974841f8dbd3561]::run_test::{closure#0}<unknown>
  1526. 1148.57 s > at <unknown source file>:<unknown line>
  1527. 1148.57 s > 13: std[5167731717db2e51]::sys::backtrace::__rust_begin_short_backtrace::<test[7974841f8dbd3561]::run_test::{closure#1}, ()><unknown>
  1528. 1148.57 s > at <unknown source file>:<unknown line>
  1529. 1148.57 s > 14: <std[5167731717db2e51]::thread::lifecycle::spawn_unchecked<test[7974841f8dbd3561]::run_test::{closure#1}, ()>::{closure#1} as core[8c5ac2f034688f9a]::ops::function::FnOnce<()>>::call_once::{shim:vtable#0}<unknown>
  1530. 1148.57 s > at <unknown source file>:<unknown line>
  1531. 1148.57 s > 15: <std[5167731717db2e51]::sys::thread::unix::Thread>::new::thread_start<unknown>
  1532. 1148.57 s > at <unknown source file>:<unknown line>
  1533. 1148.57 s > 16: start_thread<unknown>
  1534. 1148.57 s > at <unknown source file>:<unknown line>
  1535. 1148.57 s > 17: __clone3<unknown>
  1536. 1148.57 s > at <unknown source file>:<unknown line>
  1537. 1148.57 s >
  1538. 1148.57 s > Run with COLORBT_SHOW_HIDDEN=1 environment variable to disable frame filtering.
  1539. 1148.57 s > Run with RUST_BACKTRACE=full to include source snippets.
  1540. 1148.57 s > Warning: SpanTrace capture is Unsupported.
  1541. 1148.57 s > Ensure that you've setup a tracing-error ErrorLayer and the semver versions are compatible
  1542. 1148.57 s >
  1543. 1148.57 s > 3. gammaloop-integration-tests::test_runs::profile_bulk::dotted_bubble_amp_bulk_profile_passes
  1544. 1148.57 s > failure: test failure with exit code 101
  1545. 1148.57 s > Error:
  1546. 1148.57 s > 0: IR profiling requested arbitrary precision but received a quad-precision result
  1547. 1148.57 s >
  1548. 1148.57 s > Location:
  1549. 1148.57 s > crates/gammalooprs/src/integrands/process/ir.rs:2123
  1550. 1148.57 s >
  1551. 1148.57 s > ━━━━━━━━━━━━━━━━━━━━━━━━━━━━━━━━━━ BACKTRACE ━━━━━━━━━━━━━━━━━━━━━━━━━━━━━━━━━━━
  1552. 1148.57 s > 1: <color_eyre[bb06c27fa12d52c3]::config::EyreHook>::into_eyre_hook::{closure#0}<unknown>
  1553. 1148.57 s > at <unknown source file>:<unknown line>
  1554. 1148.57 s > 2: eyre[9f660d63ab6a72c5]::capture_handler<unknown>
  1555. 1148.57 s > at <unknown source file>:<unknown line>
  1556. 1148.57 s > 3: eyre[9f660d63ab6a72c5]::private::format_err<unknown>
  1557. 1148.57 s > at <unknown source file>:<unknown line>
  1558. 1148.57 s > 4: gammalooprs[1b273202b0029755]::integrands::process::ir::evaluate_profile_momentum_point_arb::<gammalooprs[1b273202b0029755]::integrands::process::amplitude::AmplitudeIntegrand><unknown>
  1559. 1148.57 s > at <unknown source file>:<unknown line>
  1560. 1148.57 s > 5: <gammalooprs[1b273202b0029755]::integrands::process::amplitude::AmplitudeIntegrand>::test_single_ir_limit_impl<unknown>
  1561. 1148.57 s > at <unknown source file>:<unknown line>
  1562. 1148.57 s > 6: gammalooprs[1b273202b0029755]::integrands::process::ir::run_ir_profile::<gammalooprs[1b273202b0029755]::integrands::process::amplitude::AmplitudeIntegrand, <gammalooprs[1b273202b0029755]::integrands::process::amplitude::AmplitudeIntegrand>::enumerate_ir_limits, <gammalooprs[1b273202b0029755]::integrands::process::amplitude::AmplitudeIntegrand>::graph_cut_definitions, <gammalooprs[1b273202b0029755]::integrands::process::amplitude::AmplitudeIntegrand>::test_single_ir_limit_impl><unknown>
  1563. 1148.57 s > at <unknown source file>:<unknown line>
  1564. 1148.57 s > 7: <gammalooprs[1b273202b0029755]::integrands::process::amplitude::AmplitudeIntegrand>::test_ir<unknown>
  1565. 1148.57 s > at <unknown source file>:<unknown line>
  1566. 1148.57 s > 8: <gammaloop_api[9fdde70dfc7501ea]::commands::profile::Profile>::run<unknown>
  1567. 1148.57 s > at <unknown source file>:<unknown line>
  1568. 1148.57 s > 9: test_runs[928b8788563090d0]::profile_bulk::dotted_bubble_amp_bulk_profile_passes<unknown>
  1569. 1148.57 s > at <unknown source file>:<unknown line>
  1570. 1148.57 s > 10: <test_runs[928b8788563090d0]::profile_bulk::dotted_bubble_amp_bulk_profile_passes::{closure#0} as core[8c5ac2f034688f9a]::ops::function::FnOnce<()>>::call_once<unknown>
  1571. 1148.57 s > at <unknown source file>:<unknown line>
  1572. 1148.57 s > 11: test[7974841f8dbd3561]::__rust_begin_short_backtrace::<core[8c5ac2f034688f9a]::result::Result<(), alloc[93e694a8365d93dd]::string::String>, fn() -> core[8c5ac2f034688f9a]::result::Result<(), alloc[93e694a8365d93dd]::string::String>><unknown>
  1573. 1148.57 s > at <unknown source file>:<unknown line>
  1574. 1148.57 s > 12: test[7974841f8dbd3561]::run_test::{closure#0}<unknown>
  1575. 1148.57 s > at <unknown source file>:<unknown line>
  1576. 1148.57 s > 13: std[5167731717db2e51]::sys::backtrace::__rust_begin_short_backtrace::<test[7974841f8dbd3561]::run_test::{closure#1}, ()><unknown>
  1577. 1148.57 s > at <unknown source file>:<unknown line>
  1578. 1148.57 s > 14: <std[5167731717db2e51]::thread::lifecycle::spawn_unchecked<test[7974841f8dbd3561]::run_test::{closure#1}, ()>::{closure#1} as core[8c5ac2f034688f9a]::ops::function::FnOnce<()>>::call_once::{shim:vtable#0}<unknown>
  1579. 1148.57 s > at <unknown source file>:<unknown line>
  1580. 1148.57 s > 15: <std[5167731717db2e51]::sys::thread::unix::Thread>::new::thread_start<unknown>
  1581. 1148.57 s > at <unknown source file>:<unknown line>
  1582. 1148.57 s > 16: start_thread<unknown>
  1583. 1148.57 s > at <unknown source file>:<unknown line>
  1584. 1148.57 s > 17: __clone3<unknown>
  1585. 1148.57 s > at <unknown source file>:<unknown line>
  1586. 1148.57 s >
  1587. 1148.57 s > Run with COLORBT_SHOW_HIDDEN=1 environment variable to disable frame filtering.
  1588. 1148.57 s > Run with RUST_BACKTRACE=full to include source snippets.
  1589. 1148.57 s > Warning: SpanTrace capture is Unsupported.
  1590. 1148.57 s > Ensure that you've setup a tracing-error ErrorLayer and the semver versions are compatible
  1591. 1148.57 s > system-out
  1592. 1148.57 s > running 1 test
  1593. 1148.57 s > test profile_bulk::dotted_bubble_amp_bulk_profile_passes ... FAILED
  1594. 1148.57 s >
  1595. 1148.57 s > failures:
  1596. 1148.57 s >
  1597. 1148.57 s > failures:
  1598. 1148.57 s > profile_bulk::dotted_bubble_amp_bulk_profile_passes
  1599. 1148.57 s >
  1600. 1148.57 s > test result: FAILED. 0 passed; 1 failed; 0 ignored; 0 measured; 82 filtered out; finished in 0.36s
  1601. 1148.57 s > system-err
  1602. 1148.57 s > [2026-09-02 17:37:03.814] @gammaloop_api::se... INFO : Running command import model ./assets/models/json/scalars/scalars_2p_3p.json
  1603. 1148.57 s > [2026-09-02 17:37:03.814] @import::model INFO : Loading JSON model scalars_2p_3p-default from /build/source/assets/models/json/scalars/scalars_2p_3p
  1604. 1148.57 s > [2026-09-02 17:37:03.815] @gammaloop_api::se... INFO : Running command import graphs ./tests/resources/graphs/dotted_bubble_amp.dot
  1605. 1148.57 s > [2026-09-02 17:37:03.816] @commands::import INFO : Loading graphs from '/build/source/tests/resources/graphs/dotted_bubble_amp.dot'
  1606. 1148.57 s > [2026-09-02 17:37:03.822] @gammaloop_api::se... INFO : Running command generate
  1607. 1148.57 s > [2026-09-02 17:37:03.945] @commands::generate INFO :
  1608. 1148.57 s > Integrand generation summary
  1609. 1148.57 s > peak RAM 64.70 MiB | cores 1
  1610. 1148.57 s > ╭───────────┬───────────────────┬─────────┬────────────┬────────────┬────────────────┬─────────────╮
  1611. 1148.57 s > │ integrand │ graph │ # evals │ expr build │ spenso │ symbolica eval │ compile │
  1612. 1148.57 s > ├───────────┼───────────────────┼─────────┼────────────┼────────────┼────────────────┼─────────────┤
  1613. 1148.57 s > │ default │ dotted_bubble_amp │ 8 │ 16ms (68%) │ 1ms (4.3%) │ 6ms (28%) │ 0ms (0.00%) │
  1614. 1148.57 s > ├───────────┼───────────────────┼─────────┼────────────┼────────────┼────────────────┼─────────────┤
  1615. 1148.57 s > │ Total │ │ 8 │ 16ms (68%) │ 1ms (4.3%) │ 6ms (28%) │ 0ms (0.00%) │
  1616. 1148.57 s > ╰───────────┴───────────────────┴─────────┴────────────┴────────────┴────────────────┴─────────────╯
  1617. 1148.57 s > [2026-09-02 17:37:03.946] @process::amplitude INFO : Input is above threshold: 1 existing threshold E-surfaces across 1/1 graph groups
  1618. 1148.57 s > [2026-09-02 17:37:03.946] @process::amplitude INFO : overlap structure of group 0: [1: [1(1,3)]]
  1619. 1148.57 s > Error:
  1620. 1148.57 s > 0: IR profiling requested arbitrary precision but received a quad-precision result
  1621. 1148.57 s >
  1622. 1148.57 s > Location:
  1623. 1148.57 s > crates/gammalooprs/src/integrands/process/ir.rs:2123
  1624. 1148.57 s >
  1625. 1148.57 s > ━━━━━━━━━━━━━━━━━━━━━━━━━━━━━━━━━━ BACKTRACE ━━━━━━━━━━━━━━━━━━━━━━━━━━━━━━━━━━━
  1626. 1148.57 s > 1: <color_eyre[bb06c27fa12d52c3]::config::EyreHook>::into_eyre_hook::{closure#0}<unknown>
  1627. 1148.57 s > at <unknown source file>:<unknown line>
  1628. 1148.57 s > 2: eyre[9f660d63ab6a72c5]::capture_handler<unknown>
  1629. 1148.57 s > at <unknown source file>:<unknown line>
  1630. 1148.57 s > 3: eyre[9f660d63ab6a72c5]::private::format_err<unknown>
  1631. 1148.57 s > at <unknown source file>:<unknown line>
  1632. 1148.57 s > 4: gammalooprs[1b273202b0029755]::integrands::process::ir::evaluate_profile_momentum_point_arb::<gammalooprs[1b273202b0029755]::integrands::process::amplitude::AmplitudeIntegrand><unknown>
  1633. 1148.57 s > at <unknown source file>:<unknown line>
  1634. 1148.57 s > 5: <gammalooprs[1b273202b0029755]::integrands::process::amplitude::AmplitudeIntegrand>::test_single_ir_limit_impl<unknown>
  1635. 1148.57 s > at <unknown source file>:<unknown line>
  1636. 1148.57 s > 6: gammalooprs[1b273202b0029755]::integrands::process::ir::run_ir_profile::<gammalooprs[1b273202b0029755]::integrands::process::amplitude::AmplitudeIntegrand, <gammalooprs[1b273202b0029755]::integrands::process::amplitude::AmplitudeIntegrand>::enumerate_ir_limits, <gammalooprs[1b273202b0029755]::integrands::process::amplitude::AmplitudeIntegrand>::graph_cut_definitions, <gammalooprs[1b273202b0029755]::integrands::process::amplitude::AmplitudeIntegrand>::test_single_ir_limit_impl><unknown>
  1637. 1148.57 s > at <unknown source file>:<unknown line>
  1638. 1148.57 s > 7: <gammalooprs[1b273202b0029755]::integrands::process::amplitude::AmplitudeIntegrand>::test_ir<unknown>
  1639. 1148.57 s > at <unknown source file>:<unknown line>
  1640. 1148.57 s > 8: <gammaloop_api[9fdde70dfc7501ea]::commands::profile::Profile>::run<unknown>
  1641. 1148.57 s > at <unknown source file>:<unknown line>
  1642. 1148.57 s > 9: test_runs[928b8788563090d0]::profile_bulk::dotted_bubble_amp_bulk_profile_passes<unknown>
  1643. 1148.57 s > at <unknown source file>:<unknown line>
  1644. 1148.57 s > 10: <test_runs[928b8788563090d0]::profile_bulk::dotted_bubble_amp_bulk_profile_passes::{closure#0} as core[8c5ac2f034688f9a]::ops::function::FnOnce<()>>::call_once<unknown>
  1645. 1148.57 s > at <unknown source file>:<unknown line>
  1646. 1148.57 s > 11: test[7974841f8dbd3561]::__rust_begin_short_backtrace::<core[8c5ac2f034688f9a]::result::Result<(), alloc[93e694a8365d93dd]::string::String>, fn() -> core[8c5ac2f034688f9a]::result::Result<(), alloc[93e694a8365d93dd]::string::String>><unknown>
  1647. 1148.57 s > at <unknown source file>:<unknown line>
  1648. 1148.57 s > 12: test[7974841f8dbd3561]::run_test::{closure#0}<unknown>
  1649. 1148.57 s > at <unknown source file>:<unknown line>
  1650. 1148.57 s > 13: std[5167731717db2e51]::sys::backtrace::__rust_begin_short_backtrace::<test[7974841f8dbd3561]::run_test::{closure#1}, ()><unknown>
  1651. 1148.57 s > at <unknown source file>:<unknown line>
  1652. 1148.57 s > 14: <std[5167731717db2e51]::thread::lifecycle::spawn_unchecked<test[7974841f8dbd3561]::run_test::{closure#1}, ()>::{closure#1} as core[8c5ac2f034688f9a]::ops::function::FnOnce<()>>::call_once::{shim:vtable#0}<unknown>
  1653. 1148.57 s > at <unknown source file>:<unknown line>
  1654. 1148.57 s > 15: <std[5167731717db2e51]::sys::thread::unix::Thread>::new::thread_start<unknown>
  1655. 1148.57 s > at <unknown source file>:<unknown line>
  1656. 1148.57 s > 16: start_thread<unknown>
  1657. 1148.57 s > at <unknown source file>:<unknown line>
  1658. 1148.57 s > 17: __clone3<unknown>
  1659. 1148.57 s > at <unknown source file>:<unknown line>
  1660. 1148.57 s >
  1661. 1148.57 s > Run with COLORBT_SHOW_HIDDEN=1 environment variable to disable frame filtering.
  1662. 1148.57 s > Run with RUST_BACKTRACE=full to include source snippets.
  1663. 1148.57 s > Warning: SpanTrace capture is Unsupported.
  1664. 1148.57 s > Ensure that you've setup a tracing-error ErrorLayer and the semver versions are compatible
  1665. 1148.57 s >
  1666. 1148.57 s > 4. gammaloop-integration-tests::test_runs::profile_bulk::double_dotted_bubble_amp_bulk_profile_passes
  1667. 1148.57 s > failure: test failure with exit code 101
  1668. 1148.57 s > Error:
  1669. 1148.57 s > 0: IR profiling requested arbitrary precision but received a quad-precision result
  1670. 1148.57 s >
  1671. 1148.57 s > Location:
  1672. 1148.57 s > crates/gammalooprs/src/integrands/process/ir.rs:2123
  1673. 1148.57 s >
  1674. 1148.57 s > ━━━━━━━━━━━━━━━━━━━━━━━━━━━━━━━━━━ BACKTRACE ━━━━━━━━━━━━━━━━━━━━━━━━━━━━━━━━━━━
  1675. 1148.57 s > 1: <color_eyre[bb06c27fa12d52c3]::config::EyreHook>::into_eyre_hook::{closure#0}<unknown>
  1676. 1148.57 s > at <unknown source file>:<unknown line>
  1677. 1148.57 s > 2: eyre[9f660d63ab6a72c5]::capture_handler<unknown>
  1678. 1148.57 s > at <unknown source file>:<unknown line>
  1679. 1148.57 s > 3: eyre[9f660d63ab6a72c5]::private::format_err<unknown>
  1680. 1148.57 s > at <unknown source file>:<unknown line>
  1681. 1148.57 s > 4: gammalooprs[1b273202b0029755]::integrands::process::ir::evaluate_profile_momentum_point_arb::<gammalooprs[1b273202b0029755]::integrands::process::amplitude::AmplitudeIntegrand><unknown>
  1682. 1148.57 s > at <unknown source file>:<unknown line>
  1683. 1148.57 s > 5: <gammalooprs[1b273202b0029755]::integrands::process::amplitude::AmplitudeIntegrand>::test_single_ir_limit_impl<unknown>
  1684. 1148.57 s > at <unknown source file>:<unknown line>
  1685. 1148.57 s > 6: gammalooprs[1b273202b0029755]::integrands::process::ir::run_ir_profile::<gammalooprs[1b273202b0029755]::integrands::process::amplitude::AmplitudeIntegrand, <gammalooprs[1b273202b0029755]::integrands::process::amplitude::AmplitudeIntegrand>::enumerate_ir_limits, <gammalooprs[1b273202b0029755]::integrands::process::amplitude::AmplitudeIntegrand>::graph_cut_definitions, <gammalooprs[1b273202b0029755]::integrands::process::amplitude::AmplitudeIntegrand>::test_single_ir_limit_impl><unknown>
  1686. 1148.57 s > at <unknown source file>:<unknown line>
  1687. 1148.57 s > 7: <gammalooprs[1b273202b0029755]::integrands::process::amplitude::AmplitudeIntegrand>::test_ir<unknown>
  1688. 1148.57 s > at <unknown source file>:<unknown line>
  1689. 1148.57 s > 8: <gammaloop_api[9fdde70dfc7501ea]::commands::profile::Profile>::run<unknown>
  1690. 1148.57 s > at <unknown source file>:<unknown line>
  1691. 1148.57 s > 9: test_runs[928b8788563090d0]::profile_bulk::double_dotted_bubble_amp_bulk_profile_passes<unknown>
  1692. 1148.57 s > at <unknown source file>:<unknown line>
  1693. 1148.57 s > 10: <test_runs[928b8788563090d0]::profile_bulk::double_dotted_bubble_amp_bulk_profile_passes::{closure#0} as core[8c5ac2f034688f9a]::ops::function::FnOnce<()>>::call_once<unknown>
  1694. 1148.57 s > at <unknown source file>:<unknown line>
  1695. 1148.57 s > 11: test[7974841f8dbd3561]::__rust_begin_short_backtrace::<core[8c5ac2f034688f9a]::result::Result<(), alloc[93e694a8365d93dd]::string::String>, fn() -> core[8c5ac2f034688f9a]::result::Result<(), alloc[93e694a8365d93dd]::string::String>><unknown>
  1696. 1148.57 s > at <unknown source file>:<unknown line>
  1697. 1148.57 s > 12: test[7974841f8dbd3561]::run_test::{closure#0}<unknown>
  1698. 1148.57 s > at <unknown source file>:<unknown line>
  1699. 1148.57 s > 13: std[5167731717db2e51]::sys::backtrace::__rust_begin_short_backtrace::<test[7974841f8dbd3561]::run_test::{closure#1}, ()><unknown>
  1700. 1148.57 s > at <unknown source file>:<unknown line>
  1701. 1148.57 s > 14: <std[5167731717db2e51]::thread::lifecycle::spawn_unchecked<test[7974841f8dbd3561]::run_test::{closure#1}, ()>::{closure#1} as core[8c5ac2f034688f9a]::ops::function::FnOnce<()>>::call_once::{shim:vtable#0}<unknown>
  1702. 1148.57 s > at <unknown source file>:<unknown line>
  1703. 1148.57 s > 15: <std[5167731717db2e51]::sys::thread::unix::Thread>::new::thread_start<unknown>
  1704. 1148.57 s > at <unknown source file>:<unknown line>
  1705. 1148.57 s > 16: start_thread<unknown>
  1706. 1148.57 s > at <unknown source file>:<unknown line>
  1707. 1148.57 s > 17: __clone3<unknown>
  1708. 1148.57 s > at <unknown source file>:<unknown line>
  1709. 1148.57 s >
  1710. 1148.57 s > Run with COLORBT_SHOW_HIDDEN=1 environment variable to disable frame filtering.
  1711. 1148.57 s > Run with RUST_BACKTRACE=full to include source snippets.
  1712. 1148.57 s > Warning: SpanTrace capture is Unsupported.
  1713. 1148.57 s > Ensure that you've setup a tracing-error ErrorLayer and the semver versions are compatible
  1714. 1148.57 s > system-out
  1715. 1148.57 s > running 1 test
  1716. 1148.57 s > test profile_bulk::double_dotted_bubble_amp_bulk_profile_passes ... FAILED
  1717. 1148.57 s >
  1718. 1148.57 s > failures:
  1719. 1148.57 s >
  1720. 1148.57 s > failures:
  1721. 1148.57 s > profile_bulk::double_dotted_bubble_amp_bulk_profile_passes
  1722. 1148.57 s >
  1723. 1148.57 s > test result: FAILED. 0 passed; 1 failed; 0 ignored; 0 measured; 82 filtered out; finished in 0.32s
  1724. 1148.57 s > system-err
  1725. 1148.57 s > [2026-09-02 17:37:03.942] @gammaloop_api::se... INFO : Running command import model ./assets/models/json/scalars/scalars_2p_3p.json
  1726. 1148.57 s > [2026-09-02 17:37:03.942] @import::model INFO : Loading JSON model scalars_2p_3p-default from /build/source/assets/models/json/scalars/scalars_2p_3p
  1727. 1148.57 s > [2026-09-02 17:37:03.943] @gammaloop_api::se... INFO : Running command import graphs ./tests/resources/graphs/double_dotted_bubble_amp.dot
  1728. 1148.57 s > [2026-09-02 17:37:03.943] @commands::import INFO : Loading graphs from '/build/source/tests/resources/graphs/double_dotted_bubble_amp.dot'
  1729. 1148.57 s > [2026-09-02 17:37:03.947] @gammaloop_api::se... INFO : Running command generate
  1730. 1148.57 s > [2026-09-02 17:37:04.050] @commands::generate INFO :
  1731. 1148.57 s > Integrand generation summary
  1732. 1148.57 s > peak RAM 63.38 MiB | cores 1
  1733. 1148.57 s > ╭───────────┬──────────────────────────┬─────────┬────────────┬────────────┬────────────────┬─────────────╮
  1734. 1148.57 s > │ integrand │ graph │ # evals │ expr build │ spenso │ symbolica eval │ compile │
  1735. 1148.57 s > ├───────────┼──────────────────────────┼─────────┼────────────┼────────────┼────────────────┼─────────────┤
  1736. 1148.57 s > │ default │ double_dotted_bubble_amp │ 11 │ 37ms (71%) │ 2ms (4.9%) │ 12ms (24%) │ 0ms (0.00%) │
  1737. 1148.57 s > ├───────────┼──────────────────────────┼─────────┼────────────┼────────────┼────────────────┼─────────────┤
  1738. 1148.57 s > │ Total │ │ 11 │ 37ms (71%) │ 2ms (4.9%) │ 12ms (24%) │ 0ms (0.00%) │
  1739. 1148.57 s > ╰───────────┴──────────────────────────┴─────────┴────────────┴────────────┴────────────────┴─────────────╯
  1740. 1148.57 s > [2026-09-02 17:37:04.051] @process::amplitude INFO : Input is above threshold: 1 existing threshold E-surfaces across 1/1 graph groups
  1741. 1148.57 s > [2026-09-02 17:37:04.051] @process::amplitude INFO : overlap structure of group 0: [1: [1(1,4)]]
  1742. 1148.57 s > Error:
  1743. 1148.57 s > 0: IR profiling requested arbitrary precision but received a quad-precision result
  1744. 1148.57 s >
  1745. 1148.57 s > Location:
  1746. 1148.57 s > crates/gammalooprs/src/integrands/process/ir.rs:2123
  1747. 1148.57 s >
  1748. 1148.57 s > ━━━━━━━━━━━━━━━━━━━━━━━━━━━━━━━━━━ BACKTRACE ━━━━━━━━━━━━━━━━━━━━━━━━━━━━━━━━━━━
  1749. 1148.57 s > 1: <color_eyre[bb06c27fa12d52c3]::config::EyreHook>::into_eyre_hook::{closure#0}<unknown>
  1750. 1148.57 s > at <unknown source file>:<unknown line>
  1751. 1148.57 s > 2: eyre[9f660d63ab6a72c5]::capture_handler<unknown>
  1752. 1148.57 s > at <unknown source file>:<unknown line>
  1753. 1148.57 s > 3: eyre[9f660d63ab6a72c5]::private::format_err<unknown>
  1754. 1148.57 s > at <unknown source file>:<unknown line>
  1755. 1148.57 s > 4: gammalooprs[1b273202b0029755]::integrands::process::ir::evaluate_profile_momentum_point_arb::<gammalooprs[1b273202b0029755]::integrands::process::amplitude::AmplitudeIntegrand><unknown>
  1756. 1148.57 s > at <unknown source file>:<unknown line>
  1757. 1148.57 s > 5: <gammalooprs[1b273202b0029755]::integrands::process::amplitude::AmplitudeIntegrand>::test_single_ir_limit_impl<unknown>
  1758. 1148.57 s > at <unknown source file>:<unknown line>
  1759. 1148.57 s > 6: gammalooprs[1b273202b0029755]::integrands::process::ir::run_ir_profile::<gammalooprs[1b273202b0029755]::integrands::process::amplitude::AmplitudeIntegrand, <gammalooprs[1b273202b0029755]::integrands::process::amplitude::AmplitudeIntegrand>::enumerate_ir_limits, <gammalooprs[1b273202b0029755]::integrands::process::amplitude::AmplitudeIntegrand>::graph_cut_definitions, <gammalooprs[1b273202b0029755]::integrands::process::amplitude::AmplitudeIntegrand>::test_single_ir_limit_impl><unknown>
  1760. 1148.57 s > at <unknown source file>:<unknown line>
  1761. 1148.57 s > 7: <gammalooprs[1b273202b0029755]::integrands::process::amplitude::AmplitudeIntegrand>::test_ir<unknown>
  1762. 1148.57 s > at <unknown source file>:<unknown line>
  1763. 1148.57 s > 8: <gammaloop_api[9fdde70dfc7501ea]::commands::profile::Profile>::run<unknown>
  1764. 1148.57 s > at <unknown source file>:<unknown line>
  1765. 1148.57 s > 9: test_runs[928b8788563090d0]::profile_bulk::double_dotted_bubble_amp_bulk_profile_passes<unknown>
  1766. 1148.57 s > at <unknown source file>:<unknown line>
  1767. 1148.57 s > 10: <test_runs[928b8788563090d0]::profile_bulk::double_dotted_bubble_amp_bulk_profile_passes::{closure#0} as core[8c5ac2f034688f9a]::ops::function::FnOnce<()>>::call_once<unknown>
  1768. 1148.57 s > at <unknown source file>:<unknown line>
  1769. 1148.57 s > 11: test[7974841f8dbd3561]::__rust_begin_short_backtrace::<core[8c5ac2f034688f9a]::result::Result<(), alloc[93e694a8365d93dd]::string::String>, fn() -> core[8c5ac2f034688f9a]::result::Result<(), alloc[93e694a8365d93dd]::string::String>><unknown>
  1770. 1148.57 s > at <unknown source file>:<unknown line>
  1771. 1148.57 s > 12: test[7974841f8dbd3561]::run_test::{closure#0}<unknown>
  1772. 1148.57 s > at <unknown source file>:<unknown line>
  1773. 1148.57 s > 13: std[5167731717db2e51]::sys::backtrace::__rust_begin_short_backtrace::<test[7974841f8dbd3561]::run_test::{closure#1}, ()><unknown>
  1774. 1148.57 s > at <unknown source file>:<unknown line>
  1775. 1148.57 s > 14: <std[5167731717db2e51]::thread::lifecycle::spawn_unchecked<test[7974841f8dbd3561]::run_test::{closure#1}, ()>::{closure#1} as core[8c5ac2f034688f9a]::ops::function::FnOnce<()>>::call_once::{shim:vtable#0}<unknown>
  1776. 1148.57 s > at <unknown source file>:<unknown line>
  1777. 1148.57 s > 15: <std[5167731717db2e51]::sys::thread::unix::Thread>::new::thread_start<unknown>
  1778. 1148.57 s > at <unknown source file>:<unknown line>
  1779. 1148.57 s > 16: start_thread<unknown>
  1780. 1148.57 s > at <unknown source file>:<unknown line>
  1781. 1148.57 s > 17: __clone3<unknown>
  1782. 1148.57 s > at <unknown source file>:<unknown line>
  1783. 1148.57 s >
  1784. 1148.57 s > Run with COLORBT_SHOW_HIDDEN=1 environment variable to disable frame filtering.
  1785. 1148.57 s > Run with RUST_BACKTRACE=full to include source snippets.
  1786. 1148.57 s > Warning: SpanTrace capture is Unsupported.
  1787. 1148.57 s > Ensure that you've setup a tracing-error ErrorLayer and the semver versions are compatible
  1788. 1148.57 s >
  1789. 1148.57 s > 5. gammaloop-integration-tests::test_runs::profile_bulk::massless_triangle_bulk_profile_passes
  1790. 1148.57 s > failure: test failure with exit code 101
  1791. 1148.57 s > Error:
  1792. 1148.57 s > 0: IR profiling requested arbitrary precision but received a quad-precision result
  1793. 1148.57 s >
  1794. 1148.57 s > Location:
  1795. 1148.57 s > crates/gammalooprs/src/integrands/process/ir.rs:2123
  1796. 1148.57 s >
  1797. 1148.57 s > ━━━━━━━━━━━━━━━━━━━━━━━━━━━━━━━━━━ BACKTRACE ━━━━━━━━━━━━━━━━━━━━━━━━━━━━━━━━━━━
  1798. 1148.57 s > 1: <color_eyre[bb06c27fa12d52c3]::config::EyreHook>::into_eyre_hook::{closure#0}<unknown>
  1799. 1148.57 s > at <unknown source file>:<unknown line>
  1800. 1148.57 s > 2: eyre[9f660d63ab6a72c5]::capture_handler<unknown>
  1801. 1148.57 s > at <unknown source file>:<unknown line>
  1802. 1148.57 s > 3: eyre[9f660d63ab6a72c5]::private::format_err<unknown>
  1803. 1148.57 s > at <unknown source file>:<unknown line>
  1804. 1148.57 s > 4: gammalooprs[1b273202b0029755]::integrands::process::ir::evaluate_profile_momentum_point_arb::<gammalooprs[1b273202b0029755]::integrands::process::amplitude::AmplitudeIntegrand><unknown>
  1805. 1148.57 s > at <unknown source file>:<unknown line>
  1806. 1148.57 s > 5: <gammalooprs[1b273202b0029755]::integrands::process::amplitude::AmplitudeIntegrand>::test_single_ir_limit_impl<unknown>
  1807. 1148.57 s > at <unknown source file>:<unknown line>
  1808. 1148.57 s > 6: gammalooprs[1b273202b0029755]::integrands::process::ir::run_ir_profile::<gammalooprs[1b273202b0029755]::integrands::process::amplitude::AmplitudeIntegrand, <gammalooprs[1b273202b0029755]::integrands::process::amplitude::AmplitudeIntegrand>::enumerate_ir_limits, <gammalooprs[1b273202b0029755]::integrands::process::amplitude::AmplitudeIntegrand>::graph_cut_definitions, <gammalooprs[1b273202b0029755]::integrands::process::amplitude::AmplitudeIntegrand>::test_single_ir_limit_impl><unknown>
  1809. 1148.57 s > at <unknown source file>:<unknown line>
  1810. 1148.57 s > 7: <gammalooprs[1b273202b0029755]::integrands::process::amplitude::AmplitudeIntegrand>::test_ir<unknown>
  1811. 1148.57 s > at <unknown source file>:<unknown line>
  1812. 1148.57 s > 8: <gammaloop_api[9fdde70dfc7501ea]::commands::profile::Profile>::run<unknown>
  1813. 1148.57 s > at <unknown source file>:<unknown line>
  1814. 1148.57 s > 9: test_runs[928b8788563090d0]::profile_bulk::massless_triangle_bulk_profile_passes<unknown>
  1815. 1148.57 s > at <unknown source file>:<unknown line>
  1816. 1148.57 s > 10: <test_runs[928b8788563090d0]::profile_bulk::massless_triangle_bulk_profile_passes::{closure#0} as core[8c5ac2f034688f9a]::ops::function::FnOnce<()>>::call_once<unknown>
  1817. 1148.57 s > at <unknown source file>:<unknown line>
  1818. 1148.57 s > 11: test[7974841f8dbd3561]::__rust_begin_short_backtrace::<core[8c5ac2f034688f9a]::result::Result<(), alloc[93e694a8365d93dd]::string::String>, fn() -> core[8c5ac2f034688f9a]::result::Result<(), alloc[93e694a8365d93dd]::string::String>><unknown>
  1819. 1148.57 s > at <unknown source file>:<unknown line>
  1820. 1148.57 s > 12: test[7974841f8dbd3561]::run_test::{closure#0}<unknown>
  1821. 1148.57 s > at <unknown source file>:<unknown line>
  1822. 1148.57 s > 13: std[5167731717db2e51]::sys::backtrace::__rust_begin_short_backtrace::<test[7974841f8dbd3561]::run_test::{closure#1}, ()><unknown>
  1823. 1148.57 s > at <unknown source file>:<unknown line>
  1824. 1148.57 s > 14: <std[5167731717db2e51]::thread::lifecycle::spawn_unchecked<test[7974841f8dbd3561]::run_test::{closure#1}, ()>::{closure#1} as core[8c5ac2f034688f9a]::ops::function::FnOnce<()>>::call_once::{shim:vtable#0}<unknown>
  1825. 1148.57 s > at <unknown source file>:<unknown line>
  1826. 1148.57 s > 15: <std[5167731717db2e51]::sys::thread::unix::Thread>::new::thread_start<unknown>
  1827. 1148.57 s > at <unknown source file>:<unknown line>
  1828. 1148.57 s > 16: start_thread<unknown>
  1829. 1148.57 s > at <unknown source file>:<unknown line>
  1830. 1148.57 s > 17: __clone3<unknown>
  1831. 1148.57 s > at <unknown source file>:<unknown line>
  1832. 1148.57 s >
  1833. 1148.57 s > Run with COLORBT_SHOW_HIDDEN=1 environment variable to disable frame filtering.
  1834. 1148.57 s > Run with RUST_BACKTRACE=full to include source snippets.
  1835. 1148.57 s > Warning: SpanTrace capture is Unsupported.
  1836. 1148.57 s > Ensure that you've setup a tracing-error ErrorLayer and the semver versions are compatible
  1837. 1148.57 s > system-out
  1838. 1148.57 s > running 1 test
  1839. 1148.57 s > test profile_bulk::massless_triangle_bulk_profile_passes ... FAILED
  1840. 1148.57 s >
  1841. 1148.57 s > failures:
  1842. 1148.57 s >
  1843. 1148.57 s > failures:
  1844. 1148.57 s > profile_bulk::massless_triangle_bulk_profile_passes
  1845. 1148.57 s >
  1846. 1148.57 s > test result: FAILED. 0 passed; 1 failed; 0 ignored; 0 measured; 82 filtered out; finished in 0.32s
  1847. 1148.57 s > system-err
  1848. 1148.57 s > [2026-09-02 17:37:04.026] @gammaloop_api::se... INFO : Running command import model scalars
  1849. 1148.57 s > [2026-09-02 17:37:04.026] @import::model INFO : Loading built-in JSON model scalars-default
  1850. 1148.57 s > [2026-09-02 17:37:04.030] @gammalooprs::model INFO : The following 2 external parameters were forced to zero by the restriction card:
  1851. 1148.57 s > width_scalar_1, width_scalar_2
  1852. 1148.57 s > [2026-09-02 17:37:04.031] @gammaloop_api::se... INFO : Running command import graphs ./tests/resources/graphs/massless_triangle.dot
  1853. 1148.57 s > [2026-09-02 17:37:04.031] @commands::import INFO : Loading graphs from '/build/source/tests/resources/graphs/massless_triangle.dot'
  1854. 1148.57 s > [2026-09-02 17:37:04.034] @gammaloop_api::se... INFO : Running command generate
  1855. 1148.57 s > [2026-09-02 17:37:04.138] @commands::generate INFO :
  1856. 1148.57 s > Integrand generation summary
  1857. 1148.57 s > peak RAM 63.30 MiB | cores 1
  1858. 1148.57 s > ╭───────────┬─────────────────────┬─────────┬────────────┬────────────┬────────────────┬─────────────╮
  1859. 1148.57 s > │ integrand │ graph │ # evals │ expr build │ spenso │ symbolica eval │ compile │
  1860. 1148.57 s > ├───────────┼─────────────────────┼─────────┼────────────┼────────────┼────────────────┼─────────────┤
  1861. 1148.57 s > │ default │ massless_triangle_0 │ 9 │ 30ms (73%) │ 2ms (6.8%) │ 8ms (20%) │ 0ms (0.00%) │
  1862. 1148.57 s > ├───────────┼─────────────────────┼─────────┼────────────┼────────────┼────────────────┼─────────────┤
  1863. 1148.57 s > │ Total │ │ 9 │ 30ms (73%) │ 2ms (6.8%) │ 8ms (20%) │ 0ms (0.00%) │
  1864. 1148.57 s > ╰───────────┴─────────────────────┴─────────┴────────────┴────────────┴────────────────┴─────────────╯
  1865. 1148.57 s > [2026-09-02 17:37:04.140] @process::amplitude INFO : Input is above threshold: 2 existing threshold E-surfaces across 1/1 graph groups
  1866. 1148.57 s > [2026-09-02 17:37:04.140] @process::amplitude INFO : overlap structure of group 0: [2: [0(1,5), 1(1,3)]]
  1867. 1148.57 s > Error:
  1868. 1148.57 s > 0: IR profiling requested arbitrary precision but received a quad-precision result
  1869. 1148.57 s >
  1870. 1148.57 s > Location:
  1871. 1148.57 s > crates/gammalooprs/src/integrands/process/ir.rs:2123
  1872. 1148.57 s >
  1873. 1148.57 s > ━━━━━━━━━━━━━━━━━━━━━━━━━━━━━━━━━━ BACKTRACE ━━━━━━━━━━━━━━━━━━━━━━━━━━━━━━━━━━━
  1874. 1148.57 s > 1: <color_eyre[bb06c27fa12d52c3]::config::EyreHook>::into_eyre_hook::{closure#0}<unknown>
  1875. 1148.57 s > at <unknown source file>:<unknown line>
  1876. 1148.57 s > 2: eyre[9f660d63ab6a72c5]::capture_handler<unknown>
  1877. 1148.57 s > at <unknown source file>:<unknown line>
  1878. 1148.57 s > 3: eyre[9f660d63ab6a72c5]::private::format_err<unknown>
  1879. 1148.57 s > at <unknown source file>:<unknown line>
  1880. 1148.57 s > 4: gammalooprs[1b273202b0029755]::integrands::process::ir::evaluate_profile_momentum_point_arb::<gammalooprs[1b273202b0029755]::integrands::process::amplitude::AmplitudeIntegrand><unknown>
  1881. 1148.57 s > at <unknown source file>:<unknown line>
  1882. 1148.57 s > 5: <gammalooprs[1b273202b0029755]::integrands::process::amplitude::AmplitudeIntegrand>::test_single_ir_limit_impl<unknown>
  1883. 1148.57 s > at <unknown source file>:<unknown line>
  1884. 1148.57 s > 6: gammalooprs[1b273202b0029755]::integrands::process::ir::run_ir_profile::<gammalooprs[1b273202b0029755]::integrands::process::amplitude::AmplitudeIntegrand, <gammalooprs[1b273202b0029755]::integrands::process::amplitude::AmplitudeIntegrand>::enumerate_ir_limits, <gammalooprs[1b273202b0029755]::integrands::process::amplitude::AmplitudeIntegrand>::graph_cut_definitions, <gammalooprs[1b273202b0029755]::integrands::process::amplitude::AmplitudeIntegrand>::test_single_ir_limit_impl><unknown>
  1885. 1148.57 s > at <unknown source file>:<unknown line>
  1886. 1148.57 s > 7: <gammalooprs[1b273202b0029755]::integrands::process::amplitude::AmplitudeIntegrand>::test_ir<unknown>
  1887. 1148.57 s > at <unknown source file>:<unknown line>
  1888. 1148.57 s > 8: <gammaloop_api[9fdde70dfc7501ea]::commands::profile::Profile>::run<unknown>
  1889. 1148.57 s > at <unknown source file>:<unknown line>
  1890. 1148.57 s > 9: test_runs[928b8788563090d0]::profile_bulk::massless_triangle_bulk_profile_passes<unknown>
  1891. 1148.57 s > at <unknown source file>:<unknown line>
  1892. 1148.57 s > 10: <test_runs[928b8788563090d0]::profile_bulk::massless_triangle_bulk_profile_passes::{closure#0} as core[8c5ac2f034688f9a]::ops::function::FnOnce<()>>::call_once<unknown>
  1893. 1148.57 s > at <unknown source file>:<unknown line>
  1894. 1148.57 s > 11: test[7974841f8dbd3561]::__rust_begin_short_backtrace::<core[8c5ac2f034688f9a]::result::Result<(), alloc[93e694a8365d93dd]::string::String>, fn() -> core[8c5ac2f034688f9a]::result::Result<(), alloc[93e694a8365d93dd]::string::String>><unknown>
  1895. 1148.57 s > at <unknown source file>:<unknown line>
  1896. 1148.57 s > 12: test[7974841f8dbd3561]::run_test::{closure#0}<unknown>
  1897. 1148.57 s > at <unknown source file>:<unknown line>
  1898. 1148.57 s > 13: std[5167731717db2e51]::sys::backtrace::__rust_begin_short_backtrace::<test[7974841f8dbd3561]::run_test::{closure#1}, ()><unknown>
  1899. 1148.57 s > at <unknown source file>:<unknown line>
  1900. 1148.57 s > 14: <std[5167731717db2e51]::thread::lifecycle::spawn_unchecked<test[7974841f8dbd3561]::run_test::{closure#1}, ()>::{closure#1} as core[8c5ac2f034688f9a]::ops::function::FnOnce<()>>::call_once::{shim:vtable#0}<unknown>
  1901. 1148.57 s > at <unknown source file>:<unknown line>
  1902. 1148.57 s > 15: <std[5167731717db2e51]::sys::thread::unix::Thread>::new::thread_start<unknown>
  1903. 1148.57 s > at <unknown source file>:<unknown line>
  1904. 1148.57 s > 16: start_thread<unknown>
  1905. 1148.57 s > at <unknown source file>:<unknown line>
  1906. 1148.57 s > 17: __clone3<unknown>
  1907. 1148.57 s > at <unknown source file>:<unknown line>
  1908. 1148.57 s >
  1909. 1148.57 s > Run with COLORBT_SHOW_HIDDEN=1 environment variable to disable frame filtering.
  1910. 1148.57 s > Run with RUST_BACKTRACE=full to include source snippets.
  1911. 1148.57 s > Warning: SpanTrace capture is Unsupported.
  1912. 1148.57 s > Ensure that you've setup a tracing-error ErrorLayer and the semver versions are compatible
  1913. 1148.57 s >
  1914. 1148.57 s > 6. gammaloop-integration-tests::test_runs::profile_bulk::scalar_self_energy_amp_bulk_profile_passes
  1915. 1148.57 s > failure: test failure with exit code 101
  1916. 1148.57 s > Error:
  1917. 1148.57 s > 0: IR profiling requested arbitrary precision but received a quad-precision result
  1918. 1148.57 s >
  1919. 1148.57 s > Location:
  1920. 1148.57 s > crates/gammalooprs/src/integrands/process/ir.rs:2123
  1921. 1148.57 s >
  1922. 1148.57 s > ━━━━━━━━━━━━━━━━━━━━━━━━━━━━━━━━━━ BACKTRACE ━━━━━━━━━━━━━━━━━━━━━━━━━━━━━━━━━━━
  1923. 1148.57 s > 1: <color_eyre[bb06c27fa12d52c3]::config::EyreHook>::into_eyre_hook::{closure#0}<unknown>
  1924. 1148.57 s > at <unknown source file>:<unknown line>
  1925. 1148.57 s > 2: eyre[9f660d63ab6a72c5]::capture_handler<unknown>
  1926. 1148.57 s > at <unknown source file>:<unknown line>
  1927. 1148.57 s > 3: eyre[9f660d63ab6a72c5]::private::format_err<unknown>
  1928. 1148.57 s > at <unknown source file>:<unknown line>
  1929. 1148.57 s > 4: gammalooprs[1b273202b0029755]::integrands::process::ir::evaluate_profile_momentum_point_arb::<gammalooprs[1b273202b0029755]::integrands::process::amplitude::AmplitudeIntegrand><unknown>
  1930. 1148.57 s > at <unknown source file>:<unknown line>
  1931. 1148.57 s > 5: <gammalooprs[1b273202b0029755]::integrands::process::amplitude::AmplitudeIntegrand>::test_single_ir_limit_impl<unknown>
  1932. 1148.57 s > at <unknown source file>:<unknown line>
  1933. 1148.57 s > 6: gammalooprs[1b273202b0029755]::integrands::process::ir::run_ir_profile::<gammalooprs[1b273202b0029755]::integrands::process::amplitude::AmplitudeIntegrand, <gammalooprs[1b273202b0029755]::integrands::process::amplitude::AmplitudeIntegrand>::enumerate_ir_limits, <gammalooprs[1b273202b0029755]::integrands::process::amplitude::AmplitudeIntegrand>::graph_cut_definitions, <gammalooprs[1b273202b0029755]::integrands::process::amplitude::AmplitudeIntegrand>::test_single_ir_limit_impl><unknown>
  1934. 1148.57 s > at <unknown source file>:<unknown line>
  1935. 1148.57 s > 7: <gammalooprs[1b273202b0029755]::integrands::process::amplitude::AmplitudeIntegrand>::test_ir<unknown>
  1936. 1148.57 s > at <unknown source file>:<unknown line>
  1937. 1148.57 s > 8: <gammaloop_api[9fdde70dfc7501ea]::commands::profile::Profile>::run<unknown>
  1938. 1148.57 s > at <unknown source file>:<unknown line>
  1939. 1148.57 s > 9: test_runs[928b8788563090d0]::profile_bulk::scalar_self_energy_amp_bulk_profile_passes<unknown>
  1940. 1148.57 s > at <unknown source file>:<unknown line>
  1941. 1148.57 s > 10: <test_runs[928b8788563090d0]::profile_bulk::scalar_self_energy_amp_bulk_profile_passes::{closure#0} as core[8c5ac2f034688f9a]::ops::function::FnOnce<()>>::call_once<unknown>
  1942. 1148.57 s > at <unknown source file>:<unknown line>
  1943. 1148.57 s > 11: test[7974841f8dbd3561]::__rust_begin_short_backtrace::<core[8c5ac2f034688f9a]::result::Result<(), alloc[93e694a8365d93dd]::string::String>, fn() -> core[8c5ac2f034688f9a]::result::Result<(), alloc[93e694a8365d93dd]::string::String>><unknown>
  1944. 1148.57 s > at <unknown source file>:<unknown line>
  1945. 1148.57 s > 12: test[7974841f8dbd3561]::run_test::{closure#0}<unknown>
  1946. 1148.57 s > at <unknown source file>:<unknown line>
  1947. 1148.57 s > 13: std[5167731717db2e51]::sys::backtrace::__rust_begin_short_backtrace::<test[7974841f8dbd3561]::run_test::{closure#1}, ()><unknown>
  1948. 1148.57 s > at <unknown source file>:<unknown line>
  1949. 1148.57 s > 14: <std[5167731717db2e51]::thread::lifecycle::spawn_unchecked<test[7974841f8dbd3561]::run_test::{closure#1}, ()>::{closure#1} as core[8c5ac2f034688f9a]::ops::function::FnOnce<()>>::call_once::{shim:vtable#0}<unknown>
  1950. 1148.57 s > at <unknown source file>:<unknown line>
  1951. 1148.57 s > 15: <std[5167731717db2e51]::sys::thread::unix::Thread>::new::thread_start<unknown>
  1952. 1148.57 s > at <unknown source file>:<unknown line>
  1953. 1148.57 s > 16: start_thread<unknown>
  1954. 1148.57 s > at <unknown source file>:<unknown line>
  1955. 1148.57 s > 17: __clone3<unknown>
  1956. 1148.57 s > at <unknown source file>:<unknown line>
  1957. 1148.57 s >
  1958. 1148.57 s > Run with COLORBT_SHOW_HIDDEN=1 environment variable to disable frame filtering.
  1959. 1148.57 s > Run with RUST_BACKTRACE=full to include source snippets.
  1960. 1148.57 s > Warning: SpanTrace capture is Unsupported.
  1961. 1148.57 s > Ensure that you've setup a tracing-error ErrorLayer and the semver versions are compatible
  1962. 1148.57 s > system-out
  1963. 1148.57 s > running 1 test
  1964. 1148.57 s > test profile_bulk::scalar_self_energy_amp_bulk_profile_passes ... FAILED
  1965. 1148.57 s >
  1966. 1148.57 s > failures:
  1967. 1148.57 s >
  1968. 1148.57 s > failures:
  1969. 1148.57 s > profile_bulk::scalar_self_energy_amp_bulk_profile_passes
  1970. 1148.57 s >
  1971. 1148.57 s > test result: FAILED. 0 passed; 1 failed; 0 ignored; 0 measured; 82 filtered out; finished in 0.75s
  1972. 1148.57 s > system-err
  1973. 1148.57 s > [2026-09-02 17:37:04.211] @gammaloop_api::se... INFO : Running command import model ./assets/models/json/scalars/scalars.json
  1974. 1148.57 s > [2026-09-02 17:37:04.211] @import::model INFO : Loading JSON model scalars-default from /build/source/assets/models/json/scalars/scalars
  1975. 1148.57 s > [2026-09-02 17:37:04.214] @gammalooprs::model INFO : The following 2 external parameters were forced to zero by the restriction card:
  1976. 1148.57 s > width_scalar_1, width_scalar_2
  1977. 1148.57 s > [2026-09-02 17:37:04.215] @gammaloop_api::se... INFO : Running command import graphs ./tests/resources/graphs/scalar_self_energy_amp.dot
  1978. 1148.57 s > [2026-09-02 17:37:04.215] @commands::import INFO : Loading graphs from '/build/source/tests/resources/graphs/scalar_self_energy_amp.dot'
  1979. 1148.57 s > [2026-09-02 17:37:04.221] @gammaloop_api::se... INFO : Running command generate
  1980. 1148.57 s > [2026-09-02 17:37:04.660] @commands::generate INFO :
  1981. 1148.57 s > Integrand generation summary
  1982. 1148.57 s > peak RAM 70.36 MiB | cores 1
  1983. 1148.57 s > ╭───────────┬────────────────────────┬─────────┬─────────────┬────────────┬────────────────┬─────────────╮
  1984. 1148.57 s > │ integrand │ graph │ # evals │ expr build │ spenso │ symbolica eval │ compile │
  1985. 1148.57 s > ├───────────┼────────────────────────┼─────────┼─────────────┼────────────┼────────────────┼─────────────┤
  1986. 1148.57 s > │ default │ scalar_self_energy_amp │ 6 │ 368ms (94%) │ 8ms (2.2%) │ 13ms (3.6%) │ 0ms (0.00%) │
  1987. 1148.57 s > ├───────────┼────────────────────────┼─────────┼─────────────┼────────────┼────────────────┼─────────────┤
  1988. 1148.57 s > │ Total │ │ 6 │ 368ms (94%) │ 8ms (2.2%) │ 13ms (3.6%) │ 0ms (0.00%) │
  1989. 1148.57 s > ╰───────────┴────────────────────────┴─────────┴─────────────┴────────────┴────────────────┴─────────────╯
  1990. 1148.57 s > [2026-09-02 17:37:04.662] @process::amplitude INFO : Input is above threshold: 2 existing threshold E-surfaces across 1/1 graph groups
  1991. 1148.57 s > [2026-09-02 17:37:04.662] @process::amplitude INFO : overlap structure of group 0: [2: [2(1,5), 4(2,3,5)]]
  1992. 1148.57 s > Error:
  1993. 1148.57 s > 0: IR profiling requested arbitrary precision but received a quad-precision result
  1994. 1148.57 s >
  1995. 1148.57 s > Location:
  1996. 1148.57 s > crates/gammalooprs/src/integrands/process/ir.rs:2123
  1997. 1148.57 s >
  1998. 1148.57 s > ━━━━━━━━━━━━━━━━━━━━━━━━━━━━━━━━━━ BACKTRACE ━━━━━━━━━━━━━━━━━━━━━━━━━━━━━━━━━━━
  1999. 1148.57 s > 1: <color_eyre[bb06c27fa12d52c3]::config::EyreHook>::into_eyre_hook::{closure#0}<unknown>
  2000. 1148.57 s > at <unknown source file>:<unknown line>
  2001. 1148.57 s > 2: eyre[9f660d63ab6a72c5]::capture_handler<unknown>
  2002. 1148.57 s > at <unknown source file>:<unknown line>
  2003. 1148.57 s > 3: eyre[9f660d63ab6a72c5]::private::format_err<unknown>
  2004. 1148.57 s > at <unknown source file>:<unknown line>
  2005. 1148.57 s > 4: gammalooprs[1b273202b0029755]::integrands::process::ir::evaluate_profile_momentum_point_arb::<gammalooprs[1b273202b0029755]::integrands::process::amplitude::AmplitudeIntegrand><unknown>
  2006. 1148.57 s > at <unknown source file>:<unknown line>
  2007. 1148.57 s > 5: <gammalooprs[1b273202b0029755]::integrands::process::amplitude::AmplitudeIntegrand>::test_single_ir_limit_impl<unknown>
  2008. 1148.57 s > at <unknown source file>:<unknown line>
  2009. 1148.57 s > 6: gammalooprs[1b273202b0029755]::integrands::process::ir::run_ir_profile::<gammalooprs[1b273202b0029755]::integrands::process::amplitude::AmplitudeIntegrand, <gammalooprs[1b273202b0029755]::integrands::process::amplitude::AmplitudeIntegrand>::enumerate_ir_limits, <gammalooprs[1b273202b0029755]::integrands::process::amplitude::AmplitudeIntegrand>::graph_cut_definitions, <gammalooprs[1b273202b0029755]::integrands::process::amplitude::AmplitudeIntegrand>::test_single_ir_limit_impl><unknown>
  2010. 1148.57 s > at <unknown source file>:<unknown line>
  2011. 1148.57 s > 7: <gammalooprs[1b273202b0029755]::integrands::process::amplitude::AmplitudeIntegrand>::test_ir<unknown>
  2012. 1148.57 s > at <unknown source file>:<unknown line>
  2013. 1148.57 s > 8: <gammaloop_api[9fdde70dfc7501ea]::commands::profile::Profile>::run<unknown>
  2014. 1148.57 s > at <unknown source file>:<unknown line>
  2015. 1148.57 s > 9: test_runs[928b8788563090d0]::profile_bulk::scalar_self_energy_amp_bulk_profile_passes<unknown>
  2016. 1148.57 s > at <unknown source file>:<unknown line>
  2017. 1148.57 s > 10: <test_runs[928b8788563090d0]::profile_bulk::scalar_self_energy_amp_bulk_profile_passes::{closure#0} as core[8c5ac2f034688f9a]::ops::function::FnOnce<()>>::call_once<unknown>
  2018. 1148.57 s > at <unknown source file>:<unknown line>
  2019. 1148.57 s > 11: test[7974841f8dbd3561]::__rust_begin_short_backtrace::<core[8c5ac2f034688f9a]::result::Result<(), alloc[93e694a8365d93dd]::string::String>, fn() -> core[8c5ac2f034688f9a]::result::Result<(), alloc[93e694a8365d93dd]::string::String>><unknown>
  2020. 1148.57 s > at <unknown source file>:<unknown line>
  2021. 1148.57 s > 12: test[7974841f8dbd3561]::run_test::{closure#0}<unknown>
  2022. 1148.57 s > at <unknown source file>:<unknown line>
  2023. 1148.57 s > 13: std[5167731717db2e51]::sys::backtrace::__rust_begin_short_backtrace::<test[7974841f8dbd3561]::run_test::{closure#1}, ()><unknown>
  2024. 1148.57 s > at <unknown source file>:<unknown line>
  2025. 1148.57 s > 14: <std[5167731717db2e51]::thread::lifecycle::spawn_unchecked<test[7974841f8dbd3561]::run_test::{closure#1}, ()>::{closure#1} as core[8c5ac2f034688f9a]::ops::function::FnOnce<()>>::call_once::{shim:vtable#0}<unknown>
  2026. 1148.57 s > at <unknown source file>:<unknown line>
  2027. 1148.57 s > 15: <std[5167731717db2e51]::sys::thread::unix::Thread>::new::thread_start<unknown>
  2028. 1148.57 s > at <unknown source file>:<unknown line>
  2029. 1148.57 s > 16: start_thread<unknown>
  2030. 1148.57 s > at <unknown source file>:<unknown line>
  2031. 1148.57 s > 17: __clone3<unknown>
  2032. 1148.57 s > at <unknown source file>:<unknown line>
  2033. 1148.57 s >
  2034. 1148.57 s > Run with COLORBT_SHOW_HIDDEN=1 environment variable to disable frame filtering.
  2035. 1148.57 s > Run with RUST_BACKTRACE=full to include source snippets.
  2036. 1148.57 s > Warning: SpanTrace capture is Unsupported.
  2037. 1148.57 s > Ensure that you've setup a tracing-error ErrorLayer and the semver versions are compatible
  2038. 1148.57 s >
  2039. 1148.57 s > 7. gammaloop-integration-tests::uv::dod2_bubble_uv
  2040. 1148.57 s > failure: test failure with exit code 101
  2041. 1148.57 s > system-out
  2042. 1148.57 s > running 1 test
  2043. 1148.57 s > +-------------+-----------------+---------+--------+----------+-----------------------------------------------------------------------------------------------------------------------+-------+
  2044. 1148.57 s > | case | check | graph | status | sigma | threshold | error |
  2045. 1148.57 s > +-------------+-----------------+---------+--------+----------+-----------------------------------------------------------------------------------------------------------------------+-------+
  2046. 1148.57 s > | dod2_bubble | uv_profile | - | FAIL | - | - | - |
  2047. 1148.57 s > +-------------+-----------------+---------+--------+----------+-----------------------------------------------------------------------------------------------------------------------+-------+
  2048. 1148.57 s > | dod2_bubble | m_uv.inspect | inspect | pass | - | best inspect relative delta 1.000e0 >= 1000*accuracy 1.000e-7 (accuracy=1.000e-10, exponent=+8.0, seed=0, probes=10) | - |
  2049. 1148.57 s > +-------------+-----------------+---------+--------+----------+-----------------------------------------------------------------------------------------------------------------------+-------+
  2050. 1148.57 s > | dod2_bubble | m_uv.integrated | GL0 | pass | 0.0sigma | compatible within 2sigma | - |
  2051. 1148.57 s > +-------------+-----------------+---------+--------+----------+-----------------------------------------------------------------------------------------------------------------------+-------+
  2052. 1148.57 s > | dod2_bubble | rls.inspect | inspect | pass | - | best inspect relative delta 2.822e-3 >= 1000*accuracy 1.000e-7 (accuracy=1.000e-10, exponent=+2.0, seed=1, probes=10) | - |
  2053. 1148.57 s > +-------------+-----------------+---------+--------+----------+-----------------------------------------------------------------------------------------------------------------------+-------+
  2054. 1148.57 s > | dod2_bubble | rls.integrated | GL0 | pass | 0.0sigma | compatible within 2sigma | - |
  2055. 1148.57 s > +-------------+-----------------+---------+--------+----------+-----------------------------------------------------------------------------------------------------------------------+-------+
  2056. 1148.57 s > | dod2_bubble | mu_r.inspect | inspect | pass | - | best inspect relative delta 6.951e-1 >= 1000*accuracy 1.000e-7 (accuracy=1.000e-10, exponent=+0.0, seed=0, probes=10) | - |
  2057. 1148.57 s > +-------------+-----------------+---------+--------+----------+-----------------------------------------------------------------------------------------------------------------------+-------+
  2058. 1148.57 s > | dod2_bubble | target | - | pass | - | 2sigma | - |
  2059. 1148.57 s > +-------------+-----------------+---------+--------+----------+-----------------------------------------------------------------------------------------------------------------------+-------+
  2060. 1148.57 s > test dod2_bubble_uv ... FAILED
  2061. 1148.57 s >
  2062. 1148.57 s > failures:
  2063. 1148.57 s >
  2064. 1148.57 s > failures:
  2065. 1148.57 s > dod2_bubble_uv
  2066. 1148.57 s >
  2067. 1148.57 s > test result: FAILED. 0 passed; 1 failed; 0 ignored; 0 measured; 24 filtered out; finished in 37.46s
  2068. 1148.57 s > system-err
  2069. 1148.57 s > [2026-09-02 17:37:05.601] @gammaloop_api::se... INFO : Running command run generate
  2070. 1148.57 s > [2026-09-02 17:37:05.601] @gammaloop_api::se... INFO : Starting command block generate
  2071. 1148.57 s > [2026-09-02 17:37:05.601] @gammaloop_api::se... INFO : Running command import model scalars-default.json
  2072. 1148.57 s > [2026-09-02 17:37:05.601] @import::model INFO : Loading built-in JSON model scalars-default
  2073. 1148.57 s > [2026-09-02 17:37:05.605] @gammalooprs::model INFO : The following 2 external parameters were forced to zero by the restriction card:
  2074. 1148.57 s > width_scalar_1, width_scalar_2
  2075. 1148.57 s > [2026-09-02 17:37:05.605] @gammaloop_api::se... INFO : Running command remove processes
  2076. 1148.57 s > [2026-09-02 17:37:05.605] @gammaloop_api::se... INFO : Running command set global kv global.generation.uv.generate_integrated=true
  2077. 1148.57 s > [2026-09-02 17:37:05.605] @gammaloop_api::se... INFO : Running command import graphs ./tests/resources/graphs/scalar/dod2_bubble.dot -p bubble_dod2 -i scalar_bubble_below_thres
  2078. 1148.57 s > [2026-09-02 17:37:05.606] @commands::import INFO : Loading graphs from '/build/source/tests/resources/graphs/scalar/dod2_bubble.dot'
  2079. 1148.57 s > [2026-09-02 17:37:05.608] @gammaloop_api::se... INFO : Running command generate existing -p bubble_dod2 -i scalar_bubble_below_thres
  2080. 1148.57 s > [2026-09-02 17:37:05.608] @approx::local_4d [{#uv, #inspect, #integrated}] DEBUG : Rescaled momenta expanded
  2081. 1148.57 s > field value
  2082. 1148.57 s > res n-terms: 1, byte size: 3,expr:
  2083. 1148.57 s > 1
  2084. 1148.57 s > [2026-09-02 17:37:05.610] @approx::local_4d [{#uv, #inspect, #integrated}] DEBUG : Rescaled momenta expanded
  2085. 1148.57 s > field value
  2086. 1148.57 s > res n-terms: 1, byte size: 585,expr:
  2087. 1148.57 s > -SCALAR_COUPLING²·q₀(αᵉ².¹)·q₀(αᵉ³.¹)·q₂(αᵉ².¹)·q₂(αᵉ³.¹)
  2088. 1148.57 s > /(t²·denom(3,-q₀-q₂/t,mass_scalar_2²,-mass_scalar_2²+2·(q₀.q₂)/t+(q₂.q₂)/t²+(q₀.q₀))
  2089. 1148.57 s > ·denom(2,q₂/t,mass_scalar_2²,-mass_scalar_2²+(q₂.q₂)/t²))
  2090. 1148.57 s > [2026-09-02 17:37:05.615] @approx::final_integrand[{#generation, #profile, #uv, #graph, #summary}] DEBUG : Computed global numerator
  2091. 1148.57 s > field value
  2092. 1148.57 s > global_num n-terms: 1, byte size: 4,expr:
  2093. 1148.57 s > 1/2
  2094. 1148.57 s > span build_3d{span_context=true graph=GL0 current=subgraph=0, topo_order=0, dod=0}
  2095. 1148.57 s > [2026-09-02 17:37:05.624] @uv::approx [{#generation, #uv, #fourd}] DEBUG : Computing 4D
  2096. 1148.57 s > field value
  2097. 1148.57 s > simple subgraph(S_11,S_y)*Approx(subgraph(S_y,0)) of GL0
  2098. 1148.57 s > span compute_4d{span_context=true graph=GL0 current=subgraph=y, topo_order=1, dod=2 given=subgraph=0, topo_order=0, dod=0 reduced=SubSet { set: BitVec<usize, bitvec::order::Lsb0> { addr: 0x7fffec027530, head: 000000, bits: 6, capacity: 64 } [0, 0, 1, 1, 1, 1], id: PhantomData<linnet::half_edge::involution::Hedge> }}
  2099. 1148.57 s > [2026-09-02 17:37:05.624] @approx::local_4d [{#uv, #algebra, #integrated, #start}] DEBUG :
  2100. 1148.57 s > field value
  2101. 1148.57 s > integrand n-terms: 1, byte size: 409,expr:
  2102. 1148.57 s > SCALAR_COUPLING²·(q₀(αᵉ³.¹)+q₃(αᵉ³.¹))·q₀(αᵉ².¹)·q₀(αᵉ³.¹)·q₂(αᵉ².¹)
  2103. 1148.57 s > /(denom(2,q₂,mass_scalar_2²,-mass_scalar_2²+(q₂.q₂))·denom(3,q₃,mass_scalar_2²,-mass_scalar_2²+(q₃.q₃)))
  2104. 1148.57 s > reduced y
  2105. 1148.57 s > span grow{span_context=true current=subgraph=y, topo_order=1, dod=2 given=subgraph=0, topo_order=0, dod=0}
  2106. 1148.57 s > [2026-09-02 17:37:05.625] @approx::local_4d [{#uv, #inspect, #integrated}] DEBUG : Rescaled momenta expanded
  2107. 1148.57 s > field value
  2108. 1148.57 s > res n-terms: 1, byte size: 585,expr:
  2109. 1148.57 s > -SCALAR_COUPLING²·q₀(αᵉ².¹)·q₀(αᵉ³.¹)·q₂(αᵉ².¹)·q₂(αᵉ³.¹)
  2110. 1148.57 s > /(t²·denom(3,-q₀-q₂/t,mass_scalar_2²,-mass_scalar_2²+2·(q₀.q₂)/t+(q₂.q₂)/t²+(q₀.q₀))
  2111. 1148.57 s > ·denom(2,q₂/t,mass_scalar_2²,-mass_scalar_2²+(q₂.q₂)/t²))
  2112. 1148.57 s > span t{span_context=true current=subgraph=y, topo_order=1, dod=2 given=subgraph=0, topo_order=0, dod=0}
  2113. 1148.57 s > [2026-09-02 17:37:05.625] @approx::local_4d [{#uv, #integrated, #rescaled}] DEBUG : Rescaled expanded
  2114. 1148.57 s > field value
  2115. 1148.57 s > n_loops 1
  2116. 1148.57 s > res n-terms: 1, byte size: 707,expr:
  2117. 1148.57 s > -SCALAR_COUPLING²·q₀(αᵉ².¹)·q₀(αᵉ³.¹)·q₂(αᵉ².¹)·q₂(αᵉ³.¹)
  2118. 1148.57 s > /(t²·denom(3,-q₂,mUVexp²+t²·mass_scalar_2²,-mUV²+t²·(-mass_scalar_2²+2·(q₀.q₂)/t+(q₂.q₂)/t²+(q₀.q₀))+t²·mUVexp²)
  2119. 1148.57 s > ·denom(2,q₂,mUVexp²+t²·mass_scalar_2²,-mUV²+t²·(-mass_scalar_2²+(q₂.q₂)/t²)+t²·mUVexp²))
  2120. 1148.57 s > span t{span_context=true current=subgraph=y, topo_order=1, dod=2 given=subgraph=0, topo_order=0, dod=0}
  2121. 1148.57 s > [2026-09-02 17:37:05.626] @approx::local_4d [{#uv, #integrated, #series}] DEBUG : Series expanded
  2122. 1148.57 s > field value
  2123. 1148.57 s > res n-terms: 3, byte size: 1896,expr:
  2124. 1148.57 s > (1/2·SCALAR_COUPLING²·(2·mUVexp²-2·mass_scalar_2²)/(denom(2,q₂,mUVexp²,-mUV²+(q₂.q₂))²·denom(3,-q₂,mUVexp²,-mUV²+(q₂.q₂)))
  2125. 1148.57 s > -SCALAR_COUPLING²
  2126. 1148.57 s > ·(-1/2·(2·mUVexp²-2·mass_scalar_2²+2·(q₀.q₀))/denom(3,-q₂,mUVexp²,-mUV²+(q₂.q₂))
  2127. 1148.57 s > +4·(q₀.q₂)²/denom(3,-q₂,mUVexp²,-mUV²+(q₂.q₂))²
  2128. 1148.57 s > )/(denom(2,q₂,mUVexp²,-mUV²+(q₂.q₂))·denom(3,-q₂,mUVexp²,-mUV²+(q₂.q₂)))
  2129. 1148.57 s > )·q₀(αᵉ².¹)·q₀(αᵉ³.¹)·q₂(αᵉ².¹)·q₂(αᵉ³.¹)
  2130. 1148.57 s > +2·SCALAR_COUPLING²·(q₀.q₂)·q₀(αᵉ².¹)·q₀(αᵉ³.¹)·q₂(αᵉ².¹)·q₂(αᵉ³.¹)
  2131. 1148.57 s > /(t·denom(2,q₂,mUVexp²,-mUV²+(q₂.q₂))·denom(3,-q₂,mUVexp²,-mUV²+(q₂.q₂))²)
  2132. 1148.57 s > -SCALAR_COUPLING²·q₀(αᵉ².¹)·q₀(αᵉ³.¹)·q₂(αᵉ².¹)·q₂(αᵉ³.¹)
  2133. 1148.57 s > /(t²·denom(2,q₂,mUVexp²,-mUV²+(q₂.q₂))·denom(3,-q₂,mUVexp²,-mUV²+(q₂.q₂)))
  2134. 1148.57 s > span t{span_context=true current=subgraph=y, topo_order=1, dod=2 given=subgraph=0, topo_order=0, dod=0}
  2135. 1148.57 s > [2026-09-02 17:37:05.627] @approx::local_4d [{#uv, #integrated, #series}] DEBUG : Evaluated at t = 1
  2136. 1148.57 s > field value
  2137. 1148.57 s > res n-terms: 3, byte size: 1880,expr:
  2138. 1148.57 s > (1/2·SCALAR_COUPLING²·(2·mUVexp²-2·mass_scalar_2²)/(denom(2,q₂,mUVexp²,-mUV²+(q₂.q₂))²·denom(3,-q₂,mUVexp²,-mUV²+(q₂.q₂)))
  2139. 1148.57 s > -SCALAR_COUPLING²
  2140. 1148.57 s > ·(-1/2·(2·mUVexp²-2·mass_scalar_2²+2·(q₀.q₀))/denom(3,-q₂,mUVexp²,-mUV²+(q₂.q₂))
  2141. 1148.57 s > +4·(q₀.q₂)²/denom(3,-q₂,mUVexp²,-mUV²+(q₂.q₂))²
  2142. 1148.57 s > )/(denom(2,q₂,mUVexp²,-mUV²+(q₂.q₂))·denom(3,-q₂,mUVexp²,-mUV²+(q₂.q₂)))
  2143. 1148.57 s > )·q₀(αᵉ².¹)·q₀(αᵉ³.¹)·q₂(αᵉ².¹)·q₂(αᵉ³.¹)
  2144. 1148.57 s > -SCALAR_COUPLING²·q₀(αᵉ².¹)·q₀(αᵉ³.¹)·q₂(αᵉ².¹)·q₂(αᵉ³.¹)
  2145. 1148.57 s > /(denom(2,q₂,mUVexp²,-mUV²+(q₂.q₂))·denom(3,-q₂,mUVexp²,-mUV²+(q₂.q₂)))
  2146. 1148.57 s > +2·SCALAR_COUPLING²·(q₀.q₂)·q₀(αᵉ².¹)·q₀(αᵉ³.¹)·q₂(αᵉ².¹)·q₂(αᵉ³.¹)
  2147. 1148.57 s > /(denom(2,q₂,mUVexp²,-mUV²+(q₂.q₂))·denom(3,-q₂,mUVexp²,-mUV²+(q₂.q₂))²)
  2148. 1148.57 s > span t{span_context=true current=subgraph=y, topo_order=1, dod=2 given=subgraph=0, topo_order=0, dod=0}
  2149. 1148.57 s > [2026-09-02 17:37:05.629] @approx::local_4d [{#uv, #collect, #integrated}] DEBUG : After gamma chain collection
  2150. 1148.57 s > field value
  2151. 1148.57 s > expr n-terms: 3, byte size: 1880,expr:
  2152. 1148.57 s > (1/2·SCALAR_COUPLING²·(2·mUVexp²-2·mass_scalar_2²)/(denom(2,q₂,mUVexp²,-mUV²+(q₂.q₂))²·denom(3,-q₂,mUVexp²,-mUV²+(q₂.q₂)))
  2153. 1148.57 s > -SCALAR_COUPLING²
  2154. 1148.57 s > ·(-1/2·(2·mUVexp²-2·mass_scalar_2²+2·(q₀.q₀))/denom(3,-q₂,mUVexp²,-mUV²+(q₂.q₂))
  2155. 1148.58 s > +4·(q₀.q₂)²/denom(3,-q₂,mUVexp²,-mUV²+(q₂.q₂))²
  2156. 1148.58 s > )/(denom(2,q₂,mUVexp²,-mUV²+(q₂.q₂))·denom(3,-q₂,mUVexp²,-mUV²+(q₂.q₂)))
  2157. 1148.58 s > )·q₀(αᵉ².¹)·q₀(αᵉ³.¹)·q₂(αᵉ².¹)·q₂(αᵉ³.¹)
  2158. 1148.58 s > -SCALAR_COUPLING²·q₀(αᵉ².¹)·q₀(αᵉ³.¹)·q₂(αᵉ².¹)·q₂(αᵉ³.¹)
  2159. 1148.58 s > /(denom(2,q₂,mUVexp²,-mUV²+(q₂.q₂))·denom(3,-q₂,mUVexp²,-mUV²+(q₂.q₂)))
  2160. 1148.58 s > +2·SCALAR_COUPLING²·(q₀.q₂)·q₀(αᵉ².¹)·q₀(αᵉ³.¹)·q₂(αᵉ².¹)·q₂(αᵉ³.¹)
  2161. 1148.58 s > /(denom(2,q₂,mUVexp²,-mUV²+(q₂.q₂))·denom(3,-q₂,mUVexp²,-mUV²+(q₂.q₂))²)
  2162. 1148.58 s > span t{span_context=true current=subgraph=y, topo_order=1, dod=2 given=subgraph=0, topo_order=0, dod=0}
  2163. 1148.58 s > [2026-09-02 17:37:05.631] @approx::local_4d [{#profile, #uv, #collect, #integrated, #start, #trace}] DEBUG : After gamma schoonschip
  2164. 1148.58 s > field value
  2165. 1148.58 s > expr n-terms: 3, byte size: 1631,expr:
  2166. 1148.58 s > (1/2·SCALAR_COUPLING²·(2·mUVexp²-2·mass_scalar_2²)/(denom(2,q₂,mUVexp²,-mUV²+(q₂.q₂))²·denom(3,-q₂,mUVexp²,-mUV²+(q₂.q₂)))
  2167. 1148.58 s > -SCALAR_COUPLING²
  2168. 1148.58 s > ·(-1/2·(2·mUVexp²-2·mass_scalar_2²+2·(q₀.q₀))/denom(3,-q₂,mUVexp²,-mUV²+(q₂.q₂))
  2169. 1148.58 s > +4·(q₀.q₂)²/denom(3,-q₂,mUVexp²,-mUV²+(q₂.q₂))²
  2170. 1148.58 s > )/(denom(2,q₂,mUVexp²,-mUV²+(q₂.q₂))·denom(3,-q₂,mUVexp²,-mUV²+(q₂.q₂)))
  2171. 1148.58 s > )·(q₀.q₂)²
  2172. 1148.58 s > -SCALAR_COUPLING²·(q₀.q₂)²/(denom(2,q₂,mUVexp²,-mUV²+(q₂.q₂))·denom(3,-q₂,mUVexp²,-mUV²+(q₂.q₂)))
  2173. 1148.58 s > +2·SCALAR_COUPLING²·(q₀.q₂)·(q₀.q₂)²
  2174. 1148.58 s > /(denom(2,q₂,mUVexp²,-mUV²+(q₂.q₂))·denom(3,-q₂,mUVexp²,-mUV²+(q₂.q₂))²)
  2175. 1148.58 s > span t{span_context=true current=subgraph=y, topo_order=1, dod=2 given=subgraph=0, topo_order=0, dod=0}
  2176. 1148.58 s > [2026-09-02 17:37:05.633] @approx::local_4d [{#profile, #uv, #collect, #integrated, #start, #trace}] DEBUG : After gamma collection
  2177. 1148.58 s > field value
  2178. 1148.58 s > expr n-terms: 1, byte size: 1347,expr:
  2179. 1148.58 s > SCALAR_COUPLING²
  2180. 1148.58 s > ·(-denom(2,q₂,mUVexp²,-mUV²+(q₂.q₂))·denom(3,-q₂,mUVexp²,-mUV²+(q₂.q₂))²
  2181. 1148.58 s > +1/2·(2·mUVexp²-2·mass_scalar_2²)·denom(3,-q₂,mUVexp²,-mUV²+(q₂.q₂))²
  2182. 1148.58 s > -(-1/2·(2·mUVexp²-2·mass_scalar_2²+2·(q₀.q₀))·denom(3,-q₂,mUVexp²,-mUV²+(q₂.q₂))+4·(q₀.q₂)²)
  2183. 1148.58 s > ·denom(2,q₂,mUVexp²,-mUV²+(q₂.q₂))
  2184. 1148.58 s > +2·(q₀.q₂)·denom(2,q₂,mUVexp²,-mUV²+(q₂.q₂))·denom(3,-q₂,mUVexp²,-mUV²+(q₂.q₂))
  2185. 1148.58 s > )·(q₀.q₂)²/(denom(2,q₂,mUVexp²,-mUV²+(q₂.q₂))²·denom(3,-q₂,mUVexp²,-mUV²+(q₂.q₂))³)
  2186. 1148.58 s > span t{span_context=true current=subgraph=y, topo_order=1, dod=2 given=subgraph=0, topo_order=0, dod=0}
  2187. 1148.58 s > [2026-09-02 17:37:05.634] @approx::local_4d [{#profile, #uv, #gamma, #integrated, #start, #trace, #vakint}] DEBUG : After gamma simplification
  2188. 1148.58 s > ... omitted 3263 more lines; see full nextest output above
  2189. 1148.58 s >
  2190. 1148.58 s > 8. gammaloop-integration-tests::uv::sunrise_scalar_1_uv
  2191. 1148.58 s > failure: test failure with exit code 101
  2192. 1148.58 s > system-out
  2193. 1148.58 s > running 1 test
  2194. 1148.58 s > test sunrise_scalar_1_uv has been running for over 60 seconds
  2195. 1148.58 s > +------------------+------------------------+--------------+--------+----------+----------------------------------------------------------------------------------------------------------------------+-------+
  2196. 1148.58 s > | case | check | graph | status | sigma | threshold | error |
  2197. 1148.58 s > +------------------+------------------------+--------------+--------+----------+----------------------------------------------------------------------------------------------------------------------+-------+
  2198. 1148.58 s > | sunrise_scalar_1 | uv_profile | - | FAIL | - | - | - |
  2199. 1148.58 s > +------------------+------------------------+--------------+--------+----------+----------------------------------------------------------------------------------------------------------------------+-------+
  2200. 1148.58 s > | sunrise_scalar_1 | m_uv.inspect | inspect | pass | - | best inspect relative delta 1.624e0 >= 1000*accuracy 1.000e-3 (accuracy=1.000e-6, exponent=+1.0, seed=1, probes=10) | - |
  2201. 1148.58 s > +------------------+------------------------+--------------+--------+----------+----------------------------------------------------------------------------------------------------------------------+-------+
  2202. 1148.58 s > | sunrise_scalar_1 | m_uv.integrated | sunrise | pass | 0.1sigma | compatible within 2sigma | - |
  2203. 1148.58 s > +------------------+------------------------+--------------+--------+----------+----------------------------------------------------------------------------------------------------------------------+-------+
  2204. 1148.58 s > | sunrise_scalar_1 | rls.inspect | inspect | pass | - | best inspect relative delta 8.682e-1 >= 1000*accuracy 1.000e-3 (accuracy=1.000e-6, exponent=+1.0, seed=1, probes=10) | - |
  2205. 1148.58 s > +------------------+------------------------+--------------+--------+----------+----------------------------------------------------------------------------------------------------------------------+-------+
  2206. 1148.58 s > | sunrise_scalar_1 | rls.integrated | sunrise | pass | 0.0sigma | compatible within 2sigma | - |
  2207. 1148.58 s > +------------------+------------------------+--------------+--------+----------+----------------------------------------------------------------------------------------------------------------------+-------+
  2208. 1148.58 s > | sunrise_scalar_1 | mu_r.inspect | inspect | pass | - | best inspect relative delta 1.752e0 >= 1000*accuracy 1.000e-3 (accuracy=1.000e-6, exponent=+1.0, seed=1, probes=10) | - |
  2209. 1148.58 s > +------------------+------------------------+--------------+--------+----------+----------------------------------------------------------------------------------------------------------------------+-------+
  2210. 1148.58 s > | sunrise_scalar_1 | integrated.relerr | integrated | pass | - | relative error 9.20% <= 10.00% | - |
  2211. 1148.58 s > +------------------+------------------------+--------------+--------+----------+----------------------------------------------------------------------------------------------------------------------+-------+
  2212. 1148.58 s > | sunrise_scalar_1 | m_uv.integrated.relerr | m_uv-shifted | pass | - | relative error 5.89% <= 10.00% | - |
  2213. 1148.58 s > +------------------+------------------------+--------------+--------+----------+----------------------------------------------------------------------------------------------------------------------+-------+
  2214. 1148.58 s > | sunrise_scalar_1 | target | - | pass | - | 2sigma | - |
  2215. 1148.58 s > +------------------+------------------------+--------------+--------+----------+----------------------------------------------------------------------------------------------------------------------+-------+
  2216. 1148.58 s > test sunrise_scalar_1_uv ... FAILED
  2217. 1148.58 s >
  2218. 1148.58 s > failures:
  2219. 1148.58 s >
  2220. 1148.58 s > failures:
  2221. 1148.58 s > sunrise_scalar_1_uv
  2222. 1148.58 s >
  2223. 1148.58 s > test result: FAILED. 0 passed; 1 failed; 0 ignored; 0 measured; 24 filtered out; finished in 89.04s
  2224. 1148.58 s > system-err
  2225. 1148.58 s > [2026-09-02 17:37:09.726] @gammaloop_api::se... INFO : Running command run generate
  2226. 1148.58 s > [2026-09-02 17:37:09.726] @gammaloop_api::se... INFO : Starting command block generate
  2227. 1148.58 s > [2026-09-02 17:37:09.726] @gammaloop_api::se... INFO : Running command import model scalars-default.json
  2228. 1148.58 s > [2026-09-02 17:37:09.726] @import::model INFO : Loading built-in JSON model scalars-default
  2229. 1148.58 s > [2026-09-02 17:37:09.730] @gammalooprs::model INFO : The following 2 external parameters were forced to zero by the restriction card:
  2230. 1148.58 s > width_scalar_1, width_scalar_2
  2231. 1148.58 s > [2026-09-02 17:37:09.730] @gammaloop_api::se... INFO : Running command remove processes
  2232. 1148.58 s > [2026-09-02 17:37:09.730] @gammaloop_api::se... INFO : Running command set global kv global.generation.uv.generate_integrated=true
  2233. 1148.58 s > [2026-09-02 17:37:09.731] @gammaloop_api::se... INFO : Running command import graphs ./tests/resources/graphs/scalar_sunrise.dot -p sunrise_scalar_1 -i scalar_sunrise
  2234. 1148.58 s > [2026-09-02 17:37:09.731] @commands::import INFO : Loading graphs from '/build/source/tests/resources/graphs/scalar_sunrise.dot'
  2235. 1148.58 s > [2026-09-02 17:37:09.733] @gammaloop_api::se... INFO : Running command generate existing -p sunrise_scalar_1 -i scalar_sunrise
  2236. 1148.58 s > [2026-09-02 17:37:09.735] @approx::local_4d [{#uv, #inspect, #integrated}] DEBUG : Rescaled momenta expanded
  2237. 1148.58 s > field value
  2238. 1148.58 s > res n-terms: 1, byte size: 777,expr:
  2239. 1148.58 s > 1/(denom(0,q₀/t,mass_scalar_1²,-mass_scalar_1²+(q₀.q₀)/t²)·denom(1,q₁/t,mass_scalar_1²,-mass_scalar_1²+(q₁.q₁)/t²)
  2240. 1148.58 s > ·denom(2,q₄-q₀/t-q₁/t,mass_scalar_1²,
  2241. 1148.58 s > -mass_scalar_1²-2·(q₀.q₄)/t-2·(q₁.q₄)/t+(q₀.q₀)/t²+2·(q₀.q₁)/t²
  2242. 1148.58 s > +(q₁.q₁)/t²+(q₄.q₄)
  2243. 1148.58 s > ))
  2244. 1148.58 s > [2026-09-02 17:37:09.749] @approx::local_4d [{#uv, #inspect, #integrated}] DEBUG : Rescaled momenta expanded
  2245. 1148.58 s > field value
  2246. 1148.58 s > res n-terms: 1, byte size: 611,expr:
  2247. 1148.58 s > 1/(denom(0,q₀/t,mass_scalar_1²,-mass_scalar_1²+(q₀.q₀)/t²)
  2248. 1148.58 s > ·denom(2,-q₁+q₃-q₀/t,mass_scalar_1²,
  2249. 1148.58 s > -mass_scalar_1²+2·(q₀.q₁)/t-2·(q₀.q₃)/t+(q₀.q₀)/t²+(q₁.q₁)
  2250. 1148.58 s > -2·(q₁.q₃)+(q₃.q₃)
  2251. 1148.58 s > ))
  2252. 1148.58 s > [2026-09-02 17:37:09.750] @approx::local_4d [{#uv, #inspect, #integrated}] DEBUG : Rescaled momenta expanded
  2253. 1148.58 s > field value
  2254. 1148.58 s > res n-terms: 1, byte size: 611,expr:
  2255. 1148.58 s > 1/(denom(1,q₁/t,mass_scalar_1²,-mass_scalar_1²+(q₁.q₁)/t²)
  2256. 1148.58 s > ·denom(2,-q₀+q₃-q₁/t,mass_scalar_1²,
  2257. 1148.58 s > -mass_scalar_1²+2·(q₀.q₁)/t-2·(q₁.q₃)/t+(q₁.q₁)/t²+(q₀.q₀)
  2258. 1148.58 s > -2·(q₀.q₃)+(q₃.q₃)
  2259. 1148.58 s > ))
  2260. 1148.58 s > [2026-09-02 17:37:09.751] @approx::local_4d [{#uv, #inspect, #integrated}] DEBUG : Rescaled momenta expanded
  2261. 1148.58 s > field value
  2262. 1148.58 s > res n-terms: 1, byte size: 3,expr:
  2263. 1148.58 s > 1
  2264. 1148.58 s > [2026-09-02 17:37:09.751] @approx::local_4d [{#uv, #inspect, #integrated}] DEBUG : Rescaled momenta expanded
  2265. 1148.58 s > field value
  2266. 1148.58 s > res n-terms: 1, byte size: 611,expr:
  2267. 1148.58 s > 1/(denom(0,q₀/t,mass_scalar_1²,-mass_scalar_1²+(q₀.q₀)/t²)
  2268. 1148.58 s > ·denom(1,-q₂+q₃-q₀/t,mass_scalar_1²,
  2269. 1148.58 s > -mass_scalar_1²+2·(q₀.q₂)/t-2·(q₀.q₃)/t+(q₀.q₀)/t²+(q₂.q₂)
  2270. 1148.58 s > -2·(q₂.q₃)+(q₃.q₃)
  2271. 1148.58 s > ))
  2272. 1148.58 s > [2026-09-02 17:37:09.752] @approx::final_integrand[{#generation, #profile, #uv, #graph, #summary}] DEBUG : Computed global numerator
  2273. 1148.58 s > field value
  2274. 1148.58 s > global_num n-terms: 1, byte size: 3,expr:
  2275. 1148.58 s > 1
  2276. 1148.58 s > span build_3d{span_context=true graph=sunrise current=subgraph=0, topo_order=0, dod=0}
  2277. 1148.58 s > [2026-09-02 17:37:09.753] @uv::approx [{#generation, #uv, #fourd}] DEBUG : Computing 4D
  2278. 1148.58 s > field value
  2279. 1148.58 s > simple subgraph(S_47,S_44)*Approx(subgraph(S_44,0)) of sunrise
  2280. 1148.58 s > span compute_4d{span_context=true graph=sunrise current=subgraph=44, topo_order=1, dod=2 given=subgraph=0, topo_order=0, dod=0 reduced=SubSet { set: BitVec<usize, bitvec::order::Lsb0> { addr: 0x7fffec00d8c0, head: 000000, bits: 8, capacity: 64 } [0, 0, 1, 1, 1, 1, 1, 1], id: PhantomData<linnet::half_edge::involution::Hedge> }}
  2281. 1148.58 s > [2026-09-02 17:37:09.755] @approx::local_4d [{#uv, #algebra, #integrated, #start}] DEBUG :
  2282. 1148.58 s > field value
  2283. 1148.58 s > integrand n-terms: 1, byte size: 322,expr:
  2284. 1148.58 s > 1/(denom(0,q₀,mass_scalar_1²,-mass_scalar_1²+(q₀.q₀))·denom(1,q₁,mass_scalar_1²,-mass_scalar_1²+(q₁.q₁))
  2285. 1148.58 s > ·denom(2,q₂,mass_scalar_1²,-mass_scalar_1²+(q₂.q₂)))
  2286. 1148.58 s > reduced 44
  2287. 1148.58 s > span grow{span_context=true current=subgraph=44, topo_order=1, dod=2 given=subgraph=0, topo_order=0, dod=0}
  2288. 1148.58 s > [2026-09-02 17:37:09.756] @approx::local_4d [{#uv, #inspect, #integrated}] DEBUG : Rescaled momenta expanded
  2289. 1148.58 s > field value
  2290. 1148.58 s > res n-terms: 1, byte size: 777,expr:
  2291. 1148.58 s > 1/(denom(0,q₀/t,mass_scalar_1²,-mass_scalar_1²+(q₀.q₀)/t²)·denom(1,q₁/t,mass_scalar_1²,-mass_scalar_1²+(q₁.q₁)/t²)
  2292. 1148.58 s > ·denom(2,q₄-q₀/t-q₁/t,mass_scalar_1²,
  2293. 1148.58 s > -mass_scalar_1²-2·(q₀.q₄)/t-2·(q₁.q₄)/t+(q₀.q₀)/t²+2·(q₀.q₁)/t²
  2294. 1148.58 s > +(q₁.q₁)/t²+(q₄.q₄)
  2295. 1148.58 s > ))
  2296. 1148.58 s > span t{span_context=true current=subgraph=44, topo_order=1, dod=2 given=subgraph=0, topo_order=0, dod=0}
  2297. 1148.58 s > [2026-09-02 17:37:09.756] @approx::local_4d [{#uv, #integrated, #rescaled}] DEBUG : Rescaled expanded
  2298. 1148.58 s > field value
  2299. 1148.58 s > n_loops 2
  2300. 1148.58 s > res n-terms: 1, byte size: 982,expr:
  2301. 1148.58 s > 1/(t²
  2302. 1148.58 s > ·denom(2,-q₀-q₁,mUVexp²+t²·mass_scalar_1²,
  2303. 1148.58 s > -mUV²
  2304. 1148.58 s > +t²
  2305. 1148.58 s > ·(-mass_scalar_1²-2·(q₀.q₄)/t-2·(q₁.q₄)/t+(q₀.q₀)/t²+2·(q₀.q₁)/t²
  2306. 1148.58 s > +(q₁.q₁)/t²+(q₄.q₄)
  2307. 1148.58 s > )
  2308. 1148.58 s > +t²·mUVexp²
  2309. 1148.58 s > )
  2310. 1148.58 s > ·denom(0,q₀,mUVexp²+t²·mass_scalar_1²,-mUV²+t²·(-mass_scalar_1²+(q₀.q₀)/t²)+t²·mUVexp²)
  2311. 1148.58 s > ·denom(1,q₁,mUVexp²+t²·mass_scalar_1²,-mUV²+t²·(-mass_scalar_1²+(q₁.q₁)/t²)+t²·mUVexp²))
  2312. 1148.58 s > span t{span_context=true current=subgraph=44, topo_order=1, dod=2 given=subgraph=0, topo_order=0, dod=0}
  2313. 1148.58 s > [2026-09-02 17:37:09.757] @approx::local_4d [{#uv, #integrated, #series}] DEBUG : Series expanded
  2314. 1148.58 s > field value
  2315. 1148.58 s > res n-terms: 4, byte size: 3187,expr:
  2316. 1148.58 s > -1/2·(2·mUVexp²-2·mass_scalar_1²)
  2317. 1148.58 s > /(denom(0,q₀,mUVexp²,-mUV²+(q₀.q₀))·denom(1,q₁,mUVexp²,-mUV²+(q₁.q₁))²
  2318. 1148.58 s > ·denom(2,-q₀-q₁,mUVexp²,-mUV²+(q₀.q₀)+2·(q₀.q₁)+(q₁.q₁)))
  2319. 1148.58 s > +(-1/2·(2·mUVexp²-2·mass_scalar_1²)
  2320. 1148.58 s > /(denom(0,q₀,mUVexp²,-mUV²+(q₀.q₀))²
  2321. 1148.58 s > ·denom(2,-q₀-q₁,mUVexp²,-mUV²+(q₀.q₀)+2·(q₀.q₁)+(q₁.q₁)))
  2322. 1148.58 s > +(-1/2·(2·mUVexp²-2·mass_scalar_1²+2·(q₄.q₄))
  2323. 1148.58 s > /denom(2,-q₀-q₁,mUVexp²,-mUV²+(q₀.q₀)+2·(q₀.q₁)+(q₁.q₁))
  2324. 1148.58 s > +(-2·(q₀.q₄)-2·(q₁.q₄))²
  2325. 1148.58 s > /denom(2,-q₀-q₁,mUVexp²,-mUV²+(q₀.q₀)+2·(q₀.q₁)+(q₁.q₁))²
  2326. 1148.58 s > )
  2327. 1148.58 s > /(denom(0,q₀,mUVexp²,-mUV²+(q₀.q₀))
  2328. 1148.58 s > ·denom(2,-q₀-q₁,mUVexp²,-mUV²+(q₀.q₀)+2·(q₀.q₁)+(q₁.q₁)))
  2329. 1148.58 s > )/denom(1,q₁,mUVexp²,-mUV²+(q₁.q₁))
  2330. 1148.58 s > -(-2·(q₀.q₄)-2·(q₁.q₄))
  2331. 1148.58 s > /(t·denom(0,q₀,mUVexp²,-mUV²+(q₀.q₀))·denom(1,q₁,mUVexp²,-mUV²+(q₁.q₁))
  2332. 1148.58 s > ·denom(2,-q₀-q₁,mUVexp²,-mUV²+(q₀.q₀)+2·(q₀.q₁)+(q₁.q₁))²)
  2333. 1148.58 s > +1/(t²·denom(0,q₀,mUVexp²,-mUV²+(q₀.q₀))·denom(1,q₁,mUVexp²,-mUV²+(q₁.q₁))
  2334. 1148.58 s > ·denom(2,-q₀-q₁,mUVexp²,-mUV²+(q₀.q₀)+2·(q₀.q₁)+(q₁.q₁)))
  2335. 1148.58 s > span t{span_context=true current=subgraph=44, topo_order=1, dod=2 given=subgraph=0, topo_order=0, dod=0}
  2336. 1148.58 s > [2026-09-02 17:37:09.757] @approx::local_4d [{#uv, #integrated, #series}] DEBUG : Evaluated at t = 1
  2337. 1148.58 s > field value
  2338. 1148.58 s > res n-terms: 4, byte size: 3171,expr:
  2339. 1148.58 s > -1/2·(2·mUVexp²-2·mass_scalar_1²)
  2340. 1148.58 s > /(denom(0,q₀,mUVexp²,-mUV²+(q₀.q₀))·denom(1,q₁,mUVexp²,-mUV²+(q₁.q₁))²
  2341. 1148.58 s > ·denom(2,-q₀-q₁,mUVexp²,-mUV²+(q₀.q₀)+2·(q₀.q₁)+(q₁.q₁)))
  2342. 1148.58 s > -(-2·(q₀.q₄)-2·(q₁.q₄))
  2343. 1148.58 s > /(denom(0,q₀,mUVexp²,-mUV²+(q₀.q₀))·denom(1,q₁,mUVexp²,-mUV²+(q₁.q₁))
  2344. 1148.58 s > ... omitted 20090 more lines; see full nextest output above
  2345. 1148.58 s >
  2346. 1148.58 s > 9. gammaloop-integration-tests::uv::se1l_uv
  2347. 1148.58 s > failure: test failure with exit code 101
  2348. 1148.58 s > system-out
  2349. 1148.58 s > running 1 test
  2350. 1148.58 s > test se1l_uv has been running for over 60 seconds
  2351. 1148.58 s > +------+-----------------+---------+--------+----------+-----------------------------------------------------------------------------------------------------------------------+-------+
  2352. 1148.58 s > | case | check | graph | status | sigma | threshold | error |
  2353. 1148.58 s > +------+-----------------+---------+--------+----------+-----------------------------------------------------------------------------------------------------------------------+-------+
  2354. 1148.58 s > | se1l | uv_profile | - | FAIL | - | - | - |
  2355. 1148.58 s > +------+-----------------+---------+--------+----------+-----------------------------------------------------------------------------------------------------------------------+-------+
  2356. 1148.58 s > | se1l | m_uv.inspect | inspect | pass | - | best inspect relative delta 1.097e-1 >= 1000*accuracy 1.000e-7 (accuracy=1.000e-10, exponent=+2.0, seed=1, probes=10) | - |
  2357. 1148.58 s > +------+-----------------+---------+--------+----------+-----------------------------------------------------------------------------------------------------------------------+-------+
  2358. 1148.58 s > | se1l | m_uv.integrated | se1l | pass | 0.1sigma | compatible within 2sigma | - |
  2359. 1148.58 s > +------+-----------------+---------+--------+----------+-----------------------------------------------------------------------------------------------------------------------+-------+
  2360. 1148.58 s > | se1l | rls.inspect | inspect | pass | - | best inspect relative delta 4.499e-2 >= 1000*accuracy 1.000e-7 (accuracy=1.000e-10, exponent=+2.0, seed=1, probes=10) | - |
  2361. 1148.58 s > +------+-----------------+---------+--------+----------+-----------------------------------------------------------------------------------------------------------------------+-------+
  2362. 1148.58 s > | se1l | rls.integrated | se1l | pass | 0.0sigma | compatible within 2sigma | - |
  2363. 1148.58 s > +------+-----------------+---------+--------+----------+-----------------------------------------------------------------------------------------------------------------------+-------+
  2364. 1148.58 s > | se1l | mu_r.inspect | inspect | pass | - | best inspect relative delta 1.424e-1 >= 1000*accuracy 1.000e-7 (accuracy=1.000e-10, exponent=+2.0, seed=1, probes=10) | - |
  2365. 1148.58 s > +------+-----------------+---------+--------+----------+-----------------------------------------------------------------------------------------------------------------------+-------+
  2366. 1148.58 s > | se1l | target | - | pass | - | 2sigma | - |
  2367. 1148.58 s > +------+-----------------+---------+--------+----------+-----------------------------------------------------------------------------------------------------------------------+-------+
  2368. 1148.58 s > test se1l_uv ... FAILED
  2369. 1148.58 s >
  2370. 1148.58 s > failures:
  2371. 1148.58 s >
  2372. 1148.58 s > failures:
  2373. 1148.58 s > se1l_uv
  2374. 1148.58 s >
  2375. 1148.58 s > test result: FAILED. 0 passed; 1 failed; 0 ignored; 0 measured; 24 filtered out; finished in 98.90s
  2376. 1148.58 s > system-err
  2377. 1148.58 s > [2026-09-02 17:37:09.696] @gammaloop_api::se... INFO : Running command run generate
  2378. 1148.58 s > [2026-09-02 17:37:09.696] @gammaloop_api::se... INFO : Starting command block generate
  2379. 1148.58 s > [2026-09-02 17:37:09.696] @gammaloop_api::se... INFO : Running command import model sm-default
  2380. 1148.58 s > [2026-09-02 17:37:09.697] @import::model INFO : Loading built-in JSON model sm-default
  2381. 1148.58 s > [2026-09-02 17:37:09.719] @gammalooprs::model INFO : The following 11 external parameters were forced to zero by the restriction card:
  2382. 1148.58 s > lamWS, AWS, rhoWS, etaWS, ymc, yme, ymm, MC, Me, MM, WTau
  2383. 1148.58 s > [2026-09-02 17:37:09.719] @gammalooprs::model INFO : The following 34 vertex rules were removed by the restriction card:
  2384. 1148.58 s > V_82 -> (c~, d, G+) | V_83 -> (t~, d, G+) | V_84 -> (c~, s, G+) | V_85 -> (t~, s, G+) | V_86 -> (u~, b, G+) | V_87 -> (c~, b, G+) | V_90 -> (c~, d, W+) | V_91 -> (t~, d, W+) | V_92 -> (u~, s, W+) | V_94 -> (t~, s, W+) | V_95 -> (u~, b, W+) | V_96 -> (c~, b, W+) | V_101 -> (e+, e-, G0) | V_102 -> (mu+, mu-, G0) | V_104 -> (e+, e-, H) | V_105 -> (mu+, mu-, H) | V_110 -> (ve~, e-, G+) | V_111 -> (vm~, mu-, G+) | V_116 -> (b~, u, G-) | V_117 -> (d~, c, G-) | V_118 -> (s~, c, G-) | V_119 -> (b~, c, G-) | V_120 -> (d~, t, G-) | V_121 -> (s~, t, G-) | V_124 -> (s~, u, W-) | V_125 -> (b~, u, W-) | V_126 -> (d~, c, W-) | V_128 -> (b~, c, W-) | V_129 -> (d~, t, W-) | V_130 -> (s~, t, W-) | V_138 -> (c~, c, G0) | V_140 -> (c~, c, H) | V_145 -> (e+, ve, G-) | V_146 -> (mu+, vm, G-)
  2385. 1148.58 s > [2026-09-02 17:37:09.719] @gammalooprs::model INFO : The following 36 couplings were removed by the restriction card:
  2386. 1148.58 s > GC_13, GC_14, GC_16, GC_17, GC_18, GC_19, GC_20, GC_22, GC_23, GC_24, GC_25, GC_26, GC_28, GC_29, GC_42, GC_43, GC_44, GC_46, GC_47, GC_48, GC_84, GC_85, GC_86, GC_87, GC_88, GC_89, GC_90, GC_91, GC_92, GC_93, GC_101, GC_102, GC_103, GC_105, GC_106, GC_107
  2387. 1148.58 s > [2026-09-02 17:37:09.720] @gammaloop_api::se... INFO : Running command remove processes
  2388. 1148.58 s > [2026-09-02 17:37:09.720] @gammaloop_api::se... INFO : Running command set global kv global.generation.uv.generate_integrated=true
  2389. 1148.58 s > [2026-09-02 17:37:09.720] @gammaloop_api::se... INFO : Running command import graphs ./tests/resources/graphs/uv_tests/se1l.dot -p se1l -i se1l
  2390. 1148.58 s > [2026-09-02 17:37:09.720] @commands::import INFO : Loading graphs from '/build/source/tests/resources/graphs/uv_tests/se1l.dot'
  2391. 1148.58 s > [2026-09-02 17:37:09.723] @gammaloop_api::se... INFO : Running command generate existing -p se1l -i se1l
  2392. 1148.58 s > [2026-09-02 17:37:10.483] @commands::generate INFO :
  2393. 1148.58 s > Integrand generation summary
  2394. 1148.58 s > peak RAM 84.38 MiB | cores 1
  2395. 1148.58 s > ╭───────────┬───────┬─────────┬─────────────┬─────────────┬────────────────┬─────────────╮
  2396. 1148.58 s > │ integrand │ graph │ # evals │ expr build │ spenso │ symbolica eval │ compile │
  2397. 1148.58 s > ├───────────┼───────┼─────────┼─────────────┼─────────────┼────────────────┼─────────────┤
  2398. 1148.58 s > │ se1l │ se1l │ 5 │ 624ms (88%) │ 33ms (4.7%) │ 53ms (7.5%) │ 0ms (0.00%) │
  2399. 1148.58 s > ├───────────┼───────┼─────────┼─────────────┼─────────────┼────────────────┼─────────────┤
  2400. 1148.58 s > │ Total │ │ 5 │ 624ms (88%) │ 33ms (4.7%) │ 53ms (7.5%) │ 0ms (0.00%) │
  2401. 1148.58 s > ╰───────────┴───────┴─────────┴─────────────┴─────────────┴────────────────┴─────────────╯
  2402. 1148.58 s > [2026-09-02 17:37:10.484] @gammaloop_api::se... INFO : Running command set process -p se1l -i se1l kv general.m_uv=0.2
  2403. 1148.58 s > [2026-09-02 17:37:10.485] @gammaloop_api::se... INFO : Running command set process -p se1l -i se1l kv general.mu_r=0.2
  2404. 1148.58 s > [2026-09-02 17:37:10.485] @gammaloop_api::se... INFO : Running command set process -p se1l -i se1l kv general.renormalization_localization_scale=0.2
  2405. 1148.58 s > [2026-09-02 17:37:10.490] @gammaloop_api::se... INFO : Running command duplicate integrand -p se1l -i se1l --output_process_name se1l --output_integrand_name se1l_muv_shifted
  2406. 1148.58 s > [2026-09-02 17:37:10.492] @gammaloop_api::se... INFO : Running command set process -p se1l -i se1l_muv_shifted kv general.m_uv=0.5
  2407. 1148.58 s > [2026-09-02 17:37:10.492] @gammaloop_api::se... INFO : Running command duplicate integrand -p se1l -i se1l --output_process_name se1l --output_integrand_name se1l_rls_shifted
  2408. 1148.58 s > [2026-09-02 17:37:10.494] @gammaloop_api::se... INFO : Running command set process -p se1l -i se1l_rls_shifted kv general.renormalization_localization_scale=1
  2409. 1148.58 s > [2026-09-02 17:37:10.495] @gammaloop_api::se... INFO : Running command duplicate integrand -p se1l -i se1l --output_process_name se1l --output_integrand_name se1l_mur_shifted
  2410. 1148.58 s > [2026-09-02 17:37:10.498] @gammaloop_api::se... INFO : Running command set process -p se1l -i se1l_mur_shifted kv general.mu_r=0.8
  2411. 1148.58 s > [2026-09-02 17:37:10.503] @process::amplitude WARNING : External state 0 ('g', PDG 21, helicity +) is off shell: p^2 = +2.5e5, expected m^2 = +0e0 (|Δ| = +2.5e5). Fixed-helicity spinor/vector/tensor external states may be ill-defined at this kinematic point.
  2412. 1148.58 s > field value
  2413. 1148.58 s > span warm_up{integrand.name=se1l}
  2414. 1148.58 s > [2026-09-02 17:37:10.503] @process::amplitude WARNING : External state 1 ('g', PDG 21, helicity -) is off shell: p^2 = +2.5e5, expected m^2 = +0e0 (|Δ| = +2.5e5). Fixed-helicity spinor/vector/tensor external states may be ill-defined at this kinematic point.
  2415. 1148.58 s > field value
  2416. 1148.58 s > span warm_up{integrand.name=se1l}
  2417. 1148.58 s > [2026-09-02 17:37:10.503] @process::amplitude INFO : Input is above threshold: 1 existing threshold E-surfaces across 1/1 graph groups
  2418. 1148.58 s > field value
  2419. 1148.58 s > existing_esurfaces 1
  2420. 1148.58 s > group_count 1
  2421. 1148.58 s > groups_above_threshold 1
  2422. 1148.58 s > integrand se1l
  2423. 1148.58 s > span warm_up{integrand.name=se1l}
  2424. 1148.58 s > threshold_status above threshold
  2425. 1148.58 s > [2026-09-02 17:37:10.503] @process::amplitude INFO : overlap structure of group 0: [1: [0(2,3)]]
  2426. 1148.58 s > field value
  2427. 1148.58 s > span warm_up{integrand.name=se1l}
  2428. 1148.58 s > [2026-09-02 17:37:10.657] @commands::profile INFO :
  2429. 1148.58 s > ╭───────┬──────┬──────────┬───────┬─────┬──────────┬───────────╮
  2430. 1148.58 s > │ fixed │ → ∞ │ slope │ r2 │ DOD │ bare DOD │ inspect │
  2431. 1148.58 s > ├───────┼──────┼──────────┼───────┼─────┼──────────┼───────────┤
  2432. 1148.58 s > │ {} │ {e3} │ 1.639236 │ 0.904 │ 2 │ 2 │ arb retry │
  2433. 1148.58 s > │ {} │ {e2} │ 1.698834 │ 0.902 │ 2 │ 2 │ arb retry │
  2434. 1148.58 s > ╰───────┴──────┴──────────┴───────┴─────┴──────────┴───────────╯
  2435. 1148.58 s > [2026-09-02 17:37:10.657] @commands::profile INFO :
  2436. 1148.58 s > ╭───────┬──────┬─────────────┬──────────┬───────┬─────┬──────────┬───────────╮
  2437. 1148.58 s > │ fixed │ → ∞ │ orientation │ slope │ r2 │ DOD │ bare DOD │ inspect │
  2438. 1148.58 s > ├───────┼──────┼─────────────┼──────────┼───────┼─────┼──────────┼───────────┤
  2439. 1148.58 s > │ {} │ {e3} │ 00-+ │ 0.343429 │ 0.145 │ 0 │ 2 │ arb retry │
  2440. 1148.58 s > │ {} │ {e3} │ 00+- │ 0.342577 │ 0.135 │ 0 │ 2 │ arb retry │
  2441. 1148.58 s > │ {} │ {e2} │ 00-+ │ 0.385975 │ 0.161 │ 0 │ 2 │ arb retry │
  2442. 1148.58 s > │ {} │ {e2} │ 00+- │ 0.384920 │ 0.192 │ 0 │ 2 │ arb retry │
  2443. 1148.58 s > ╰───────┴──────┴─────────────┴──────────┴───────┴─────┴──────────┴───────────╯
  2444. 1148.58 s > [2026-09-02 17:37:10.658] @gammaloop_api::se... INFO : Running command set process kv integrator.target_relative_accuracy=0.001 integrator.n_increase=0 integrator.n_start=50000 integrator.n_max=400000 integrator.seed=1337
  2445. 1148.58 s > [2026-09-02 17:37:10.659] @commands::integrate INFO : Created workspace directory at /build/source/tests/artifacts/se1l/integration_workspace_se1l
  2446. 1148.58 s > [2026-09-02 17:37:10.680] @commands::integrate INFO : No integration state found, starting new integration
  2447. 1148.58 s > [2026-09-02 17:37:10.680] @commands::integrate INFO : Gammaloop now integrates se1l@se1l, se1l@se1l_muv_shifted, se1l@se1l_rls_shifted
  2448. 1148.58 s > [2026-09-02 17:37:10.681] @process::amplitude WARNING : External state 0 ('g', PDG 21, helicity +) is off shell: p^2 = +2.5e5, expected m^2 = +0e0 (|Δ| = +2.5e5). Fixed-helicity spinor/vector/tensor external states may be ill-defined at this kinematic point.
  2449. 1148.58 s > field value
  2450. 1148.58 s > span warm_up{integrand.name=se1l}
  2451. 1148.58 s > [2026-09-02 17:37:10.681] @process::amplitude WARNING : External state 1 ('g', PDG 21, helicity -) is off shell: p^2 = +2.5e5, expected m^2 = +0e0 (|Δ| = +2.5e5). Fixed-helicity spinor/vector/tensor external states may be ill-defined at this kinematic point.
  2452. 1148.58 s > field value
  2453. 1148.58 s > span warm_up{integrand.name=se1l}
  2454. 1148.58 s > [2026-09-02 17:37:10.681] @process::amplitude INFO : Input is above threshold: 1 existing threshold E-surfaces across 1/1 graph groups
  2455. 1148.58 s > field value
  2456. 1148.58 s > existing_esurfaces 1
  2457. 1148.58 s > group_count 1
  2458. 1148.58 s > groups_above_threshold 1
  2459. 1148.58 s > integrand se1l
  2460. 1148.58 s > span warm_up{integrand.name=se1l}
  2461. 1148.58 s > threshold_status above threshold
  2462. 1148.58 s > [2026-09-02 17:37:10.681] @process::amplitude INFO : overlap structure of group 0: [1: [0(2,3)]]
  2463. 1148.58 s > field value
  2464. 1148.58 s > span warm_up{integrand.name=se1l}
  2465. 1148.58 s > [2026-09-02 17:37:10.682] @process::amplitude WARNING : External state 0 ('g', PDG 21, helicity +) is off shell: p^2 = +2.5e5, expected m^2 = +0e0 (|Δ| = +2.5e5). Fixed-helicity spinor/vector/tensor external states may be ill-defined at this kinematic point.
  2466. 1148.58 s > field value
  2467. 1148.58 s > span warm_up{integrand.name=se1l_muv_shifted}
  2468. 1148.58 s > [2026-09-02 17:37:10.682] @process::amplitude WARNING : External state 1 ('g', PDG 21, helicity -) is off shell: p^2 = +2.5e5, expected m^2 = +0e0 (|Δ| = +2.5e5). Fixed-helicity spinor/vector/tensor external states may be ill-defined at this kinematic point.
  2469. 1148.58 s > field value
  2470. 1148.58 s > span warm_up{integrand.name=se1l_muv_shifted}
  2471. 1148.58 s > [2026-09-02 17:37:10.682] @process::amplitude INFO : Input is above threshold: 1 existing threshold E-surfaces across 1/1 graph groups
  2472. 1148.58 s > field value
  2473. 1148.58 s > existing_esurfaces 1
  2474. 1148.58 s > group_count 1
  2475. 1148.58 s > groups_above_threshold 1
  2476. 1148.58 s > integrand se1l_muv_shifted
  2477. 1148.58 s > span warm_up{integrand.name=se1l_muv_shifted}
  2478. 1148.58 s > threshold_status above threshold
  2479. 1148.58 s > [2026-09-02 17:37:10.682] @process::amplitude INFO : overlap structure of group 0: [1: [0(2,3)]]
  2480. 1148.58 s > field value
  2481. 1148.58 s > span warm_up{integrand.name=se1l_muv_shifted}
  2482. 1148.58 s > [2026-09-02 17:37:10.683] @process::amplitude WARNING : External state 0 ('g', PDG 21, helicity +) is off shell: p^2 = +2.5e5, expected m^2 = +0e0 (|Δ| = +2.5e5). Fixed-helicity spinor/vector/tensor external states may be ill-defined at this kinematic point.
  2483. 1148.58 s > field value
  2484. 1148.58 s > span warm_up{integrand.name=se1l_rls_shifted}
  2485. 1148.58 s > [2026-09-02 17:37:10.683] @process::amplitude WARNING : External state 1 ('g', PDG 21, helicity -) is off shell: p^2 = +2.5e5, expected m^2 = +0e0 (|Δ| = +2.5e5). Fixed-helicity spinor/vector/tensor external states may be ill-defined at this kinematic point.
  2486. 1148.58 s > field value
  2487. 1148.58 s > span warm_up{integrand.name=se1l_rls_shifted}
  2488. 1148.58 s > [2026-09-02 17:37:10.684] @process::amplitude INFO : Input is above threshold: 1 existing threshold E-surfaces across 1/1 graph groups
  2489. 1148.58 s > field value
  2490. 1148.58 s > existing_esurfaces 1
  2491. 1148.58 s > group_count 1
  2492. 1148.58 s > groups_above_threshold 1
  2493. 1148.58 s > integrand se1l_rls_shifted
  2494. 1148.58 s > span warm_up{integrand.name=se1l_rls_shifted}
  2495. 1148.58 s > threshold_status above threshold
  2496. 1148.58 s > ... omitted 1410 more lines; see full nextest output above
  2497. 1148.58 s > =========================================
  2498. 1148.58 s For full logs, run:
  2499. 1148.58 s nix log /nix/store/zpyfjihmv7i6ghxwmb5sjv51y6brg4wy-gammaloop-nextest-integration.drv
  2500. 1148.68 s Run failed.