1. 0.13 s $ /nix/store/9ypz3flqsrl5xl495mm8h645gadjsxi1-coreutils-9.11/bin/timeout --kill-after=15s 7200s /nix/store/23zk8sgzamrbmj1fday15szf7f2279s8-nix-2.34.7/bin/nix --extra-experimental-features nix-command --extra-experimental-features flakes flake clone git+https://github.com/alphal00p/gammaloop --dest /tmp/nix-ci-worker/stable-pwd/repo/
  2. 0.15 s Cloning into '/tmp/nix-ci-worker/stable-pwd/repo'...
  3. 1.54 s remote: Enumerating objects: 66333, done.
  4. 1.77 s remote: Counting objects: 0% (1/8984) remote: Counting objects: 1% (90/8984) remote: Counting objects: 2% (180/8984) remote: Counting objects: 3% (270/8984) remote: Counting objects: 4% (360/8984) remote: Counting objects: 5% (450/8984) remote: Counting objects: 6% (540/8984) remote: Counting objects: 7% (629/8984) remote: Counting objects: 8% (719/8984) remote: Counting objects: 9% (809/8984) remote: Counting objects: 10% (899/8984) remote: Counting objects: 11% (989/8984) remote: Counting objects: 12% (1079/8984) remote: Counting objects: 13% (1168/8984) remote: Counting objects: 14% (1258/8984) remote: Counting objects: 15% (1348/8984) remote: Counting objects: 16% (1438/8984) remote: Counting objects: 17% (1528/8984) remote: Counting objects: 18% (1618/8984) remote: Counting objects: 19% (1707/8984) remote: Counting objects: 20% (1797/8984) remote: Counting objects: 21% (1887/8984) remote: Counting objects: 22% (1977/8984) remote: Counting objects: 23% (2067/8984) remote: Counting objects: 24% (2157/8984) remote: Counting objects: 25% (2246/8984) remote: Counting objects: 26% (2336/8984) remote: Counting objects: 27% (2426/8984) remote: Counting objects: 28% (2516/8984) remote: Counting objects: 29% (2606/8984) remote: Counting objects: 30% (2696/8984) remote: Counting objects: 31% (2786/8984) remote: Counting objects: 32% (2875/8984) remote: Counting objects: 33% (2965/8984) remote: Counting objects: 34% (3055/8984) remote: Counting objects: 35% (3145/8984) remote: Counting objects: 36% (3235/8984) remote: Counting objects: 37% (3325/8984) remote: Counting objects: 38% (3414/8984) remote: Counting objects: 39% (3504/8984) remote: Counting objects: 40% (3594/8984) remote: Counting objects: 41% (3684/8984) remote: Counting objects: 42% (3774/8984) remote: Counting objects: 43% (3864/8984) remote: Counting objects: 44% (3953/8984) remote: Counting objects: 45% (4043/8984) remote: Counting objects: 46% (4133/8984) remote: Counting objects: 47% (4223/8984) remote: Counting objects: 48% (4313/8984) remote: Counting objects: 49% (4403/8984) remote: Counting objects: 50% (4492/8984) remote: Counting objects: 51% (4582/8984) remote: Counting objects: 52% (4672/8984) remote: Counting objects: 53% (4762/8984) remote: Counting objects: 54% (4852/8984) remote: Counting objects: 55% (4942/8984) remote: Counting objects: 56% (5032/8984) remote: Counting objects: 57% (5121/8984) remote: Counting objects: 58% (5211/8984) remote: Counting objects: 59% (5301/8984) remote: Counting objects: 60% (5391/8984) remote: Counting objects: 61% (5481/8984) remote: Counting objects: 62% (5571/8984) remote: Counting objects: 63% (5660/8984) remote: Counting objects: 64% (5750/8984) remote: Counting objects: 65% (5840/8984) remote: Counting objects: 66% (5930/8984) remote: Counting objects: 67% (6020/8984) remote: Counting objects: 68% (6110/8984) remote: Counting objects: 69% (6199/8984) remote: Counting objects: 70% (6289/8984) remote: Counting objects: 71% (6379/8984) remote: Counting objects: 72% (6469/8984) remote: Counting objects: 73% (6559/8984) remote: Counting objects: 74% (6649/8984) remote: Counting objects: 75% (6738/8984) remote: Counting objects: 76% (6828/8984) remote: Counting objects: 77% (6918/8984) remote: Counting objects: 78% (7008/8984) remote: Counting objects: 79% (7098/8984) remote: Counting objects: 80% (7188/8984) remote: Counting objects: 81% (7278/8984) remote: Counting objects: 82% (7367/8984) remote: Counting objects: 83% (7457/8984) remote: Counting objects: 84% (7547/8984) remote: Counting objects: 85% (7637/8984) remote: Counting objects: 86% (7727/8984) remote: Counting objects: 87% (7817/8984) remote: Counting objects: 88% (7906/8984) remote: Counting objects: 89% (7996/8984) remote: Counting objects: 90% (8086/8984) remote: Counting objects: 91% (8176/8984) remote: Counting objects: 92% (8266/8984) remote: Counting objects: 93% (8356/8984) remote: Counting objects: 94% (8445/8984) remote: Counting objects: 95% (8535/8984) remote: Counting objects: 96% (8625/8984) remote: Counting objects: 97% (8715/8984) remote: Counting objects: 98% (8805/8984) remote: Counting objects: 99% (8895/8984) remote: Counting objects: 100% (8984/8984) remote: Counting objects: 100% (8984/8984), done.
  5. 4.38 s remote: Compressing objects: 0% (1/2110) remote: Compressing objects: 1% (22/2110) remote: Compressing objects: 2% (43/2110) remote: Compressing objects: 3% (64/2110) remote: Compressing objects: 4% (85/2110) remote: Compressing objects: 5% (106/2110) remote: Compressing objects: 6% (127/2110) remote: Compressing objects: 7% (148/2110) remote: Compressing objects: 8% (169/2110) remote: Compressing objects: 9% (190/2110) remote: Compressing objects: 10% (211/2110) remote: Compressing objects: 11% (233/2110) remote: Compressing objects: 12% (254/2110) remote: Compressing objects: 13% (275/2110) remote: Compressing objects: 14% (296/2110) remote: Compressing objects: 15% (317/2110) remote: Compressing objects: 16% (338/2110) remote: Compressing objects: 17% (359/2110) remote: Compressing objects: 18% (380/2110) remote: Compressing objects: 19% (401/2110) remote: Compressing objects: 20% (422/2110) remote: Compressing objects: 20% (435/2110) remote: Compressing objects: 21% (444/2110) remote: Compressing objects: 22% (465/2110) remote: Compressing objects: 23% (486/2110) remote: Compressing objects: 24% (507/2110) remote: Compressing objects: 25% (528/2110) remote: Compressing objects: 25% (544/2110) remote: Compressing objects: 26% (549/2110) remote: Compressing objects: 27% (570/2110) remote: Compressing objects: 28% (591/2110) remote: Compressing objects: 29% (612/2110) remote: Compressing objects: 30% (633/2110) remote: Compressing objects: 31% (655/2110) remote: Compressing objects: 32% (676/2110) remote: Compressing objects: 33% (697/2110) remote: Compressing objects: 34% (718/2110) remote: Compressing objects: 35% (739/2110) remote: Compressing objects: 36% (760/2110) remote: Compressing objects: 37% (781/2110) remote: Compressing objects: 38% (802/2110) remote: Compressing objects: 39% (823/2110) remote: Compressing objects: 40% (844/2110) remote: Compressing objects: 41% (866/2110) remote: Compressing objects: 42% (887/2110) remote: Compressing objects: 43% (908/2110) remote: Compressing objects: 44% (929/2110) remote: Compressing objects: 45% (950/2110) remote: Compressing objects: 46% (971/2110) remote: Compressing objects: 47% (992/2110) remote: Compressing objects: 48% (1013/2110) remote: Compressing objects: 49% (1034/2110) remote: Compressing objects: 50% (1055/2110) remote: Compressing objects: 51% (1077/2110) remote: Compressing objects: 52% (1098/2110) remote: Compressing objects: 53% (1119/2110) remote: Compressing objects: 54% (1140/2110) remote: Compressing objects: 55% (1161/2110) remote: Compressing objects: 56% (1182/2110) remote: Compressing objects: 57% (1203/2110) remote: Compressing objects: 58% (1224/2110) remote: Compressing objects: 59% (1245/2110) remote: Compressing objects: 60% (1266/2110) remote: Compressing objects: 61% (1288/2110) remote: Compressing objects: 62% (1309/2110) remote: Compressing objects: 63% (1330/2110) remote: Compressing objects: 64% (1351/2110) remote: Compressing objects: 65% (1372/2110) remote: Compressing objects: 66% (1393/2110) remote: Compressing objects: 67% (1414/2110) remote: Compressing objects: 68% (1435/2110) remote: Compressing objects: 69% (1456/2110) remote: Compressing objects: 70% (1477/2110) remote: Compressing objects: 71% (1499/2110) remote: Compressing objects: 72% (1520/2110) remote: Compressing objects: 73% (1541/2110) remote: Compressing objects: 74% (1562/2110) remote: Compressing objects: 75% (1583/2110) remote: Compressing objects: 76% (1604/2110) remote: Compressing objects: 77% (1625/2110) remote: Compressing objects: 78% (1646/2110) remote: Compressing objects: 79% (1667/2110) remote: Compressing objects: 80% (1688/2110) remote: Compressing objects: 81% (1710/2110) remote: Compressing objects: 82% (1731/2110) remote: Compressing objects: 83% (1752/2110) remote: Compressing objects: 84% (1773/2110) remote: Compressing objects: 85% (1794/2110) remote: Compressing objects: 86% (1815/2110) remote: Compressing objects: 87% (1836/2110) remote: Compressing objects: 88% (1857/2110) remote: Compressing objects: 89% (1878/2110) remote: Compressing objects: 90% (1899/2110) remote: Compressing objects: 91% (1921/2110) remote: Compressing objects: 92% (1942/2110) remote: Compressing objects: 93% (1963/2110) remote: Compressing objects: 94% (1984/2110) remote: Compressing objects: 95% (2005/2110) remote: Compressing objects: 96% (2026/2110) remote: Compressing objects: 97% (2047/2110) remote: Compressing objects: 98% (2068/2110) remote: Compressing objects: 99% (2089/2110) remote: Compressing objects: 100% (2110/2110) remote: Compressing objects: 100% (2110/2110), done.
  6. 7.54 s Receiving objects: 0% (1/66333) Receiving objects: 1% (664/66333) Receiving objects: 2% (1327/66333) Receiving objects: 3% (1990/66333) Receiving objects: 4% (2654/66333) Receiving objects: 5% (3317/66333) Receiving objects: 6% (3980/66333) Receiving objects: 7% (4644/66333) Receiving objects: 8% (5307/66333), 9.34 MiB | 18.66 MiB/s Receiving objects: 9% (5970/66333), 9.34 MiB | 18.66 MiB/s Receiving objects: 10% (6634/66333), 9.34 MiB | 18.66 MiB/s Receiving objects: 11% (7297/66333), 9.34 MiB | 18.66 MiB/s Receiving objects: 12% (7960/66333), 9.34 MiB | 18.66 MiB/s Receiving objects: 13% (8624/66333), 9.34 MiB | 18.66 MiB/s Receiving objects: 14% (9287/66333), 9.34 MiB | 18.66 MiB/s Receiving objects: 15% (9950/66333), 9.34 MiB | 18.66 MiB/s Receiving objects: 16% (10614/66333), 9.34 MiB | 18.66 MiB/s Receiving objects: 17% (11277/66333), 9.34 MiB | 18.66 MiB/s Receiving objects: 18% (11940/66333), 9.34 MiB | 18.66 MiB/s Receiving objects: 19% (12604/66333), 9.34 MiB | 18.66 MiB/s Receiving objects: 20% (13267/66333), 9.34 MiB | 18.66 MiB/s Receiving objects: 21% (13930/66333), 9.34 MiB | 18.66 MiB/s Receiving objects: 22% (14594/66333), 9.34 MiB | 18.66 MiB/s Receiving objects: 23% (15257/66333), 9.34 MiB | 18.66 MiB/s Receiving objects: 24% (15920/66333), 9.34 MiB | 18.66 MiB/s Receiving objects: 25% (16584/66333), 9.34 MiB | 18.66 MiB/s Receiving objects: 26% (17247/66333), 9.34 MiB | 18.66 MiB/s Receiving objects: 27% (17910/66333), 9.34 MiB | 18.66 MiB/s Receiving objects: 28% (18574/66333), 9.34 MiB | 18.66 MiB/s Receiving objects: 29% (19237/66333), 9.34 MiB | 18.66 MiB/s Receiving objects: 30% (19900/66333), 9.34 MiB | 18.66 MiB/s Receiving objects: 31% (20564/66333), 9.34 MiB | 18.66 MiB/s Receiving objects: 32% (21227/66333), 9.34 MiB | 18.66 MiB/s Receiving objects: 33% (21890/66333), 9.34 MiB | 18.66 MiB/s Receiving objects: 34% (22554/66333), 9.34 MiB | 18.66 MiB/s Receiving objects: 35% (23217/66333), 9.34 MiB | 18.66 MiB/s Receiving objects: 35% (23223/66333), 9.34 MiB | 18.66 MiB/s Receiving objects: 36% (23880/66333), 25.93 MiB | 25.92 MiB/s Receiving objects: 37% (24544/66333), 25.93 MiB | 25.92 MiB/s Receiving objects: 38% (25207/66333), 25.93 MiB | 25.92 MiB/s Receiving objects: 39% (25870/66333), 25.93 MiB | 25.92 MiB/s Receiving objects: 40% (26534/66333), 25.93 MiB | 25.92 MiB/s Receiving objects: 41% (27197/66333), 25.93 MiB | 25.92 MiB/s Receiving objects: 42% (27860/66333), 25.93 MiB | 25.92 MiB/s Receiving objects: 43% (28524/66333), 25.93 MiB | 25.92 MiB/s Receiving objects: 44% (29187/66333), 25.93 MiB | 25.92 MiB/s Receiving objects: 45% (29850/66333), 25.93 MiB | 25.92 MiB/s Receiving objects: 46% (30514/66333), 25.93 MiB | 25.92 MiB/s Receiving objects: 47% (31177/66333), 25.93 MiB | 25.92 MiB/s Receiving objects: 48% (31840/66333), 25.93 MiB | 25.92 MiB/s Receiving objects: 49% (32504/66333), 25.93 MiB | 25.92 MiB/s Receiving objects: 50% (33167/66333), 25.93 MiB | 25.92 MiB/s Receiving objects: 51% (33830/66333), 25.93 MiB | 25.92 MiB/s Receiving objects: 52% (34494/66333), 25.93 MiB | 25.92 MiB/s Receiving objects: 53% (35157/66333), 25.93 MiB | 25.92 MiB/s Receiving objects: 54% (35820/66333), 25.93 MiB | 25.92 MiB/s Receiving objects: 55% (36484/66333), 25.93 MiB | 25.92 MiB/s Receiving objects: 56% (37147/66333), 25.93 MiB | 25.92 MiB/s Receiving objects: 57% (37810/66333), 25.93 MiB | 25.92 MiB/s Receiving objects: 58% (38474/66333), 25.93 MiB | 25.92 MiB/s Receiving objects: 59% (39137/66333), 25.93 MiB | 25.92 MiB/s Receiving objects: 60% (39800/66333), 45.68 MiB | 30.41 MiB/s Receiving objects: 61% (40464/66333), 45.68 MiB | 30.41 MiB/s Receiving objects: 62% (41127/66333), 45.68 MiB | 30.41 MiB/s Receiving objects: 63% (41790/66333), 45.68 MiB | 30.41 MiB/s Receiving objects: 64% (42454/66333), 45.68 MiB | 30.41 MiB/s Receiving objects: 65% (43117/66333), 45.68 MiB | 30.41 MiB/s Receiving objects: 66% (43780/66333), 45.68 MiB | 30.41 MiB/s Receiving objects: 67% (44444/66333), 45.68 MiB | 30.41 MiB/s Receiving objects: 68% (45107/66333), 45.68 MiB | 30.41 MiB/s Receiving objects: 69% (45770/66333), 45.68 MiB | 30.41 MiB/s Receiving objects: 70% (46434/66333), 45.68 MiB | 30.41 MiB/s Receiving objects: 71% (47097/66333), 45.68 MiB | 30.41 MiB/s Receiving objects: 72% (47760/66333), 45.68 MiB | 30.41 MiB/s Receiving objects: 73% (48424/66333), 45.68 MiB | 30.41 MiB/s Receiving objects: 73% (48916/66333), 62.18 MiB | 31.05 MiB/s Receiving objects: 74% (49087/66333), 62.18 MiB | 31.05 MiB/s Receiving objects: 75% (49750/66333), 62.18 MiB | 31.05 MiB/s Receiving objects: 76% (50414/66333), 62.18 MiB | 31.05 MiB/s Receiving objects: 77% (51077/66333), 62.18 MiB | 31.05 MiB/s Receiving objects: 78% (51740/66333), 62.18 MiB | 31.05 MiB/s Receiving objects: 79% (52404/66333), 62.18 MiB | 31.05 MiB/s Receiving objects: 80% (53067/66333), 62.18 MiB | 31.05 MiB/s Receiving objects: 81% (53730/66333), 62.18 MiB | 31.05 MiB/s Receiving objects: 82% (54394/66333), 77.99 MiB | 31.05 MiB/s Receiving objects: 83% (55057/66333), 77.99 MiB | 31.05 MiB/s Receiving objects: 84% (55720/66333), 77.99 MiB | 31.05 MiB/s Receiving objects: 85% (56384/66333), 77.99 MiB | 31.05 MiB/s Receiving objects: 86% (57047/66333), 77.99 MiB | 31.05 MiB/s Receiving objects: 87% (57710/66333), 77.99 MiB | 31.05 MiB/s Receiving objects: 88% (58374/66333), 77.99 MiB | 31.05 MiB/s Receiving objects: 89% (59037/66333), 77.99 MiB | 31.05 MiB/s Receiving objects: 90% (59700/66333), 77.99 MiB | 31.05 MiB/s Receiving objects: 91% (60364/66333), 77.99 MiB | 31.05 MiB/s Receiving objects: 92% (61027/66333), 77.99 MiB | 31.05 MiB/s Receiving objects: 93% (61690/66333), 77.99 MiB | 31.05 MiB/s Receiving objects: 94% (62354/66333), 77.99 MiB | 31.05 MiB/s Receiving objects: 95% (63017/66333), 77.99 MiB | 31.05 MiB/s Receiving objects: 96% (63680/66333), 77.99 MiB | 31.05 MiB/s Receiving objects: 97% (64344/66333), 77.99 MiB | 31.05 MiB/s Receiving objects: 98% (65007/66333), 77.99 MiB | 31.05 MiB/s Receiving objects: 99% (65670/66333), 77.99 MiB | 31.05 MiB/s Receiving objects: 99% (65905/66333), 77.99 MiB | 31.05 MiB/s remote: Total 66333 (delta 7265), reused 7233 (delta 6589), pack-reused 57349 (from 1)
  7. 7.55 s Receiving objects: 100% (66333/66333), 93.97 MiB | 31.20 MiB/s Receiving objects: 100% (66333/66333), 98.63 MiB | 31.19 MiB/s, done.
  8. 8.95 s Resolving deltas: 0% (0/46383) Resolving deltas: 1% (464/46383) Resolving deltas: 2% (928/46383) Resolving deltas: 3% (1393/46383) Resolving deltas: 4% (1856/46383) Resolving deltas: 5% (2320/46383) Resolving deltas: 6% (2783/46383) Resolving deltas: 7% (3247/46383) Resolving deltas: 8% (3711/46383) Resolving deltas: 9% (4175/46383) Resolving deltas: 10% (4639/46383) Resolving deltas: 11% (5103/46383) Resolving deltas: 12% (5566/46383) Resolving deltas: 13% (6035/46383) Resolving deltas: 14% (6494/46383) Resolving deltas: 15% (6959/46383) Resolving deltas: 16% (7422/46383) Resolving deltas: 17% (7886/46383) Resolving deltas: 18% (8349/46383) Resolving deltas: 19% (8813/46383) Resolving deltas: 20% (9278/46383) Resolving deltas: 21% (9741/46383) Resolving deltas: 22% (10205/46383) Resolving deltas: 23% (10670/46383) Resolving deltas: 24% (11132/46383) Resolving deltas: 25% (11597/46383) Resolving deltas: 26% (12060/46383) Resolving deltas: 27% (12525/46383) Resolving deltas: 28% (12988/46383) Resolving deltas: 29% (13453/46383) Resolving deltas: 30% (13915/46383) Resolving deltas: 31% (14379/46383) Resolving deltas: 32% (14843/46383) Resolving deltas: 33% (15307/46383) Resolving deltas: 34% (15771/46383) Resolving deltas: 35% (16235/46383) Resolving deltas: 36% (16698/46383) Resolving deltas: 37% (17163/46383) Resolving deltas: 38% (17626/46383) Resolving deltas: 39% (18090/46383) Resolving deltas: 40% (18554/46383) Resolving deltas: 41% (19018/46383) Resolving deltas: 42% (19481/46383) Resolving deltas: 43% (19945/46383) Resolving deltas: 44% (20409/46383) Resolving deltas: 45% (20873/46383) Resolving deltas: 46% (21338/46383) Resolving deltas: 47% (21801/46383) Resolving deltas: 48% (22264/46383) Resolving deltas: 49% (22728/46383) Resolving deltas: 50% (23192/46383) Resolving deltas: 51% (23656/46383) Resolving deltas: 52% (24120/46383) Resolving deltas: 53% (24583/46383) Resolving deltas: 54% (25047/46383) Resolving deltas: 55% (25512/46383) Resolving deltas: 56% (25976/46383) Resolving deltas: 57% (26439/46383) Resolving deltas: 58% (26904/46383) Resolving deltas: 59% (27367/46383) Resolving deltas: 60% (27830/46383) Resolving deltas: 61% (28295/46383) Resolving deltas: 62% (28758/46383) Resolving deltas: 63% (29224/46383) Resolving deltas: 64% (29686/46383) Resolving deltas: 65% (30149/46383) Resolving deltas: 66% (30613/46383) Resolving deltas: 67% (31077/46383) Resolving deltas: 68% (31541/46383) Resolving deltas: 69% (32005/46383) Resolving deltas: 70% (32469/46383) Resolving deltas: 71% (32932/46383) Resolving deltas: 72% (33396/46383) Resolving deltas: 73% (33860/46383) Resolving deltas: 74% (34324/46383) Resolving deltas: 75% (34788/46383) Resolving deltas: 76% (35252/46383) Resolving deltas: 77% (35715/46383) Resolving deltas: 77% (36147/46383) Resolving deltas: 78% (36179/46383) Resolving deltas: 79% (36643/46383) Resolving deltas: 80% (37107/46383) Resolving deltas: 81% (37571/46383) Resolving deltas: 82% (38035/46383) Resolving deltas: 83% (38498/46383) Resolving deltas: 84% (38962/46383) Resolving deltas: 85% (39426/46383) Resolving deltas: 86% (39890/46383) Resolving deltas: 87% (40354/46383) Resolving deltas: 88% (40818/46383) Resolving deltas: 89% (41281/46383) Resolving deltas: 90% (41745/46383) Resolving deltas: 91% (42209/46383) Resolving deltas: 92% (42673/46383) Resolving deltas: 93% (43137/46383) Resolving deltas: 94% (43601/46383) Resolving deltas: 95% (44064/46383) Resolving deltas: 96% (44528/46383) Resolving deltas: 97% (44992/46383) Resolving deltas: 98% (45457/46383) Resolving deltas: 99% (45920/46383) Resolving deltas: 100% (46383/46383) Resolving deltas: 100% (46383/46383), done.
  9. 9.55 s Fetching commit 21b5487d2e568713832af8be542a7570e3bff6a6 for docs ...
  10. 9.55 s $ /nix/store/bcnisk3ydfgv26v2gw3zlky24g00yww2-git-2.54.0/bin/git fetch origin 21b5487d2e568713832af8be542a7570e3bff6a6
  11. 10.12 s From https://github.com/alphal00p/gammaloop
  12. 10.12 s * branch 21b5487d2e568713832af8be542a7570e3bff6a6 -> FETCH_HEAD
  13. 10.14 s $ /nix/store/9ypz3flqsrl5xl495mm8h645gadjsxi1-coreutils-9.11/bin/timeout --kill-after=15s 7200s /nix/store/bcnisk3ydfgv26v2gw3zlky24g00yww2-git-2.54.0/bin/git -c advice.detachedHead=false checkout 21b5487d2e568713832af8be542a7570e3bff6a6
  14. 10.49 s HEAD is now at 21b5487d2 fix nix develop error
  15. 10.50 s $ /nix/store/9ypz3flqsrl5xl495mm8h645gadjsxi1-coreutils-9.11/bin/timeout --kill-after=15s 7200s /nix/store/23zk8sgzamrbmj1fday15szf7f2279s8-nix-2.34.7/bin/nix --extra-experimental-features nix-command --extra-experimental-features flakes --log-format internal-json run .#packages.x86_64-linux.nix-ci-check-gammaloop-doctest --print-build-logs
  16. 10.95 s stdenv.isDarwin is deprecated, use stdenv.hostPlatform.isDarwin instead
  17. 26.76 s
  18. 28.70 s Downloading cached busybox from https://cache.nix-ci.com
  19. 28.72 s Downloading cached editline-1.17.1-unstable-2025-05 from https://cache.nix-ci.com
  20. 28.72 s Downloading cached aws-c-common from https://cache.nix-ci.com
  21. 28.72 s Downloading cached boehm-gc from https://cache.nix-ci.com
  22. 28.72 s Downloading cached libgit2-1.9.7-lib from https://cache.nix-ci.com
  23. 28.72 s Downloading cached libseccomp-2.6.1-lib from https://cache.nix-ci.com
  24. 28.72 s Downloading cached libarchive-3.8.9-lib from https://cache.nix-ci.com
  25. 28.72 s Downloading cached lowdown-3.0.1-lib from https://cache.nix-ci.com
  26. 28.72 s Downloading cached s2n-tls from https://cache.nix-ci.com
  27. 28.72 s Downloading cached hwloc-2.14.0-lib from https://cache.nix-ci.com
  28. 28.72 s Downloading cached libsodium-1.0.22-unstable-2026-07 from https://cache.nix-ci.com
  29. 28.72 s Downloading cached libcpuid from https://cache.nix-ci.com
  30. 29.45 s Downloaded cached busybox (230 KiB) in 750ms
  31. 29.46 s Progress: 0 of 1 built, 1 of 36 downloaded from cache (11 downloading)
  32. 29.47 s Downloaded cached editline-1.17.1-unstable-2025-05 (58 KiB) in 747ms
  33. 29.47 s Progress: 0 of 1 built, 2 of 36 downloaded from cache (10 downloading)
  34. 29.47 s Downloaded cached libseccomp-2.6.1-lib (189 KiB) in 750ms
  35. 29.47 s Progress: 0 of 1 built, 3 of 36 downloaded from cache (9 downloading)
  36. 29.49 s Downloaded cached libcpuid (326 KiB) in 763ms
  37. 29.49 s Downloaded cached hwloc-2.14.0-lib (458 KiB) in 765ms
  38. 29.49 s Downloaded cached lowdown-3.0.1-lib (341 KiB) in 766ms
  39. 29.49 s Progress: 0 of 1 built, 4 of 36 downloaded from cache (8 downloading)
  40. 29.49 s Downloaded cached boehm-gc (312 KiB) in 768ms
  41. 29.49 s Progress: 0 of 1 built, 5 of 36 downloaded from cache (7 downloading)
  42. 29.49 s Progress: 0 of 1 built, 6 of 36 downloaded from cache (6 downloading)
  43. 29.49 s Downloaded cached libarchive-3.8.9-lib (961 KiB) in 769ms
  44. 29.49 s Downloaded cached libsodium-1.0.22-unstable-2026-07 (669 KiB) in 769ms
  45. 29.50 s Downloaded cached libgit2-1.9.7-lib (1.6 MiB) in 773ms
  46. 29.50 s Downloading cached onetbb from https://cache.nix-ci.com
  47. 29.50 s Downloaded cached aws-c-common (1.1 MiB) in 774ms
  48. 29.50 s Progress: 0 of 1 built, 7 of 36 downloaded from cache (6 downloading)
  49. 29.50 s Progress: 0 of 1 built, 8 of 36 downloaded from cache (5 downloading)
  50. 29.50 s Progress: 0 of 1 built, 9 of 36 downloaded from cache (4 downloading)
  51. 29.50 s Progress: 0 of 1 built, 10 of 36 downloaded from cache (3 downloading)
  52. 29.50 s Downloaded cached s2n-tls (1.3 MiB) in 778ms
  53. 29.50 s Progress: 0 of 1 built, 11 of 36 downloaded from cache (2 downloading)
  54. 29.50 s Downloading cached aws-c-cal from https://cache.nix-ci.com
  55. 29.50 s Downloading cached aws-c-compression from https://cache.nix-ci.com
  56. 29.50 s Downloading cached aws-c-sdkutils from https://cache.nix-ci.com
  57. 29.50 s Progress: 0 of 1 built, 12 of 36 downloaded from cache (5 downloading)
  58. 29.50 s Downloading cached aws-checksums from https://cache.nix-ci.com
  59. 30.08 s Downloaded cached aws-checksums (86 KiB) in 577ms
  60. 30.08 s Downloaded cached aws-c-sdkutils (155 KiB) in 578ms
  61. 30.08 s Progress: 0 of 1 built, 13 of 36 downloaded from cache (4 downloading)
  62. 30.08 s Downloaded cached aws-c-cal (158 KiB) in 578ms
  63. 30.08 s Progress: 0 of 1 built, 14 of 36 downloaded from cache (3 downloading)
  64. 30.08 s Downloaded cached aws-c-compression (31 KiB) in 581ms
  65. 30.09 s Progress: 0 of 1 built, 15 of 36 downloaded from cache (2 downloading)
  66. 30.09 s Downloaded cached onetbb (626 KiB) in 593ms
  67. 30.09 s Progress: 0 of 1 built, 16 of 36 downloaded from cache (2 downloading)
  68. 30.09 s Downloading cached aws-c-io from https://cache.nix-ci.com
  69. 30.09 s Progress: 0 of 1 built, 17 of 36 downloaded from cache (1 downloading)
  70. 30.09 s Downloading cached libblake3 from https://cache.nix-ci.com
  71. 30.11 s Downloaded cached libblake3 (117 KiB) in 24ms
  72. 30.11 s Progress: 0 of 1 built, 18 of 36 downloaded from cache (1 downloading)
  73. 30.12 s Downloading cached nix-util from https://cache.nix-ci.com
  74. 30.12 s Downloaded cached aws-c-io (648 KiB) in 33ms
  75. 30.12 s Progress: 0 of 1 built, 19 of 36 downloaded from cache (1 downloading)
  76. 30.12 s Downloading cached aws-c-event-stream from https://cache.nix-ci.com
  77. 30.12 s Downloading cached aws-c-http from https://cache.nix-ci.com
  78. 30.69 s Downloaded cached aws-c-event-stream (176 KiB) in 567ms
  79. 30.70 s Downloaded cached nix-util (2.4 MiB) in 580ms
  80. 30.70 s Progress: 0 of 1 built, 20 of 36 downloaded from cache (2 downloading)
  81. 30.70 s Downloaded cached aws-c-http (641 KiB) in 575ms
  82. 30.70 s Progress: 0 of 1 built, 21 of 36 downloaded from cache (1 downloading)
  83. 30.70 s Progress: 0 of 1 built, 22 of 36 downloaded from cache
  84. 30.70 s Downloading cached aws-c-auth from https://cache.nix-ci.com
  85. 30.70 s Downloading cached nix-nswrapper from https://cache.nix-ci.com
  86. 30.70 s Downloading cached aws-c-mqtt from https://cache.nix-ci.com
  87. 30.73 s Downloaded cached nix-nswrapper (131 KiB) in 24ms
  88. 30.73 s Downloaded cached aws-c-mqtt (557 KiB) in 25ms
  89. 30.73 s Progress: 0 of 1 built, 23 of 36 downloaded from cache (2 downloading)
  90. 30.73 s Progress: 0 of 1 built, 24 of 36 downloaded from cache (1 downloading)
  91. 30.73 s Downloaded cached aws-c-auth (387 KiB) in 29ms
  92. 30.73 s Progress: 0 of 1 built, 25 of 36 downloaded from cache
  93. 30.73 s Downloading cached aws-c-s3 from https://cache.nix-ci.com
  94. 31.34 s Downloaded cached aws-c-s3 (384 KiB) in 611ms
  95. 31.34 s Progress: 0 of 1 built, 26 of 36 downloaded from cache
  96. 31.34 s Downloading cached aws-crt-cpp from https://cache.nix-ci.com
  97. 31.36 s Downloaded cached aws-crt-cpp (979 KiB) in 18ms
  98. 31.36 s Progress: 0 of 1 built, 27 of 36 downloaded from cache
  99. 31.36 s Downloading cached nix-store from https://cache.nix-ci.com
  100. 32.02 s Downloaded cached nix-store (5.8 MiB) in 653ms
  101. 32.02 s Progress: 0 of 1 built, 28 of 36 downloaded from cache
  102. 32.02 s Downloading cached nix-main from https://cache.nix-ci.com
  103. 32.02 s Downloading cached nix-fetchers from https://cache.nix-ci.com
  104. 32.73 s Downloaded cached nix-main (393 KiB) in 713ms
  105. 32.73 s Progress: 0 of 1 built, 29 of 36 downloaded from cache (1 downloading)
  106. 32.73 s Downloaded cached nix-fetchers (1.5 MiB) in 714ms
  107. 32.73 s Progress: 0 of 1 built, 30 of 36 downloaded from cache
  108. 32.73 s Downloading cached nix-expr from https://cache.nix-ci.com
  109. 32.77 s Downloaded cached nix-expr (3.3 MiB) in 36ms
  110. 32.77 s Progress: 0 of 1 built, 31 of 36 downloaded from cache
  111. 32.77 s Downloading cached nix-flake from https://cache.nix-ci.com
  112. 33.39 s Downloaded cached nix-flake (956 KiB) in 622ms
  113. 33.39 s Progress: 0 of 1 built, 32 of 36 downloaded from cache
  114. 33.39 s Downloading cached nix-cmd from https://cache.nix-ci.com
  115. 33.42 s Downloaded cached nix-cmd (1 MiB) in 24ms
  116. 33.42 s Progress: 0 of 1 built, 33 of 36 downloaded from cache
  117. 33.42 s Downloading cached nix from https://cache.nix-ci.com
  118. 33.51 s Downloaded cached nix (3.9 MiB) in 96ms
  119. 33.51 s Progress: 0 of 1 built, 34 of 36 downloaded from cache
  120. 33.52 s Downloading cached nix from https://cache.nix-ci.com
  121. 34.07 s Downloaded cached nix (8848 B) in 549ms
  122. 34.07 s Progress: 0 of 1 built, 35 of 36 downloaded from cache
  123. 34.10 s Downloading cached nix-ci-check-gammaloop-doctest from https://cache.nix-ci.com
  124. 34.10 s Downloaded cached nix-ci-check-gammaloop-doctest (1008 B) in 0ms
  125. 34.10 s Progress: 0 of 1 built, 36 of 36 downloaded from cache
  126. 34.58 s evaluating derivation 'gevaluation warning: stdenv.isDarwin is deprecated, use stdenv.hostPlatform.isDarwin instead
  127. 38.08 s copying '/nix/store/rdcn evaluating derivation 'g querying gammaloop-works [0/1 built, 0.0 KiB DL] [1/0/1 built, 0.0 KiB DLgammaloop-workspace-doctest> Running phase: unpackPhase
  128. 38.09 s gammaloop-workspace-doctest> unpacking source archive /nix/store/5afz06g4vsphrihpxicbxvm3sk5psnll-source
  129. 41.78 s gammaloop-workspace-doctest> source root is source
  130. 41.83 s gammaloop-workspace-doctest> Running phase: patchPhase
  131. 41.84 s gammaloop-workspace-doctest> Executing configureCargoCommonVars
  132. 41.84 s gammaloop-workspace-doctest> decompressing cargo artifacts from /nix/store/72wdcnp633ang33qg6wvb90brvf1679y-gammaloop-workspace-deps-deps-0.1.0/target.tar.zst to target
  133. 48.38 s gammaloop-workspace-doctest> Running phase: updateAutotoolsGnuConfigScriptsPhase
  134. 48.44 s gammaloop-workspace-doctest> Running phase: configurePhase
  135. 48.45 s gammaloop-workspace-doctest> will append /build/source/.cargo-home/config.toml with contents of /nix/store/29aa708jkn8wd8vjwja1a5gh8k8wpi2b-vendor-cargo-deps/config.toml
  136. 48.45 s gammaloop-workspace-doctest> default configurePhase, nothing to do
  137. 48.45 s gammaloop-workspace-doctest> Running phase: buildPhase
  138. 48.46 s gammaloop-workspace-doctest> +++ command cargo --version
  139. 48.47 s gammaloop-workspace-doctest> cargo 1.98.0 (797e8a9bc 2026-08-05)
  140. 48.51 s gammaloop-workspace-doctest> +++ command cargo test --profile ci-optim --doc --locked --workspace --features gammaloop-api/cli,gammaloop-tracing-filter/clap,gammaloop-tracing-filter/symbolica,idenso/bincode,idenso/reference-cases,linnet/bincode,linnet/drawing,linnet/nodestore-vec,linnet/rkyv,linnet/serde,linnet/symbolica,spenso-macros/shadowing,spenso/shadowing,symbolica/tracing_max_level_info
  141. 49.37 s gammaloop-workspace-doctest> Compiling target-lexicon v0.13.5
  142. 49.40 s gammaloop-workspace-doctest> Compiling symbolica v2.2.0 (https://github.com/symbolica-dev/symbolica?branch=dev#0441bd7a)
  143. 49.40 s gammaloop-workspace-doctest> Compiling maplit v1.0.2
  144. 49.42 s gammaloop-workspace-doctest> Compiling gammaloop-tracing-filter-macros v0.1.0 (/build/source/crates/gammaloop-tracing-filter-macros)
  145. 49.42 s gammaloop-workspace-doctest> Compiling vakint v0.1.2 (/build/source/crates/vakint)
  146. 49.43 s gammaloop-workspace-doctest> Compiling gammalooprs v0.3.4 (/build/source/crates/gammalooprs)
  147. 49.46 s gammaloop-workspace-doctest> Compiling alphal00p-docs-macros v0.1.0 (/build/source/crates/alphal00p-docs-macros)
  148. 49.46 s gammaloop-workspace-doctest> Compiling alphal00p-docs-schema v0.1.0 (/build/source/crates/alphal00p-docs-schema)
  149. 49.46 s gammaloop-workspace-doctest> Compiling rustc_version v0.4.1
  150. 49.47 s gammaloop-workspace-doctest> Compiling bincode v1.3.3
  151. 49.47 s gammaloop-workspace-doctest> Compiling gungraun-runner v0.18.2
  152. 49.47 s gammaloop-workspace-doctest> Compiling target-triple v1.0.1
  153. 49.48 s gammaloop-workspace-doctest> Compiling iai-callgrind-runner v0.14.2
  154. 49.52 s gammaloop-workspace-doctest> Compiling gammaloop-integration-tests v0.1.0 (/build/source/tests)
  155. 49.52 s gammaloop-workspace-doctest> Compiling test-log-core v0.2.20
  156. 49.90 s gammaloop-workspace-doctest> Compiling wait-timeout v0.2.1
  157. 50.01 s gammaloop-workspace-doctest> Compiling iai-callgrind v0.14.2
  158. 50.02 s gammaloop-workspace-doctest> Compiling quick-error v1.2.3
  159. 50.12 s gammaloop-workspace-doctest> Compiling bit-vec v0.8.0
  160. 50.13 s gammaloop-workspace-doctest> Compiling rusty-fork v0.3.1
  161. 50.44 s gammaloop-workspace-doctest> Compiling iai-callgrind-macros v0.5.1
  162. 50.59 s gammaloop-workspace-doctest> Compiling bit-set v0.8.0
  163. 50.60 s gammaloop-workspace-doctest> Compiling rand_xorshift v0.4.0
  164. 50.65 s gammaloop-workspace-doctest> Compiling console v0.15.11
  165. 50.72 s gammaloop-workspace-doctest> Compiling termcolor v1.4.1
  166. 50.74 s gammaloop-workspace-doctest> Compiling gungraun-macros v0.8.0
  167. 50.81 s gammaloop-workspace-doctest> Compiling unarray v0.1.4
  168. 50.82 s gammaloop-workspace-doctest> Compiling glob v0.3.4
  169. 50.98 s gammaloop-workspace-doctest> Compiling base64 v0.21.7
  170. 51.63 s gammaloop-workspace-doctest> Compiling similar-asserts v1.7.0
  171. 51.64 s gammaloop-workspace-doctest> Compiling trybuild v1.0.120
  172. 51.73 s gammaloop-workspace-doctest> Compiling ron v0.8.1
  173. 51.73 s gammaloop-workspace-doctest> Compiling proptest v1.11.0
  174. 51.98 s gammaloop-workspace-doctest> Compiling alphal00p-docs-builder v0.1.0 (/build/source/crates/alphal00p-docs-builder)
  175. 52.67 s gammaloop-workspace-doctest> Compiling pyo3-build-config v0.28.3
  176. 52.72 s gammaloop-workspace-doctest> Compiling alphal00p-docs-catalogs v0.1.0 (/build/source/crates/alphal00p-docs-catalogs)
  177. 52.95 s gammaloop-workspace-doctest> Compiling kurvst v0.1.0 (/build/source/crates/kurvst)
  178. 53.93 s gammaloop-workspace-doctest> Compiling test-log-macros v0.2.20
  179. 59.31 s gammaloop-workspace-doctest> Compiling test-log v0.2.20
  180. 61.22 s gammaloop-workspace-doctest> Compiling alphal00p-docs-examples v0.1.0 (/build/source/crates/alphal00p-docs-examples)
  181. 64.41 s gammaloop-workspace-doctest> Compiling pyo3-ffi v0.28.3
  182. 64.75 s gammaloop-workspace-doctest> Compiling pyo3-macros-backend v0.28.3
  183. 64.84 s gammaloop-workspace-doctest> Compiling pyo3 v0.28.3
  184. 64.98 s gammaloop-workspace-doctest> Compiling numpy v0.28.0
  185. 65.22 s gammaloop-workspace-doctest> Compiling gammaloop-api v0.1.0 (/build/source/crates/gammaloop-api)
  186. 66.10 s gammaloop-workspace-doctest> Compiling gungraun v0.18.2
  187. 77.98 s gammaloop-workspace-doctest> Compiling pyo3-macros v0.28.3
  188. 84.71 s gammaloop-workspace-doctest> Compiling pyo3-stub-gen v0.17.2
  189. 85.72 s gammaloop-workspace-doctest> Compiling numerica v2.2.0 (https://github.com/symbolica-dev/symbolica?branch=dev#0441bd7a)
  190. 88.98 s gammaloop-workspace-doctest> Compiling graphica v2.1.0 (https://github.com/symbolica-dev/symbolica?branch=dev#0441bd7a)
  191. 93.52 s gammaloop-workspace-doctest> Compiling symbolica-utils v0.1.0 (/build/source/crates/symbolica-utils)
  192. 385.40 s gammaloop-workspace-doctest> Compiling gammaloop-workspace-hack v0.1.0 (/build/source/crates/gammaloop-workspace-hack)
  193. 385.41 s gammaloop-workspace-doctest> Compiling spenso-macros v0.3.2 (/build/source/crates/spenso-macros)
  194. 385.59 s gammaloop-workspace-doctest> Compiling linnet v0.17.0 (/build/source/crates/linnet)
  195. 389.51 s gammaloop-workspace-doctest> Compiling spenso v0.6.0 (/build/source/crates/spenso)
  196. 401.73 s gammaloop-workspace-doctest> Compiling idenso v0.3.0 (/build/source/crates/idenso)
  197. 401.75 s gammaloop-workspace-doctest> Compiling gammaloop-tracing-filter v0.1.0 (/build/source/crates/gammaloop-tracing-filter)
  198. 410.06 s gammaloop-workspace-doctest> Compiling spenso-hep-lib v0.1.7 (/build/source/crates/spenso-hep-lib)
  199. 410.51 s gammaloop-workspace-doctest> Compiling spynso3 v0.1.2 (/build/source/crates/spynso3)
  200. 475.95 s gammaloop-workspace-doctest> Compiling linnest v0.1.0 (/build/source/crates/linnest)
  201. 475.96 s gammaloop-workspace-doctest> Compiling linnet-py v0.1.0 (/build/source/crates/linnet-py)
  202. 639.78 s gammaloop-workspace-doctest> Finished `ci-optim` profile [optimized] target(s) in 9m 51s
  203. 639.95 s gammaloop-workspace-doctest> warning: the following packages contain code that will be rejected by a future version of Rust: proc-macro-error2 v2.0.1
  204. 639.95 s gammaloop-workspace-doctest> note: to see what the problems were, use the option `--future-incompat-report`, or run `cargo report future-incompatibilities --id 1`
  205. 639.99 s gammaloop-workspace-doctest> Doc-tests alphal00p_docs_builder
  206. 640.18 s gammaloop-workspace-doctest>
  207. 640.18 s gammaloop-workspace-doctest> running 0 tests
  208. 640.18 s gammaloop-workspace-doctest>
  209. 640.18 s gammaloop-workspace-doctest> test result: ok. 0 passed; 0 failed; 0 ignored; 0 measured; 0 filtered out; finished in 0.00s
  210. 640.18 s gammaloop-workspace-doctest>
  211. 640.18 s gammaloop-workspace-doctest> Doc-tests alphal00p_docs_catalogs
  212. 641.58 s gammaloop-workspace-doctest>
  213. 641.58 s gammaloop-workspace-doctest> running 0 tests
  214. 641.58 s gammaloop-workspace-doctest>
  215. 641.58 s gammaloop-workspace-doctest> test result: ok. 0 passed; 0 failed; 0 ignored; 0 measured; 0 filtered out; finished in 0.00s
  216. 641.58 s gammaloop-workspace-doctest>
  217. 641.59 s gammaloop-workspace-doctest> Doc-tests alphal00p_docs_examples
  218. 641.61 s gammaloop-workspace-doctest>
  219. 641.61 s gammaloop-workspace-doctest> running 0 tests
  220. 641.61 s gammaloop-workspace-doctest>
  221. 641.61 s gammaloop-workspace-doctest> test result: ok. 0 passed; 0 failed; 0 ignored; 0 measured; 0 filtered out; finished in 0.00s
  222. 641.61 s gammaloop-workspace-doctest>
  223. 641.61 s gammaloop-workspace-doctest> Doc-tests alphal00p_docs
  224. 641.67 s gammaloop-workspace-doctest>
  225. 641.67 s gammaloop-workspace-doctest> running 0 tests
  226. 641.67 s gammaloop-workspace-doctest>
  227. 641.67 s gammaloop-workspace-doctest> test result: ok. 0 passed; 0 failed; 0 ignored; 0 measured; 0 filtered out; finished in 0.00s
  228. 641.67 s gammaloop-workspace-doctest>
  229. 641.67 s gammaloop-workspace-doctest> Doc-tests alphal00p_docs_schema
  230. 641.77 s gammaloop-workspace-doctest>
  231. 641.77 s gammaloop-workspace-doctest> running 0 tests
  232. 641.77 s gammaloop-workspace-doctest>
  233. 641.77 s gammaloop-workspace-doctest> test result: ok. 0 passed; 0 failed; 0 ignored; 0 measured; 0 filtered out; finished in 0.00s
  234. 641.77 s gammaloop-workspace-doctest>
  235. 641.77 s gammaloop-workspace-doctest> Doc-tests gammaloop_api
  236. 642.96 s gammaloop-workspace-doctest>
  237. 642.96 s gammaloop-workspace-doctest> running 16 tests
  238. 642.98 s gammaloop-workspace-doctest> test crates/gammaloop-api/src/python.rs - python::GammaLoopAPI::evaluate_samples (line 3108) ... FAILED
  239. 642.99 s gammaloop-workspace-doctest> test crates/gammaloop-api/src/python.rs - python::PyHistogramAccumulator (line 871) ... FAILED
  240. 642.99 s gammaloop-workspace-doctest> test crates/gammaloop-api/src/python.rs - python::GammaLoopAPI::get_active_command_blocks (line 3760) ... FAILED
  241. 642.99 s gammaloop-workspace-doctest> test crates/gammaloop-api/src/python.rs - python::GammaLoopAPI::get_integrand_settings (line 3647) ... FAILED
  242. 642.99 s gammaloop-workspace-doctest> test crates/gammaloop-api/src/python.rs - python::GammaLoopAPI::evaluate_sample (line 2967) ... FAILED
  243. 642.99 s gammaloop-workspace-doctest> test crates/gammaloop-api/src/python.rs - python::GammaLoopAPI::get_integrand_info (line 3585) ... FAILED
  244. 642.99 s gammaloop-workspace-doctest> test crates/gammaloop-api/src/python.rs - python::GammaLoopAPI::get_default_runtime_settings (line 3796) ... FAILED
  245. 643.04 s gammaloop-workspace-doctest> test crates/gammaloop-api/src/lib.rs - (line 18) - compile ... ok
  246. 643.13 s gammaloop-workspace-doctest> test crates/gammaloop-api/src/python.rs - python::GammaLoopAPI::get_run_history (line 3711) ... FAILED
  247. 643.13 s gammaloop-workspace-doctest> test crates/gammaloop-api/src/python.rs - python::GammaLoopAPI::run_command (line 3901) ... FAILED
  248. 643.13 s gammaloop-workspace-doctest> test crates/gammaloop-api/src/python.rs - python::GammaLoopAPI::get_global_settings (line 3739) ... FAILED
  249. 643.14 s gammaloop-workspace-doctest> test crates/gammaloop-api/src/python.rs - python::atom_to_canonical_string (line 128) ... FAILED
  250. 643.14 s gammaloop-workspace-doctest> test crates/gammaloop-api/src/python.rs - python::evaluate_graph_overall_factor (line 95) ... FAILED
  251. 643.14 s gammaloop-workspace-doctest> test crates/gammaloop-api/src/python.rs - python::atom_to_dots (line 157) ... FAILED
  252. 643.15 s gammaloop-workspace-doctest> test crates/gammaloop-api/src/python.rs - python::GammaLoopAPI::new_python (line 2834) ... FAILED
  253. 646.20 s gammaloop-workspace-doctest> test crates/gammaloop-api/src/commands/evaluate_samples.rs - commands::evaluate_samples::EvaluateSamples (line 50) ... ok
  254. 646.22 s gammaloop-workspace-doctest>
  255. 646.22 s gammaloop-workspace-doctest> failures:
  256. 646.22 s gammaloop-workspace-doctest>
  257. 646.22 s gammaloop-workspace-doctest> ---- crates/gammaloop-api/src/python.rs - python::GammaLoopAPI::evaluate_samples (line 3108) stdout ----
  258. 646.22 s gammaloop-workspace-doctest> error: expected one of `!` or `::`, found `pathlib`
  259. 646.22 s gammaloop-workspace-doctest> --> crates/gammaloop-api/src/python.rs:3109:6
  260. 646.22 s gammaloop-workspace-doctest> |
  261. 646.22 s gammaloop-workspace-doctest> 3109 | from pathlib import Path
  262. 646.22 s gammaloop-workspace-doctest> | ^^^^^^^ expected one of `!` or `::`
  263. 646.22 s gammaloop-workspace-doctest>
  264. 646.22 s gammaloop-workspace-doctest> error: aborting due to 1 previous error
  265. 646.22 s gammaloop-workspace-doctest>
  266. 646.22 s gammaloop-workspace-doctest> Couldn't compile the test.
  267. 646.22 s gammaloop-workspace-doctest> ---- crates/gammaloop-api/src/python.rs - python::PyHistogramAccumulator (line 871) stdout ----
  268. 646.22 s gammaloop-workspace-doctest> error: expected one of `!` or `::`, found `gammaloop`
  269. 646.22 s gammaloop-workspace-doctest> --> crates/gammaloop-api/src/python.rs:872:6
  270. 646.22 s gammaloop-workspace-doctest> |
  271. 646.22 s gammaloop-workspace-doctest> 872 | from gammaloop import HistogramAccumulator
  272. 646.22 s gammaloop-workspace-doctest> | ^^^^^^^^^ expected one of `!` or `::`
  273. 646.22 s gammaloop-workspace-doctest>
  274. 646.22 s gammaloop-workspace-doctest> error: aborting due to 1 previous error
  275. 646.22 s gammaloop-workspace-doctest>
  276. 646.22 s gammaloop-workspace-doctest> Couldn't compile the test.
  277. 646.22 s gammaloop-workspace-doctest> ---- crates/gammaloop-api/src/python.rs - python::GammaLoopAPI::get_active_command_blocks (line 3760) stdout ----
  278. 646.22 s gammaloop-workspace-doctest> error: expected item, found keyword `for`
  279. 646.22 s gammaloop-workspace-doctest> --> crates/gammaloop-api/src/python.rs:3761:1
  280. 646.22 s gammaloop-workspace-doctest> |
  281. 646.22 s gammaloop-workspace-doctest> 3761 | for name, commands in api.get_active_command_blocks().items():
  282. 646.22 s gammaloop-workspace-doctest> | ^^^ expected item
  283. 646.22 s gammaloop-workspace-doctest> |
  284. 646.22 s gammaloop-workspace-doctest> = note: for a full list of items that can appear in modules, see <https://doc.rust-lang.org/reference/items.html>
  285. 646.22 s gammaloop-workspace-doctest>
  286. 646.22 s gammaloop-workspace-doctest> error: aborting due to 1 previous error
  287. 646.22 s gammaloop-workspace-doctest>
  288. 646.22 s gammaloop-workspace-doctest> Couldn't compile the test.
  289. 646.22 s gammaloop-workspace-doctest> ---- crates/gammaloop-api/src/python.rs - python::GammaLoopAPI::get_integrand_settings (line 3647) stdout ----
  290. 646.22 s gammaloop-workspace-doctest> error: expected one of `!` or `::`, found `=`
  291. 646.22 s gammaloop-workspace-doctest> --> crates/gammaloop-api/src/python.rs:3648:10
  292. 646.22 s gammaloop-workspace-doctest> |
  293. 646.22 s gammaloop-workspace-doctest> 3648 | settings = api.get_integrand_settings(process_id=0)
  294. 646.22 s gammaloop-workspace-doctest> | ^ expected one of `!` or `::`
  295. 646.22 s gammaloop-workspace-doctest>
  296. 646.22 s gammaloop-workspace-doctest> error: aborting due to 1 previous error
  297. 646.22 s gammaloop-workspace-doctest>
  298. 646.22 s gammaloop-workspace-doctest> Couldn't compile the test.
  299. 646.22 s gammaloop-workspace-doctest> ---- crates/gammaloop-api/src/python.rs - python::GammaLoopAPI::evaluate_sample (line 2967) stdout ----
  300. 646.22 s gammaloop-workspace-doctest> error: expected one of `!` or `::`, found `pathlib`
  301. 646.22 s gammaloop-workspace-doctest> --> crates/gammaloop-api/src/python.rs:2968:6
  302. 646.22 s gammaloop-workspace-doctest> |
  303. 646.22 s gammaloop-workspace-doctest> 2968 | from pathlib import Path
  304. 646.22 s gammaloop-workspace-doctest> | ^^^^^^^ expected one of `!` or `::`
  305. 646.22 s gammaloop-workspace-doctest>
  306. 646.22 s gammaloop-workspace-doctest> error: aborting due to 1 previous error
  307. 646.22 s gammaloop-workspace-doctest>
  308. 646.22 s gammaloop-workspace-doctest> Couldn't compile the test.
  309. 646.22 s gammaloop-workspace-doctest> ---- crates/gammaloop-api/src/python.rs - python::GammaLoopAPI::get_integrand_info (line 3585) stdout ----
  310. 646.22 s gammaloop-workspace-doctest> error: expected one of `!` or `::`, found `pathlib`
  311. 646.22 s gammaloop-workspace-doctest> --> crates/gammaloop-api/src/python.rs:3586:6
  312. 646.22 s gammaloop-workspace-doctest> |
  313. 646.22 s gammaloop-workspace-doctest> 3586 | from pathlib import Path
  314. 646.22 s gammaloop-workspace-doctest> | ^^^^^^^ expected one of `!` or `::`
  315. 646.22 s gammaloop-workspace-doctest>
  316. 646.22 s gammaloop-workspace-doctest> error: aborting due to 1 previous error
  317. 646.22 s gammaloop-workspace-doctest>
  318. 646.22 s gammaloop-workspace-doctest> Couldn't compile the test.
  319. 646.22 s gammaloop-workspace-doctest> ---- crates/gammaloop-api/src/python.rs - python::GammaLoopAPI::get_default_runtime_settings (line 3796) stdout ----
  320. 646.22 s gammaloop-workspace-doctest> error: expected one of `!` or `::`, found `=`
  321. 646.22 s gammaloop-workspace-doctest> --> crates/gammaloop-api/src/python.rs:3797:9
  322. 646.22 s gammaloop-workspace-doctest> |
  323. 646.22 s gammaloop-workspace-doctest> 3797 | runtime = api.get_default_runtime_settings()
  324. 646.22 s gammaloop-workspace-doctest> | ^ expected one of `!` or `::`
  325. 646.22 s gammaloop-workspace-doctest>
  326. 646.22 s gammaloop-workspace-doctest> error: aborting due to 1 previous error
  327. 646.22 s gammaloop-workspace-doctest>
  328. 646.22 s gammaloop-workspace-doctest> Couldn't compile the test.
  329. 646.22 s gammaloop-workspace-doctest> ---- crates/gammaloop-api/src/python.rs - python::GammaLoopAPI::get_run_history (line 3711) stdout ----
  330. 646.22 s gammaloop-workspace-doctest> error[E0425]: cannot find value `run_card_toml` in this scope
  331. 646.22 s gammaloop-workspace-doctest> --> crates/gammaloop-api/src/python.rs:3712:1
  332. 646.22 s gammaloop-workspace-doctest> |
  333. 646.22 s gammaloop-workspace-doctest> 3712 | run_card_toml = api.get_run_history()
  334. 646.22 s gammaloop-workspace-doctest> | ^^^^^^^^^^^^^
  335. 646.22 s gammaloop-workspace-doctest> |
  336. 646.22 s gammaloop-workspace-doctest> help: you might have meant to introduce a new binding
  337. 646.22 s gammaloop-workspace-doctest> |
  338. 646.22 s gammaloop-workspace-doctest> 3712 | let run_card_toml = api.get_run_history()
  339. 646.22 s gammaloop-workspace-doctest> | +++
  340. 646.22 s gammaloop-workspace-doctest>
  341. 646.22 s gammaloop-workspace-doctest> error[E0425]: cannot find value `api` in this scope
  342. 646.22 s gammaloop-workspace-doctest> --> crates/gammaloop-api/src/python.rs:3712:17
  343. 646.22 s gammaloop-workspace-doctest> |
  344. 646.22 s gammaloop-workspace-doctest> 3712 | run_card_toml = api.get_run_history()
  345. 646.22 s gammaloop-workspace-doctest> | ^^^ not found in this scope
  346. 646.22 s gammaloop-workspace-doctest>
  347. 646.22 s gammaloop-workspace-doctest> error: aborting due to 2 previous errors
  348. 646.22 s gammaloop-workspace-doctest>
  349. 646.22 s gammaloop-workspace-doctest> For more information about this error, try `rustc --explain E0425`.
  350. 646.22 s gammaloop-workspace-doctest> Couldn't compile the test.
  351. 646.22 s gammaloop-workspace-doctest> ---- crates/gammaloop-api/src/python.rs - python::GammaLoopAPI::run_command (line 3901) stdout ----
  352. 646.22 s gammaloop-workspace-doctest> error[E0425]: cannot find value `api` in this scope
  353. 646.22 s gammaloop-workspace-doctest> --> crates/gammaloop-api/src/python.rs:3902:1
  354. 646.22 s gammaloop-workspace-doctest> |
  355. 646.22 s gammaloop-workspace-doctest> 3902 | api.run("display processes")
  356. 646.22 s gammaloop-workspace-doctest> | ^^^ not found in this scope
  357. 646.22 s gammaloop-workspace-doctest>
  358. 646.22 s gammaloop-workspace-doctest> error: aborting due to 1 previous error
  359. 646.22 s gammaloop-workspace-doctest>
  360. 646.22 s gammaloop-workspace-doctest> For more information about this error, try `rustc --explain E0425`.
  361. 646.22 s gammaloop-workspace-doctest> Couldn't compile the test.
  362. 646.22 s gammaloop-workspace-doctest> ---- crates/gammaloop-api/src/python.rs - python::GammaLoopAPI::get_global_settings (line 3739) stdout ----
  363. 646.22 s gammaloop-workspace-doctest> error[E0425]: cannot find value `settings_toml` in this scope
  364. 646.22 s gammaloop-workspace-doctest> --> crates/gammaloop-api/src/python.rs:3740:1
  365. 646.22 s gammaloop-workspace-doctest> |
  366. 646.22 s gammaloop-workspace-doctest> 3740 | settings_toml = api.get_global_settings()
  367. 646.22 s gammaloop-workspace-doctest> | ^^^^^^^^^^^^^
  368. 646.22 s gammaloop-workspace-doctest> |
  369. 646.22 s gammaloop-workspace-doctest> help: you might have meant to introduce a new binding
  370. 646.22 s gammaloop-workspace-doctest> |
  371. 646.22 s gammaloop-workspace-doctest> 3740 | let settings_toml = api.get_global_settings()
  372. 646.22 s gammaloop-workspace-doctest> | +++
  373. 646.22 s gammaloop-workspace-doctest>
  374. 646.22 s gammaloop-workspace-doctest> error[E0425]: cannot find value `api` in this scope
  375. 646.22 s gammaloop-workspace-doctest> --> crates/gammaloop-api/src/python.rs:3740:17
  376. 646.22 s gammaloop-workspace-doctest> |
  377. 646.22 s gammaloop-workspace-doctest> 3740 | settings_toml = api.get_global_settings()
  378. 646.22 s gammaloop-workspace-doctest> | ^^^ not found in this scope
  379. 646.22 s gammaloop-workspace-doctest>
  380. 646.22 s gammaloop-workspace-doctest> error: aborting due to 2 previous errors
  381. 646.22 s gammaloop-workspace-doctest>
  382. 646.22 s gammaloop-workspace-doctest> For more information about this error, try `rustc --explain E0425`.
  383. 646.22 s gammaloop-workspace-doctest> Couldn't compile the test.
  384. 646.22 s gammaloop-workspace-doctest> ---- crates/gammaloop-api/src/python.rs - python::atom_to_canonical_string (line 128) stdout ----
  385. 646.22 s gammaloop-workspace-doctest> error[E0425]: cannot find function `atom_to_canonical_string` in this scope
  386. 646.22 s gammaloop-workspace-doctest> --> crates/gammaloop-api/src/python.rs:129:1
  387. 646.22 s gammaloop-workspace-doctest> |
  388. 646.22 s gammaloop-workspace-doctest> 129 | atom_to_canonical_string("x + x")
  389. 646.22 s gammaloop-workspace-doctest> | ^^^^^^^^^^^^^^^^^^^^^^^^ not found in this scope
  390. 646.22 s gammaloop-workspace-doctest>
  391. 646.22 s gammaloop-workspace-doctest> error: aborting due to 1 previous error
  392. 646.22 s gammaloop-workspace-doctest>
  393. 646.22 s gammaloop-workspace-doctest> For more information about this error, try `rustc --explain E0425`.
  394. 646.22 s gammaloop-workspace-doctest> Couldn't compile the test.
  395. 646.22 s gammaloop-workspace-doctest> ---- crates/gammaloop-api/src/python.rs - python::evaluate_graph_overall_factor (line 95) stdout ----
  396. 646.22 s gammaloop-workspace-doctest> error[E0425]: cannot find function `evaluate_graph_overall_factor` in this scope
  397. 646.22 s gammaloop-workspace-doctest> --> crates/gammaloop-api/src/python.rs:96:1
  398. 646.22 s gammaloop-workspace-doctest> |
  399. 646.22 s gammaloop-workspace-doctest> 96 | evaluate_graph_overall_factor(
  400. 646.22 s gammaloop-workspace-doctest> | ^^^^^^^^^^^^^^^^^^^^^^^^^^^^^ not found in this scope
  401. 646.22 s gammaloop-workspace-doctest>
  402. 646.22 s gammaloop-workspace-doctest> error: aborting due to 1 previous error
  403. 646.22 s gammaloop-workspace-doctest>
  404. 646.22 s gammaloop-workspace-doctest> For more information about this error, try `rustc --explain E0425`.
  405. 646.22 s gammaloop-workspace-doctest> Couldn't compile the test.
  406. 646.22 s gammaloop-workspace-doctest> ---- crates/gammaloop-api/src/python.rs - python::atom_to_dots (line 157) stdout ----
  407. 646.22 s gammaloop-workspace-doctest> error[E0425]: cannot find function `to_dots` in this scope
  408. 646.22 s gammaloop-workspace-doctest> --> crates/gammaloop-api/src/python.rs:158:1
  409. 646.22 s gammaloop-workspace-doctest> |
  410. 646.22 s gammaloop-workspace-doctest> 158 | to_dots("p(mu) * q(mu)")
  411. 646.22 s gammaloop-workspace-doctest> | ^^^^^^^ not found in this scope
  412. 646.22 s gammaloop-workspace-doctest>
  413. 646.22 s gammaloop-workspace-doctest> error: aborting due to 1 previous error
  414. 646.22 s gammaloop-workspace-doctest>
  415. 646.22 s gammaloop-workspace-doctest> For more information about this error, try `rustc --explain E0425`.
  416. 646.22 s gammaloop-workspace-doctest> Couldn't compile the test.
  417. 646.22 s gammaloop-workspace-doctest> ---- crates/gammaloop-api/src/python.rs - python::GammaLoopAPI::new_python (line 2834) stdout ----
  418. 646.22 s gammaloop-workspace-doctest> error[E0425]: cannot find value `api` in this scope
  419. 646.22 s gammaloop-workspace-doctest> --> crates/gammaloop-api/src/python.rs:2835:1
  420. 646.22 s gammaloop-workspace-doctest> |
  421. 646.22 s gammaloop-workspace-doctest> 2835 | api = GammaLoopAPI(state_folder="./state", read_only_state=True)
  422. 646.22 s gammaloop-workspace-doctest> | ^^^
  423. 646.22 s gammaloop-workspace-doctest> |
  424. 646.22 s gammaloop-workspace-doctest> help: you might have meant to introduce a new binding
  425. 646.22 s gammaloop-workspace-doctest> |
  426. 646.22 s gammaloop-workspace-doctest> 2835 | let api = GammaLoopAPI(state_folder="./state", read_only_state=True)
  427. 646.22 s gammaloop-workspace-doctest> | +++
  428. 646.22 s gammaloop-workspace-doctest>
  429. 646.22 s gammaloop-workspace-doctest> error[E0425]: cannot find value `state_folder` in this scope
  430. 646.22 s gammaloop-workspace-doctest> --> crates/gammaloop-api/src/python.rs:2835:20
  431. 646.22 s gammaloop-workspace-doctest> |
  432. 646.22 s gammaloop-workspace-doctest> 2835 | api = GammaLoopAPI(state_folder="./state", read_only_state=True)
  433. 646.22 s gammaloop-workspace-doctest> | ^^^^^^^^^^^^ not found in this scope
  434. 646.22 s gammaloop-workspace-doctest>
  435. 646.22 s gammaloop-workspace-doctest> error[E0425]: cannot find value `read_only_state` in this scope
  436. 646.22 s gammaloop-workspace-doctest> --> crates/gammaloop-api/src/python.rs:2835:44
  437. 646.22 s gammaloop-workspace-doctest> |
  438. 646.22 s gammaloop-workspace-doctest> 2835 | api = GammaLoopAPI(state_folder="./state", read_only_state=True)
  439. 646.22 s gammaloop-workspace-doctest> | ^^^^^^^^^^^^^^^ not found in this scope
  440. 646.22 s gammaloop-workspace-doctest>
  441. 646.22 s gammaloop-workspace-doctest> error[E0425]: cannot find value `True` in this scope
  442. 646.23 s gammaloop-workspace-doctest> --> crates/gammaloop-api/src/python.rs:2835:60
  443. 646.23 s gammaloop-workspace-doctest> |
  444. 646.23 s gammaloop-workspace-doctest> 2835 | api = GammaLoopAPI(state_folder="./state", read_only_state=True)
  445. 646.23 s gammaloop-workspace-doctest> | ^^^^ not found in this scope
  446. 646.23 s gammaloop-workspace-doctest> |
  447. 646.23 s gammaloop-workspace-doctest> help: you may want to use a bool value instead
  448. 646.23 s gammaloop-workspace-doctest> |
  449. 646.23 s gammaloop-workspace-doctest> 2835 - api = GammaLoopAPI(state_folder="./state", read_only_state=True)
  450. 646.23 s gammaloop-workspace-doctest> 2835 + api = GammaLoopAPI(state_folder="./state", read_only_state=true)
  451. 646.23 s gammaloop-workspace-doctest> |
  452. 646.23 s gammaloop-workspace-doctest>
  453. 646.23 s gammaloop-workspace-doctest> error[E0425]: cannot find function, tuple struct or tuple variant `GammaLoopAPI` in this scope
  454. 646.23 s gammaloop-workspace-doctest> --> crates/gammaloop-api/src/python.rs:2835:7
  455. 646.23 s gammaloop-workspace-doctest> |
  456. 646.23 s gammaloop-workspace-doctest> 2835 | api = GammaLoopAPI(state_folder="./state", read_only_state=True)
  457. 646.23 s gammaloop-workspace-doctest> | ^^^^^^^^^^^^ not found in this scope
  458. 646.23 s gammaloop-workspace-doctest>
  459. 646.23 s gammaloop-workspace-doctest> error: aborting due to 5 previous errors
  460. 646.23 s gammaloop-workspace-doctest>
  461. 646.23 s gammaloop-workspace-doctest> For more information about this error, try `rustc --explain E0425`.
  462. 646.23 s gammaloop-workspace-doctest> Couldn't compile the test.
  463. 646.23 s gammaloop-workspace-doctest>
  464. 646.23 s gammaloop-workspace-doctest> failures:
  465. 646.23 s gammaloop-workspace-doctest> crates/gammaloop-api/src/python.rs - python::GammaLoopAPI::evaluate_sample (line 2967)
  466. 646.23 s gammaloop-workspace-doctest> crates/gammaloop-api/src/python.rs - python::GammaLoopAPI::evaluate_samples (line 3108)
  467. 646.23 s gammaloop-workspace-doctest> crates/gammaloop-api/src/python.rs - python::GammaLoopAPI::get_active_command_blocks (line 3760)
  468. 646.23 s gammaloop-workspace-doctest> crates/gammaloop-api/src/python.rs - python::GammaLoopAPI::get_default_runtime_settings (line 3796)
  469. 646.23 s gammaloop-workspace-doctest> crates/gammaloop-api/src/python.rs - python::GammaLoopAPI::get_global_settings (line 3739)
  470. 646.23 s gammaloop-workspace-doctest> crates/gammaloop-api/src/python.rs - python::GammaLoopAPI::get_integrand_info (line 3585)
  471. 646.23 s gammaloop-workspace-doctest> crates/gammaloop-api/src/python.rs - python::GammaLoopAPI::get_integrand_settings (line 3647)
  472. 646.23 s gammaloop-workspace-doctest> crates/gammaloop-api/src/python.rs - python::GammaLoopAPI::get_run_history (line 3711)
  473. 646.23 s gammaloop-workspace-doctest> crates/gammaloop-api/src/python.rs - python::GammaLoopAPI::new_python (line 2834)
  474. 646.23 s gammaloop-workspace-doctest> crates/gammaloop-api/src/python.rs - python::GammaLoopAPI::run_command (line 3901)
  475. 646.23 s gammaloop-workspace-doctest> crates/gammaloop-api/src/python.rs - python::PyHistogramAccumulator (line 871)
  476. 646.23 s gammaloop-workspace-doctest> crates/gammaloop-api/src/python.rs - python::atom_to_canonical_string (line 128)
  477. 646.23 s gammaloop-workspace-doctest> crates/gammaloop-api/src/python.rs - python::atom_to_dots (line 157)
  478. 646.23 s gammaloop-workspace-doctest> crates/gammaloop-api/src/python.rs - python::evaluate_graph_overall_factor (line 95)
  479. 646.23 s gammaloop-workspace-doctest>
  480. 646.23 s gammaloop-workspace-doctest> test result: FAILED. 2 passed; 14 failed; 0 ignored; 0 measured; 0 filtered out; finished in 3.24s
  481. 646.23 s gammaloop-workspace-doctest>
  482. 646.23 s gammaloop-workspace-doctest> error: doctest failed, to rerun pass `-p gammaloop-api --doc`
  483. 646.77 s error: Cannot build '/nix/store/7sklrrqr33rrmr48m29bipvdyblkjnbd-gammaloop-workspace-doctest-0.1.0.drv'.
  484. 646.77 s Reason: builder failed with exit code 101.
  485. 646.77 s Output paths:
  486. 646.77 s /nix/store/7szg1bw742zdanb7cjwdrz3z00q4sq55-gammaloop-workspace-doctest-0.1.0
  487. 646.77 s Last 356 log lines:
  488. 646.77 s > Running phase: unpackPhase
  489. 646.77 s > unpacking source archive /nix/store/5afz06g4vsphrihpxicbxvm3sk5psnll-source
  490. 646.77 s > source root is source
  491. 646.77 s > Running phase: patchPhase
  492. 646.77 s > Executing configureCargoCommonVars
  493. 646.77 s > decompressing cargo artifacts from /nix/store/72wdcnp633ang33qg6wvb90brvf1679y-gammaloop-workspace-deps-deps-0.1.0/target.tar.zst to target
  494. 646.77 s > Running phase: updateAutotoolsGnuConfigScriptsPhase
  495. 646.77 s > Running phase: configurePhase
  496. 646.77 s > will append /build/source/.cargo-home/config.toml with contents of /nix/store/29aa708jkn8wd8vjwja1a5gh8k8wpi2b-vendor-cargo-deps/config.toml
  497. 646.77 s > default configurePhase, nothing to do
  498. 646.77 s > Running phase: buildPhase
  499. 646.77 s > +++ command cargo --version
  500. 646.77 s > cargo 1.98.0 (797e8a9bc 2026-08-05)
  501. 646.77 s > +++ command cargo test --profile ci-optim --doc --locked --workspace --features gammaloop-api/cli,gammaloop-tracing-filter/clap,gammaloop-tracing-filter/symbolica,idenso/bincode,idenso/reference-cases,linnet/bincode,linnet/drawing,linnet/nodestore-vec,linnet/rkyv,linnet/serde,linnet/symbolica,spenso-macros/shadowing,spenso/shadowing,symbolica/tracing_max_level_info
  502. 646.77 s > Compiling target-lexicon v0.13.5
  503. 646.77 s > Compiling symbolica v2.2.0 (https://github.com/symbolica-dev/symbolica?branch=dev#0441bd7a)
  504. 646.77 s > Compiling maplit v1.0.2
  505. 646.77 s > Compiling gammaloop-tracing-filter-macros v0.1.0 (/build/source/crates/gammaloop-tracing-filter-macros)
  506. 646.77 s > Compiling vakint v0.1.2 (/build/source/crates/vakint)
  507. 646.77 s > Compiling gammalooprs v0.3.4 (/build/source/crates/gammalooprs)
  508. 646.77 s > Compiling alphal00p-docs-macros v0.1.0 (/build/source/crates/alphal00p-docs-macros)
  509. 646.77 s > Compiling alphal00p-docs-schema v0.1.0 (/build/source/crates/alphal00p-docs-schema)
  510. 646.77 s > Compiling rustc_version v0.4.1
  511. 646.77 s > Compiling bincode v1.3.3
  512. 646.77 s > Compiling gungraun-runner v0.18.2
  513. 646.77 s > Compiling target-triple v1.0.1
  514. 646.77 s > Compiling iai-callgrind-runner v0.14.2
  515. 646.77 s > Compiling gammaloop-integration-tests v0.1.0 (/build/source/tests)
  516. 646.77 s > Compiling test-log-core v0.2.20
  517. 646.77 s > Compiling wait-timeout v0.2.1
  518. 646.77 s > Compiling iai-callgrind v0.14.2
  519. 646.77 s > Compiling quick-error v1.2.3
  520. 646.77 s > Compiling bit-vec v0.8.0
  521. 646.77 s > Compiling rusty-fork v0.3.1
  522. 646.77 s > Compiling iai-callgrind-macros v0.5.1
  523. 646.77 s > Compiling bit-set v0.8.0
  524. 646.77 s > Compiling rand_xorshift v0.4.0
  525. 646.77 s > Compiling console v0.15.11
  526. 646.77 s > Compiling termcolor v1.4.1
  527. 646.77 s > Compiling gungraun-macros v0.8.0
  528. 646.77 s > Compiling unarray v0.1.4
  529. 646.77 s > Compiling glob v0.3.4
  530. 646.77 s > Compiling base64 v0.21.7
  531. 646.77 s > Compiling similar-asserts v1.7.0
  532. 646.77 s > Compiling trybuild v1.0.120
  533. 646.77 s > Compiling ron v0.8.1
  534. 646.77 s > Compiling proptest v1.11.0
  535. 646.77 s > Compiling alphal00p-docs-builder v0.1.0 (/build/source/crates/alphal00p-docs-builder)
  536. 646.77 s > Compiling pyo3-build-config v0.28.3
  537. 646.77 s > Compiling alphal00p-docs-catalogs v0.1.0 (/build/source/crates/alphal00p-docs-catalogs)
  538. 646.77 s > Compiling kurvst v0.1.0 (/build/source/crates/kurvst)
  539. 646.77 s > Compiling test-log-macros v0.2.20
  540. 646.77 s > Compiling test-log v0.2.20
  541. 646.77 s > Compiling alphal00p-docs-examples v0.1.0 (/build/source/crates/alphal00p-docs-examples)
  542. 646.77 s > Compiling pyo3-ffi v0.28.3
  543. 646.77 s > Compiling pyo3-macros-backend v0.28.3
  544. 646.77 s > Compiling pyo3 v0.28.3
  545. 646.77 s > Compiling numpy v0.28.0
  546. 646.77 s > Compiling gammaloop-api v0.1.0 (/build/source/crates/gammaloop-api)
  547. 646.77 s > Compiling gungraun v0.18.2
  548. 646.77 s > Compiling pyo3-macros v0.28.3
  549. 646.77 s > Compiling pyo3-stub-gen v0.17.2
  550. 646.77 s > Compiling numerica v2.2.0 (https://github.com/symbolica-dev/symbolica?branch=dev#0441bd7a)
  551. 646.77 s > Compiling graphica v2.1.0 (https://github.com/symbolica-dev/symbolica?branch=dev#0441bd7a)
  552. 646.77 s > Compiling symbolica-utils v0.1.0 (/build/source/crates/symbolica-utils)
  553. 646.77 s > Compiling gammaloop-workspace-hack v0.1.0 (/build/source/crates/gammaloop-workspace-hack)
  554. 646.77 s > Compiling spenso-macros v0.3.2 (/build/source/crates/spenso-macros)
  555. 646.77 s > Compiling linnet v0.17.0 (/build/source/crates/linnet)
  556. 646.77 s > Compiling spenso v0.6.0 (/build/source/crates/spenso)
  557. 646.77 s > Compiling idenso v0.3.0 (/build/source/crates/idenso)
  558. 646.77 s > Compiling gammaloop-tracing-filter v0.1.0 (/build/source/crates/gammaloop-tracing-filter)
  559. 646.77 s > Compiling spenso-hep-lib v0.1.7 (/build/source/crates/spenso-hep-lib)
  560. 646.77 s > Compiling spynso3 v0.1.2 (/build/source/crates/spynso3)
  561. 646.77 s > Compiling linnest v0.1.0 (/build/source/crates/linnest)
  562. 646.77 s > Compiling linnet-py v0.1.0 (/build/source/crates/linnet-py)
  563. 646.77 s > Finished `ci-optim` profile [optimized] target(s) in 9m 51s
  564. 646.77 s > warning: the following packages contain code that will be rejected by a future version of Rust: proc-macro-error2 v2.0.1
  565. 646.77 s > note: to see what the problems were, use the option `--future-incompat-report`, or run `cargo report future-incompatibilities --id 1`
  566. 646.77 s > Doc-tests alphal00p_docs_builder
  567. 646.77 s >
  568. 646.77 s > running 0 tests
  569. 646.77 s >
  570. 646.77 s > test result: ok. 0 passed; 0 failed; 0 ignored; 0 measured; 0 filtered out; finished in 0.00s
  571. 646.77 s >
  572. 646.77 s > Doc-tests alphal00p_docs_catalogs
  573. 646.77 s >
  574. 646.77 s > running 0 tests
  575. 646.77 s >
  576. 646.77 s > test result: ok. 0 passed; 0 failed; 0 ignored; 0 measured; 0 filtered out; finished in 0.00s
  577. 646.77 s >
  578. 646.77 s > Doc-tests alphal00p_docs_examples
  579. 646.77 s >
  580. 646.77 s > running 0 tests
  581. 646.77 s >
  582. 646.77 s > test result: ok. 0 passed; 0 failed; 0 ignored; 0 measured; 0 filtered out; finished in 0.00s
  583. 646.77 s >
  584. 646.77 s > Doc-tests alphal00p_docs
  585. 646.77 s >
  586. 646.77 s > running 0 tests
  587. 646.77 s >
  588. 646.77 s > test result: ok. 0 passed; 0 failed; 0 ignored; 0 measured; 0 filtered out; finished in 0.00s
  589. 646.77 s >
  590. 646.77 s > Doc-tests alphal00p_docs_schema
  591. 646.77 s >
  592. 646.77 s > running 0 tests
  593. 646.77 s >
  594. 646.77 s > test result: ok. 0 passed; 0 failed; 0 ignored; 0 measured; 0 filtered out; finished in 0.00s
  595. 646.77 s >
  596. 646.77 s > Doc-tests gammaloop_api
  597. 646.77 s >
  598. 646.77 s > running 16 tests
  599. 646.77 s > test crates/gammaloop-api/src/python.rs - python::GammaLoopAPI::evaluate_samples (line 3108) ... FAILED
  600. 646.77 s > test crates/gammaloop-api/src/python.rs - python::PyHistogramAccumulator (line 871) ... FAILED
  601. 646.77 s > test crates/gammaloop-api/src/python.rs - python::GammaLoopAPI::get_active_command_blocks (line 3760) ... FAILED
  602. 646.77 s > test crates/gammaloop-api/src/python.rs - python::GammaLoopAPI::get_integrand_settings (line 3647) ... FAILED
  603. 646.77 s > test crates/gammaloop-api/src/python.rs - python::GammaLoopAPI::evaluate_sample (line 2967) ... FAILED
  604. 646.77 s > test crates/gammaloop-api/src/python.rs - python::GammaLoopAPI::get_integrand_info (line 3585) ... FAILED
  605. 646.77 s > test crates/gammaloop-api/src/python.rs - python::GammaLoopAPI::get_default_runtime_settings (line 3796) ... FAILED
  606. 646.77 s > test crates/gammaloop-api/src/lib.rs - (line 18) - compile ... ok
  607. 646.77 s > test crates/gammaloop-api/src/python.rs - python::GammaLoopAPI::get_run_history (line 3711) ... FAILED
  608. 646.77 s > test crates/gammaloop-api/src/python.rs - python::GammaLoopAPI::run_command (line 3901) ... FAILED
  609. 646.77 s > test crates/gammaloop-api/src/python.rs - python::GammaLoopAPI::get_global_settings (line 3739) ... FAILED
  610. 646.77 s > test crates/gammaloop-api/src/python.rs - python::atom_to_canonical_string (line 128) ... FAILED
  611. 646.77 s > test crates/gammaloop-api/src/python.rs - python::evaluate_graph_overall_factor (line 95) ... FAILED
  612. 646.77 s > test crates/gammaloop-api/src/python.rs - python::atom_to_dots (line 157) ... FAILED
  613. 646.77 s > test crates/gammaloop-api/src/python.rs - python::GammaLoopAPI::new_python (line 2834) ... FAILED
  614. 646.77 s > test crates/gammaloop-api/src/commands/evaluate_samples.rs - commands::evaluate_samples::EvaluateSamples (line 50) ... ok
  615. 646.77 s >
  616. 646.77 s > failures:
  617. 646.77 s >
  618. 646.77 s > ---- crates/gammaloop-api/src/python.rs - python::GammaLoopAPI::evaluate_samples (line 3108) stdout ----
  619. 646.77 s > error: expected one of `!` or `::`, found `pathlib`
  620. 646.77 s > --> crates/gammaloop-api/src/python.rs:3109:6
  621. 646.77 s > |
  622. 646.77 s > 3109 | from pathlib import Path
  623. 646.77 s > | ^^^^^^^ expected one of `!` or `::`
  624. 646.77 s >
  625. 646.77 s > error: aborting due to 1 previous error
  626. 646.77 s >
  627. 646.77 s > Couldn't compile the test.
  628. 646.77 s > ---- crates/gammaloop-api/src/python.rs - python::PyHistogramAccumulator (line 871) stdout ----
  629. 646.77 s > error: expected one of `!` or `::`, found `gammaloop`
  630. 646.77 s > --> crates/gammaloop-api/src/python.rs:872:6
  631. 646.77 s > |
  632. 646.77 s > 872 | from gammaloop import HistogramAccumulator
  633. 646.77 s > | ^^^^^^^^^ expected one of `!` or `::`
  634. 646.77 s >
  635. 646.77 s > error: aborting due to 1 previous error
  636. 646.77 s >
  637. 646.77 s > Couldn't compile the test.
  638. 646.77 s > ---- crates/gammaloop-api/src/python.rs - python::GammaLoopAPI::get_active_command_blocks (line 3760) stdout ----
  639. 646.77 s > error: expected item, found keyword `for`
  640. 646.77 s > --> crates/gammaloop-api/src/python.rs:3761:1
  641. 646.77 s > |
  642. 646.77 s > 3761 | for name, commands in api.get_active_command_blocks().items():
  643. 646.77 s > | ^^^ expected item
  644. 646.77 s > |
  645. 646.77 s > = note: for a full list of items that can appear in modules, see <https://doc.rust-lang.org/reference/items.html>
  646. 646.77 s >
  647. 646.77 s > error: aborting due to 1 previous error
  648. 646.77 s >
  649. 646.77 s > Couldn't compile the test.
  650. 646.77 s > ---- crates/gammaloop-api/src/python.rs - python::GammaLoopAPI::get_integrand_settings (line 3647) stdout ----
  651. 646.77 s > error: expected one of `!` or `::`, found `=`
  652. 646.77 s > --> crates/gammaloop-api/src/python.rs:3648:10
  653. 646.77 s > |
  654. 646.77 s > 3648 | settings = api.get_integrand_settings(process_id=0)
  655. 646.77 s > | ^ expected one of `!` or `::`
  656. 646.77 s >
  657. 646.77 s > error: aborting due to 1 previous error
  658. 646.77 s >
  659. 646.77 s > Couldn't compile the test.
  660. 646.77 s > ---- crates/gammaloop-api/src/python.rs - python::GammaLoopAPI::evaluate_sample (line 2967) stdout ----
  661. 646.77 s > error: expected one of `!` or `::`, found `pathlib`
  662. 646.77 s > --> crates/gammaloop-api/src/python.rs:2968:6
  663. 646.77 s > |
  664. 646.77 s > 2968 | from pathlib import Path
  665. 646.77 s > | ^^^^^^^ expected one of `!` or `::`
  666. 646.77 s >
  667. 646.77 s > error: aborting due to 1 previous error
  668. 646.77 s >
  669. 646.77 s > Couldn't compile the test.
  670. 646.77 s > ---- crates/gammaloop-api/src/python.rs - python::GammaLoopAPI::get_integrand_info (line 3585) stdout ----
  671. 646.77 s > error: expected one of `!` or `::`, found `pathlib`
  672. 646.77 s > --> crates/gammaloop-api/src/python.rs:3586:6
  673. 646.77 s > |
  674. 646.77 s > 3586 | from pathlib import Path
  675. 646.77 s > | ^^^^^^^ expected one of `!` or `::`
  676. 646.77 s >
  677. 646.77 s > error: aborting due to 1 previous error
  678. 646.77 s >
  679. 646.77 s > Couldn't compile the test.
  680. 646.77 s > ---- crates/gammaloop-api/src/python.rs - python::GammaLoopAPI::get_default_runtime_settings (line 3796) stdout ----
  681. 646.77 s > error: expected one of `!` or `::`, found `=`
  682. 646.77 s > --> crates/gammaloop-api/src/python.rs:3797:9
  683. 646.77 s > |
  684. 646.77 s > 3797 | runtime = api.get_default_runtime_settings()
  685. 646.77 s > | ^ expected one of `!` or `::`
  686. 646.77 s >
  687. 646.77 s > error: aborting due to 1 previous error
  688. 646.77 s >
  689. 646.77 s > Couldn't compile the test.
  690. 646.77 s > ---- crates/gammaloop-api/src/python.rs - python::GammaLoopAPI::get_run_history (line 3711) stdout ----
  691. 646.77 s > error[E0425]: cannot find value `run_card_toml` in this scope
  692. 646.77 s > --> crates/gammaloop-api/src/python.rs:3712:1
  693. 646.77 s > |
  694. 646.77 s > 3712 | run_card_toml = api.get_run_history()
  695. 646.77 s > | ^^^^^^^^^^^^^
  696. 646.77 s > |
  697. 646.77 s > help: you might have meant to introduce a new binding
  698. 646.77 s > |
  699. 646.77 s > 3712 | let run_card_toml = api.get_run_history()
  700. 646.77 s > | +++
  701. 646.77 s >
  702. 646.77 s > error[E0425]: cannot find value `api` in this scope
  703. 646.77 s > --> crates/gammaloop-api/src/python.rs:3712:17
  704. 646.77 s > |
  705. 646.77 s > 3712 | run_card_toml = api.get_run_history()
  706. 646.77 s > | ^^^ not found in this scope
  707. 646.77 s >
  708. 646.77 s > error: aborting due to 2 previous errors
  709. 646.77 s >
  710. 646.77 s > For more information about this error, try `rustc --explain E0425`.
  711. 646.77 s > Couldn't compile the test.
  712. 646.77 s > ---- crates/gammaloop-api/src/python.rs - python::GammaLoopAPI::run_command (line 3901) stdout ----
  713. 646.77 s > error[E0425]: cannot find value `api` in this scope
  714. 646.77 s > --> crates/gammaloop-api/src/python.rs:3902:1
  715. 646.77 s > |
  716. 646.77 s > 3902 | api.run("display processes")
  717. 646.77 s > | ^^^ not found in this scope
  718. 646.77 s >
  719. 646.77 s > error: aborting due to 1 previous error
  720. 646.77 s >
  721. 646.77 s > For more information about this error, try `rustc --explain E0425`.
  722. 646.77 s > Couldn't compile the test.
  723. 646.77 s > ---- crates/gammaloop-api/src/python.rs - python::GammaLoopAPI::get_global_settings (line 3739) stdout ----
  724. 646.77 s > error[E0425]: cannot find value `settings_toml` in this scope
  725. 646.77 s > --> crates/gammaloop-api/src/python.rs:3740:1
  726. 646.77 s > |
  727. 646.77 s > 3740 | settings_toml = api.get_global_settings()
  728. 646.77 s > | ^^^^^^^^^^^^^
  729. 646.77 s > |
  730. 646.77 s > help: you might have meant to introduce a new binding
  731. 646.77 s > |
  732. 646.77 s > 3740 | let settings_toml = api.get_global_settings()
  733. 646.77 s > | +++
  734. 646.77 s >
  735. 646.77 s > error[E0425]: cannot find value `api` in this scope
  736. 646.77 s > --> crates/gammaloop-api/src/python.rs:3740:17
  737. 646.77 s > |
  738. 646.77 s > 3740 | settings_toml = api.get_global_settings()
  739. 646.77 s > | ^^^ not found in this scope
  740. 646.77 s >
  741. 646.77 s > error: aborting due to 2 previous errors
  742. 646.77 s >
  743. 646.77 s > For more information about this error, try `rustc --explain E0425`.
  744. 646.77 s > Couldn't compile the test.
  745. 646.77 s > ---- crates/gammaloop-api/src/python.rs - python::atom_to_canonical_string (line 128) stdout ----
  746. 646.77 s > error[E0425]: cannot find function `atom_to_canonical_string` in this scope
  747. 646.77 s > --> crates/gammaloop-api/src/python.rs:129:1
  748. 646.77 s > |
  749. 646.77 s > 129 | atom_to_canonical_string("x + x")
  750. 646.77 s > | ^^^^^^^^^^^^^^^^^^^^^^^^ not found in this scope
  751. 646.77 s >
  752. 646.77 s > error: aborting due to 1 previous error
  753. 646.77 s >
  754. 646.77 s > For more information about this error, try `rustc --explain E0425`.
  755. 646.77 s > Couldn't compile the test.
  756. 646.77 s > ---- crates/gammaloop-api/src/python.rs - python::evaluate_graph_overall_factor (line 95) stdout ----
  757. 646.77 s > error[E0425]: cannot find function `evaluate_graph_overall_factor` in this scope
  758. 646.77 s > --> crates/gammaloop-api/src/python.rs:96:1
  759. 646.77 s > |
  760. 646.77 s > 96 | evaluate_graph_overall_factor(
  761. 646.77 s > | ^^^^^^^^^^^^^^^^^^^^^^^^^^^^^ not found in this scope
  762. 646.77 s >
  763. 646.77 s > error: aborting due to 1 previous error
  764. 646.77 s >
  765. 646.77 s > For more information about this error, try `rustc --explain E0425`.
  766. 646.77 s > Couldn't compile the test.
  767. 646.77 s > ---- crates/gammaloop-api/src/python.rs - python::atom_to_dots (line 157) stdout ----
  768. 646.77 s > error[E0425]: cannot find function `to_dots` in this scope
  769. 646.77 s > --> crates/gammaloop-api/src/python.rs:158:1
  770. 646.77 s > |
  771. 646.77 s > 158 | to_dots("p(mu) * q(mu)")
  772. 646.77 s > | ^^^^^^^ not found in this scope
  773. 646.77 s >
  774. 646.77 s > error: aborting due to 1 previous error
  775. 646.77 s >
  776. 646.77 s > For more information about this error, try `rustc --explain E0425`.
  777. 646.77 s > Couldn't compile the test.
  778. 646.77 s > ---- crates/gammaloop-api/src/python.rs - python::GammaLoopAPI::new_python (line 2834) stdout ----
  779. 646.77 s > error[E0425]: cannot find value `api` in this scope
  780. 646.77 s > --> crates/gammaloop-api/src/python.rs:2835:1
  781. 646.77 s > |
  782. 646.77 s > 2835 | api = GammaLoopAPI(state_folder="./state", read_only_state=True)
  783. 646.77 s > | ^^^
  784. 646.77 s > |
  785. 646.77 s > help: you might have meant to introduce a new binding
  786. 646.77 s > |
  787. 646.77 s > 2835 | let api = GammaLoopAPI(state_folder="./state", read_only_state=True)
  788. 646.77 s > | +++
  789. 646.77 s >
  790. 646.77 s > error[E0425]: cannot find value `state_folder` in this scope
  791. 646.77 s > --> crates/gammaloop-api/src/python.rs:2835:20
  792. 646.77 s > |
  793. 646.77 s > 2835 | api = GammaLoopAPI(state_folder="./state", read_only_state=True)
  794. 646.77 s > | ^^^^^^^^^^^^ not found in this scope
  795. 646.77 s >
  796. 646.77 s > error[E0425]: cannot find value `read_only_state` in this scope
  797. 646.77 s > --> crates/gammaloop-api/src/python.rs:2835:44
  798. 646.77 s > |
  799. 646.77 s > 2835 | api = GammaLoopAPI(state_folder="./state", read_only_state=True)
  800. 646.77 s > | ^^^^^^^^^^^^^^^ not found in this scope
  801. 646.77 s >
  802. 646.77 s > error[E0425]: cannot find value `True` in this scope
  803. 646.77 s > --> crates/gammaloop-api/src/python.rs:2835:60
  804. 646.77 s > |
  805. 646.77 s > 2835 | api = GammaLoopAPI(state_folder="./state", read_only_state=True)
  806. 646.77 s > | ^^^^ not found in this scope
  807. 646.77 s > |
  808. 646.77 s > help: you may want to use a bool value instead
  809. 646.77 s > |
  810. 646.77 s > 2835 - api = GammaLoopAPI(state_folder="./state", read_only_state=True)
  811. 646.77 s > 2835 + api = GammaLoopAPI(state_folder="./state", read_only_state=true)
  812. 646.77 s > |
  813. 646.77 s >
  814. 646.77 s > error[E0425]: cannot find function, tuple struct or tuple variant `GammaLoopAPI` in this scope
  815. 646.77 s > --> crates/gammaloop-api/src/python.rs:2835:7
  816. 646.77 s > |
  817. 646.77 s > 2835 | api = GammaLoopAPI(state_folder="./state", read_only_state=True)
  818. 646.77 s > | ^^^^^^^^^^^^ not found in this scope
  819. 646.77 s >
  820. 646.77 s > error: aborting due to 5 previous errors
  821. 646.77 s >
  822. 646.77 s > For more information about this error, try `rustc --explain E0425`.
  823. 646.77 s > Couldn't compile the test.
  824. 646.77 s >
  825. 646.77 s > failures:
  826. 646.77 s > crates/gammaloop-api/src/python.rs - python::GammaLoopAPI::evaluate_sample (line 2967)
  827. 646.77 s > crates/gammaloop-api/src/python.rs - python::GammaLoopAPI::evaluate_samples (line 3108)
  828. 646.77 s > crates/gammaloop-api/src/python.rs - python::GammaLoopAPI::get_active_command_blocks (line 3760)
  829. 646.77 s > crates/gammaloop-api/src/python.rs - python::GammaLoopAPI::get_default_runtime_settings (line 3796)
  830. 646.77 s > crates/gammaloop-api/src/python.rs - python::GammaLoopAPI::get_global_settings (line 3739)
  831. 646.77 s > crates/gammaloop-api/src/python.rs - python::GammaLoopAPI::get_integrand_info (line 3585)
  832. 646.77 s > crates/gammaloop-api/src/python.rs - python::GammaLoopAPI::get_integrand_settings (line 3647)
  833. 646.77 s > crates/gammaloop-api/src/python.rs - python::GammaLoopAPI::get_run_history (line 3711)
  834. 646.77 s > crates/gammaloop-api/src/python.rs - python::GammaLoopAPI::new_python (line 2834)
  835. 646.77 s > crates/gammaloop-api/src/python.rs - python::GammaLoopAPI::run_command (line 3901)
  836. 646.78 s > crates/gammaloop-api/src/python.rs - python::PyHistogramAccumulator (line 871)
  837. 646.78 s > crates/gammaloop-api/src/python.rs - python::atom_to_canonical_string (line 128)
  838. 646.78 s > crates/gammaloop-api/src/python.rs - python::atom_to_dots (line 157)
  839. 646.78 s > crates/gammaloop-api/src/python.rs - python::evaluate_graph_overall_factor (line 95)
  840. 646.78 s >
  841. 646.78 s > test result: FAILED. 2 passed; 14 failed; 0 ignored; 0 measured; 0 filtered out; finished in 3.24s
  842. 646.78 s >
  843. 646.78 s > error: doctest failed, to rerun pass `-p gammaloop-api --doc`
  844. 646.78 s For full logs, run:
  845. 646.78 s nix log /nix/store/7sklrrqr33rrmr48m29bipvdyblkjnbd-gammaloop-workspace-doctest-0.1.0.drv
  846. 646.86 s [0 built (1 failed), 0.0Run failed.