test packages.x86_64-linux.nix-ci-check-gammaloop-doctest
0.13 s
$ /nix/store/9ypz3flqsrl5xl495mm8h645gadjsxi1-coreutils-9.11/bin/timeout --kill-after=15s 7200s /nix/store/23zk8sgzamrbmj1fday15szf7f2279s8-nix-2.34.7/bin/nix --extra-experimental-features nix-command --extra-experimental-features flakes flake clone git+https://github.com/alphal00p/gammaloop --dest /tmp/nix-ci-worker/stable-pwd/repo/
0.15 s
Cloning into '/tmp/nix-ci-worker/stable-pwd/repo'...
1.54 s
remote: Enumerating objects: 66333, done.
1.77 s
remote: Counting objects: 0% (1/8984)
remote: Counting objects: 1% (90/8984)
remote: Counting objects: 2% (180/8984)
remote: Counting objects: 3% (270/8984)
remote: Counting objects: 4% (360/8984)
remote: Counting objects: 5% (450/8984)
remote: Counting objects: 6% (540/8984)
remote: Counting objects: 7% (629/8984)
remote: Counting objects: 8% (719/8984)
remote: Counting objects: 9% (809/8984)
remote: Counting objects: 10% (899/8984)
remote: Counting objects: 11% (989/8984)
remote: Counting objects: 12% (1079/8984)
remote: Counting objects: 13% (1168/8984)
remote: Counting objects: 14% (1258/8984)
remote: Counting objects: 15% (1348/8984)
remote: Counting objects: 16% (1438/8984)
remote: Counting objects: 17% (1528/8984)
remote: Counting objects: 18% (1618/8984)
remote: Counting objects: 19% (1707/8984)
remote: Counting objects: 20% (1797/8984)
remote: Counting objects: 21% (1887/8984)
remote: Counting objects: 22% (1977/8984)
remote: Counting objects: 23% (2067/8984)
remote: Counting objects: 24% (2157/8984)
remote: Counting objects: 25% (2246/8984)
remote: Counting objects: 26% (2336/8984)
remote: Counting objects: 27% (2426/8984)
remote: Counting objects: 28% (2516/8984)
remote: Counting objects: 29% (2606/8984)
remote: Counting objects: 30% (2696/8984)
remote: Counting objects: 31% (2786/8984)
remote: Counting objects: 32% (2875/8984)
remote: Counting objects: 33% (2965/8984)
remote: Counting objects: 34% (3055/8984)
remote: Counting objects: 35% (3145/8984)
remote: Counting objects: 36% (3235/8984)
remote: Counting objects: 37% (3325/8984)
remote: Counting objects: 38% (3414/8984)
remote: Counting objects: 39% (3504/8984)
remote: Counting objects: 40% (3594/8984)
remote: Counting objects: 41% (3684/8984)
remote: Counting objects: 42% (3774/8984)
remote: Counting objects: 43% (3864/8984)
remote: Counting objects: 44% (3953/8984)
remote: Counting objects: 45% (4043/8984)
remote: Counting objects: 46% (4133/8984)
remote: Counting objects: 47% (4223/8984)
remote: Counting objects: 48% (4313/8984)
remote: Counting objects: 49% (4403/8984)
remote: Counting objects: 50% (4492/8984)
remote: Counting objects: 51% (4582/8984)
remote: Counting objects: 52% (4672/8984)
remote: Counting objects: 53% (4762/8984)
remote: Counting objects: 54% (4852/8984)
remote: Counting objects: 55% (4942/8984)
remote: Counting objects: 56% (5032/8984)
remote: Counting objects: 57% (5121/8984)
remote: Counting objects: 58% (5211/8984)
remote: Counting objects: 59% (5301/8984)
remote: Counting objects: 60% (5391/8984)
remote: Counting objects: 61% (5481/8984)
remote: Counting objects: 62% (5571/8984)
remote: Counting objects: 63% (5660/8984)
remote: Counting objects: 64% (5750/8984)
remote: Counting objects: 65% (5840/8984)
remote: Counting objects: 66% (5930/8984)
remote: Counting objects: 67% (6020/8984)
remote: Counting objects: 68% (6110/8984)
remote: Counting objects: 69% (6199/8984)
remote: Counting objects: 70% (6289/8984)
remote: Counting objects: 71% (6379/8984)
remote: Counting objects: 72% (6469/8984)
remote: Counting objects: 73% (6559/8984)
remote: Counting objects: 74% (6649/8984)
remote: Counting objects: 75% (6738/8984)
remote: Counting objects: 76% (6828/8984)
remote: Counting objects: 77% (6918/8984)
remote: Counting objects: 78% (7008/8984)
remote: Counting objects: 79% (7098/8984)
remote: Counting objects: 80% (7188/8984)
remote: Counting objects: 81% (7278/8984)
remote: Counting objects: 82% (7367/8984)
remote: Counting objects: 83% (7457/8984)
remote: Counting objects: 84% (7547/8984)
remote: Counting objects: 85% (7637/8984)
remote: Counting objects: 86% (7727/8984)
remote: Counting objects: 87% (7817/8984)
remote: Counting objects: 88% (7906/8984)
remote: Counting objects: 89% (7996/8984)
remote: Counting objects: 90% (8086/8984)
remote: Counting objects: 91% (8176/8984)
remote: Counting objects: 92% (8266/8984)
remote: Counting objects: 93% (8356/8984)
remote: Counting objects: 94% (8445/8984)
remote: Counting objects: 95% (8535/8984)
remote: Counting objects: 96% (8625/8984)
remote: Counting objects: 97% (8715/8984)
remote: Counting objects: 98% (8805/8984)
remote: Counting objects: 99% (8895/8984)
remote: Counting objects: 100% (8984/8984)
remote: Counting objects: 100% (8984/8984), done.
4.38 s
remote: Compressing objects: 0% (1/2110)
remote: Compressing objects: 1% (22/2110)
remote: Compressing objects: 2% (43/2110)
remote: Compressing objects: 3% (64/2110)
remote: Compressing objects: 4% (85/2110)
remote: Compressing objects: 5% (106/2110)
remote: Compressing objects: 6% (127/2110)
remote: Compressing objects: 7% (148/2110)
remote: Compressing objects: 8% (169/2110)
remote: Compressing objects: 9% (190/2110)
remote: Compressing objects: 10% (211/2110)
remote: Compressing objects: 11% (233/2110)
remote: Compressing objects: 12% (254/2110)
remote: Compressing objects: 13% (275/2110)
remote: Compressing objects: 14% (296/2110)
remote: Compressing objects: 15% (317/2110)
remote: Compressing objects: 16% (338/2110)
remote: Compressing objects: 17% (359/2110)
remote: Compressing objects: 18% (380/2110)
remote: Compressing objects: 19% (401/2110)
remote: Compressing objects: 20% (422/2110)
remote: Compressing objects: 20% (435/2110)
remote: Compressing objects: 21% (444/2110)
remote: Compressing objects: 22% (465/2110)
remote: Compressing objects: 23% (486/2110)
remote: Compressing objects: 24% (507/2110)
remote: Compressing objects: 25% (528/2110)
remote: Compressing objects: 25% (544/2110)
remote: Compressing objects: 26% (549/2110)
remote: Compressing objects: 27% (570/2110)
remote: Compressing objects: 28% (591/2110)
remote: Compressing objects: 29% (612/2110)
remote: Compressing objects: 30% (633/2110)
remote: Compressing objects: 31% (655/2110)
remote: Compressing objects: 32% (676/2110)
remote: Compressing objects: 33% (697/2110)
remote: Compressing objects: 34% (718/2110)
remote: Compressing objects: 35% (739/2110)
remote: Compressing objects: 36% (760/2110)
remote: Compressing objects: 37% (781/2110)
remote: Compressing objects: 38% (802/2110)
remote: Compressing objects: 39% (823/2110)
remote: Compressing objects: 40% (844/2110)
remote: Compressing objects: 41% (866/2110)
remote: Compressing objects: 42% (887/2110)
remote: Compressing objects: 43% (908/2110)
remote: Compressing objects: 44% (929/2110)
remote: Compressing objects: 45% (950/2110)
remote: Compressing objects: 46% (971/2110)
remote: Compressing objects: 47% (992/2110)
remote: Compressing objects: 48% (1013/2110)
remote: Compressing objects: 49% (1034/2110)
remote: Compressing objects: 50% (1055/2110)
remote: Compressing objects: 51% (1077/2110)
remote: Compressing objects: 52% (1098/2110)
remote: Compressing objects: 53% (1119/2110)
remote: Compressing objects: 54% (1140/2110)
remote: Compressing objects: 55% (1161/2110)
remote: Compressing objects: 56% (1182/2110)
remote: Compressing objects: 57% (1203/2110)
remote: Compressing objects: 58% (1224/2110)
remote: Compressing objects: 59% (1245/2110)
remote: Compressing objects: 60% (1266/2110)
remote: Compressing objects: 61% (1288/2110)
remote: Compressing objects: 62% (1309/2110)
remote: Compressing objects: 63% (1330/2110)
remote: Compressing objects: 64% (1351/2110)
remote: Compressing objects: 65% (1372/2110)
remote: Compressing objects: 66% (1393/2110)
remote: Compressing objects: 67% (1414/2110)
remote: Compressing objects: 68% (1435/2110)
remote: Compressing objects: 69% (1456/2110)
remote: Compressing objects: 70% (1477/2110)
remote: Compressing objects: 71% (1499/2110)
remote: Compressing objects: 72% (1520/2110)
remote: Compressing objects: 73% (1541/2110)
remote: Compressing objects: 74% (1562/2110)
remote: Compressing objects: 75% (1583/2110)
remote: Compressing objects: 76% (1604/2110)
remote: Compressing objects: 77% (1625/2110)
remote: Compressing objects: 78% (1646/2110)
remote: Compressing objects: 79% (1667/2110)
remote: Compressing objects: 80% (1688/2110)
remote: Compressing objects: 81% (1710/2110)
remote: Compressing objects: 82% (1731/2110)
remote: Compressing objects: 83% (1752/2110)
remote: Compressing objects: 84% (1773/2110)
remote: Compressing objects: 85% (1794/2110)
remote: Compressing objects: 86% (1815/2110)
remote: Compressing objects: 87% (1836/2110)
remote: Compressing objects: 88% (1857/2110)
remote: Compressing objects: 89% (1878/2110)
remote: Compressing objects: 90% (1899/2110)
remote: Compressing objects: 91% (1921/2110)
remote: Compressing objects: 92% (1942/2110)
remote: Compressing objects: 93% (1963/2110)
remote: Compressing objects: 94% (1984/2110)
remote: Compressing objects: 95% (2005/2110)
remote: Compressing objects: 96% (2026/2110)
remote: Compressing objects: 97% (2047/2110)
remote: Compressing objects: 98% (2068/2110)
remote: Compressing objects: 99% (2089/2110)
remote: Compressing objects: 100% (2110/2110)
remote: Compressing objects: 100% (2110/2110), done.
7.54 s
Receiving objects: 0% (1/66333)
Receiving objects: 1% (664/66333)
Receiving objects: 2% (1327/66333)
Receiving objects: 3% (1990/66333)
Receiving objects: 4% (2654/66333)
Receiving objects: 5% (3317/66333)
Receiving objects: 6% (3980/66333)
Receiving objects: 7% (4644/66333)
Receiving objects: 8% (5307/66333), 9.34 MiB | 18.66 MiB/s
Receiving objects: 9% (5970/66333), 9.34 MiB | 18.66 MiB/s
Receiving objects: 10% (6634/66333), 9.34 MiB | 18.66 MiB/s
Receiving objects: 11% (7297/66333), 9.34 MiB | 18.66 MiB/s
Receiving objects: 12% (7960/66333), 9.34 MiB | 18.66 MiB/s
Receiving objects: 13% (8624/66333), 9.34 MiB | 18.66 MiB/s
Receiving objects: 14% (9287/66333), 9.34 MiB | 18.66 MiB/s
Receiving objects: 15% (9950/66333), 9.34 MiB | 18.66 MiB/s
Receiving objects: 16% (10614/66333), 9.34 MiB | 18.66 MiB/s
Receiving objects: 17% (11277/66333), 9.34 MiB | 18.66 MiB/s
Receiving objects: 18% (11940/66333), 9.34 MiB | 18.66 MiB/s
Receiving objects: 19% (12604/66333), 9.34 MiB | 18.66 MiB/s
Receiving objects: 20% (13267/66333), 9.34 MiB | 18.66 MiB/s
Receiving objects: 21% (13930/66333), 9.34 MiB | 18.66 MiB/s
Receiving objects: 22% (14594/66333), 9.34 MiB | 18.66 MiB/s
Receiving objects: 23% (15257/66333), 9.34 MiB | 18.66 MiB/s
Receiving objects: 24% (15920/66333), 9.34 MiB | 18.66 MiB/s
Receiving objects: 25% (16584/66333), 9.34 MiB | 18.66 MiB/s
Receiving objects: 26% (17247/66333), 9.34 MiB | 18.66 MiB/s
Receiving objects: 27% (17910/66333), 9.34 MiB | 18.66 MiB/s
Receiving objects: 28% (18574/66333), 9.34 MiB | 18.66 MiB/s
Receiving objects: 29% (19237/66333), 9.34 MiB | 18.66 MiB/s
Receiving objects: 30% (19900/66333), 9.34 MiB | 18.66 MiB/s
Receiving objects: 31% (20564/66333), 9.34 MiB | 18.66 MiB/s
Receiving objects: 32% (21227/66333), 9.34 MiB | 18.66 MiB/s
Receiving objects: 33% (21890/66333), 9.34 MiB | 18.66 MiB/s
Receiving objects: 34% (22554/66333), 9.34 MiB | 18.66 MiB/s
Receiving objects: 35% (23217/66333), 9.34 MiB | 18.66 MiB/s
Receiving objects: 35% (23223/66333), 9.34 MiB | 18.66 MiB/s
Receiving objects: 36% (23880/66333), 25.93 MiB | 25.92 MiB/s
Receiving objects: 37% (24544/66333), 25.93 MiB | 25.92 MiB/s
Receiving objects: 38% (25207/66333), 25.93 MiB | 25.92 MiB/s
Receiving objects: 39% (25870/66333), 25.93 MiB | 25.92 MiB/s
Receiving objects: 40% (26534/66333), 25.93 MiB | 25.92 MiB/s
Receiving objects: 41% (27197/66333), 25.93 MiB | 25.92 MiB/s
Receiving objects: 42% (27860/66333), 25.93 MiB | 25.92 MiB/s
Receiving objects: 43% (28524/66333), 25.93 MiB | 25.92 MiB/s
Receiving objects: 44% (29187/66333), 25.93 MiB | 25.92 MiB/s
Receiving objects: 45% (29850/66333), 25.93 MiB | 25.92 MiB/s
Receiving objects: 46% (30514/66333), 25.93 MiB | 25.92 MiB/s
Receiving objects: 47% (31177/66333), 25.93 MiB | 25.92 MiB/s
Receiving objects: 48% (31840/66333), 25.93 MiB | 25.92 MiB/s
Receiving objects: 49% (32504/66333), 25.93 MiB | 25.92 MiB/s
Receiving objects: 50% (33167/66333), 25.93 MiB | 25.92 MiB/s
Receiving objects: 51% (33830/66333), 25.93 MiB | 25.92 MiB/s
Receiving objects: 52% (34494/66333), 25.93 MiB | 25.92 MiB/s
Receiving objects: 53% (35157/66333), 25.93 MiB | 25.92 MiB/s
Receiving objects: 54% (35820/66333), 25.93 MiB | 25.92 MiB/s
Receiving objects: 55% (36484/66333), 25.93 MiB | 25.92 MiB/s
Receiving objects: 56% (37147/66333), 25.93 MiB | 25.92 MiB/s
Receiving objects: 57% (37810/66333), 25.93 MiB | 25.92 MiB/s
Receiving objects: 58% (38474/66333), 25.93 MiB | 25.92 MiB/s
Receiving objects: 59% (39137/66333), 25.93 MiB | 25.92 MiB/s
Receiving objects: 60% (39800/66333), 45.68 MiB | 30.41 MiB/s
Receiving objects: 61% (40464/66333), 45.68 MiB | 30.41 MiB/s
Receiving objects: 62% (41127/66333), 45.68 MiB | 30.41 MiB/s
Receiving objects: 63% (41790/66333), 45.68 MiB | 30.41 MiB/s
Receiving objects: 64% (42454/66333), 45.68 MiB | 30.41 MiB/s
Receiving objects: 65% (43117/66333), 45.68 MiB | 30.41 MiB/s
Receiving objects: 66% (43780/66333), 45.68 MiB | 30.41 MiB/s
Receiving objects: 67% (44444/66333), 45.68 MiB | 30.41 MiB/s
Receiving objects: 68% (45107/66333), 45.68 MiB | 30.41 MiB/s
Receiving objects: 69% (45770/66333), 45.68 MiB | 30.41 MiB/s
Receiving objects: 70% (46434/66333), 45.68 MiB | 30.41 MiB/s
Receiving objects: 71% (47097/66333), 45.68 MiB | 30.41 MiB/s
Receiving objects: 72% (47760/66333), 45.68 MiB | 30.41 MiB/s
Receiving objects: 73% (48424/66333), 45.68 MiB | 30.41 MiB/s
Receiving objects: 73% (48916/66333), 62.18 MiB | 31.05 MiB/s
Receiving objects: 74% (49087/66333), 62.18 MiB | 31.05 MiB/s
Receiving objects: 75% (49750/66333), 62.18 MiB | 31.05 MiB/s
Receiving objects: 76% (50414/66333), 62.18 MiB | 31.05 MiB/s
Receiving objects: 77% (51077/66333), 62.18 MiB | 31.05 MiB/s
Receiving objects: 78% (51740/66333), 62.18 MiB | 31.05 MiB/s
Receiving objects: 79% (52404/66333), 62.18 MiB | 31.05 MiB/s
Receiving objects: 80% (53067/66333), 62.18 MiB | 31.05 MiB/s
Receiving objects: 81% (53730/66333), 62.18 MiB | 31.05 MiB/s
Receiving objects: 82% (54394/66333), 77.99 MiB | 31.05 MiB/s
Receiving objects: 83% (55057/66333), 77.99 MiB | 31.05 MiB/s
Receiving objects: 84% (55720/66333), 77.99 MiB | 31.05 MiB/s
Receiving objects: 85% (56384/66333), 77.99 MiB | 31.05 MiB/s
Receiving objects: 86% (57047/66333), 77.99 MiB | 31.05 MiB/s
Receiving objects: 87% (57710/66333), 77.99 MiB | 31.05 MiB/s
Receiving objects: 88% (58374/66333), 77.99 MiB | 31.05 MiB/s
Receiving objects: 89% (59037/66333), 77.99 MiB | 31.05 MiB/s
Receiving objects: 90% (59700/66333), 77.99 MiB | 31.05 MiB/s
Receiving objects: 91% (60364/66333), 77.99 MiB | 31.05 MiB/s
Receiving objects: 92% (61027/66333), 77.99 MiB | 31.05 MiB/s
Receiving objects: 93% (61690/66333), 77.99 MiB | 31.05 MiB/s
Receiving objects: 94% (62354/66333), 77.99 MiB | 31.05 MiB/s
Receiving objects: 95% (63017/66333), 77.99 MiB | 31.05 MiB/s
Receiving objects: 96% (63680/66333), 77.99 MiB | 31.05 MiB/s
Receiving objects: 97% (64344/66333), 77.99 MiB | 31.05 MiB/s
Receiving objects: 98% (65007/66333), 77.99 MiB | 31.05 MiB/s
Receiving objects: 99% (65670/66333), 77.99 MiB | 31.05 MiB/s
Receiving objects: 99% (65905/66333), 77.99 MiB | 31.05 MiB/s
remote: Total 66333 (delta 7265), reused 7233 (delta 6589), pack-reused 57349 (from 1)
7.55 s
Receiving objects: 100% (66333/66333), 93.97 MiB | 31.20 MiB/s
Receiving objects: 100% (66333/66333), 98.63 MiB | 31.19 MiB/s, done.
8.95 s
Resolving deltas: 0% (0/46383)
Resolving deltas: 1% (464/46383)
Resolving deltas: 2% (928/46383)
Resolving deltas: 3% (1393/46383)
Resolving deltas: 4% (1856/46383)
Resolving deltas: 5% (2320/46383)
Resolving deltas: 6% (2783/46383)
Resolving deltas: 7% (3247/46383)
Resolving deltas: 8% (3711/46383)
Resolving deltas: 9% (4175/46383)
Resolving deltas: 10% (4639/46383)
Resolving deltas: 11% (5103/46383)
Resolving deltas: 12% (5566/46383)
Resolving deltas: 13% (6035/46383)
Resolving deltas: 14% (6494/46383)
Resolving deltas: 15% (6959/46383)
Resolving deltas: 16% (7422/46383)
Resolving deltas: 17% (7886/46383)
Resolving deltas: 18% (8349/46383)
Resolving deltas: 19% (8813/46383)
Resolving deltas: 20% (9278/46383)
Resolving deltas: 21% (9741/46383)
Resolving deltas: 22% (10205/46383)
Resolving deltas: 23% (10670/46383)
Resolving deltas: 24% (11132/46383)
Resolving deltas: 25% (11597/46383)
Resolving deltas: 26% (12060/46383)
Resolving deltas: 27% (12525/46383)
Resolving deltas: 28% (12988/46383)
Resolving deltas: 29% (13453/46383)
Resolving deltas: 30% (13915/46383)
Resolving deltas: 31% (14379/46383)
Resolving deltas: 32% (14843/46383)
Resolving deltas: 33% (15307/46383)
Resolving deltas: 34% (15771/46383)
Resolving deltas: 35% (16235/46383)
Resolving deltas: 36% (16698/46383)
Resolving deltas: 37% (17163/46383)
Resolving deltas: 38% (17626/46383)
Resolving deltas: 39% (18090/46383)
Resolving deltas: 40% (18554/46383)
Resolving deltas: 41% (19018/46383)
Resolving deltas: 42% (19481/46383)
Resolving deltas: 43% (19945/46383)
Resolving deltas: 44% (20409/46383)
Resolving deltas: 45% (20873/46383)
Resolving deltas: 46% (21338/46383)
Resolving deltas: 47% (21801/46383)
Resolving deltas: 48% (22264/46383)
Resolving deltas: 49% (22728/46383)
Resolving deltas: 50% (23192/46383)
Resolving deltas: 51% (23656/46383)
Resolving deltas: 52% (24120/46383)
Resolving deltas: 53% (24583/46383)
Resolving deltas: 54% (25047/46383)
Resolving deltas: 55% (25512/46383)
Resolving deltas: 56% (25976/46383)
Resolving deltas: 57% (26439/46383)
Resolving deltas: 58% (26904/46383)
Resolving deltas: 59% (27367/46383)
Resolving deltas: 60% (27830/46383)
Resolving deltas: 61% (28295/46383)
Resolving deltas: 62% (28758/46383)
Resolving deltas: 63% (29224/46383)
Resolving deltas: 64% (29686/46383)
Resolving deltas: 65% (30149/46383)
Resolving deltas: 66% (30613/46383)
Resolving deltas: 67% (31077/46383)
Resolving deltas: 68% (31541/46383)
Resolving deltas: 69% (32005/46383)
Resolving deltas: 70% (32469/46383)
Resolving deltas: 71% (32932/46383)
Resolving deltas: 72% (33396/46383)
Resolving deltas: 73% (33860/46383)
Resolving deltas: 74% (34324/46383)
Resolving deltas: 75% (34788/46383)
Resolving deltas: 76% (35252/46383)
Resolving deltas: 77% (35715/46383)
Resolving deltas: 77% (36147/46383)
Resolving deltas: 78% (36179/46383)
Resolving deltas: 79% (36643/46383)
Resolving deltas: 80% (37107/46383)
Resolving deltas: 81% (37571/46383)
Resolving deltas: 82% (38035/46383)
Resolving deltas: 83% (38498/46383)
Resolving deltas: 84% (38962/46383)
Resolving deltas: 85% (39426/46383)
Resolving deltas: 86% (39890/46383)
Resolving deltas: 87% (40354/46383)
Resolving deltas: 88% (40818/46383)
Resolving deltas: 89% (41281/46383)
Resolving deltas: 90% (41745/46383)
Resolving deltas: 91% (42209/46383)
Resolving deltas: 92% (42673/46383)
Resolving deltas: 93% (43137/46383)
Resolving deltas: 94% (43601/46383)
Resolving deltas: 95% (44064/46383)
Resolving deltas: 96% (44528/46383)
Resolving deltas: 97% (44992/46383)
Resolving deltas: 98% (45457/46383)
Resolving deltas: 99% (45920/46383)
Resolving deltas: 100% (46383/46383)
Resolving deltas: 100% (46383/46383), done.
9.55 s
Fetching commit 21b5487d2e568713832af8be542a7570e3bff6a6 for docs ...
9.55 s
$ /nix/store/bcnisk3ydfgv26v2gw3zlky24g00yww2-git-2.54.0/bin/git fetch origin 21b5487d2e568713832af8be542a7570e3bff6a6
10.12 s
From https://github.com/alphal00p/gammaloop
10.12 s
* branch 21b5487d2e568713832af8be542a7570e3bff6a6 -> FETCH_HEAD
10.14 s
$ /nix/store/9ypz3flqsrl5xl495mm8h645gadjsxi1-coreutils-9.11/bin/timeout --kill-after=15s 7200s /nix/store/bcnisk3ydfgv26v2gw3zlky24g00yww2-git-2.54.0/bin/git -c advice.detachedHead=false checkout 21b5487d2e568713832af8be542a7570e3bff6a6
10.49 s
HEAD is now at 21b5487d2 fix nix develop error
10.50 s
$ /nix/store/9ypz3flqsrl5xl495mm8h645gadjsxi1-coreutils-9.11/bin/timeout --kill-after=15s 7200s /nix/store/23zk8sgzamrbmj1fday15szf7f2279s8-nix-2.34.7/bin/nix --extra-experimental-features nix-command --extra-experimental-features flakes --log-format internal-json run .#packages.x86_64-linux.nix-ci-check-gammaloop-doctest --print-build-logs
10.95 s
stdenv.isDarwin is deprecated, use stdenv.hostPlatform.isDarwin instead
26.76 s
28.70 s
Downloading cached busybox from https://cache.nix-ci.com
28.72 s
Downloading cached editline-1.17.1-unstable-2025-05 from https://cache.nix-ci.com
28.72 s
Downloading cached aws-c-common from https://cache.nix-ci.com
28.72 s
Downloading cached boehm-gc from https://cache.nix-ci.com
28.72 s
Downloading cached libgit2-1.9.7-lib from https://cache.nix-ci.com
28.72 s
Downloading cached libseccomp-2.6.1-lib from https://cache.nix-ci.com
28.72 s
Downloading cached libarchive-3.8.9-lib from https://cache.nix-ci.com
28.72 s
Downloading cached lowdown-3.0.1-lib from https://cache.nix-ci.com
28.72 s
Downloading cached s2n-tls from https://cache.nix-ci.com
28.72 s
Downloading cached hwloc-2.14.0-lib from https://cache.nix-ci.com
28.72 s
Downloading cached libsodium-1.0.22-unstable-2026-07 from https://cache.nix-ci.com
28.72 s
Downloading cached libcpuid from https://cache.nix-ci.com
29.45 s
Downloaded cached busybox (230 KiB) in 750ms
29.46 s
Progress: 0 of 1 built, 1 of 36 downloaded from cache (11 downloading)
29.47 s
Downloaded cached editline-1.17.1-unstable-2025-05 (58 KiB) in 747ms
29.47 s
Progress: 0 of 1 built, 2 of 36 downloaded from cache (10 downloading)
29.47 s
Downloaded cached libseccomp-2.6.1-lib (189 KiB) in 750ms
29.47 s
Progress: 0 of 1 built, 3 of 36 downloaded from cache (9 downloading)
29.49 s
Downloaded cached libcpuid (326 KiB) in 763ms
29.49 s
Downloaded cached hwloc-2.14.0-lib (458 KiB) in 765ms
29.49 s
Downloaded cached lowdown-3.0.1-lib (341 KiB) in 766ms
29.49 s
Progress: 0 of 1 built, 4 of 36 downloaded from cache (8 downloading)
29.49 s
Downloaded cached boehm-gc (312 KiB) in 768ms
29.49 s
Progress: 0 of 1 built, 5 of 36 downloaded from cache (7 downloading)
29.49 s
Progress: 0 of 1 built, 6 of 36 downloaded from cache (6 downloading)
29.49 s
Downloaded cached libarchive-3.8.9-lib (961 KiB) in 769ms
29.49 s
Downloaded cached libsodium-1.0.22-unstable-2026-07 (669 KiB) in 769ms
29.50 s
Downloaded cached libgit2-1.9.7-lib (1.6 MiB) in 773ms
29.50 s
Downloading cached onetbb from https://cache.nix-ci.com
29.50 s
Downloaded cached aws-c-common (1.1 MiB) in 774ms
29.50 s
Progress: 0 of 1 built, 7 of 36 downloaded from cache (6 downloading)
29.50 s
Progress: 0 of 1 built, 8 of 36 downloaded from cache (5 downloading)
29.50 s
Progress: 0 of 1 built, 9 of 36 downloaded from cache (4 downloading)
29.50 s
Progress: 0 of 1 built, 10 of 36 downloaded from cache (3 downloading)
29.50 s
Downloaded cached s2n-tls (1.3 MiB) in 778ms
29.50 s
Progress: 0 of 1 built, 11 of 36 downloaded from cache (2 downloading)
29.50 s
Downloading cached aws-c-cal from https://cache.nix-ci.com
29.50 s
Downloading cached aws-c-compression from https://cache.nix-ci.com
29.50 s
Downloading cached aws-c-sdkutils from https://cache.nix-ci.com
29.50 s
Progress: 0 of 1 built, 12 of 36 downloaded from cache (5 downloading)
29.50 s
Downloading cached aws-checksums from https://cache.nix-ci.com
30.08 s
Downloaded cached aws-checksums (86 KiB) in 577ms
30.08 s
Downloaded cached aws-c-sdkutils (155 KiB) in 578ms
30.08 s
Progress: 0 of 1 built, 13 of 36 downloaded from cache (4 downloading)
30.08 s
Downloaded cached aws-c-cal (158 KiB) in 578ms
30.08 s
Progress: 0 of 1 built, 14 of 36 downloaded from cache (3 downloading)
30.08 s
Downloaded cached aws-c-compression (31 KiB) in 581ms
30.09 s
Progress: 0 of 1 built, 15 of 36 downloaded from cache (2 downloading)
30.09 s
Downloaded cached onetbb (626 KiB) in 593ms
30.09 s
Progress: 0 of 1 built, 16 of 36 downloaded from cache (2 downloading)
30.09 s
Downloading cached aws-c-io from https://cache.nix-ci.com
30.09 s
Progress: 0 of 1 built, 17 of 36 downloaded from cache (1 downloading)
30.09 s
Downloading cached libblake3 from https://cache.nix-ci.com
30.11 s
Downloaded cached libblake3 (117 KiB) in 24ms
30.11 s
Progress: 0 of 1 built, 18 of 36 downloaded from cache (1 downloading)
30.12 s
Downloading cached nix-util from https://cache.nix-ci.com
30.12 s
Downloaded cached aws-c-io (648 KiB) in 33ms
30.12 s
Progress: 0 of 1 built, 19 of 36 downloaded from cache (1 downloading)
30.12 s
Downloading cached aws-c-event-stream from https://cache.nix-ci.com
30.12 s
Downloading cached aws-c-http from https://cache.nix-ci.com
30.69 s
Downloaded cached aws-c-event-stream (176 KiB) in 567ms
30.70 s
Downloaded cached nix-util (2.4 MiB) in 580ms
30.70 s
Progress: 0 of 1 built, 20 of 36 downloaded from cache (2 downloading)
30.70 s
Downloaded cached aws-c-http (641 KiB) in 575ms
30.70 s
Progress: 0 of 1 built, 21 of 36 downloaded from cache (1 downloading)
30.70 s
Progress: 0 of 1 built, 22 of 36 downloaded from cache
30.70 s
Downloading cached aws-c-auth from https://cache.nix-ci.com
30.70 s
Downloading cached nix-nswrapper from https://cache.nix-ci.com
30.70 s
Downloading cached aws-c-mqtt from https://cache.nix-ci.com
30.73 s
Downloaded cached nix-nswrapper (131 KiB) in 24ms
30.73 s
Downloaded cached aws-c-mqtt (557 KiB) in 25ms
30.73 s
Progress: 0 of 1 built, 23 of 36 downloaded from cache (2 downloading)
30.73 s
Progress: 0 of 1 built, 24 of 36 downloaded from cache (1 downloading)
30.73 s
Downloaded cached aws-c-auth (387 KiB) in 29ms
30.73 s
Progress: 0 of 1 built, 25 of 36 downloaded from cache
30.73 s
Downloading cached aws-c-s3 from https://cache.nix-ci.com
31.34 s
Downloaded cached aws-c-s3 (384 KiB) in 611ms
31.34 s
Progress: 0 of 1 built, 26 of 36 downloaded from cache
31.34 s
Downloading cached aws-crt-cpp from https://cache.nix-ci.com
31.36 s
Downloaded cached aws-crt-cpp (979 KiB) in 18ms
31.36 s
Progress: 0 of 1 built, 27 of 36 downloaded from cache
31.36 s
Downloading cached nix-store from https://cache.nix-ci.com
32.02 s
Downloaded cached nix-store (5.8 MiB) in 653ms
32.02 s
Progress: 0 of 1 built, 28 of 36 downloaded from cache
32.02 s
Downloading cached nix-main from https://cache.nix-ci.com
32.02 s
Downloading cached nix-fetchers from https://cache.nix-ci.com
32.73 s
Downloaded cached nix-main (393 KiB) in 713ms
32.73 s
Progress: 0 of 1 built, 29 of 36 downloaded from cache (1 downloading)
32.73 s
Downloaded cached nix-fetchers (1.5 MiB) in 714ms
32.73 s
Progress: 0 of 1 built, 30 of 36 downloaded from cache
32.73 s
Downloading cached nix-expr from https://cache.nix-ci.com
32.77 s
Downloaded cached nix-expr (3.3 MiB) in 36ms
32.77 s
Progress: 0 of 1 built, 31 of 36 downloaded from cache
32.77 s
Downloading cached nix-flake from https://cache.nix-ci.com
33.39 s
Downloaded cached nix-flake (956 KiB) in 622ms
33.39 s
Progress: 0 of 1 built, 32 of 36 downloaded from cache
33.39 s
Downloading cached nix-cmd from https://cache.nix-ci.com
33.42 s
Downloaded cached nix-cmd (1 MiB) in 24ms
33.42 s
Progress: 0 of 1 built, 33 of 36 downloaded from cache
33.42 s
Downloading cached nix from https://cache.nix-ci.com
33.51 s
Downloaded cached nix (3.9 MiB) in 96ms
33.51 s
Progress: 0 of 1 built, 34 of 36 downloaded from cache
33.52 s
Downloading cached nix from https://cache.nix-ci.com
34.07 s
Downloaded cached nix (8848 B) in 549ms
34.07 s
Progress: 0 of 1 built, 35 of 36 downloaded from cache
34.10 s
Downloading cached nix-ci-check-gammaloop-doctest from https://cache.nix-ci.com
34.10 s
Downloaded cached nix-ci-check-gammaloop-doctest (1008 B) in 0ms
34.10 s
Progress: 0 of 1 built, 36 of 36 downloaded from cache
34.58 s
evaluating derivation 'gevaluation warning: stdenv.isDarwin is deprecated, use stdenv.hostPlatform.isDarwin instead
38.08 s
copying '/nix/store/rdcn
evaluating derivation 'g
querying gammaloop-works
[0 /1 built, 0.0 KiB DL]
[1 /0 /1 built, 0.0 KiB DLgammaloop-workspace-doctest> Running phase: unpackPhase
38.09 s
gammaloop-workspace-doctest> unpacking source archive /nix/store/5afz06g4vsphrihpxicbxvm3sk5psnll-source
41.78 s
gammaloop-workspace-doctest> source root is source
41.83 s
gammaloop-workspace-doctest> Running phase: patchPhase
41.84 s
gammaloop-workspace-doctest> Executing configureCargoCommonVars
41.84 s
gammaloop-workspace-doctest> decompressing cargo artifacts from /nix/store/72wdcnp633ang33qg6wvb90brvf1679y-gammaloop-workspace-deps-deps-0.1.0/target.tar.zst to target
48.38 s
gammaloop-workspace-doctest> Running phase: updateAutotoolsGnuConfigScriptsPhase
48.44 s
gammaloop-workspace-doctest> Running phase: configurePhase
48.45 s
gammaloop-workspace-doctest> will append /build/source/.cargo-home/config.toml with contents of /nix/store/29aa708jkn8wd8vjwja1a5gh8k8wpi2b-vendor-cargo-deps/config.toml
48.45 s
gammaloop-workspace-doctest> default configurePhase, nothing to do
48.45 s
gammaloop-workspace-doctest> Running phase: buildPhase
48.46 s
gammaloop-workspace-doctest> +++ command cargo --version
48.47 s
gammaloop-workspace-doctest> cargo 1.98.0 (797e8a9bc 2026-08-05)
48.51 s
gammaloop-workspace-doctest> +++ command cargo test --profile ci-optim --doc --locked --workspace --features gammaloop-api/cli,gammaloop-tracing-filter/clap,gammaloop-tracing-filter/symbolica,idenso/bincode,idenso/reference-cases,linnet/bincode,linnet/drawing,linnet/nodestore-vec,linnet/rkyv,linnet/serde,linnet/symbolica,spenso-macros/shadowing,spenso/shadowing,symbolica/tracing_max_level_info
49.37 s
gammaloop-workspace-doctest> Compiling target-lexicon v0.13.5
49.40 s
gammaloop-workspace-doctest> Compiling symbolica v2.2.0 (https://github.com/symbolica-dev/symbolica?branch=dev#0441bd7a)
49.40 s
gammaloop-workspace-doctest> Compiling maplit v1.0.2
49.42 s
gammaloop-workspace-doctest> Compiling gammaloop-tracing-filter-macros v0.1.0 (/build/source/crates/gammaloop-tracing-filter-macros)
49.42 s
gammaloop-workspace-doctest> Compiling vakint v0.1.2 (/build/source/crates/vakint)
49.43 s
gammaloop-workspace-doctest> Compiling gammalooprs v0.3.4 (/build/source/crates/gammalooprs)
49.46 s
gammaloop-workspace-doctest> Compiling alphal00p-docs-macros v0.1.0 (/build/source/crates/alphal00p-docs-macros)
49.46 s
gammaloop-workspace-doctest> Compiling alphal00p-docs-schema v0.1.0 (/build/source/crates/alphal00p-docs-schema)
49.46 s
gammaloop-workspace-doctest> Compiling rustc_version v0.4.1
49.47 s
gammaloop-workspace-doctest> Compiling bincode v1.3.3
49.47 s
gammaloop-workspace-doctest> Compiling gungraun-runner v0.18.2
49.47 s
gammaloop-workspace-doctest> Compiling target-triple v1.0.1
49.48 s
gammaloop-workspace-doctest> Compiling iai-callgrind-runner v0.14.2
49.52 s
gammaloop-workspace-doctest> Compiling gammaloop-integration-tests v0.1.0 (/build/source/tests)
49.52 s
gammaloop-workspace-doctest> Compiling test-log-core v0.2.20
49.90 s
gammaloop-workspace-doctest> Compiling wait-timeout v0.2.1
50.01 s
gammaloop-workspace-doctest> Compiling iai-callgrind v0.14.2
50.02 s
gammaloop-workspace-doctest> Compiling quick-error v1.2.3
50.12 s
gammaloop-workspace-doctest> Compiling bit-vec v0.8.0
50.13 s
gammaloop-workspace-doctest> Compiling rusty-fork v0.3.1
50.44 s
gammaloop-workspace-doctest> Compiling iai-callgrind-macros v0.5.1
50.59 s
gammaloop-workspace-doctest> Compiling bit-set v0.8.0
50.60 s
gammaloop-workspace-doctest> Compiling rand_xorshift v0.4.0
50.65 s
gammaloop-workspace-doctest> Compiling console v0.15.11
50.72 s
gammaloop-workspace-doctest> Compiling termcolor v1.4.1
50.74 s
gammaloop-workspace-doctest> Compiling gungraun-macros v0.8.0
50.81 s
gammaloop-workspace-doctest> Compiling unarray v0.1.4
50.82 s
gammaloop-workspace-doctest> Compiling glob v0.3.4
50.98 s
gammaloop-workspace-doctest> Compiling base64 v0.21.7
51.63 s
gammaloop-workspace-doctest> Compiling similar-asserts v1.7.0
51.64 s
gammaloop-workspace-doctest> Compiling trybuild v1.0.120
51.73 s
gammaloop-workspace-doctest> Compiling ron v0.8.1
51.73 s
gammaloop-workspace-doctest> Compiling proptest v1.11.0
51.98 s
gammaloop-workspace-doctest> Compiling alphal00p-docs-builder v0.1.0 (/build/source/crates/alphal00p-docs-builder)
52.67 s
gammaloop-workspace-doctest> Compiling pyo3-build-config v0.28.3
52.72 s
gammaloop-workspace-doctest> Compiling alphal00p-docs-catalogs v0.1.0 (/build/source/crates/alphal00p-docs-catalogs)
52.95 s
gammaloop-workspace-doctest> Compiling kurvst v0.1.0 (/build/source/crates/kurvst)
53.93 s
gammaloop-workspace-doctest> Compiling test-log-macros v0.2.20
59.31 s
gammaloop-workspace-doctest> Compiling test-log v0.2.20
61.22 s
gammaloop-workspace-doctest> Compiling alphal00p-docs-examples v0.1.0 (/build/source/crates/alphal00p-docs-examples)
64.41 s
gammaloop-workspace-doctest> Compiling pyo3-ffi v0.28.3
64.75 s
gammaloop-workspace-doctest> Compiling pyo3-macros-backend v0.28.3
64.84 s
gammaloop-workspace-doctest> Compiling pyo3 v0.28.3
64.98 s
gammaloop-workspace-doctest> Compiling numpy v0.28.0
65.22 s
gammaloop-workspace-doctest> Compiling gammaloop-api v0.1.0 (/build/source/crates/gammaloop-api)
66.10 s
gammaloop-workspace-doctest> Compiling gungraun v0.18.2
77.98 s
gammaloop-workspace-doctest> Compiling pyo3-macros v0.28.3
84.71 s
gammaloop-workspace-doctest> Compiling pyo3-stub-gen v0.17.2
85.72 s
gammaloop-workspace-doctest> Compiling numerica v2.2.0 (https://github.com/symbolica-dev/symbolica?branch=dev#0441bd7a)
88.98 s
gammaloop-workspace-doctest> Compiling graphica v2.1.0 (https://github.com/symbolica-dev/symbolica?branch=dev#0441bd7a)
93.52 s
gammaloop-workspace-doctest> Compiling symbolica-utils v0.1.0 (/build/source/crates/symbolica-utils)
385.40 s
gammaloop-workspace-doctest> Compiling gammaloop-workspace-hack v0.1.0 (/build/source/crates/gammaloop-workspace-hack)
385.41 s
gammaloop-workspace-doctest> Compiling spenso-macros v0.3.2 (/build/source/crates/spenso-macros)
385.59 s
gammaloop-workspace-doctest> Compiling linnet v0.17.0 (/build/source/crates/linnet)
389.51 s
gammaloop-workspace-doctest> Compiling spenso v0.6.0 (/build/source/crates/spenso)
401.73 s
gammaloop-workspace-doctest> Compiling idenso v0.3.0 (/build/source/crates/idenso)
401.75 s
gammaloop-workspace-doctest> Compiling gammaloop-tracing-filter v0.1.0 (/build/source/crates/gammaloop-tracing-filter)
410.06 s
gammaloop-workspace-doctest> Compiling spenso-hep-lib v0.1.7 (/build/source/crates/spenso-hep-lib)
410.51 s
gammaloop-workspace-doctest> Compiling spynso3 v0.1.2 (/build/source/crates/spynso3)
475.95 s
gammaloop-workspace-doctest> Compiling linnest v0.1.0 (/build/source/crates/linnest)
475.96 s
gammaloop-workspace-doctest> Compiling linnet-py v0.1.0 (/build/source/crates/linnet-py)
639.78 s
gammaloop-workspace-doctest> Finished `ci-optim` profile [optimized] target(s) in 9m 51s
639.95 s
gammaloop-workspace-doctest> warning : the following packages contain code that will be rejected by a future version of Rust: proc-macro-error2 v2.0.1
639.95 s
gammaloop-workspace-doctest> note : to see what the problems were, use the option `--future-incompat-report`, or run `cargo report future-incompatibilities --id 1`
639.99 s
gammaloop-workspace-doctest> Doc-tests alphal00p_docs_builder
640.18 s
gammaloop-workspace-doctest>
640.18 s
gammaloop-workspace-doctest> running 0 tests
640.18 s
gammaloop-workspace-doctest>
640.18 s
gammaloop-workspace-doctest> test result: ok. 0 passed; 0 failed; 0 ignored; 0 measured; 0 filtered out; finished in 0.00s
640.18 s
gammaloop-workspace-doctest>
640.18 s
gammaloop-workspace-doctest> Doc-tests alphal00p_docs_catalogs
641.58 s
gammaloop-workspace-doctest>
641.58 s
gammaloop-workspace-doctest> running 0 tests
641.58 s
gammaloop-workspace-doctest>
641.58 s
gammaloop-workspace-doctest> test result: ok. 0 passed; 0 failed; 0 ignored; 0 measured; 0 filtered out; finished in 0.00s
641.58 s
gammaloop-workspace-doctest>
641.59 s
gammaloop-workspace-doctest> Doc-tests alphal00p_docs_examples
641.61 s
gammaloop-workspace-doctest>
641.61 s
gammaloop-workspace-doctest> running 0 tests
641.61 s
gammaloop-workspace-doctest>
641.61 s
gammaloop-workspace-doctest> test result: ok. 0 passed; 0 failed; 0 ignored; 0 measured; 0 filtered out; finished in 0.00s
641.61 s
gammaloop-workspace-doctest>
641.61 s
gammaloop-workspace-doctest> Doc-tests alphal00p_docs
641.67 s
gammaloop-workspace-doctest>
641.67 s
gammaloop-workspace-doctest> running 0 tests
641.67 s
gammaloop-workspace-doctest>
641.67 s
gammaloop-workspace-doctest> test result: ok. 0 passed; 0 failed; 0 ignored; 0 measured; 0 filtered out; finished in 0.00s
641.67 s
gammaloop-workspace-doctest>
641.67 s
gammaloop-workspace-doctest> Doc-tests alphal00p_docs_schema
641.77 s
gammaloop-workspace-doctest>
641.77 s
gammaloop-workspace-doctest> running 0 tests
641.77 s
gammaloop-workspace-doctest>
641.77 s
gammaloop-workspace-doctest> test result: ok. 0 passed; 0 failed; 0 ignored; 0 measured; 0 filtered out; finished in 0.00s
641.77 s
gammaloop-workspace-doctest>
641.77 s
gammaloop-workspace-doctest> Doc-tests gammaloop_api
642.96 s
gammaloop-workspace-doctest>
642.96 s
gammaloop-workspace-doctest> running 16 tests
642.98 s
gammaloop-workspace-doctest> test crates/gammaloop-api/src/python.rs - python::GammaLoopAPI::evaluate_samples (line 3108) ... FAILED
642.99 s
gammaloop-workspace-doctest> test crates/gammaloop-api/src/python.rs - python::PyHistogramAccumulator (line 871) ... FAILED
642.99 s
gammaloop-workspace-doctest> test crates/gammaloop-api/src/python.rs - python::GammaLoopAPI::get_active_command_blocks (line 3760) ... FAILED
642.99 s
gammaloop-workspace-doctest> test crates/gammaloop-api/src/python.rs - python::GammaLoopAPI::get_integrand_settings (line 3647) ... FAILED
642.99 s
gammaloop-workspace-doctest> test crates/gammaloop-api/src/python.rs - python::GammaLoopAPI::evaluate_sample (line 2967) ... FAILED
642.99 s
gammaloop-workspace-doctest> test crates/gammaloop-api/src/python.rs - python::GammaLoopAPI::get_integrand_info (line 3585) ... FAILED
642.99 s
gammaloop-workspace-doctest> test crates/gammaloop-api/src/python.rs - python::GammaLoopAPI::get_default_runtime_settings (line 3796) ... FAILED
643.04 s
gammaloop-workspace-doctest> test crates/gammaloop-api/src/lib.rs - (line 18) - compile ... ok
643.13 s
gammaloop-workspace-doctest> test crates/gammaloop-api/src/python.rs - python::GammaLoopAPI::get_run_history (line 3711) ... FAILED
643.13 s
gammaloop-workspace-doctest> test crates/gammaloop-api/src/python.rs - python::GammaLoopAPI::run_command (line 3901) ... FAILED
643.13 s
gammaloop-workspace-doctest> test crates/gammaloop-api/src/python.rs - python::GammaLoopAPI::get_global_settings (line 3739) ... FAILED
643.14 s
gammaloop-workspace-doctest> test crates/gammaloop-api/src/python.rs - python::atom_to_canonical_string (line 128) ... FAILED
643.14 s
gammaloop-workspace-doctest> test crates/gammaloop-api/src/python.rs - python::evaluate_graph_overall_factor (line 95) ... FAILED
643.14 s
gammaloop-workspace-doctest> test crates/gammaloop-api/src/python.rs - python::atom_to_dots (line 157) ... FAILED
643.15 s
gammaloop-workspace-doctest> test crates/gammaloop-api/src/python.rs - python::GammaLoopAPI::new_python (line 2834) ... FAILED
646.20 s
gammaloop-workspace-doctest> test crates/gammaloop-api/src/commands/evaluate_samples.rs - commands::evaluate_samples::EvaluateSamples (line 50) ... ok
646.22 s
gammaloop-workspace-doctest>
646.22 s
gammaloop-workspace-doctest> failures:
646.22 s
gammaloop-workspace-doctest>
646.22 s
gammaloop-workspace-doctest> ---- crates/gammaloop-api/src/python.rs - python::GammaLoopAPI::evaluate_samples (line 3108) stdout ----
646.22 s
gammaloop-workspace-doctest> error: expected one of `!` or `::`, found `pathlib`
646.22 s
gammaloop-workspace-doctest> --> crates/gammaloop-api/src/python.rs:3109:6
646.22 s
gammaloop-workspace-doctest> |
646.22 s
gammaloop-workspace-doctest> 3109 | from pathlib import Path
646.22 s
gammaloop-workspace-doctest> | ^^^^^^^ expected one of `!` or `::`
646.22 s
gammaloop-workspace-doctest>
646.22 s
gammaloop-workspace-doctest> error: aborting due to 1 previous error
646.22 s
gammaloop-workspace-doctest>
646.22 s
gammaloop-workspace-doctest> Couldn't compile the test.
646.22 s
gammaloop-workspace-doctest> ---- crates/gammaloop-api/src/python.rs - python::PyHistogramAccumulator (line 871) stdout ----
646.22 s
gammaloop-workspace-doctest> error: expected one of `!` or `::`, found `gammaloop`
646.22 s
gammaloop-workspace-doctest> --> crates/gammaloop-api/src/python.rs:872:6
646.22 s
gammaloop-workspace-doctest> |
646.22 s
gammaloop-workspace-doctest> 872 | from gammaloop import HistogramAccumulator
646.22 s
gammaloop-workspace-doctest> | ^^^^^^^^^ expected one of `!` or `::`
646.22 s
gammaloop-workspace-doctest>
646.22 s
gammaloop-workspace-doctest> error: aborting due to 1 previous error
646.22 s
gammaloop-workspace-doctest>
646.22 s
gammaloop-workspace-doctest> Couldn't compile the test.
646.22 s
gammaloop-workspace-doctest> ---- crates/gammaloop-api/src/python.rs - python::GammaLoopAPI::get_active_command_blocks (line 3760) stdout ----
646.22 s
gammaloop-workspace-doctest> error: expected item, found keyword `for`
646.22 s
gammaloop-workspace-doctest> --> crates/gammaloop-api/src/python.rs:3761:1
646.22 s
gammaloop-workspace-doctest> |
646.22 s
gammaloop-workspace-doctest> 3761 | for name, commands in api.get_active_command_blocks().items():
646.22 s
gammaloop-workspace-doctest> | ^^^ expected item
646.22 s
gammaloop-workspace-doctest> |
646.22 s
gammaloop-workspace-doctest> = note: for a full list of items that can appear in modules, see <https://doc.rust-lang.org/reference/items.html>
646.22 s
gammaloop-workspace-doctest>
646.22 s
gammaloop-workspace-doctest> error: aborting due to 1 previous error
646.22 s
gammaloop-workspace-doctest>
646.22 s
gammaloop-workspace-doctest> Couldn't compile the test.
646.22 s
gammaloop-workspace-doctest> ---- crates/gammaloop-api/src/python.rs - python::GammaLoopAPI::get_integrand_settings (line 3647) stdout ----
646.22 s
gammaloop-workspace-doctest> error: expected one of `!` or `::`, found `=`
646.22 s
gammaloop-workspace-doctest> --> crates/gammaloop-api/src/python.rs:3648:10
646.22 s
gammaloop-workspace-doctest> |
646.22 s
gammaloop-workspace-doctest> 3648 | settings = api.get_integrand_settings(process_id=0)
646.22 s
gammaloop-workspace-doctest> | ^ expected one of `!` or `::`
646.22 s
gammaloop-workspace-doctest>
646.22 s
gammaloop-workspace-doctest> error: aborting due to 1 previous error
646.22 s
gammaloop-workspace-doctest>
646.22 s
gammaloop-workspace-doctest> Couldn't compile the test.
646.22 s
gammaloop-workspace-doctest> ---- crates/gammaloop-api/src/python.rs - python::GammaLoopAPI::evaluate_sample (line 2967) stdout ----
646.22 s
gammaloop-workspace-doctest> error: expected one of `!` or `::`, found `pathlib`
646.22 s
gammaloop-workspace-doctest> --> crates/gammaloop-api/src/python.rs:2968:6
646.22 s
gammaloop-workspace-doctest> |
646.22 s
gammaloop-workspace-doctest> 2968 | from pathlib import Path
646.22 s
gammaloop-workspace-doctest> | ^^^^^^^ expected one of `!` or `::`
646.22 s
gammaloop-workspace-doctest>
646.22 s
gammaloop-workspace-doctest> error: aborting due to 1 previous error
646.22 s
gammaloop-workspace-doctest>
646.22 s
gammaloop-workspace-doctest> Couldn't compile the test.
646.22 s
gammaloop-workspace-doctest> ---- crates/gammaloop-api/src/python.rs - python::GammaLoopAPI::get_integrand_info (line 3585) stdout ----
646.22 s
gammaloop-workspace-doctest> error: expected one of `!` or `::`, found `pathlib`
646.22 s
gammaloop-workspace-doctest> --> crates/gammaloop-api/src/python.rs:3586:6
646.22 s
gammaloop-workspace-doctest> |
646.22 s
gammaloop-workspace-doctest> 3586 | from pathlib import Path
646.22 s
gammaloop-workspace-doctest> | ^^^^^^^ expected one of `!` or `::`
646.22 s
gammaloop-workspace-doctest>
646.22 s
gammaloop-workspace-doctest> error: aborting due to 1 previous error
646.22 s
gammaloop-workspace-doctest>
646.22 s
gammaloop-workspace-doctest> Couldn't compile the test.
646.22 s
gammaloop-workspace-doctest> ---- crates/gammaloop-api/src/python.rs - python::GammaLoopAPI::get_default_runtime_settings (line 3796) stdout ----
646.22 s
gammaloop-workspace-doctest> error: expected one of `!` or `::`, found `=`
646.22 s
gammaloop-workspace-doctest> --> crates/gammaloop-api/src/python.rs:3797:9
646.22 s
gammaloop-workspace-doctest> |
646.22 s
gammaloop-workspace-doctest> 3797 | runtime = api.get_default_runtime_settings()
646.22 s
gammaloop-workspace-doctest> | ^ expected one of `!` or `::`
646.22 s
gammaloop-workspace-doctest>
646.22 s
gammaloop-workspace-doctest> error: aborting due to 1 previous error
646.22 s
gammaloop-workspace-doctest>
646.22 s
gammaloop-workspace-doctest> Couldn't compile the test.
646.22 s
gammaloop-workspace-doctest> ---- crates/gammaloop-api/src/python.rs - python::GammaLoopAPI::get_run_history (line 3711) stdout ----
646.22 s
gammaloop-workspace-doctest> error[E0425] : cannot find value `run_card_toml` in this scope
646.22 s
gammaloop-workspace-doctest> --> crates/gammaloop-api/src/python.rs:3712:1
646.22 s
gammaloop-workspace-doctest> |
646.22 s
gammaloop-workspace-doctest> 3712 | run_card_toml = api.get_run_history()
646.22 s
gammaloop-workspace-doctest> | ^^^^^^^^^^^^^
646.22 s
gammaloop-workspace-doctest> |
646.22 s
gammaloop-workspace-doctest> help : you might have meant to introduce a new binding
646.22 s
gammaloop-workspace-doctest> |
646.22 s
gammaloop-workspace-doctest> 3712 | let run_card_toml = api.get_run_history()
646.22 s
gammaloop-workspace-doctest> | +++
646.22 s
gammaloop-workspace-doctest>
646.22 s
gammaloop-workspace-doctest> error[E0425] : cannot find value `api` in this scope
646.22 s
gammaloop-workspace-doctest> --> crates/gammaloop-api/src/python.rs:3712:17
646.22 s
gammaloop-workspace-doctest> |
646.22 s
gammaloop-workspace-doctest> 3712 | run_card_toml = api.get_run_history()
646.22 s
gammaloop-workspace-doctest> | ^^^ not found in this scope
646.22 s
gammaloop-workspace-doctest>
646.22 s
gammaloop-workspace-doctest> error : aborting due to 2 previous errors
646.22 s
gammaloop-workspace-doctest>
646.22 s
gammaloop-workspace-doctest> For more information about this error, try `rustc --explain E0425`.
646.22 s
gammaloop-workspace-doctest> Couldn't compile the test.
646.22 s
gammaloop-workspace-doctest> ---- crates/gammaloop-api/src/python.rs - python::GammaLoopAPI::run_command (line 3901) stdout ----
646.22 s
gammaloop-workspace-doctest> error[E0425] : cannot find value `api` in this scope
646.22 s
gammaloop-workspace-doctest> --> crates/gammaloop-api/src/python.rs:3902:1
646.22 s
gammaloop-workspace-doctest> |
646.22 s
gammaloop-workspace-doctest> 3902 | api.run("display processes")
646.22 s
gammaloop-workspace-doctest> | ^^^ not found in this scope
646.22 s
gammaloop-workspace-doctest>
646.22 s
gammaloop-workspace-doctest> error : aborting due to 1 previous error
646.22 s
gammaloop-workspace-doctest>
646.22 s
gammaloop-workspace-doctest> For more information about this error, try `rustc --explain E0425`.
646.22 s
gammaloop-workspace-doctest> Couldn't compile the test.
646.22 s
gammaloop-workspace-doctest> ---- crates/gammaloop-api/src/python.rs - python::GammaLoopAPI::get_global_settings (line 3739) stdout ----
646.22 s
gammaloop-workspace-doctest> error[E0425] : cannot find value `settings_toml` in this scope
646.22 s
gammaloop-workspace-doctest> --> crates/gammaloop-api/src/python.rs:3740:1
646.22 s
gammaloop-workspace-doctest> |
646.22 s
gammaloop-workspace-doctest> 3740 | settings_toml = api.get_global_settings()
646.22 s
gammaloop-workspace-doctest> | ^^^^^^^^^^^^^
646.22 s
gammaloop-workspace-doctest> |
646.22 s
gammaloop-workspace-doctest> help : you might have meant to introduce a new binding
646.22 s
gammaloop-workspace-doctest> |
646.22 s
gammaloop-workspace-doctest> 3740 | let settings_toml = api.get_global_settings()
646.22 s
gammaloop-workspace-doctest> | +++
646.22 s
gammaloop-workspace-doctest>
646.22 s
gammaloop-workspace-doctest> error[E0425] : cannot find value `api` in this scope
646.22 s
gammaloop-workspace-doctest> --> crates/gammaloop-api/src/python.rs:3740:17
646.22 s
gammaloop-workspace-doctest> |
646.22 s
gammaloop-workspace-doctest> 3740 | settings_toml = api.get_global_settings()
646.22 s
gammaloop-workspace-doctest> | ^^^ not found in this scope
646.22 s
gammaloop-workspace-doctest>
646.22 s
gammaloop-workspace-doctest> error : aborting due to 2 previous errors
646.22 s
gammaloop-workspace-doctest>
646.22 s
gammaloop-workspace-doctest> For more information about this error, try `rustc --explain E0425`.
646.22 s
gammaloop-workspace-doctest> Couldn't compile the test.
646.22 s
gammaloop-workspace-doctest> ---- crates/gammaloop-api/src/python.rs - python::atom_to_canonical_string (line 128) stdout ----
646.22 s
gammaloop-workspace-doctest> error[E0425] : cannot find function `atom_to_canonical_string` in this scope
646.22 s
gammaloop-workspace-doctest> --> crates/gammaloop-api/src/python.rs:129:1
646.22 s
gammaloop-workspace-doctest> |
646.22 s
gammaloop-workspace-doctest> 129 | atom_to_canonical_string("x + x")
646.22 s
gammaloop-workspace-doctest> | ^^^^^^^^^^^^^^^^^^^^^^^^ not found in this scope
646.22 s
gammaloop-workspace-doctest>
646.22 s
gammaloop-workspace-doctest> error : aborting due to 1 previous error
646.22 s
gammaloop-workspace-doctest>
646.22 s
gammaloop-workspace-doctest> For more information about this error, try `rustc --explain E0425`.
646.22 s
gammaloop-workspace-doctest> Couldn't compile the test.
646.22 s
gammaloop-workspace-doctest> ---- crates/gammaloop-api/src/python.rs - python::evaluate_graph_overall_factor (line 95) stdout ----
646.22 s
gammaloop-workspace-doctest> error[E0425] : cannot find function `evaluate_graph_overall_factor` in this scope
646.22 s
gammaloop-workspace-doctest> --> crates/gammaloop-api/src/python.rs:96:1
646.22 s
gammaloop-workspace-doctest> |
646.22 s
gammaloop-workspace-doctest> 96 | evaluate_graph_overall_factor(
646.22 s
gammaloop-workspace-doctest> | ^^^^^^^^^^^^^^^^^^^^^^^^^^^^^ not found in this scope
646.22 s
gammaloop-workspace-doctest>
646.22 s
gammaloop-workspace-doctest> error : aborting due to 1 previous error
646.22 s
gammaloop-workspace-doctest>
646.22 s
gammaloop-workspace-doctest> For more information about this error, try `rustc --explain E0425`.
646.22 s
gammaloop-workspace-doctest> Couldn't compile the test.
646.22 s
gammaloop-workspace-doctest> ---- crates/gammaloop-api/src/python.rs - python::atom_to_dots (line 157) stdout ----
646.22 s
gammaloop-workspace-doctest> error[E0425] : cannot find function `to_dots` in this scope
646.22 s
gammaloop-workspace-doctest> --> crates/gammaloop-api/src/python.rs:158:1
646.22 s
gammaloop-workspace-doctest> |
646.22 s
gammaloop-workspace-doctest> 158 | to_dots("p(mu) * q(mu)")
646.22 s
gammaloop-workspace-doctest> | ^^^^^^^ not found in this scope
646.22 s
gammaloop-workspace-doctest>
646.22 s
gammaloop-workspace-doctest> error : aborting due to 1 previous error
646.22 s
gammaloop-workspace-doctest>
646.22 s
gammaloop-workspace-doctest> For more information about this error, try `rustc --explain E0425`.
646.22 s
gammaloop-workspace-doctest> Couldn't compile the test.
646.22 s
gammaloop-workspace-doctest> ---- crates/gammaloop-api/src/python.rs - python::GammaLoopAPI::new_python (line 2834) stdout ----
646.22 s
gammaloop-workspace-doctest> error[E0425] : cannot find value `api` in this scope
646.22 s
gammaloop-workspace-doctest> --> crates/gammaloop-api/src/python.rs:2835:1
646.22 s
gammaloop-workspace-doctest> |
646.22 s
gammaloop-workspace-doctest> 2835 | api = GammaLoopAPI(state_folder="./state", read_only_state=True)
646.22 s
gammaloop-workspace-doctest> | ^^^
646.22 s
gammaloop-workspace-doctest> |
646.22 s
gammaloop-workspace-doctest> help : you might have meant to introduce a new binding
646.22 s
gammaloop-workspace-doctest> |
646.22 s
gammaloop-workspace-doctest> 2835 | let api = GammaLoopAPI(state_folder="./state", read_only_state=True)
646.22 s
gammaloop-workspace-doctest> | +++
646.22 s
gammaloop-workspace-doctest>
646.22 s
gammaloop-workspace-doctest> error[E0425] : cannot find value `state_folder` in this scope
646.22 s
gammaloop-workspace-doctest> --> crates/gammaloop-api/src/python.rs:2835:20
646.22 s
gammaloop-workspace-doctest> |
646.22 s
gammaloop-workspace-doctest> 2835 | api = GammaLoopAPI(state_folder="./state", read_only_state=True)
646.22 s
gammaloop-workspace-doctest> | ^^^^^^^^^^^^ not found in this scope
646.22 s
gammaloop-workspace-doctest>
646.22 s
gammaloop-workspace-doctest> error[E0425] : cannot find value `read_only_state` in this scope
646.22 s
gammaloop-workspace-doctest> --> crates/gammaloop-api/src/python.rs:2835:44
646.22 s
gammaloop-workspace-doctest> |
646.22 s
gammaloop-workspace-doctest> 2835 | api = GammaLoopAPI(state_folder="./state", read_only_state=True)
646.22 s
gammaloop-workspace-doctest> | ^^^^^^^^^^^^^^^ not found in this scope
646.22 s
gammaloop-workspace-doctest>
646.22 s
gammaloop-workspace-doctest> error[E0425] : cannot find value `True` in this scope
646.23 s
gammaloop-workspace-doctest> --> crates/gammaloop-api/src/python.rs:2835:60
646.23 s
gammaloop-workspace-doctest> |
646.23 s
gammaloop-workspace-doctest> 2835 | api = GammaLoopAPI(state_folder="./state", read_only_state=True)
646.23 s
gammaloop-workspace-doctest> | ^^^^ not found in this scope
646.23 s
gammaloop-workspace-doctest> |
646.23 s
gammaloop-workspace-doctest> help : you may want to use a bool value instead
646.23 s
gammaloop-workspace-doctest> |
646.23 s
gammaloop-workspace-doctest> 2835 - api = GammaLoopAPI(state_folder="./state", read_only_state=True )
646.23 s
gammaloop-workspace-doctest> 2835 + api = GammaLoopAPI(state_folder="./state", read_only_state=true )
646.23 s
gammaloop-workspace-doctest> |
646.23 s
gammaloop-workspace-doctest>
646.23 s
gammaloop-workspace-doctest> error[E0425] : cannot find function, tuple struct or tuple variant `GammaLoopAPI` in this scope
646.23 s
gammaloop-workspace-doctest> --> crates/gammaloop-api/src/python.rs:2835:7
646.23 s
gammaloop-workspace-doctest> |
646.23 s
gammaloop-workspace-doctest> 2835 | api = GammaLoopAPI(state_folder="./state", read_only_state=True)
646.23 s
gammaloop-workspace-doctest> | ^^^^^^^^^^^^ not found in this scope
646.23 s
gammaloop-workspace-doctest>
646.23 s
gammaloop-workspace-doctest> error : aborting due to 5 previous errors
646.23 s
gammaloop-workspace-doctest>
646.23 s
gammaloop-workspace-doctest> For more information about this error, try `rustc --explain E0425`.
646.23 s
gammaloop-workspace-doctest> Couldn't compile the test.
646.23 s
gammaloop-workspace-doctest>
646.23 s
gammaloop-workspace-doctest> failures:
646.23 s
gammaloop-workspace-doctest> crates/gammaloop-api/src/python.rs - python::GammaLoopAPI::evaluate_sample (line 2967)
646.23 s
gammaloop-workspace-doctest> crates/gammaloop-api/src/python.rs - python::GammaLoopAPI::evaluate_samples (line 3108)
646.23 s
gammaloop-workspace-doctest> crates/gammaloop-api/src/python.rs - python::GammaLoopAPI::get_active_command_blocks (line 3760)
646.23 s
gammaloop-workspace-doctest> crates/gammaloop-api/src/python.rs - python::GammaLoopAPI::get_default_runtime_settings (line 3796)
646.23 s
gammaloop-workspace-doctest> crates/gammaloop-api/src/python.rs - python::GammaLoopAPI::get_global_settings (line 3739)
646.23 s
gammaloop-workspace-doctest> crates/gammaloop-api/src/python.rs - python::GammaLoopAPI::get_integrand_info (line 3585)
646.23 s
gammaloop-workspace-doctest> crates/gammaloop-api/src/python.rs - python::GammaLoopAPI::get_integrand_settings (line 3647)
646.23 s
gammaloop-workspace-doctest> crates/gammaloop-api/src/python.rs - python::GammaLoopAPI::get_run_history (line 3711)
646.23 s
gammaloop-workspace-doctest> crates/gammaloop-api/src/python.rs - python::GammaLoopAPI::new_python (line 2834)
646.23 s
gammaloop-workspace-doctest> crates/gammaloop-api/src/python.rs - python::GammaLoopAPI::run_command (line 3901)
646.23 s
gammaloop-workspace-doctest> crates/gammaloop-api/src/python.rs - python::PyHistogramAccumulator (line 871)
646.23 s
gammaloop-workspace-doctest> crates/gammaloop-api/src/python.rs - python::atom_to_canonical_string (line 128)
646.23 s
gammaloop-workspace-doctest> crates/gammaloop-api/src/python.rs - python::atom_to_dots (line 157)
646.23 s
gammaloop-workspace-doctest> crates/gammaloop-api/src/python.rs - python::evaluate_graph_overall_factor (line 95)
646.23 s
gammaloop-workspace-doctest>
646.23 s
gammaloop-workspace-doctest> test result: FAILED. 2 passed; 14 failed; 0 ignored; 0 measured; 0 filtered out; finished in 3.24s
646.23 s
gammaloop-workspace-doctest>
646.23 s
gammaloop-workspace-doctest> error : doctest failed, to rerun pass `-p gammaloop-api --doc`
646.77 s
error: Cannot build '/nix/store/7sklrrqr33rrmr48m29bipvdyblkjnbd-gammaloop-workspace-doctest-0.1.0.drv '.
646.77 s
Reason: builder failed with exit code 101 .
646.77 s
Output paths:
646.77 s
/nix/store/7szg1bw742zdanb7cjwdrz3z00q4sq55-gammaloop-workspace-doctest-0.1.0
646.77 s
Last 356 log lines:
646.77 s
> Running phase: unpackPhase
646.77 s
> unpacking source archive /nix/store/5afz06g4vsphrihpxicbxvm3sk5psnll-source
646.77 s
> source root is source
646.77 s
> Running phase: patchPhase
646.77 s
> Executing configureCargoCommonVars
646.77 s
> decompressing cargo artifacts from /nix/store/72wdcnp633ang33qg6wvb90brvf1679y-gammaloop-workspace-deps-deps-0.1.0/target.tar.zst to target
646.77 s
> Running phase: updateAutotoolsGnuConfigScriptsPhase
646.77 s
> Running phase: configurePhase
646.77 s
> will append /build/source/.cargo-home/config.toml with contents of /nix/store/29aa708jkn8wd8vjwja1a5gh8k8wpi2b-vendor-cargo-deps/config.toml
646.77 s
> default configurePhase, nothing to do
646.77 s
> Running phase: buildPhase
646.77 s
> +++ command cargo --version
646.77 s
> cargo 1.98.0 (797e8a9bc 2026-08-05)
646.77 s
> +++ command cargo test --profile ci-optim --doc --locked --workspace --features gammaloop-api/cli,gammaloop-tracing-filter/clap,gammaloop-tracing-filter/symbolica,idenso/bincode,idenso/reference-cases,linnet/bincode,linnet/drawing,linnet/nodestore-vec,linnet/rkyv,linnet/serde,linnet/symbolica,spenso-macros/shadowing,spenso/shadowing,symbolica/tracing_max_level_info
646.77 s
> Compiling target-lexicon v0.13.5
646.77 s
> Compiling symbolica v2.2.0 (https://github.com/symbolica-dev/symbolica?branch=dev#0441bd7a)
646.77 s
> Compiling maplit v1.0.2
646.77 s
> Compiling gammaloop-tracing-filter-macros v0.1.0 (/build/source/crates/gammaloop-tracing-filter-macros)
646.77 s
> Compiling vakint v0.1.2 (/build/source/crates/vakint)
646.77 s
> Compiling gammalooprs v0.3.4 (/build/source/crates/gammalooprs)
646.77 s
> Compiling alphal00p-docs-macros v0.1.0 (/build/source/crates/alphal00p-docs-macros)
646.77 s
> Compiling alphal00p-docs-schema v0.1.0 (/build/source/crates/alphal00p-docs-schema)
646.77 s
> Compiling rustc_version v0.4.1
646.77 s
> Compiling bincode v1.3.3
646.77 s
> Compiling gungraun-runner v0.18.2
646.77 s
> Compiling target-triple v1.0.1
646.77 s
> Compiling iai-callgrind-runner v0.14.2
646.77 s
> Compiling gammaloop-integration-tests v0.1.0 (/build/source/tests)
646.77 s
> Compiling test-log-core v0.2.20
646.77 s
> Compiling wait-timeout v0.2.1
646.77 s
> Compiling iai-callgrind v0.14.2
646.77 s
> Compiling quick-error v1.2.3
646.77 s
> Compiling bit-vec v0.8.0
646.77 s
> Compiling rusty-fork v0.3.1
646.77 s
> Compiling iai-callgrind-macros v0.5.1
646.77 s
> Compiling bit-set v0.8.0
646.77 s
> Compiling rand_xorshift v0.4.0
646.77 s
> Compiling console v0.15.11
646.77 s
> Compiling termcolor v1.4.1
646.77 s
> Compiling gungraun-macros v0.8.0
646.77 s
> Compiling unarray v0.1.4
646.77 s
> Compiling glob v0.3.4
646.77 s
> Compiling base64 v0.21.7
646.77 s
> Compiling similar-asserts v1.7.0
646.77 s
> Compiling trybuild v1.0.120
646.77 s
> Compiling ron v0.8.1
646.77 s
> Compiling proptest v1.11.0
646.77 s
> Compiling alphal00p-docs-builder v0.1.0 (/build/source/crates/alphal00p-docs-builder)
646.77 s
> Compiling pyo3-build-config v0.28.3
646.77 s
> Compiling alphal00p-docs-catalogs v0.1.0 (/build/source/crates/alphal00p-docs-catalogs)
646.77 s
> Compiling kurvst v0.1.0 (/build/source/crates/kurvst)
646.77 s
> Compiling test-log-macros v0.2.20
646.77 s
> Compiling test-log v0.2.20
646.77 s
> Compiling alphal00p-docs-examples v0.1.0 (/build/source/crates/alphal00p-docs-examples)
646.77 s
> Compiling pyo3-ffi v0.28.3
646.77 s
> Compiling pyo3-macros-backend v0.28.3
646.77 s
> Compiling pyo3 v0.28.3
646.77 s
> Compiling numpy v0.28.0
646.77 s
> Compiling gammaloop-api v0.1.0 (/build/source/crates/gammaloop-api)
646.77 s
> Compiling gungraun v0.18.2
646.77 s
> Compiling pyo3-macros v0.28.3
646.77 s
> Compiling pyo3-stub-gen v0.17.2
646.77 s
> Compiling numerica v2.2.0 (https://github.com/symbolica-dev/symbolica?branch=dev#0441bd7a)
646.77 s
> Compiling graphica v2.1.0 (https://github.com/symbolica-dev/symbolica?branch=dev#0441bd7a)
646.77 s
> Compiling symbolica-utils v0.1.0 (/build/source/crates/symbolica-utils)
646.77 s
> Compiling gammaloop-workspace-hack v0.1.0 (/build/source/crates/gammaloop-workspace-hack)
646.77 s
> Compiling spenso-macros v0.3.2 (/build/source/crates/spenso-macros)
646.77 s
> Compiling linnet v0.17.0 (/build/source/crates/linnet)
646.77 s
> Compiling spenso v0.6.0 (/build/source/crates/spenso)
646.77 s
> Compiling idenso v0.3.0 (/build/source/crates/idenso)
646.77 s
> Compiling gammaloop-tracing-filter v0.1.0 (/build/source/crates/gammaloop-tracing-filter)
646.77 s
> Compiling spenso-hep-lib v0.1.7 (/build/source/crates/spenso-hep-lib)
646.77 s
> Compiling spynso3 v0.1.2 (/build/source/crates/spynso3)
646.77 s
> Compiling linnest v0.1.0 (/build/source/crates/linnest)
646.77 s
> Compiling linnet-py v0.1.0 (/build/source/crates/linnet-py)
646.77 s
> Finished `ci-optim` profile [optimized] target(s) in 9m 51s
646.77 s
> warning : the following packages contain code that will be rejected by a future version of Rust: proc-macro-error2 v2.0.1
646.77 s
> note : to see what the problems were, use the option `--future-incompat-report`, or run `cargo report future-incompatibilities --id 1`
646.77 s
> Doc-tests alphal00p_docs_builder
646.77 s
>
646.77 s
> running 0 tests
646.77 s
>
646.77 s
> test result: ok. 0 passed; 0 failed; 0 ignored; 0 measured; 0 filtered out; finished in 0.00s
646.77 s
>
646.77 s
> Doc-tests alphal00p_docs_catalogs
646.77 s
>
646.77 s
> running 0 tests
646.77 s
>
646.77 s
> test result: ok. 0 passed; 0 failed; 0 ignored; 0 measured; 0 filtered out; finished in 0.00s
646.77 s
>
646.77 s
> Doc-tests alphal00p_docs_examples
646.77 s
>
646.77 s
> running 0 tests
646.77 s
>
646.77 s
> test result: ok. 0 passed; 0 failed; 0 ignored; 0 measured; 0 filtered out; finished in 0.00s
646.77 s
>
646.77 s
> Doc-tests alphal00p_docs
646.77 s
>
646.77 s
> running 0 tests
646.77 s
>
646.77 s
> test result: ok. 0 passed; 0 failed; 0 ignored; 0 measured; 0 filtered out; finished in 0.00s
646.77 s
>
646.77 s
> Doc-tests alphal00p_docs_schema
646.77 s
>
646.77 s
> running 0 tests
646.77 s
>
646.77 s
> test result: ok. 0 passed; 0 failed; 0 ignored; 0 measured; 0 filtered out; finished in 0.00s
646.77 s
>
646.77 s
> Doc-tests gammaloop_api
646.77 s
>
646.77 s
> running 16 tests
646.77 s
> test crates/gammaloop-api/src/python.rs - python::GammaLoopAPI::evaluate_samples (line 3108) ... FAILED
646.77 s
> test crates/gammaloop-api/src/python.rs - python::PyHistogramAccumulator (line 871) ... FAILED
646.77 s
> test crates/gammaloop-api/src/python.rs - python::GammaLoopAPI::get_active_command_blocks (line 3760) ... FAILED
646.77 s
> test crates/gammaloop-api/src/python.rs - python::GammaLoopAPI::get_integrand_settings (line 3647) ... FAILED
646.77 s
> test crates/gammaloop-api/src/python.rs - python::GammaLoopAPI::evaluate_sample (line 2967) ... FAILED
646.77 s
> test crates/gammaloop-api/src/python.rs - python::GammaLoopAPI::get_integrand_info (line 3585) ... FAILED
646.77 s
> test crates/gammaloop-api/src/python.rs - python::GammaLoopAPI::get_default_runtime_settings (line 3796) ... FAILED
646.77 s
> test crates/gammaloop-api/src/lib.rs - (line 18) - compile ... ok
646.77 s
> test crates/gammaloop-api/src/python.rs - python::GammaLoopAPI::get_run_history (line 3711) ... FAILED
646.77 s
> test crates/gammaloop-api/src/python.rs - python::GammaLoopAPI::run_command (line 3901) ... FAILED
646.77 s
> test crates/gammaloop-api/src/python.rs - python::GammaLoopAPI::get_global_settings (line 3739) ... FAILED
646.77 s
> test crates/gammaloop-api/src/python.rs - python::atom_to_canonical_string (line 128) ... FAILED
646.77 s
> test crates/gammaloop-api/src/python.rs - python::evaluate_graph_overall_factor (line 95) ... FAILED
646.77 s
> test crates/gammaloop-api/src/python.rs - python::atom_to_dots (line 157) ... FAILED
646.77 s
> test crates/gammaloop-api/src/python.rs - python::GammaLoopAPI::new_python (line 2834) ... FAILED
646.77 s
> test crates/gammaloop-api/src/commands/evaluate_samples.rs - commands::evaluate_samples::EvaluateSamples (line 50) ... ok
646.77 s
>
646.77 s
> failures:
646.77 s
>
646.77 s
> ---- crates/gammaloop-api/src/python.rs - python::GammaLoopAPI::evaluate_samples (line 3108) stdout ----
646.77 s
> error: expected one of `!` or `::`, found `pathlib`
646.77 s
> --> crates/gammaloop-api/src/python.rs:3109:6
646.77 s
> |
646.77 s
> 3109 | from pathlib import Path
646.77 s
> | ^^^^^^^ expected one of `!` or `::`
646.77 s
>
646.77 s
> error: aborting due to 1 previous error
646.77 s
>
646.77 s
> Couldn't compile the test.
646.77 s
> ---- crates/gammaloop-api/src/python.rs - python::PyHistogramAccumulator (line 871) stdout ----
646.77 s
> error: expected one of `!` or `::`, found `gammaloop`
646.77 s
> --> crates/gammaloop-api/src/python.rs:872:6
646.77 s
> |
646.77 s
> 872 | from gammaloop import HistogramAccumulator
646.77 s
> | ^^^^^^^^^ expected one of `!` or `::`
646.77 s
>
646.77 s
> error: aborting due to 1 previous error
646.77 s
>
646.77 s
> Couldn't compile the test.
646.77 s
> ---- crates/gammaloop-api/src/python.rs - python::GammaLoopAPI::get_active_command_blocks (line 3760) stdout ----
646.77 s
> error: expected item, found keyword `for`
646.77 s
> --> crates/gammaloop-api/src/python.rs:3761:1
646.77 s
> |
646.77 s
> 3761 | for name, commands in api.get_active_command_blocks().items():
646.77 s
> | ^^^ expected item
646.77 s
> |
646.77 s
> = note: for a full list of items that can appear in modules, see <https://doc.rust-lang.org/reference/items.html>
646.77 s
>
646.77 s
> error: aborting due to 1 previous error
646.77 s
>
646.77 s
> Couldn't compile the test.
646.77 s
> ---- crates/gammaloop-api/src/python.rs - python::GammaLoopAPI::get_integrand_settings (line 3647) stdout ----
646.77 s
> error: expected one of `!` or `::`, found `=`
646.77 s
> --> crates/gammaloop-api/src/python.rs:3648:10
646.77 s
> |
646.77 s
> 3648 | settings = api.get_integrand_settings(process_id=0)
646.77 s
> | ^ expected one of `!` or `::`
646.77 s
>
646.77 s
> error: aborting due to 1 previous error
646.77 s
>
646.77 s
> Couldn't compile the test.
646.77 s
> ---- crates/gammaloop-api/src/python.rs - python::GammaLoopAPI::evaluate_sample (line 2967) stdout ----
646.77 s
> error: expected one of `!` or `::`, found `pathlib`
646.77 s
> --> crates/gammaloop-api/src/python.rs:2968:6
646.77 s
> |
646.77 s
> 2968 | from pathlib import Path
646.77 s
> | ^^^^^^^ expected one of `!` or `::`
646.77 s
>
646.77 s
> error: aborting due to 1 previous error
646.77 s
>
646.77 s
> Couldn't compile the test.
646.77 s
> ---- crates/gammaloop-api/src/python.rs - python::GammaLoopAPI::get_integrand_info (line 3585) stdout ----
646.77 s
> error: expected one of `!` or `::`, found `pathlib`
646.77 s
> --> crates/gammaloop-api/src/python.rs:3586:6
646.77 s
> |
646.77 s
> 3586 | from pathlib import Path
646.77 s
> | ^^^^^^^ expected one of `!` or `::`
646.77 s
>
646.77 s
> error: aborting due to 1 previous error
646.77 s
>
646.77 s
> Couldn't compile the test.
646.77 s
> ---- crates/gammaloop-api/src/python.rs - python::GammaLoopAPI::get_default_runtime_settings (line 3796) stdout ----
646.77 s
> error: expected one of `!` or `::`, found `=`
646.77 s
> --> crates/gammaloop-api/src/python.rs:3797:9
646.77 s
> |
646.77 s
> 3797 | runtime = api.get_default_runtime_settings()
646.77 s
> | ^ expected one of `!` or `::`
646.77 s
>
646.77 s
> error: aborting due to 1 previous error
646.77 s
>
646.77 s
> Couldn't compile the test.
646.77 s
> ---- crates/gammaloop-api/src/python.rs - python::GammaLoopAPI::get_run_history (line 3711) stdout ----
646.77 s
> error[E0425] : cannot find value `run_card_toml` in this scope
646.77 s
> --> crates/gammaloop-api/src/python.rs:3712:1
646.77 s
> |
646.77 s
> 3712 | run_card_toml = api.get_run_history()
646.77 s
> | ^^^^^^^^^^^^^
646.77 s
> |
646.77 s
> help : you might have meant to introduce a new binding
646.77 s
> |
646.77 s
> 3712 | let run_card_toml = api.get_run_history()
646.77 s
> | +++
646.77 s
>
646.77 s
> error[E0425] : cannot find value `api` in this scope
646.77 s
> --> crates/gammaloop-api/src/python.rs:3712:17
646.77 s
> |
646.77 s
> 3712 | run_card_toml = api.get_run_history()
646.77 s
> | ^^^ not found in this scope
646.77 s
>
646.77 s
> error : aborting due to 2 previous errors
646.77 s
>
646.77 s
> For more information about this error, try `rustc --explain E0425`.
646.77 s
> Couldn't compile the test.
646.77 s
> ---- crates/gammaloop-api/src/python.rs - python::GammaLoopAPI::run_command (line 3901) stdout ----
646.77 s
> error[E0425] : cannot find value `api` in this scope
646.77 s
> --> crates/gammaloop-api/src/python.rs:3902:1
646.77 s
> |
646.77 s
> 3902 | api.run("display processes")
646.77 s
> | ^^^ not found in this scope
646.77 s
>
646.77 s
> error : aborting due to 1 previous error
646.77 s
>
646.77 s
> For more information about this error, try `rustc --explain E0425`.
646.77 s
> Couldn't compile the test.
646.77 s
> ---- crates/gammaloop-api/src/python.rs - python::GammaLoopAPI::get_global_settings (line 3739) stdout ----
646.77 s
> error[E0425] : cannot find value `settings_toml` in this scope
646.77 s
> --> crates/gammaloop-api/src/python.rs:3740:1
646.77 s
> |
646.77 s
> 3740 | settings_toml = api.get_global_settings()
646.77 s
> | ^^^^^^^^^^^^^
646.77 s
> |
646.77 s
> help : you might have meant to introduce a new binding
646.77 s
> |
646.77 s
> 3740 | let settings_toml = api.get_global_settings()
646.77 s
> | +++
646.77 s
>
646.77 s
> error[E0425] : cannot find value `api` in this scope
646.77 s
> --> crates/gammaloop-api/src/python.rs:3740:17
646.77 s
> |
646.77 s
> 3740 | settings_toml = api.get_global_settings()
646.77 s
> | ^^^ not found in this scope
646.77 s
>
646.77 s
> error : aborting due to 2 previous errors
646.77 s
>
646.77 s
> For more information about this error, try `rustc --explain E0425`.
646.77 s
> Couldn't compile the test.
646.77 s
> ---- crates/gammaloop-api/src/python.rs - python::atom_to_canonical_string (line 128) stdout ----
646.77 s
> error[E0425] : cannot find function `atom_to_canonical_string` in this scope
646.77 s
> --> crates/gammaloop-api/src/python.rs:129:1
646.77 s
> |
646.77 s
> 129 | atom_to_canonical_string("x + x")
646.77 s
> | ^^^^^^^^^^^^^^^^^^^^^^^^ not found in this scope
646.77 s
>
646.77 s
> error : aborting due to 1 previous error
646.77 s
>
646.77 s
> For more information about this error, try `rustc --explain E0425`.
646.77 s
> Couldn't compile the test.
646.77 s
> ---- crates/gammaloop-api/src/python.rs - python::evaluate_graph_overall_factor (line 95) stdout ----
646.77 s
> error[E0425] : cannot find function `evaluate_graph_overall_factor` in this scope
646.77 s
> --> crates/gammaloop-api/src/python.rs:96:1
646.77 s
> |
646.77 s
> 96 | evaluate_graph_overall_factor(
646.77 s
> | ^^^^^^^^^^^^^^^^^^^^^^^^^^^^^ not found in this scope
646.77 s
>
646.77 s
> error : aborting due to 1 previous error
646.77 s
>
646.77 s
> For more information about this error, try `rustc --explain E0425`.
646.77 s
> Couldn't compile the test.
646.77 s
> ---- crates/gammaloop-api/src/python.rs - python::atom_to_dots (line 157) stdout ----
646.77 s
> error[E0425] : cannot find function `to_dots` in this scope
646.77 s
> --> crates/gammaloop-api/src/python.rs:158:1
646.77 s
> |
646.77 s
> 158 | to_dots("p(mu) * q(mu)")
646.77 s
> | ^^^^^^^ not found in this scope
646.77 s
>
646.77 s
> error : aborting due to 1 previous error
646.77 s
>
646.77 s
> For more information about this error, try `rustc --explain E0425`.
646.77 s
> Couldn't compile the test.
646.77 s
> ---- crates/gammaloop-api/src/python.rs - python::GammaLoopAPI::new_python (line 2834) stdout ----
646.77 s
> error[E0425] : cannot find value `api` in this scope
646.77 s
> --> crates/gammaloop-api/src/python.rs:2835:1
646.77 s
> |
646.77 s
> 2835 | api = GammaLoopAPI(state_folder="./state", read_only_state=True)
646.77 s
> | ^^^
646.77 s
> |
646.77 s
> help : you might have meant to introduce a new binding
646.77 s
> |
646.77 s
> 2835 | let api = GammaLoopAPI(state_folder="./state", read_only_state=True)
646.77 s
> | +++
646.77 s
>
646.77 s
> error[E0425] : cannot find value `state_folder` in this scope
646.77 s
> --> crates/gammaloop-api/src/python.rs:2835:20
646.77 s
> |
646.77 s
> 2835 | api = GammaLoopAPI(state_folder="./state", read_only_state=True)
646.77 s
> | ^^^^^^^^^^^^ not found in this scope
646.77 s
>
646.77 s
> error[E0425] : cannot find value `read_only_state` in this scope
646.77 s
> --> crates/gammaloop-api/src/python.rs:2835:44
646.77 s
> |
646.77 s
> 2835 | api = GammaLoopAPI(state_folder="./state", read_only_state=True)
646.77 s
> | ^^^^^^^^^^^^^^^ not found in this scope
646.77 s
>
646.77 s
> error[E0425] : cannot find value `True` in this scope
646.77 s
> --> crates/gammaloop-api/src/python.rs:2835:60
646.77 s
> |
646.77 s
> 2835 | api = GammaLoopAPI(state_folder="./state", read_only_state=True)
646.77 s
> | ^^^^ not found in this scope
646.77 s
> |
646.77 s
> help : you may want to use a bool value instead
646.77 s
> |
646.77 s
> 2835 - api = GammaLoopAPI(state_folder="./state", read_only_state=True )
646.77 s
> 2835 + api = GammaLoopAPI(state_folder="./state", read_only_state=true )
646.77 s
> |
646.77 s
>
646.77 s
> error[E0425] : cannot find function, tuple struct or tuple variant `GammaLoopAPI` in this scope
646.77 s
> --> crates/gammaloop-api/src/python.rs:2835:7
646.77 s
> |
646.77 s
> 2835 | api = GammaLoopAPI(state_folder="./state", read_only_state=True)
646.77 s
> | ^^^^^^^^^^^^ not found in this scope
646.77 s
>
646.77 s
> error : aborting due to 5 previous errors
646.77 s
>
646.77 s
> For more information about this error, try `rustc --explain E0425`.
646.77 s
> Couldn't compile the test.
646.77 s
>
646.77 s
> failures:
646.77 s
> crates/gammaloop-api/src/python.rs - python::GammaLoopAPI::evaluate_sample (line 2967)
646.77 s
> crates/gammaloop-api/src/python.rs - python::GammaLoopAPI::evaluate_samples (line 3108)
646.77 s
> crates/gammaloop-api/src/python.rs - python::GammaLoopAPI::get_active_command_blocks (line 3760)
646.77 s
> crates/gammaloop-api/src/python.rs - python::GammaLoopAPI::get_default_runtime_settings (line 3796)
646.77 s
> crates/gammaloop-api/src/python.rs - python::GammaLoopAPI::get_global_settings (line 3739)
646.77 s
> crates/gammaloop-api/src/python.rs - python::GammaLoopAPI::get_integrand_info (line 3585)
646.77 s
> crates/gammaloop-api/src/python.rs - python::GammaLoopAPI::get_integrand_settings (line 3647)
646.77 s
> crates/gammaloop-api/src/python.rs - python::GammaLoopAPI::get_run_history (line 3711)
646.77 s
> crates/gammaloop-api/src/python.rs - python::GammaLoopAPI::new_python (line 2834)
646.77 s
> crates/gammaloop-api/src/python.rs - python::GammaLoopAPI::run_command (line 3901)
646.78 s
> crates/gammaloop-api/src/python.rs - python::PyHistogramAccumulator (line 871)
646.78 s
> crates/gammaloop-api/src/python.rs - python::atom_to_canonical_string (line 128)
646.78 s
> crates/gammaloop-api/src/python.rs - python::atom_to_dots (line 157)
646.78 s
> crates/gammaloop-api/src/python.rs - python::evaluate_graph_overall_factor (line 95)
646.78 s
>
646.78 s
> test result: FAILED. 2 passed; 14 failed; 0 ignored; 0 measured; 0 filtered out; finished in 3.24s
646.78 s
>
646.78 s
> error : doctest failed, to rerun pass `-p gammaloop-api --doc`
646.78 s
For full logs, run:
646.78 s
nix log /nix/store/7sklrrqr33rrmr48m29bipvdyblkjnbd-gammaloop-workspace-doctest-0.1.0.drv
646.86 s
[0 built (1 failed ), 0.0 Run failed.