test packages.x86_64-linux.nix-ci-check-gammaloop-doctest
0.11 s
$ /nix/store/9ypz3flqsrl5xl495mm8h645gadjsxi1-coreutils-9.11/bin/timeout --kill-after=15s 7200s /nix/store/23zk8sgzamrbmj1fday15szf7f2279s8-nix-2.34.7/bin/nix --extra-experimental-features nix-command --extra-experimental-features flakes flake clone git+https://github.com/alphal00p/gammaloop --dest /tmp/nix-ci-worker/stable-pwd/repo/
0.12 s
Cloning into '/tmp/nix-ci-worker/stable-pwd/repo'...
1.61 s
remote: Enumerating objects: 66333, done.
1.84 s
remote: Counting objects: 0% (1/9005)
remote: Counting objects: 1% (91/9005)
remote: Counting objects: 2% (181/9005)
remote: Counting objects: 3% (271/9005)
remote: Counting objects: 4% (361/9005)
remote: Counting objects: 5% (451/9005)
remote: Counting objects: 6% (541/9005)
remote: Counting objects: 7% (631/9005)
remote: Counting objects: 8% (721/9005)
remote: Counting objects: 9% (811/9005)
remote: Counting objects: 10% (901/9005)
remote: Counting objects: 11% (991/9005)
remote: Counting objects: 12% (1081/9005)
remote: Counting objects: 13% (1171/9005)
remote: Counting objects: 14% (1261/9005)
remote: Counting objects: 15% (1351/9005)
remote: Counting objects: 16% (1441/9005)
remote: Counting objects: 17% (1531/9005)
remote: Counting objects: 18% (1621/9005)
remote: Counting objects: 19% (1711/9005)
remote: Counting objects: 20% (1801/9005)
remote: Counting objects: 21% (1892/9005)
remote: Counting objects: 22% (1982/9005)
remote: Counting objects: 23% (2072/9005)
remote: Counting objects: 24% (2162/9005)
remote: Counting objects: 25% (2252/9005)
remote: Counting objects: 26% (2342/9005)
remote: Counting objects: 27% (2432/9005)
remote: Counting objects: 28% (2522/9005)
remote: Counting objects: 29% (2612/9005)
remote: Counting objects: 30% (2702/9005)
remote: Counting objects: 31% (2792/9005)
remote: Counting objects: 32% (2882/9005)
remote: Counting objects: 33% (2972/9005)
remote: Counting objects: 34% (3062/9005)
remote: Counting objects: 35% (3152/9005)
remote: Counting objects: 36% (3242/9005)
remote: Counting objects: 37% (3332/9005)
remote: Counting objects: 38% (3422/9005)
remote: Counting objects: 39% (3512/9005)
remote: Counting objects: 40% (3602/9005)
remote: Counting objects: 41% (3693/9005)
remote: Counting objects: 42% (3783/9005)
remote: Counting objects: 43% (3873/9005)
remote: Counting objects: 44% (3963/9005)
remote: Counting objects: 45% (4053/9005)
remote: Counting objects: 46% (4143/9005)
remote: Counting objects: 47% (4233/9005)
remote: Counting objects: 48% (4323/9005)
remote: Counting objects: 49% (4413/9005)
remote: Counting objects: 50% (4503/9005)
remote: Counting objects: 51% (4593/9005)
remote: Counting objects: 52% (4683/9005)
remote: Counting objects: 53% (4773/9005)
remote: Counting objects: 54% (4863/9005)
remote: Counting objects: 55% (4953/9005)
remote: Counting objects: 56% (5043/9005)
remote: Counting objects: 57% (5133/9005)
remote: Counting objects: 58% (5223/9005)
remote: Counting objects: 59% (5313/9005)
remote: Counting objects: 60% (5403/9005)
remote: Counting objects: 61% (5494/9005)
remote: Counting objects: 62% (5584/9005)
remote: Counting objects: 63% (5674/9005)
remote: Counting objects: 64% (5764/9005)
remote: Counting objects: 65% (5854/9005)
remote: Counting objects: 66% (5944/9005)
remote: Counting objects: 67% (6034/9005)
remote: Counting objects: 68% (6124/9005)
remote: Counting objects: 69% (6214/9005)
remote: Counting objects: 70% (6304/9005)
remote: Counting objects: 71% (6394/9005)
remote: Counting objects: 72% (6484/9005)
remote: Counting objects: 73% (6574/9005)
remote: Counting objects: 74% (6664/9005)
remote: Counting objects: 75% (6754/9005)
remote: Counting objects: 76% (6844/9005)
remote: Counting objects: 77% (6934/9005)
remote: Counting objects: 78% (7024/9005)
remote: Counting objects: 79% (7114/9005)
remote: Counting objects: 80% (7204/9005)
remote: Counting objects: 81% (7295/9005)
remote: Counting objects: 82% (7385/9005)
remote: Counting objects: 83% (7475/9005)
remote: Counting objects: 84% (7565/9005)
remote: Counting objects: 85% (7655/9005)
remote: Counting objects: 86% (7745/9005)
remote: Counting objects: 87% (7835/9005)
remote: Counting objects: 88% (7925/9005)
remote: Counting objects: 89% (8015/9005)
remote: Counting objects: 90% (8105/9005)
remote: Counting objects: 91% (8195/9005)
remote: Counting objects: 92% (8285/9005)
remote: Counting objects: 93% (8375/9005)
remote: Counting objects: 94% (8465/9005)
remote: Counting objects: 95% (8555/9005)
remote: Counting objects: 96% (8645/9005)
remote: Counting objects: 97% (8735/9005)
remote: Counting objects: 98% (8825/9005)
remote: Counting objects: 99% (8915/9005)
remote: Counting objects: 100% (9005/9005)
remote: Counting objects: 100% (9005/9005), done.
3.97 s
remote: Compressing objects: 0% (1/2112)
remote: Compressing objects: 1% (22/2112)
remote: Compressing objects: 2% (43/2112)
remote: Compressing objects: 3% (64/2112)
remote: Compressing objects: 4% (85/2112)
remote: Compressing objects: 5% (106/2112)
remote: Compressing objects: 6% (127/2112)
remote: Compressing objects: 7% (148/2112)
remote: Compressing objects: 8% (169/2112)
remote: Compressing objects: 9% (191/2112)
remote: Compressing objects: 10% (212/2112)
remote: Compressing objects: 11% (233/2112)
remote: Compressing objects: 12% (254/2112)
remote: Compressing objects: 13% (275/2112)
remote: Compressing objects: 14% (296/2112)
remote: Compressing objects: 15% (317/2112)
remote: Compressing objects: 16% (338/2112)
remote: Compressing objects: 17% (360/2112)
remote: Compressing objects: 18% (381/2112)
remote: Compressing objects: 19% (402/2112)
remote: Compressing objects: 20% (423/2112)
remote: Compressing objects: 20% (440/2112)
remote: Compressing objects: 21% (444/2112)
remote: Compressing objects: 22% (465/2112)
remote: Compressing objects: 23% (486/2112)
remote: Compressing objects: 24% (507/2112)
remote: Compressing objects: 25% (528/2112)
remote: Compressing objects: 26% (550/2112)
remote: Compressing objects: 27% (571/2112)
remote: Compressing objects: 28% (592/2112)
remote: Compressing objects: 29% (613/2112)
remote: Compressing objects: 30% (634/2112)
remote: Compressing objects: 30% (649/2112)
remote: Compressing objects: 31% (655/2112)
remote: Compressing objects: 32% (676/2112)
remote: Compressing objects: 33% (697/2112)
remote: Compressing objects: 34% (719/2112)
remote: Compressing objects: 35% (740/2112)
remote: Compressing objects: 36% (761/2112)
remote: Compressing objects: 37% (782/2112)
remote: Compressing objects: 38% (803/2112)
remote: Compressing objects: 39% (824/2112)
remote: Compressing objects: 40% (845/2112)
remote: Compressing objects: 41% (866/2112)
remote: Compressing objects: 42% (888/2112)
remote: Compressing objects: 43% (909/2112)
remote: Compressing objects: 44% (930/2112)
remote: Compressing objects: 45% (951/2112)
remote: Compressing objects: 46% (972/2112)
remote: Compressing objects: 47% (993/2112)
remote: Compressing objects: 48% (1014/2112)
remote: Compressing objects: 49% (1035/2112)
remote: Compressing objects: 50% (1056/2112)
remote: Compressing objects: 51% (1078/2112)
remote: Compressing objects: 52% (1099/2112)
remote: Compressing objects: 53% (1120/2112)
remote: Compressing objects: 54% (1141/2112)
remote: Compressing objects: 55% (1162/2112)
remote: Compressing objects: 56% (1183/2112)
remote: Compressing objects: 57% (1204/2112)
remote: Compressing objects: 58% (1225/2112)
remote: Compressing objects: 59% (1247/2112)
remote: Compressing objects: 60% (1268/2112)
remote: Compressing objects: 61% (1289/2112)
remote: Compressing objects: 62% (1310/2112)
remote: Compressing objects: 63% (1331/2112)
remote: Compressing objects: 64% (1352/2112)
remote: Compressing objects: 65% (1373/2112)
remote: Compressing objects: 66% (1394/2112)
remote: Compressing objects: 67% (1416/2112)
remote: Compressing objects: 68% (1437/2112)
remote: Compressing objects: 69% (1458/2112)
remote: Compressing objects: 70% (1479/2112)
remote: Compressing objects: 71% (1500/2112)
remote: Compressing objects: 72% (1521/2112)
remote: Compressing objects: 73% (1542/2112)
remote: Compressing objects: 74% (1563/2112)
remote: Compressing objects: 75% (1584/2112)
remote: Compressing objects: 76% (1606/2112)
remote: Compressing objects: 77% (1627/2112)
remote: Compressing objects: 78% (1648/2112)
remote: Compressing objects: 79% (1669/2112)
remote: Compressing objects: 80% (1690/2112)
remote: Compressing objects: 81% (1711/2112)
remote: Compressing objects: 82% (1732/2112)
remote: Compressing objects: 83% (1753/2112)
remote: Compressing objects: 84% (1775/2112)
remote: Compressing objects: 85% (1796/2112)
remote: Compressing objects: 86% (1817/2112)
remote: Compressing objects: 87% (1838/2112)
remote: Compressing objects: 88% (1859/2112)
remote: Compressing objects: 89% (1880/2112)
remote: Compressing objects: 90% (1901/2112)
remote: Compressing objects: 91% (1922/2112)
remote: Compressing objects: 92% (1944/2112)
remote: Compressing objects: 93% (1965/2112)
remote: Compressing objects: 94% (1986/2112)
remote: Compressing objects: 95% (2007/2112)
remote: Compressing objects: 96% (2028/2112)
remote: Compressing objects: 97% (2049/2112)
remote: Compressing objects: 98% (2070/2112)
remote: Compressing objects: 99% (2091/2112)
remote: Compressing objects: 100% (2112/2112)
remote: Compressing objects: 100% (2112/2112), done.
7.30 s
Receiving objects: 0% (1/66333)
Receiving objects: 1% (664/66333)
Receiving objects: 2% (1327/66333)
Receiving objects: 3% (1990/66333)
Receiving objects: 4% (2654/66333)
Receiving objects: 5% (3317/66333)
Receiving objects: 6% (3980/66333)
Receiving objects: 7% (4644/66333)
Receiving objects: 8% (5307/66333), 9.11 MiB | 18.19 MiB/s
Receiving objects: 9% (5970/66333), 9.11 MiB | 18.19 MiB/s
Receiving objects: 10% (6634/66333), 9.11 MiB | 18.19 MiB/s
Receiving objects: 11% (7297/66333), 9.11 MiB | 18.19 MiB/s
Receiving objects: 12% (7960/66333), 9.11 MiB | 18.19 MiB/s
Receiving objects: 13% (8624/66333), 9.11 MiB | 18.19 MiB/s
Receiving objects: 14% (9287/66333), 9.11 MiB | 18.19 MiB/s
Receiving objects: 15% (9950/66333), 9.11 MiB | 18.19 MiB/s
Receiving objects: 16% (10614/66333), 9.11 MiB | 18.19 MiB/s
Receiving objects: 17% (11277/66333), 9.11 MiB | 18.19 MiB/s
Receiving objects: 18% (11940/66333), 9.11 MiB | 18.19 MiB/s
Receiving objects: 19% (12604/66333), 9.11 MiB | 18.19 MiB/s
Receiving objects: 20% (13267/66333), 9.11 MiB | 18.19 MiB/s
Receiving objects: 21% (13930/66333), 9.11 MiB | 18.19 MiB/s
Receiving objects: 22% (14594/66333), 9.11 MiB | 18.19 MiB/s
Receiving objects: 23% (15257/66333), 9.11 MiB | 18.19 MiB/s
Receiving objects: 24% (15920/66333), 9.11 MiB | 18.19 MiB/s
Receiving objects: 25% (16584/66333), 9.11 MiB | 18.19 MiB/s
Receiving objects: 26% (17247/66333), 9.11 MiB | 18.19 MiB/s
Receiving objects: 27% (17910/66333), 9.11 MiB | 18.19 MiB/s
Receiving objects: 28% (18574/66333), 9.11 MiB | 18.19 MiB/s
Receiving objects: 29% (19237/66333), 9.11 MiB | 18.19 MiB/s
Receiving objects: 30% (19900/66333), 9.11 MiB | 18.19 MiB/s
Receiving objects: 31% (20564/66333), 9.11 MiB | 18.19 MiB/s
Receiving objects: 32% (21227/66333), 9.11 MiB | 18.19 MiB/s
Receiving objects: 33% (21890/66333), 9.11 MiB | 18.19 MiB/s
Receiving objects: 34% (22554/66333), 9.11 MiB | 18.19 MiB/s
Receiving objects: 34% (22681/66333), 23.81 MiB | 23.80 MiB/s
Receiving objects: 35% (23217/66333), 23.81 MiB | 23.80 MiB/s
Receiving objects: 36% (23880/66333), 23.81 MiB | 23.80 MiB/s
Receiving objects: 37% (24544/66333), 23.81 MiB | 23.80 MiB/s
Receiving objects: 38% (25207/66333), 23.81 MiB | 23.80 MiB/s
Receiving objects: 39% (25870/66333), 23.81 MiB | 23.80 MiB/s
Receiving objects: 40% (26534/66333), 23.81 MiB | 23.80 MiB/s
Receiving objects: 41% (27197/66333), 23.81 MiB | 23.80 MiB/s
Receiving objects: 42% (27860/66333), 23.81 MiB | 23.80 MiB/s
Receiving objects: 43% (28524/66333), 23.81 MiB | 23.80 MiB/s
Receiving objects: 44% (29187/66333), 23.81 MiB | 23.80 MiB/s
Receiving objects: 45% (29850/66333), 23.81 MiB | 23.80 MiB/s
Receiving objects: 46% (30514/66333), 23.81 MiB | 23.80 MiB/s
Receiving objects: 47% (31177/66333), 23.81 MiB | 23.80 MiB/s
Receiving objects: 48% (31840/66333), 23.81 MiB | 23.80 MiB/s
Receiving objects: 49% (32504/66333), 23.81 MiB | 23.80 MiB/s
Receiving objects: 50% (33167/66333), 23.81 MiB | 23.80 MiB/s
Receiving objects: 51% (33830/66333), 23.81 MiB | 23.80 MiB/s
Receiving objects: 52% (34494/66333), 23.81 MiB | 23.80 MiB/s
Receiving objects: 53% (35157/66333), 23.81 MiB | 23.80 MiB/s
Receiving objects: 54% (35820/66333), 23.81 MiB | 23.80 MiB/s
Receiving objects: 55% (36484/66333), 23.81 MiB | 23.80 MiB/s
Receiving objects: 56% (37147/66333), 23.81 MiB | 23.80 MiB/s
Receiving objects: 57% (37810/66333), 39.74 MiB | 26.38 MiB/s
Receiving objects: 58% (38474/66333), 39.74 MiB | 26.38 MiB/s
Receiving objects: 59% (39137/66333), 39.74 MiB | 26.38 MiB/s
Receiving objects: 60% (39800/66333), 39.74 MiB | 26.38 MiB/s
Receiving objects: 61% (40464/66333), 39.74 MiB | 26.38 MiB/s
Receiving objects: 62% (41127/66333), 39.74 MiB | 26.38 MiB/s
Receiving objects: 63% (41790/66333), 39.74 MiB | 26.38 MiB/s
Receiving objects: 64% (42454/66333), 39.74 MiB | 26.38 MiB/s
Receiving objects: 65% (43117/66333), 39.74 MiB | 26.38 MiB/s
Receiving objects: 66% (43780/66333), 39.74 MiB | 26.38 MiB/s
Receiving objects: 67% (44444/66333), 39.74 MiB | 26.38 MiB/s
Receiving objects: 68% (45107/66333), 39.74 MiB | 26.38 MiB/s
Receiving objects: 69% (45770/66333), 39.74 MiB | 26.38 MiB/s
Receiving objects: 69% (46433/66333), 39.74 MiB | 26.38 MiB/s
Receiving objects: 70% (46434/66333), 39.74 MiB | 26.38 MiB/s
Receiving objects: 71% (47097/66333), 55.87 MiB | 27.85 MiB/s
Receiving objects: 72% (47760/66333), 55.87 MiB | 27.85 MiB/s
Receiving objects: 73% (48424/66333), 55.87 MiB | 27.85 MiB/s
Receiving objects: 74% (49087/66333), 55.87 MiB | 27.85 MiB/s
Receiving objects: 75% (49750/66333), 55.87 MiB | 27.85 MiB/s
Receiving objects: 76% (50414/66333), 55.87 MiB | 27.85 MiB/s
Receiving objects: 77% (51077/66333), 55.87 MiB | 27.85 MiB/s
Receiving objects: 78% (51740/66333), 72.28 MiB | 28.84 MiB/s
Receiving objects: 79% (52404/66333), 72.28 MiB | 28.84 MiB/s
Receiving objects: 80% (53067/66333), 72.28 MiB | 28.84 MiB/s
Receiving objects: 81% (53730/66333), 72.28 MiB | 28.84 MiB/s
Receiving objects: 82% (54394/66333), 72.28 MiB | 28.84 MiB/s
Receiving objects: 83% (55057/66333), 72.28 MiB | 28.84 MiB/s
Receiving objects: 84% (55720/66333), 72.28 MiB | 28.84 MiB/s
Receiving objects: 85% (56384/66333), 72.28 MiB | 28.84 MiB/s
Receiving objects: 86% (57047/66333), 72.28 MiB | 28.84 MiB/s
Receiving objects: 87% (57710/66333), 72.28 MiB | 28.84 MiB/s
Receiving objects: 88% (58374/66333), 72.28 MiB | 28.84 MiB/s
Receiving objects: 89% (59037/66333), 72.28 MiB | 28.84 MiB/s
Receiving objects: 90% (59700/66333), 72.28 MiB | 28.84 MiB/s
Receiving objects: 91% (60364/66333), 72.28 MiB | 28.84 MiB/s
Receiving objects: 92% (61027/66333), 72.28 MiB | 28.84 MiB/s
Receiving objects: 93% (61690/66333), 72.28 MiB | 28.84 MiB/s
Receiving objects: 94% (62354/66333), 72.28 MiB | 28.84 MiB/s
Receiving objects: 95% (63017/66333), 72.28 MiB | 28.84 MiB/s
Receiving objects: 96% (63680/66333), 72.28 MiB | 28.84 MiB/s
Receiving objects: 97% (64344/66333), 72.28 MiB | 28.84 MiB/s
Receiving objects: 98% (65007/66333), 72.28 MiB | 28.84 MiB/s
Receiving objects: 98% (65203/66333), 72.28 MiB | 28.84 MiB/s
Receiving objects: 99% (65670/66333), 88.73 MiB | 29.52 MiB/s
remote: Total 66333 (delta 7286), reused 7252 (delta 6608), pack-reused 57328 (from 1)
7.32 s
Receiving objects: 100% (66333/66333), 88.73 MiB | 29.52 MiB/s
Receiving objects: 100% (66333/66333), 98.63 MiB | 29.64 MiB/s, done.
8.06 s
Resolving deltas: 0% (0/46383)
Resolving deltas: 1% (464/46383)
Resolving deltas: 2% (928/46383)
Resolving deltas: 3% (1392/46383)
Resolving deltas: 4% (1856/46383)
Resolving deltas: 5% (2320/46383)
Resolving deltas: 6% (2783/46383)
Resolving deltas: 7% (3247/46383)
Resolving deltas: 8% (3711/46383)
Resolving deltas: 9% (4175/46383)
Resolving deltas: 10% (4639/46383)
Resolving deltas: 11% (5103/46383)
Resolving deltas: 12% (5566/46383)
Resolving deltas: 13% (6030/46383)
Resolving deltas: 14% (6494/46383)
Resolving deltas: 15% (6958/46383)
Resolving deltas: 16% (7422/46383)
Resolving deltas: 17% (7886/46383)
Resolving deltas: 18% (8349/46383)
Resolving deltas: 19% (8814/46383)
Resolving deltas: 20% (9277/46383)
Resolving deltas: 21% (9741/46383)
Resolving deltas: 22% (10205/46383)
Resolving deltas: 23% (10673/46383)
Resolving deltas: 24% (11132/46383)
Resolving deltas: 25% (11596/46383)
Resolving deltas: 26% (12060/46383)
Resolving deltas: 27% (12524/46383)
Resolving deltas: 28% (12988/46383)
Resolving deltas: 29% (13453/46383)
Resolving deltas: 30% (13915/46383)
Resolving deltas: 31% (14379/46383)
Resolving deltas: 32% (14843/46383)
Resolving deltas: 33% (15307/46383)
Resolving deltas: 34% (15772/46383)
Resolving deltas: 35% (16235/46383)
Resolving deltas: 36% (16698/46383)
Resolving deltas: 37% (17162/46383)
Resolving deltas: 38% (17626/46383)
Resolving deltas: 39% (18090/46383)
Resolving deltas: 40% (18554/46383)
Resolving deltas: 41% (19018/46383)
Resolving deltas: 42% (19481/46383)
Resolving deltas: 43% (19945/46383)
Resolving deltas: 44% (20409/46383)
Resolving deltas: 45% (20874/46383)
Resolving deltas: 46% (21337/46383)
Resolving deltas: 47% (21801/46383)
Resolving deltas: 48% (22264/46383)
Resolving deltas: 49% (22728/46383)
Resolving deltas: 50% (23192/46383)
Resolving deltas: 51% (23656/46383)
Resolving deltas: 52% (24120/46383)
Resolving deltas: 53% (24583/46383)
Resolving deltas: 54% (25047/46383)
Resolving deltas: 55% (25512/46383)
Resolving deltas: 56% (25975/46383)
Resolving deltas: 57% (26439/46383)
Resolving deltas: 58% (26903/46383)
Resolving deltas: 59% (27366/46383)
Resolving deltas: 60% (27830/46383)
Resolving deltas: 61% (28294/46383)
Resolving deltas: 62% (28758/46383)
Resolving deltas: 63% (29222/46383)
Resolving deltas: 64% (29686/46383)
Resolving deltas: 65% (30149/46383)
Resolving deltas: 66% (30613/46383)
Resolving deltas: 67% (31077/46383)
Resolving deltas: 68% (31541/46383)
Resolving deltas: 69% (32005/46383)
Resolving deltas: 70% (32469/46383)
Resolving deltas: 71% (32932/46383)
Resolving deltas: 72% (33398/46383)
Resolving deltas: 73% (33863/46383)
Resolving deltas: 74% (34324/46383)
Resolving deltas: 75% (34788/46383)
Resolving deltas: 76% (35252/46383)
Resolving deltas: 77% (35716/46383)
Resolving deltas: 78% (36181/46383)
Resolving deltas: 79% (36643/46383)
Resolving deltas: 80% (37107/46383)
Resolving deltas: 81% (37571/46383)
Resolving deltas: 82% (38035/46383)
Resolving deltas: 83% (38498/46383)
Resolving deltas: 84% (38962/46383)
Resolving deltas: 85% (39426/46383)
Resolving deltas: 86% (39891/46383)
Resolving deltas: 87% (40354/46383)
Resolving deltas: 88% (40818/46383)
Resolving deltas: 89% (41281/46383)
Resolving deltas: 90% (41747/46383)
Resolving deltas: 91% (42209/46383)
Resolving deltas: 92% (42674/46383)
Resolving deltas: 93% (43138/46383)
Resolving deltas: 94% (43601/46383)
Resolving deltas: 95% (44066/46383)
Resolving deltas: 96% (44528/46383)
Resolving deltas: 97% (44992/46383)
Resolving deltas: 98% (45456/46383)
Resolving deltas: 99% (45920/46383)
Resolving deltas: 100% (46383/46383)
Resolving deltas: 100% (46383/46383), done.
8.39 s
Fetching commit 21b5487d2e568713832af8be542a7570e3bff6a6 for docs ...
8.39 s
$ /nix/store/bcnisk3ydfgv26v2gw3zlky24g00yww2-git-2.54.0/bin/git fetch origin 21b5487d2e568713832af8be542a7570e3bff6a6
8.86 s
From https://github.com/alphal00p/gammaloop
8.86 s
* branch 21b5487d2e568713832af8be542a7570e3bff6a6 -> FETCH_HEAD
8.87 s
$ /nix/store/9ypz3flqsrl5xl495mm8h645gadjsxi1-coreutils-9.11/bin/timeout --kill-after=15s 7200s /nix/store/bcnisk3ydfgv26v2gw3zlky24g00yww2-git-2.54.0/bin/git -c advice.detachedHead=false checkout 21b5487d2e568713832af8be542a7570e3bff6a6
9.08 s
HEAD is now at 21b5487d2 fix nix develop error
9.08 s
$ /nix/store/9ypz3flqsrl5xl495mm8h645gadjsxi1-coreutils-9.11/bin/timeout --kill-after=15s 7200s /nix/store/23zk8sgzamrbmj1fday15szf7f2279s8-nix-2.34.7/bin/nix --extra-experimental-features nix-command --extra-experimental-features flakes --log-format internal-json run .#packages.x86_64-linux.nix-ci-check-gammaloop-doctest --print-build-logs
9.31 s
stdenv.isDarwin is deprecated, use stdenv.hostPlatform.isDarwin instead
11.45 s
12.05 s
evaluating derivation 'gevaluation warning: stdenv.isDarwin is deprecated, use stdenv.hostPlatform.isDarwin instead
13.83 s
copying '/nix/store/rdcn
[0 /1 built]
[1 /0 /1 built]
[1 /0 /1 built] building g gammaloop-workspace-doctest> Running phase: unpackPhase
13.84 s
gammaloop-workspace-doctest> unpacking source archive /nix/store/5afz06g4vsphrihpxicbxvm3sk5psnll-source
14.14 s
gammaloop-workspace-doctest> source root is source
14.17 s
gammaloop-workspace-doctest> Running phase: patchPhase
14.18 s
gammaloop-workspace-doctest> Executing configureCargoCommonVars
14.18 s
gammaloop-workspace-doctest> decompressing cargo artifacts from /nix/store/72wdcnp633ang33qg6wvb90brvf1679y-gammaloop-workspace-deps-deps-0.1.0/target.tar.zst to target
15.78 s
gammaloop-workspace-doctest> Running phase: updateAutotoolsGnuConfigScriptsPhase
15.82 s
gammaloop-workspace-doctest> Running phase: configurePhase
15.82 s
gammaloop-workspace-doctest> will append /build/source/.cargo-home/config.toml with contents of /nix/store/29aa708jkn8wd8vjwja1a5gh8k8wpi2b-vendor-cargo-deps/config.toml
15.83 s
gammaloop-workspace-doctest> default configurePhase, nothing to do
15.83 s
gammaloop-workspace-doctest> Running phase: buildPhase
15.83 s
gammaloop-workspace-doctest> +++ command cargo --version
15.84 s
gammaloop-workspace-doctest> cargo 1.98.0 (797e8a9bc 2026-08-05)
15.87 s
gammaloop-workspace-doctest> +++ command cargo test --profile ci-optim --doc --locked --workspace --features gammaloop-api/cli,gammaloop-tracing-filter/clap,gammaloop-tracing-filter/symbolica,idenso/bincode,idenso/reference-cases,linnet/bincode,linnet/drawing,linnet/nodestore-vec,linnet/rkyv,linnet/serde,linnet/symbolica,spenso-macros/shadowing,spenso/shadowing,symbolica/tracing_max_level_info
16.28 s
gammaloop-workspace-doctest> Compiling target-lexicon v0.13.5
16.29 s
gammaloop-workspace-doctest> Compiling symbolica v2.2.0 (https://github.com/symbolica-dev/symbolica?branch=dev#0441bd7a)
16.29 s
gammaloop-workspace-doctest> Compiling maplit v1.0.2
16.30 s
gammaloop-workspace-doctest> Compiling gammaloop-tracing-filter-macros v0.1.0 (/build/source/crates/gammaloop-tracing-filter-macros)
16.30 s
gammaloop-workspace-doctest> Compiling vakint v0.1.2 (/build/source/crates/vakint)
16.32 s
gammaloop-workspace-doctest> Compiling gammalooprs v0.3.4 (/build/source/crates/gammalooprs)
16.32 s
gammaloop-workspace-doctest> Compiling alphal00p-docs-macros v0.1.0 (/build/source/crates/alphal00p-docs-macros)
16.33 s
gammaloop-workspace-doctest> Compiling alphal00p-docs-schema v0.1.0 (/build/source/crates/alphal00p-docs-schema)
16.33 s
gammaloop-workspace-doctest> Compiling rustc_version v0.4.1
16.34 s
gammaloop-workspace-doctest> Compiling bincode v1.3.3
16.34 s
gammaloop-workspace-doctest> Compiling gungraun-runner v0.18.2
16.34 s
gammaloop-workspace-doctest> Compiling target-triple v1.0.1
16.34 s
gammaloop-workspace-doctest> Compiling iai-callgrind-runner v0.14.2
16.35 s
gammaloop-workspace-doctest> Compiling gammaloop-integration-tests v0.1.0 (/build/source/tests)
16.36 s
gammaloop-workspace-doctest> Compiling test-log-core v0.2.20
16.54 s
gammaloop-workspace-doctest> Compiling wait-timeout v0.2.1
16.57 s
gammaloop-workspace-doctest> Compiling bit-vec v0.8.0
16.58 s
gammaloop-workspace-doctest> Compiling iai-callgrind v0.14.2
16.58 s
gammaloop-workspace-doctest> Compiling quick-error v1.2.3
16.75 s
gammaloop-workspace-doctest> Compiling bit-set v0.8.0
16.75 s
gammaloop-workspace-doctest> Compiling rusty-fork v0.3.1
16.78 s
gammaloop-workspace-doctest> Compiling iai-callgrind-macros v0.5.1
16.80 s
gammaloop-workspace-doctest> Compiling rand_xorshift v0.4.0
16.81 s
gammaloop-workspace-doctest> Compiling console v0.15.11
16.87 s
gammaloop-workspace-doctest> Compiling termcolor v1.4.1
16.88 s
gammaloop-workspace-doctest> Compiling base64 v0.21.7
16.97 s
gammaloop-workspace-doctest> Compiling gungraun-macros v0.8.0
16.98 s
gammaloop-workspace-doctest> Compiling unarray v0.1.4
17.07 s
gammaloop-workspace-doctest> Compiling glob v0.3.4
17.27 s
gammaloop-workspace-doctest> Compiling alphal00p-docs-builder v0.1.0 (/build/source/crates/alphal00p-docs-builder)
17.29 s
gammaloop-workspace-doctest> Compiling similar-asserts v1.7.0
17.38 s
gammaloop-workspace-doctest> Compiling trybuild v1.0.120
17.67 s
gammaloop-workspace-doctest> Compiling alphal00p-docs-catalogs v0.1.0 (/build/source/crates/alphal00p-docs-catalogs)
17.71 s
gammaloop-workspace-doctest> Compiling ron v0.8.1
17.78 s
gammaloop-workspace-doctest> Compiling proptest v1.11.0
17.90 s
gammaloop-workspace-doctest> Compiling pyo3-build-config v0.28.3
17.90 s
gammaloop-workspace-doctest> Compiling kurvst v0.1.0 (/build/source/crates/kurvst)
18.04 s
gammaloop-workspace-doctest> Compiling test-log-macros v0.2.20
19.44 s
gammaloop-workspace-doctest> Compiling test-log v0.2.20
20.96 s
gammaloop-workspace-doctest> Compiling alphal00p-docs-examples v0.1.0 (/build/source/crates/alphal00p-docs-examples)
23.31 s
gammaloop-workspace-doctest> Compiling pyo3-ffi v0.28.3
23.41 s
gammaloop-workspace-doctest> Compiling pyo3-macros-backend v0.28.3
23.79 s
gammaloop-workspace-doctest> Compiling pyo3 v0.28.3
24.02 s
gammaloop-workspace-doctest> Compiling numpy v0.28.0
24.34 s
gammaloop-workspace-doctest> Compiling gammaloop-api v0.1.0 (/build/source/crates/gammaloop-api)
24.55 s
gammaloop-workspace-doctest> Compiling gungraun v0.18.2
36.37 s
gammaloop-workspace-doctest> Compiling pyo3-macros v0.28.3
43.72 s
gammaloop-workspace-doctest> Compiling pyo3-stub-gen v0.17.2
44.55 s
gammaloop-workspace-doctest> Compiling numerica v2.2.0 (https://github.com/symbolica-dev/symbolica?branch=dev#0441bd7a)
47.22 s
gammaloop-workspace-doctest> Compiling graphica v2.1.0 (https://github.com/symbolica-dev/symbolica?branch=dev#0441bd7a)
50.37 s
gammaloop-workspace-doctest> Compiling symbolica-utils v0.1.0 (/build/source/crates/symbolica-utils)
245.38 s
gammaloop-workspace-doctest> Compiling gammaloop-workspace-hack v0.1.0 (/build/source/crates/gammaloop-workspace-hack)
245.39 s
gammaloop-workspace-doctest> Compiling spenso-macros v0.3.2 (/build/source/crates/spenso-macros)
245.68 s
gammaloop-workspace-doctest> Compiling linnet v0.17.0 (/build/source/crates/linnet)
250.59 s
gammaloop-workspace-doctest> Compiling spenso v0.6.0 (/build/source/crates/spenso)
262.14 s
gammaloop-workspace-doctest> Compiling idenso v0.3.0 (/build/source/crates/idenso)
262.15 s
gammaloop-workspace-doctest> Compiling gammaloop-tracing-filter v0.1.0 (/build/source/crates/gammaloop-tracing-filter)
270.57 s
gammaloop-workspace-doctest> Compiling spenso-hep-lib v0.1.7 (/build/source/crates/spenso-hep-lib)
271.10 s
gammaloop-workspace-doctest> Compiling spynso3 v0.1.2 (/build/source/crates/spynso3)
359.35 s
gammaloop-workspace-doctest> Compiling linnest v0.1.0 (/build/source/crates/linnest)
359.36 s
gammaloop-workspace-doctest> Compiling linnet-py v0.1.0 (/build/source/crates/linnet-py)
567.23 s
gammaloop-workspace-doctest> Finished `ci-optim` profile [optimized] target(s) in 9m 11s
567.54 s
gammaloop-workspace-doctest> warning : the following packages contain code that will be rejected by a future version of Rust: proc-macro-error2 v2.0.1
567.54 s
gammaloop-workspace-doctest> note : to see what the problems were, use the option `--future-incompat-report`, or run `cargo report future-incompatibilities --id 1`
567.63 s
gammaloop-workspace-doctest> Doc-tests alphal00p_docs_builder
568.17 s
gammaloop-workspace-doctest>
568.17 s
gammaloop-workspace-doctest> running 0 tests
568.18 s
gammaloop-workspace-doctest>
568.18 s
gammaloop-workspace-doctest> test result: ok. 0 passed; 0 failed; 0 ignored; 0 measured; 0 filtered out; finished in 0.00s
568.18 s
gammaloop-workspace-doctest>
568.18 s
gammaloop-workspace-doctest> Doc-tests alphal00p_docs_catalogs
570.72 s
gammaloop-workspace-doctest>
570.72 s
gammaloop-workspace-doctest> running 0 tests
570.72 s
gammaloop-workspace-doctest>
570.72 s
gammaloop-workspace-doctest> test result: ok. 0 passed; 0 failed; 0 ignored; 0 measured; 0 filtered out; finished in 0.00s
570.72 s
gammaloop-workspace-doctest>
570.72 s
gammaloop-workspace-doctest> Doc-tests alphal00p_docs_examples
570.76 s
gammaloop-workspace-doctest>
570.76 s
gammaloop-workspace-doctest> running 0 tests
570.76 s
gammaloop-workspace-doctest>
570.76 s
gammaloop-workspace-doctest> test result: ok. 0 passed; 0 failed; 0 ignored; 0 measured; 0 filtered out; finished in 0.00s
570.76 s
gammaloop-workspace-doctest>
570.77 s
gammaloop-workspace-doctest> Doc-tests alphal00p_docs
570.91 s
gammaloop-workspace-doctest>
570.91 s
gammaloop-workspace-doctest> running 0 tests
570.91 s
gammaloop-workspace-doctest>
570.91 s
gammaloop-workspace-doctest> test result: ok. 0 passed; 0 failed; 0 ignored; 0 measured; 0 filtered out; finished in 0.00s
570.91 s
gammaloop-workspace-doctest>
570.92 s
gammaloop-workspace-doctest> Doc-tests alphal00p_docs_schema
571.12 s
gammaloop-workspace-doctest>
571.12 s
gammaloop-workspace-doctest> running 0 tests
571.12 s
gammaloop-workspace-doctest>
571.12 s
gammaloop-workspace-doctest> test result: ok. 0 passed; 0 failed; 0 ignored; 0 measured; 0 filtered out; finished in 0.00s
571.12 s
gammaloop-workspace-doctest>
571.12 s
gammaloop-workspace-doctest> Doc-tests gammaloop_api
573.23 s
gammaloop-workspace-doctest>
573.23 s
gammaloop-workspace-doctest> running 16 tests
573.26 s
gammaloop-workspace-doctest> test crates/gammaloop-api/src/python.rs - python::GammaLoopAPI::evaluate_sample (line 2967) ... FAILED
573.27 s
gammaloop-workspace-doctest> test crates/gammaloop-api/src/python.rs - python::GammaLoopAPI::evaluate_samples (line 3108) ... FAILED
573.28 s
gammaloop-workspace-doctest> test crates/gammaloop-api/src/python.rs - python::GammaLoopAPI::get_integrand_info (line 3585) ... FAILED
573.28 s
gammaloop-workspace-doctest> test crates/gammaloop-api/src/python.rs - python::GammaLoopAPI::get_integrand_settings (line 3647) ... FAILED
573.28 s
gammaloop-workspace-doctest> test crates/gammaloop-api/src/python.rs - python::PyHistogramAccumulator (line 871) ... FAILED
573.29 s
gammaloop-workspace-doctest> test crates/gammaloop-api/src/python.rs - python::GammaLoopAPI::get_active_command_blocks (line 3760) ... FAILED
573.29 s
gammaloop-workspace-doctest> test crates/gammaloop-api/src/python.rs - python::GammaLoopAPI::get_default_runtime_settings (line 3796) ... FAILED
573.46 s
gammaloop-workspace-doctest> test crates/gammaloop-api/src/python.rs - python::GammaLoopAPI::get_global_settings (line 3739) ... FAILED
573.49 s
gammaloop-workspace-doctest> test crates/gammaloop-api/src/python.rs - python::atom_to_dots (line 157) ... FAILED
573.49 s
gammaloop-workspace-doctest> test crates/gammaloop-api/src/python.rs - python::GammaLoopAPI::new_python (line 2834) ... FAILED
573.51 s
gammaloop-workspace-doctest> test crates/gammaloop-api/src/lib.rs - (line 18) - compile ... ok
573.54 s
gammaloop-workspace-doctest> test crates/gammaloop-api/src/python.rs - python::GammaLoopAPI::get_run_history (line 3711) ... FAILED
573.58 s
gammaloop-workspace-doctest> test crates/gammaloop-api/src/python.rs - python::GammaLoopAPI::run_command (line 3901) ... FAILED
573.62 s
gammaloop-workspace-doctest> test crates/gammaloop-api/src/python.rs - python::atom_to_canonical_string (line 128) ... FAILED
573.62 s
gammaloop-workspace-doctest> test crates/gammaloop-api/src/python.rs - python::evaluate_graph_overall_factor (line 95) ... FAILED
579.39 s
gammaloop-workspace-doctest> test crates/gammaloop-api/src/commands/evaluate_samples.rs - commands::evaluate_samples::EvaluateSamples (line 50) ... ok
579.40 s
gammaloop-workspace-doctest>
579.40 s
gammaloop-workspace-doctest> failures:
579.40 s
gammaloop-workspace-doctest>
579.40 s
gammaloop-workspace-doctest> ---- crates/gammaloop-api/src/python.rs - python::GammaLoopAPI::evaluate_sample (line 2967) stdout ----
579.40 s
gammaloop-workspace-doctest> error: expected one of `!` or `::`, found `pathlib`
579.40 s
gammaloop-workspace-doctest> --> crates/gammaloop-api/src/python.rs:2968:6
579.40 s
gammaloop-workspace-doctest> |
579.40 s
gammaloop-workspace-doctest> 2968 | from pathlib import Path
579.40 s
gammaloop-workspace-doctest> | ^^^^^^^ expected one of `!` or `::`
579.40 s
gammaloop-workspace-doctest>
579.40 s
gammaloop-workspace-doctest> error: aborting due to 1 previous error
579.40 s
gammaloop-workspace-doctest>
579.40 s
gammaloop-workspace-doctest> Couldn't compile the test.
579.40 s
gammaloop-workspace-doctest> ---- crates/gammaloop-api/src/python.rs - python::GammaLoopAPI::evaluate_samples (line 3108) stdout ----
579.40 s
gammaloop-workspace-doctest> error: expected one of `!` or `::`, found `pathlib`
579.40 s
gammaloop-workspace-doctest> --> crates/gammaloop-api/src/python.rs:3109:6
579.40 s
gammaloop-workspace-doctest> |
579.40 s
gammaloop-workspace-doctest> 3109 | from pathlib import Path
579.40 s
gammaloop-workspace-doctest> | ^^^^^^^ expected one of `!` or `::`
579.40 s
gammaloop-workspace-doctest>
579.40 s
gammaloop-workspace-doctest> error: aborting due to 1 previous error
579.40 s
gammaloop-workspace-doctest>
579.40 s
gammaloop-workspace-doctest> Couldn't compile the test.
579.40 s
gammaloop-workspace-doctest> ---- crates/gammaloop-api/src/python.rs - python::GammaLoopAPI::get_integrand_info (line 3585) stdout ----
579.40 s
gammaloop-workspace-doctest> error: expected one of `!` or `::`, found `pathlib`
579.40 s
gammaloop-workspace-doctest> --> crates/gammaloop-api/src/python.rs:3586:6
579.40 s
gammaloop-workspace-doctest> |
579.40 s
gammaloop-workspace-doctest> 3586 | from pathlib import Path
579.40 s
gammaloop-workspace-doctest> | ^^^^^^^ expected one of `!` or `::`
579.40 s
gammaloop-workspace-doctest>
579.40 s
gammaloop-workspace-doctest> error: aborting due to 1 previous error
579.40 s
gammaloop-workspace-doctest>
579.40 s
gammaloop-workspace-doctest> Couldn't compile the test.
579.40 s
gammaloop-workspace-doctest> ---- crates/gammaloop-api/src/python.rs - python::GammaLoopAPI::get_integrand_settings (line 3647) stdout ----
579.40 s
gammaloop-workspace-doctest> error: expected one of `!` or `::`, found `=`
579.40 s
gammaloop-workspace-doctest> --> crates/gammaloop-api/src/python.rs:3648:10
579.40 s
gammaloop-workspace-doctest> |
579.40 s
gammaloop-workspace-doctest> 3648 | settings = api.get_integrand_settings(process_id=0)
579.40 s
gammaloop-workspace-doctest> | ^ expected one of `!` or `::`
579.40 s
gammaloop-workspace-doctest>
579.40 s
gammaloop-workspace-doctest> error: aborting due to 1 previous error
579.40 s
gammaloop-workspace-doctest>
579.40 s
gammaloop-workspace-doctest> Couldn't compile the test.
579.40 s
gammaloop-workspace-doctest> ---- crates/gammaloop-api/src/python.rs - python::PyHistogramAccumulator (line 871) stdout ----
579.40 s
gammaloop-workspace-doctest> error: expected one of `!` or `::`, found `gammaloop`
579.40 s
gammaloop-workspace-doctest> --> crates/gammaloop-api/src/python.rs:872:6
579.40 s
gammaloop-workspace-doctest> |
579.40 s
gammaloop-workspace-doctest> 872 | from gammaloop import HistogramAccumulator
579.40 s
gammaloop-workspace-doctest> | ^^^^^^^^^ expected one of `!` or `::`
579.40 s
gammaloop-workspace-doctest>
579.40 s
gammaloop-workspace-doctest> error: aborting due to 1 previous error
579.40 s
gammaloop-workspace-doctest>
579.40 s
gammaloop-workspace-doctest> Couldn't compile the test.
579.40 s
gammaloop-workspace-doctest> ---- crates/gammaloop-api/src/python.rs - python::GammaLoopAPI::get_active_command_blocks (line 3760) stdout ----
579.40 s
gammaloop-workspace-doctest> error: expected item, found keyword `for`
579.40 s
gammaloop-workspace-doctest> --> crates/gammaloop-api/src/python.rs:3761:1
579.40 s
gammaloop-workspace-doctest> |
579.40 s
gammaloop-workspace-doctest> 3761 | for name, commands in api.get_active_command_blocks().items():
579.40 s
gammaloop-workspace-doctest> | ^^^ expected item
579.40 s
gammaloop-workspace-doctest> |
579.40 s
gammaloop-workspace-doctest> = note: for a full list of items that can appear in modules, see <https://doc.rust-lang.org/reference/items.html>
579.40 s
gammaloop-workspace-doctest>
579.40 s
gammaloop-workspace-doctest> error: aborting due to 1 previous error
579.40 s
gammaloop-workspace-doctest>
579.40 s
gammaloop-workspace-doctest> Couldn't compile the test.
579.40 s
gammaloop-workspace-doctest> ---- crates/gammaloop-api/src/python.rs - python::GammaLoopAPI::get_default_runtime_settings (line 3796) stdout ----
579.40 s
gammaloop-workspace-doctest> error: expected one of `!` or `::`, found `=`
579.40 s
gammaloop-workspace-doctest> --> crates/gammaloop-api/src/python.rs:3797:9
579.40 s
gammaloop-workspace-doctest> |
579.40 s
gammaloop-workspace-doctest> 3797 | runtime = api.get_default_runtime_settings()
579.40 s
gammaloop-workspace-doctest> | ^ expected one of `!` or `::`
579.40 s
gammaloop-workspace-doctest>
579.40 s
gammaloop-workspace-doctest> error: aborting due to 1 previous error
579.40 s
gammaloop-workspace-doctest>
579.40 s
gammaloop-workspace-doctest> Couldn't compile the test.
579.40 s
gammaloop-workspace-doctest> ---- crates/gammaloop-api/src/python.rs - python::GammaLoopAPI::get_global_settings (line 3739) stdout ----
579.40 s
gammaloop-workspace-doctest> error[E0425] : cannot find value `settings_toml` in this scope
579.40 s
gammaloop-workspace-doctest> --> crates/gammaloop-api/src/python.rs:3740:1
579.40 s
gammaloop-workspace-doctest> |
579.40 s
gammaloop-workspace-doctest> 3740 | settings_toml = api.get_global_settings()
579.40 s
gammaloop-workspace-doctest> | ^^^^^^^^^^^^^
579.40 s
gammaloop-workspace-doctest> |
579.40 s
gammaloop-workspace-doctest> help : you might have meant to introduce a new binding
579.40 s
gammaloop-workspace-doctest> |
579.40 s
gammaloop-workspace-doctest> 3740 | let settings_toml = api.get_global_settings()
579.40 s
gammaloop-workspace-doctest> | +++
579.40 s
gammaloop-workspace-doctest>
579.40 s
gammaloop-workspace-doctest> error[E0425] : cannot find value `api` in this scope
579.40 s
gammaloop-workspace-doctest> --> crates/gammaloop-api/src/python.rs:3740:17
579.40 s
gammaloop-workspace-doctest> |
579.40 s
gammaloop-workspace-doctest> 3740 | settings_toml = api.get_global_settings()
579.40 s
gammaloop-workspace-doctest> | ^^^ not found in this scope
579.40 s
gammaloop-workspace-doctest>
579.40 s
gammaloop-workspace-doctest> error : aborting due to 2 previous errors
579.40 s
gammaloop-workspace-doctest>
579.40 s
gammaloop-workspace-doctest> For more information about this error, try `rustc --explain E0425`.
579.40 s
gammaloop-workspace-doctest> Couldn't compile the test.
579.40 s
gammaloop-workspace-doctest> ---- crates/gammaloop-api/src/python.rs - python::atom_to_dots (line 157) stdout ----
579.40 s
gammaloop-workspace-doctest> error[E0425] : cannot find function `to_dots` in this scope
579.40 s
gammaloop-workspace-doctest> --> crates/gammaloop-api/src/python.rs:158:1
579.40 s
gammaloop-workspace-doctest> |
579.40 s
gammaloop-workspace-doctest> 158 | to_dots("p(mu) * q(mu)")
579.40 s
gammaloop-workspace-doctest> | ^^^^^^^ not found in this scope
579.40 s
gammaloop-workspace-doctest>
579.40 s
gammaloop-workspace-doctest> error : aborting due to 1 previous error
579.40 s
gammaloop-workspace-doctest>
579.40 s
gammaloop-workspace-doctest> For more information about this error, try `rustc --explain E0425`.
579.40 s
gammaloop-workspace-doctest> Couldn't compile the test.
579.40 s
gammaloop-workspace-doctest> ---- crates/gammaloop-api/src/python.rs - python::GammaLoopAPI::new_python (line 2834) stdout ----
579.40 s
gammaloop-workspace-doctest> error[E0425] : cannot find value `api` in this scope
579.40 s
gammaloop-workspace-doctest> --> crates/gammaloop-api/src/python.rs:2835:1
579.40 s
gammaloop-workspace-doctest> |
579.40 s
gammaloop-workspace-doctest> 2835 | api = GammaLoopAPI(state_folder="./state", read_only_state=True)
579.40 s
gammaloop-workspace-doctest> | ^^^
579.40 s
gammaloop-workspace-doctest> |
579.40 s
gammaloop-workspace-doctest> help : you might have meant to introduce a new binding
579.40 s
gammaloop-workspace-doctest> |
579.40 s
gammaloop-workspace-doctest> 2835 | let api = GammaLoopAPI(state_folder="./state", read_only_state=True)
579.40 s
gammaloop-workspace-doctest> | +++
579.40 s
gammaloop-workspace-doctest>
579.40 s
gammaloop-workspace-doctest> error[E0425] : cannot find value `state_folder` in this scope
579.40 s
gammaloop-workspace-doctest> --> crates/gammaloop-api/src/python.rs:2835:20
579.40 s
gammaloop-workspace-doctest> |
579.40 s
gammaloop-workspace-doctest> 2835 | api = GammaLoopAPI(state_folder="./state", read_only_state=True)
579.40 s
gammaloop-workspace-doctest> | ^^^^^^^^^^^^ not found in this scope
579.40 s
gammaloop-workspace-doctest>
579.40 s
gammaloop-workspace-doctest> error[E0425] : cannot find value `read_only_state` in this scope
579.40 s
gammaloop-workspace-doctest> --> crates/gammaloop-api/src/python.rs:2835:44
579.40 s
gammaloop-workspace-doctest> |
579.40 s
gammaloop-workspace-doctest> 2835 | api = GammaLoopAPI(state_folder="./state", read_only_state=True)
579.40 s
gammaloop-workspace-doctest> | ^^^^^^^^^^^^^^^ not found in this scope
579.40 s
gammaloop-workspace-doctest>
579.40 s
gammaloop-workspace-doctest> error[E0425] : cannot find value `True` in this scope
579.40 s
gammaloop-workspace-doctest> --> crates/gammaloop-api/src/python.rs:2835:60
579.40 s
gammaloop-workspace-doctest> |
579.40 s
gammaloop-workspace-doctest> 2835 | api = GammaLoopAPI(state_folder="./state", read_only_state=True)
579.40 s
gammaloop-workspace-doctest> | ^^^^ not found in this scope
579.40 s
gammaloop-workspace-doctest> |
579.40 s
gammaloop-workspace-doctest> help : you may want to use a bool value instead
579.40 s
gammaloop-workspace-doctest> |
579.40 s
gammaloop-workspace-doctest> 2835 - api = GammaLoopAPI(state_folder="./state", read_only_state=True )
579.40 s
gammaloop-workspace-doctest> 2835 + api = GammaLoopAPI(state_folder="./state", read_only_state=true )
579.40 s
gammaloop-workspace-doctest> |
579.40 s
gammaloop-workspace-doctest>
579.40 s
gammaloop-workspace-doctest> error[E0425] : cannot find function, tuple struct or tuple variant `GammaLoopAPI` in this scope
579.40 s
gammaloop-workspace-doctest> --> crates/gammaloop-api/src/python.rs:2835:7
579.40 s
gammaloop-workspace-doctest> |
579.40 s
gammaloop-workspace-doctest> 2835 | api = GammaLoopAPI(state_folder="./state", read_only_state=True)
579.40 s
gammaloop-workspace-doctest> | ^^^^^^^^^^^^ not found in this scope
579.40 s
gammaloop-workspace-doctest>
579.40 s
gammaloop-workspace-doctest> error : aborting due to 5 previous errors
579.40 s
gammaloop-workspace-doctest>
579.40 s
gammaloop-workspace-doctest> For more information about this error, try `rustc --explain E0425`.
579.40 s
gammaloop-workspace-doctest> Couldn't compile the test.
579.40 s
gammaloop-workspace-doctest> ---- crates/gammaloop-api/src/python.rs - python::GammaLoopAPI::get_run_history (line 3711) stdout ----
579.40 s
gammaloop-workspace-doctest> error[E0425] : cannot find value `run_card_toml` in this scope
579.40 s
gammaloop-workspace-doctest> --> crates/gammaloop-api/src/python.rs:3712:1
579.40 s
gammaloop-workspace-doctest> |
579.40 s
gammaloop-workspace-doctest> 3712 | run_card_toml = api.get_run_history()
579.40 s
gammaloop-workspace-doctest> | ^^^^^^^^^^^^^
579.40 s
gammaloop-workspace-doctest> |
579.40 s
gammaloop-workspace-doctest> help : you might have meant to introduce a new binding
579.40 s
gammaloop-workspace-doctest> |
579.40 s
gammaloop-workspace-doctest> 3712 | let run_card_toml = api.get_run_history()
579.40 s
gammaloop-workspace-doctest> | +++
579.40 s
gammaloop-workspace-doctest>
579.40 s
gammaloop-workspace-doctest> error[E0425] : cannot find value `api` in this scope
579.40 s
gammaloop-workspace-doctest> --> crates/gammaloop-api/src/python.rs:3712:17
579.40 s
gammaloop-workspace-doctest> |
579.40 s
gammaloop-workspace-doctest> 3712 | run_card_toml = api.get_run_history()
579.40 s
gammaloop-workspace-doctest> | ^^^ not found in this scope
579.40 s
gammaloop-workspace-doctest>
579.40 s
gammaloop-workspace-doctest> error : aborting due to 2 previous errors
579.40 s
gammaloop-workspace-doctest>
579.40 s
gammaloop-workspace-doctest> For more information about this error, try `rustc --explain E0425`.
579.40 s
gammaloop-workspace-doctest> Couldn't compile the test.
579.40 s
gammaloop-workspace-doctest> ---- crates/gammaloop-api/src/python.rs - python::GammaLoopAPI::run_command (line 3901) stdout ----
579.40 s
gammaloop-workspace-doctest> error[E0425] : cannot find value `api` in this scope
579.40 s
gammaloop-workspace-doctest> --> crates/gammaloop-api/src/python.rs:3902:1
579.40 s
gammaloop-workspace-doctest> |
579.40 s
gammaloop-workspace-doctest> 3902 | api.run("display processes")
579.40 s
gammaloop-workspace-doctest> | ^^^ not found in this scope
579.40 s
gammaloop-workspace-doctest>
579.40 s
gammaloop-workspace-doctest> error : aborting due to 1 previous error
579.40 s
gammaloop-workspace-doctest>
579.40 s
gammaloop-workspace-doctest> For more information about this error, try `rustc --explain E0425`.
579.40 s
gammaloop-workspace-doctest> Couldn't compile the test.
579.40 s
gammaloop-workspace-doctest> ---- crates/gammaloop-api/src/python.rs - python::atom_to_canonical_string (line 128) stdout ----
579.40 s
gammaloop-workspace-doctest> error[E0425] : cannot find function `atom_to_canonical_string` in this scope
579.40 s
gammaloop-workspace-doctest> --> crates/gammaloop-api/src/python.rs:129:1
579.40 s
gammaloop-workspace-doctest> |
579.40 s
gammaloop-workspace-doctest> 129 | atom_to_canonical_string("x + x")
579.40 s
gammaloop-workspace-doctest> | ^^^^^^^^^^^^^^^^^^^^^^^^ not found in this scope
579.40 s
gammaloop-workspace-doctest>
579.40 s
gammaloop-workspace-doctest> error : aborting due to 1 previous error
579.40 s
gammaloop-workspace-doctest>
579.40 s
gammaloop-workspace-doctest> For more information about this error, try `rustc --explain E0425`.
579.40 s
gammaloop-workspace-doctest> Couldn't compile the test.
579.40 s
gammaloop-workspace-doctest> ---- crates/gammaloop-api/src/python.rs - python::evaluate_graph_overall_factor (line 95) stdout ----
579.40 s
gammaloop-workspace-doctest> error[E0425] : cannot find function `evaluate_graph_overall_factor` in this scope
579.40 s
gammaloop-workspace-doctest> --> crates/gammaloop-api/src/python.rs:96:1
579.40 s
gammaloop-workspace-doctest> |
579.40 s
gammaloop-workspace-doctest> 96 | evaluate_graph_overall_factor(
579.40 s
gammaloop-workspace-doctest> | ^^^^^^^^^^^^^^^^^^^^^^^^^^^^^ not found in this scope
579.40 s
gammaloop-workspace-doctest>
579.40 s
gammaloop-workspace-doctest> error : aborting due to 1 previous error
579.40 s
gammaloop-workspace-doctest>
579.40 s
gammaloop-workspace-doctest> For more information about this error, try `rustc --explain E0425`.
579.40 s
gammaloop-workspace-doctest> Couldn't compile the test.
579.40 s
gammaloop-workspace-doctest>
579.40 s
gammaloop-workspace-doctest> failures:
579.40 s
gammaloop-workspace-doctest> crates/gammaloop-api/src/python.rs - python::GammaLoopAPI::evaluate_sample (line 2967)
579.40 s
gammaloop-workspace-doctest> crates/gammaloop-api/src/python.rs - python::GammaLoopAPI::evaluate_samples (line 3108)
579.40 s
gammaloop-workspace-doctest> crates/gammaloop-api/src/python.rs - python::GammaLoopAPI::get_active_command_blocks (line 3760)
579.40 s
gammaloop-workspace-doctest> crates/gammaloop-api/src/python.rs - python::GammaLoopAPI::get_default_runtime_settings (line 3796)
579.40 s
gammaloop-workspace-doctest> crates/gammaloop-api/src/python.rs - python::GammaLoopAPI::get_global_settings (line 3739)
579.40 s
gammaloop-workspace-doctest> crates/gammaloop-api/src/python.rs - python::GammaLoopAPI::get_integrand_info (line 3585)
579.40 s
gammaloop-workspace-doctest> crates/gammaloop-api/src/python.rs - python::GammaLoopAPI::get_integrand_settings (line 3647)
579.40 s
gammaloop-workspace-doctest> crates/gammaloop-api/src/python.rs - python::GammaLoopAPI::get_run_history (line 3711)
579.40 s
gammaloop-workspace-doctest> crates/gammaloop-api/src/python.rs - python::GammaLoopAPI::new_python (line 2834)
579.40 s
gammaloop-workspace-doctest> crates/gammaloop-api/src/python.rs - python::GammaLoopAPI::run_command (line 3901)
579.40 s
gammaloop-workspace-doctest> crates/gammaloop-api/src/python.rs - python::PyHistogramAccumulator (line 871)
579.40 s
gammaloop-workspace-doctest> crates/gammaloop-api/src/python.rs - python::atom_to_canonical_string (line 128)
579.40 s
gammaloop-workspace-doctest> crates/gammaloop-api/src/python.rs - python::atom_to_dots (line 157)
579.40 s
gammaloop-workspace-doctest> crates/gammaloop-api/src/python.rs - python::evaluate_graph_overall_factor (line 95)
579.40 s
gammaloop-workspace-doctest>
579.40 s
gammaloop-workspace-doctest> test result: FAILED. 2 passed; 14 failed; 0 ignored; 0 measured; 0 filtered out; finished in 6.16s
579.40 s
gammaloop-workspace-doctest>
579.40 s
gammaloop-workspace-doctest> error : doctest failed, to rerun pass `-p gammaloop-api --doc`
580.43 s
error: Cannot build '/nix/store/7sklrrqr33rrmr48m29bipvdyblkjnbd-gammaloop-workspace-doctest-0.1.0.drv '.
580.43 s
Reason: builder failed with exit code 101 .
580.43 s
Output paths:
580.43 s
/nix/store/7szg1bw742zdanb7cjwdrz3z00q4sq55-gammaloop-workspace-doctest-0.1.0
580.43 s
Last 356 log lines:
580.43 s
> Running phase: unpackPhase
580.43 s
> unpacking source archive /nix/store/5afz06g4vsphrihpxicbxvm3sk5psnll-source
580.43 s
> source root is source
580.43 s
> Running phase: patchPhase
580.43 s
> Executing configureCargoCommonVars
580.43 s
> decompressing cargo artifacts from /nix/store/72wdcnp633ang33qg6wvb90brvf1679y-gammaloop-workspace-deps-deps-0.1.0/target.tar.zst to target
580.43 s
> Running phase: updateAutotoolsGnuConfigScriptsPhase
580.43 s
> Running phase: configurePhase
580.43 s
> will append /build/source/.cargo-home/config.toml with contents of /nix/store/29aa708jkn8wd8vjwja1a5gh8k8wpi2b-vendor-cargo-deps/config.toml
580.43 s
> default configurePhase, nothing to do
580.43 s
> Running phase: buildPhase
580.43 s
> +++ command cargo --version
580.43 s
> cargo 1.98.0 (797e8a9bc 2026-08-05)
580.43 s
> +++ command cargo test --profile ci-optim --doc --locked --workspace --features gammaloop-api/cli,gammaloop-tracing-filter/clap,gammaloop-tracing-filter/symbolica,idenso/bincode,idenso/reference-cases,linnet/bincode,linnet/drawing,linnet/nodestore-vec,linnet/rkyv,linnet/serde,linnet/symbolica,spenso-macros/shadowing,spenso/shadowing,symbolica/tracing_max_level_info
580.43 s
> Compiling target-lexicon v0.13.5
580.43 s
> Compiling symbolica v2.2.0 (https://github.com/symbolica-dev/symbolica?branch=dev#0441bd7a)
580.43 s
> Compiling maplit v1.0.2
580.43 s
> Compiling gammaloop-tracing-filter-macros v0.1.0 (/build/source/crates/gammaloop-tracing-filter-macros)
580.43 s
> Compiling vakint v0.1.2 (/build/source/crates/vakint)
580.43 s
> Compiling gammalooprs v0.3.4 (/build/source/crates/gammalooprs)
580.43 s
> Compiling alphal00p-docs-macros v0.1.0 (/build/source/crates/alphal00p-docs-macros)
580.43 s
> Compiling alphal00p-docs-schema v0.1.0 (/build/source/crates/alphal00p-docs-schema)
580.43 s
> Compiling rustc_version v0.4.1
580.43 s
> Compiling bincode v1.3.3
580.43 s
> Compiling gungraun-runner v0.18.2
580.43 s
> Compiling target-triple v1.0.1
580.43 s
> Compiling iai-callgrind-runner v0.14.2
580.43 s
> Compiling gammaloop-integration-tests v0.1.0 (/build/source/tests)
580.43 s
> Compiling test-log-core v0.2.20
580.43 s
> Compiling wait-timeout v0.2.1
580.43 s
> Compiling bit-vec v0.8.0
580.43 s
> Compiling iai-callgrind v0.14.2
580.43 s
> Compiling quick-error v1.2.3
580.43 s
> Compiling bit-set v0.8.0
580.43 s
> Compiling rusty-fork v0.3.1
580.43 s
> Compiling iai-callgrind-macros v0.5.1
580.43 s
> Compiling rand_xorshift v0.4.0
580.43 s
> Compiling console v0.15.11
580.43 s
> Compiling termcolor v1.4.1
580.43 s
> Compiling base64 v0.21.7
580.43 s
> Compiling gungraun-macros v0.8.0
580.43 s
> Compiling unarray v0.1.4
580.43 s
> Compiling glob v0.3.4
580.43 s
> Compiling alphal00p-docs-builder v0.1.0 (/build/source/crates/alphal00p-docs-builder)
580.43 s
> Compiling similar-asserts v1.7.0
580.43 s
> Compiling trybuild v1.0.120
580.43 s
> Compiling alphal00p-docs-catalogs v0.1.0 (/build/source/crates/alphal00p-docs-catalogs)
580.43 s
> Compiling ron v0.8.1
580.43 s
> Compiling proptest v1.11.0
580.43 s
> Compiling pyo3-build-config v0.28.3
580.43 s
> Compiling kurvst v0.1.0 (/build/source/crates/kurvst)
580.43 s
> Compiling test-log-macros v0.2.20
580.43 s
> Compiling test-log v0.2.20
580.43 s
> Compiling alphal00p-docs-examples v0.1.0 (/build/source/crates/alphal00p-docs-examples)
580.43 s
> Compiling pyo3-ffi v0.28.3
580.43 s
> Compiling pyo3-macros-backend v0.28.3
580.43 s
> Compiling pyo3 v0.28.3
580.43 s
> Compiling numpy v0.28.0
580.43 s
> Compiling gammaloop-api v0.1.0 (/build/source/crates/gammaloop-api)
580.43 s
> Compiling gungraun v0.18.2
580.43 s
> Compiling pyo3-macros v0.28.3
580.43 s
> Compiling pyo3-stub-gen v0.17.2
580.43 s
> Compiling numerica v2.2.0 (https://github.com/symbolica-dev/symbolica?branch=dev#0441bd7a)
580.43 s
> Compiling graphica v2.1.0 (https://github.com/symbolica-dev/symbolica?branch=dev#0441bd7a)
580.43 s
> Compiling symbolica-utils v0.1.0 (/build/source/crates/symbolica-utils)
580.43 s
> Compiling gammaloop-workspace-hack v0.1.0 (/build/source/crates/gammaloop-workspace-hack)
580.43 s
> Compiling spenso-macros v0.3.2 (/build/source/crates/spenso-macros)
580.43 s
> Compiling linnet v0.17.0 (/build/source/crates/linnet)
580.43 s
> Compiling spenso v0.6.0 (/build/source/crates/spenso)
580.43 s
> Compiling idenso v0.3.0 (/build/source/crates/idenso)
580.43 s
> Compiling gammaloop-tracing-filter v0.1.0 (/build/source/crates/gammaloop-tracing-filter)
580.43 s
> Compiling spenso-hep-lib v0.1.7 (/build/source/crates/spenso-hep-lib)
580.43 s
> Compiling spynso3 v0.1.2 (/build/source/crates/spynso3)
580.43 s
> Compiling linnest v0.1.0 (/build/source/crates/linnest)
580.43 s
> Compiling linnet-py v0.1.0 (/build/source/crates/linnet-py)
580.43 s
> Finished `ci-optim` profile [optimized] target(s) in 9m 11s
580.43 s
> warning : the following packages contain code that will be rejected by a future version of Rust: proc-macro-error2 v2.0.1
580.43 s
> note : to see what the problems were, use the option `--future-incompat-report`, or run `cargo report future-incompatibilities --id 1`
580.43 s
> Doc-tests alphal00p_docs_builder
580.43 s
>
580.43 s
> running 0 tests
580.43 s
>
580.43 s
> test result: ok. 0 passed; 0 failed; 0 ignored; 0 measured; 0 filtered out; finished in 0.00s
580.43 s
>
580.43 s
> Doc-tests alphal00p_docs_catalogs
580.43 s
>
580.43 s
> running 0 tests
580.43 s
>
580.43 s
> test result: ok. 0 passed; 0 failed; 0 ignored; 0 measured; 0 filtered out; finished in 0.00s
580.43 s
>
580.43 s
> Doc-tests alphal00p_docs_examples
580.43 s
>
580.43 s
> running 0 tests
580.43 s
>
580.43 s
> test result: ok. 0 passed; 0 failed; 0 ignored; 0 measured; 0 filtered out; finished in 0.00s
580.43 s
>
580.43 s
> Doc-tests alphal00p_docs
580.43 s
>
580.43 s
> running 0 tests
580.43 s
>
580.43 s
> test result: ok. 0 passed; 0 failed; 0 ignored; 0 measured; 0 filtered out; finished in 0.00s
580.43 s
>
580.43 s
> Doc-tests alphal00p_docs_schema
580.43 s
>
580.43 s
> running 0 tests
580.43 s
>
580.43 s
> test result: ok. 0 passed; 0 failed; 0 ignored; 0 measured; 0 filtered out; finished in 0.00s
580.43 s
>
580.43 s
> Doc-tests gammaloop_api
580.43 s
>
580.43 s
> running 16 tests
580.43 s
> test crates/gammaloop-api/src/python.rs - python::GammaLoopAPI::evaluate_sample (line 2967) ... FAILED
580.43 s
> test crates/gammaloop-api/src/python.rs - python::GammaLoopAPI::evaluate_samples (line 3108) ... FAILED
580.43 s
> test crates/gammaloop-api/src/python.rs - python::GammaLoopAPI::get_integrand_info (line 3585) ... FAILED
580.43 s
> test crates/gammaloop-api/src/python.rs - python::GammaLoopAPI::get_integrand_settings (line 3647) ... FAILED
580.43 s
> test crates/gammaloop-api/src/python.rs - python::PyHistogramAccumulator (line 871) ... FAILED
580.43 s
> test crates/gammaloop-api/src/python.rs - python::GammaLoopAPI::get_active_command_blocks (line 3760) ... FAILED
580.43 s
> test crates/gammaloop-api/src/python.rs - python::GammaLoopAPI::get_default_runtime_settings (line 3796) ... FAILED
580.43 s
> test crates/gammaloop-api/src/python.rs - python::GammaLoopAPI::get_global_settings (line 3739) ... FAILED
580.43 s
> test crates/gammaloop-api/src/python.rs - python::atom_to_dots (line 157) ... FAILED
580.43 s
> test crates/gammaloop-api/src/python.rs - python::GammaLoopAPI::new_python (line 2834) ... FAILED
580.43 s
> test crates/gammaloop-api/src/lib.rs - (line 18) - compile ... ok
580.43 s
> test crates/gammaloop-api/src/python.rs - python::GammaLoopAPI::get_run_history (line 3711) ... FAILED
580.43 s
> test crates/gammaloop-api/src/python.rs - python::GammaLoopAPI::run_command (line 3901) ... FAILED
580.43 s
> test crates/gammaloop-api/src/python.rs - python::atom_to_canonical_string (line 128) ... FAILED
580.43 s
> test crates/gammaloop-api/src/python.rs - python::evaluate_graph_overall_factor (line 95) ... FAILED
580.43 s
> test crates/gammaloop-api/src/commands/evaluate_samples.rs - commands::evaluate_samples::EvaluateSamples (line 50) ... ok
580.43 s
>
580.43 s
> failures:
580.43 s
>
580.43 s
> ---- crates/gammaloop-api/src/python.rs - python::GammaLoopAPI::evaluate_sample (line 2967) stdout ----
580.43 s
> error: expected one of `!` or `::`, found `pathlib`
580.43 s
> --> crates/gammaloop-api/src/python.rs:2968:6
580.43 s
> |
580.43 s
> 2968 | from pathlib import Path
580.43 s
> | ^^^^^^^ expected one of `!` or `::`
580.43 s
>
580.43 s
> error: aborting due to 1 previous error
580.43 s
>
580.43 s
> Couldn't compile the test.
580.43 s
> ---- crates/gammaloop-api/src/python.rs - python::GammaLoopAPI::evaluate_samples (line 3108) stdout ----
580.43 s
> error: expected one of `!` or `::`, found `pathlib`
580.43 s
> --> crates/gammaloop-api/src/python.rs:3109:6
580.43 s
> |
580.43 s
> 3109 | from pathlib import Path
580.43 s
> | ^^^^^^^ expected one of `!` or `::`
580.43 s
>
580.43 s
> error: aborting due to 1 previous error
580.43 s
>
580.43 s
> Couldn't compile the test.
580.43 s
> ---- crates/gammaloop-api/src/python.rs - python::GammaLoopAPI::get_integrand_info (line 3585) stdout ----
580.43 s
> error: expected one of `!` or `::`, found `pathlib`
580.43 s
> --> crates/gammaloop-api/src/python.rs:3586:6
580.43 s
> |
580.43 s
> 3586 | from pathlib import Path
580.43 s
> | ^^^^^^^ expected one of `!` or `::`
580.43 s
>
580.43 s
> error: aborting due to 1 previous error
580.43 s
>
580.43 s
> Couldn't compile the test.
580.43 s
> ---- crates/gammaloop-api/src/python.rs - python::GammaLoopAPI::get_integrand_settings (line 3647) stdout ----
580.43 s
> error: expected one of `!` or `::`, found `=`
580.43 s
> --> crates/gammaloop-api/src/python.rs:3648:10
580.43 s
> |
580.43 s
> 3648 | settings = api.get_integrand_settings(process_id=0)
580.43 s
> | ^ expected one of `!` or `::`
580.43 s
>
580.43 s
> error: aborting due to 1 previous error
580.43 s
>
580.43 s
> Couldn't compile the test.
580.43 s
> ---- crates/gammaloop-api/src/python.rs - python::PyHistogramAccumulator (line 871) stdout ----
580.43 s
> error: expected one of `!` or `::`, found `gammaloop`
580.43 s
> --> crates/gammaloop-api/src/python.rs:872:6
580.43 s
> |
580.43 s
> 872 | from gammaloop import HistogramAccumulator
580.43 s
> | ^^^^^^^^^ expected one of `!` or `::`
580.43 s
>
580.43 s
> error: aborting due to 1 previous error
580.43 s
>
580.43 s
> Couldn't compile the test.
580.43 s
> ---- crates/gammaloop-api/src/python.rs - python::GammaLoopAPI::get_active_command_blocks (line 3760) stdout ----
580.43 s
> error: expected item, found keyword `for`
580.43 s
> --> crates/gammaloop-api/src/python.rs:3761:1
580.43 s
> |
580.43 s
> 3761 | for name, commands in api.get_active_command_blocks().items():
580.43 s
> | ^^^ expected item
580.43 s
> |
580.43 s
> = note: for a full list of items that can appear in modules, see <https://doc.rust-lang.org/reference/items.html>
580.43 s
>
580.43 s
> error: aborting due to 1 previous error
580.43 s
>
580.43 s
> Couldn't compile the test.
580.43 s
> ---- crates/gammaloop-api/src/python.rs - python::GammaLoopAPI::get_default_runtime_settings (line 3796) stdout ----
580.43 s
> error: expected one of `!` or `::`, found `=`
580.43 s
> --> crates/gammaloop-api/src/python.rs:3797:9
580.43 s
> |
580.43 s
> 3797 | runtime = api.get_default_runtime_settings()
580.43 s
> | ^ expected one of `!` or `::`
580.43 s
>
580.43 s
> error: aborting due to 1 previous error
580.43 s
>
580.43 s
> Couldn't compile the test.
580.43 s
> ---- crates/gammaloop-api/src/python.rs - python::GammaLoopAPI::get_global_settings (line 3739) stdout ----
580.43 s
> error[E0425] : cannot find value `settings_toml` in this scope
580.43 s
> --> crates/gammaloop-api/src/python.rs:3740:1
580.43 s
> |
580.43 s
> 3740 | settings_toml = api.get_global_settings()
580.43 s
> | ^^^^^^^^^^^^^
580.43 s
> |
580.43 s
> help : you might have meant to introduce a new binding
580.43 s
> |
580.43 s
> 3740 | let settings_toml = api.get_global_settings()
580.43 s
> | +++
580.43 s
>
580.43 s
> error[E0425] : cannot find value `api` in this scope
580.43 s
> --> crates/gammaloop-api/src/python.rs:3740:17
580.43 s
> |
580.43 s
> 3740 | settings_toml = api.get_global_settings()
580.43 s
> | ^^^ not found in this scope
580.43 s
>
580.43 s
> error : aborting due to 2 previous errors
580.43 s
>
580.43 s
> For more information about this error, try `rustc --explain E0425`.
580.43 s
> Couldn't compile the test.
580.43 s
> ---- crates/gammaloop-api/src/python.rs - python::atom_to_dots (line 157) stdout ----
580.43 s
> error[E0425] : cannot find function `to_dots` in this scope
580.43 s
> --> crates/gammaloop-api/src/python.rs:158:1
580.43 s
> |
580.43 s
> 158 | to_dots("p(mu) * q(mu)")
580.43 s
> | ^^^^^^^ not found in this scope
580.43 s
>
580.43 s
> error : aborting due to 1 previous error
580.43 s
>
580.43 s
> For more information about this error, try `rustc --explain E0425`.
580.43 s
> Couldn't compile the test.
580.43 s
> ---- crates/gammaloop-api/src/python.rs - python::GammaLoopAPI::new_python (line 2834) stdout ----
580.43 s
> error[E0425] : cannot find value `api` in this scope
580.43 s
> --> crates/gammaloop-api/src/python.rs:2835:1
580.43 s
> |
580.43 s
> 2835 | api = GammaLoopAPI(state_folder="./state", read_only_state=True)
580.43 s
> | ^^^
580.43 s
> |
580.43 s
> help : you might have meant to introduce a new binding
580.43 s
> |
580.43 s
> 2835 | let api = GammaLoopAPI(state_folder="./state", read_only_state=True)
580.43 s
> | +++
580.43 s
>
580.43 s
> error[E0425] : cannot find value `state_folder` in this scope
580.43 s
> --> crates/gammaloop-api/src/python.rs:2835:20
580.43 s
> |
580.43 s
> 2835 | api = GammaLoopAPI(state_folder="./state", read_only_state=True)
580.43 s
> | ^^^^^^^^^^^^ not found in this scope
580.43 s
>
580.43 s
> error[E0425] : cannot find value `read_only_state` in this scope
580.43 s
> --> crates/gammaloop-api/src/python.rs:2835:44
580.43 s
> |
580.43 s
> 2835 | api = GammaLoopAPI(state_folder="./state", read_only_state=True)
580.43 s
> | ^^^^^^^^^^^^^^^ not found in this scope
580.43 s
>
580.43 s
> error[E0425] : cannot find value `True` in this scope
580.43 s
> --> crates/gammaloop-api/src/python.rs:2835:60
580.43 s
> |
580.43 s
> 2835 | api = GammaLoopAPI(state_folder="./state", read_only_state=True)
580.43 s
> | ^^^^ not found in this scope
580.43 s
> |
580.43 s
> help : you may want to use a bool value instead
580.43 s
> |
580.43 s
> 2835 - api = GammaLoopAPI(state_folder="./state", read_only_state=True )
580.43 s
> 2835 + api = GammaLoopAPI(state_folder="./state", read_only_state=true )
580.43 s
> |
580.43 s
>
580.43 s
> error[E0425] : cannot find function, tuple struct or tuple variant `GammaLoopAPI` in this scope
580.43 s
> --> crates/gammaloop-api/src/python.rs:2835:7
580.43 s
> |
580.43 s
> 2835 | api = GammaLoopAPI(state_folder="./state", read_only_state=True)
580.43 s
> | ^^^^^^^^^^^^ not found in this scope
580.43 s
>
580.43 s
> error : aborting due to 5 previous errors
580.43 s
>
580.43 s
> For more information about this error, try `rustc --explain E0425`.
580.43 s
> Couldn't compile the test.
580.43 s
> ---- crates/gammaloop-api/src/python.rs - python::GammaLoopAPI::get_run_history (line 3711) stdout ----
580.43 s
> error[E0425] : cannot find value `run_card_toml` in this scope
580.43 s
> --> crates/gammaloop-api/src/python.rs:3712:1
580.43 s
> |
580.43 s
> 3712 | run_card_toml = api.get_run_history()
580.43 s
> | ^^^^^^^^^^^^^
580.43 s
> |
580.43 s
> help : you might have meant to introduce a new binding
580.43 s
> |
580.43 s
> 3712 | let run_card_toml = api.get_run_history()
580.43 s
> | +++
580.43 s
>
580.43 s
> error[E0425] : cannot find value `api` in this scope
580.43 s
> --> crates/gammaloop-api/src/python.rs:3712:17
580.43 s
> |
580.43 s
> 3712 | run_card_toml = api.get_run_history()
580.43 s
> | ^^^ not found in this scope
580.43 s
>
580.43 s
> error : aborting due to 2 previous errors
580.43 s
>
580.43 s
> For more information about this error, try `rustc --explain E0425`.
580.43 s
> Couldn't compile the test.
580.43 s
> ---- crates/gammaloop-api/src/python.rs - python::GammaLoopAPI::run_command (line 3901) stdout ----
580.43 s
> error[E0425] : cannot find value `api` in this scope
580.43 s
> --> crates/gammaloop-api/src/python.rs:3902:1
580.43 s
> |
580.43 s
> 3902 | api.run("display processes")
580.43 s
> | ^^^ not found in this scope
580.43 s
>
580.43 s
> error : aborting due to 1 previous error
580.43 s
>
580.43 s
> For more information about this error, try `rustc --explain E0425`.
580.43 s
> Couldn't compile the test.
580.43 s
> ---- crates/gammaloop-api/src/python.rs - python::atom_to_canonical_string (line 128) stdout ----
580.43 s
> error[E0425] : cannot find function `atom_to_canonical_string` in this scope
580.43 s
> --> crates/gammaloop-api/src/python.rs:129:1
580.43 s
> |
580.43 s
> 129 | atom_to_canonical_string("x + x")
580.43 s
> | ^^^^^^^^^^^^^^^^^^^^^^^^ not found in this scope
580.43 s
>
580.43 s
> error : aborting due to 1 previous error
580.43 s
>
580.43 s
> For more information about this error, try `rustc --explain E0425`.
580.43 s
> Couldn't compile the test.
580.43 s
> ---- crates/gammaloop-api/src/python.rs - python::evaluate_graph_overall_factor (line 95) stdout ----
580.43 s
> error[E0425] : cannot find function `evaluate_graph_overall_factor` in this scope
580.43 s
> --> crates/gammaloop-api/src/python.rs:96:1
580.43 s
> |
580.43 s
> 96 | evaluate_graph_overall_factor(
580.43 s
> | ^^^^^^^^^^^^^^^^^^^^^^^^^^^^^ not found in this scope
580.43 s
>
580.43 s
> error : aborting due to 1 previous error
580.43 s
>
580.43 s
> For more information about this error, try `rustc --explain E0425`.
580.43 s
> Couldn't compile the test.
580.43 s
>
580.43 s
> failures:
580.43 s
> crates/gammaloop-api/src/python.rs - python::GammaLoopAPI::evaluate_sample (line 2967)
580.43 s
> crates/gammaloop-api/src/python.rs - python::GammaLoopAPI::evaluate_samples (line 3108)
580.43 s
> crates/gammaloop-api/src/python.rs - python::GammaLoopAPI::get_active_command_blocks (line 3760)
580.43 s
> crates/gammaloop-api/src/python.rs - python::GammaLoopAPI::get_default_runtime_settings (line 3796)
580.43 s
> crates/gammaloop-api/src/python.rs - python::GammaLoopAPI::get_global_settings (line 3739)
580.43 s
> crates/gammaloop-api/src/python.rs - python::GammaLoopAPI::get_integrand_info (line 3585)
580.43 s
> crates/gammaloop-api/src/python.rs - python::GammaLoopAPI::get_integrand_settings (line 3647)
580.43 s
> crates/gammaloop-api/src/python.rs - python::GammaLoopAPI::get_run_history (line 3711)
580.43 s
> crates/gammaloop-api/src/python.rs - python::GammaLoopAPI::new_python (line 2834)
580.43 s
> crates/gammaloop-api/src/python.rs - python::GammaLoopAPI::run_command (line 3901)
580.43 s
> crates/gammaloop-api/src/python.rs - python::PyHistogramAccumulator (line 871)
580.43 s
> crates/gammaloop-api/src/python.rs - python::atom_to_canonical_string (line 128)
580.43 s
> crates/gammaloop-api/src/python.rs - python::atom_to_dots (line 157)
580.43 s
> crates/gammaloop-api/src/python.rs - python::evaluate_graph_overall_factor (line 95)
580.43 s
>
580.43 s
> test result: FAILED. 2 passed; 14 failed; 0 ignored; 0 measured; 0 filtered out; finished in 6.16s
580.43 s
>
580.43 s
> error : doctest failed, to rerun pass `-p gammaloop-api --doc`
580.43 s
For full logs, run:
580.43 s
nix log /nix/store/7sklrrqr33rrmr48m29bipvdyblkjnbd-gammaloop-workspace-doctest-0.1.0.drv
580.64 s
[0 built (1 failed )]Run failed.