test packages.x86_64-linux.nix-ci-check-gammaloop-nextest-python-api

Reproduce this run
Retry Run
  1. 65.32 s [gammaloop-nextest-binaries-python-api-gammaloop-integration-tests] + for f in *.d
  2. 65.32 s [gammaloop-nextest-binaries-python-api-gammaloop-integration-tests] ++ readlink libgammaloop_ci_test_binary_dependencies_c41dcf427a870814_host.d
  3. 65.32 s [gammaloop-nextest-binaries-python-api-gammaloop-integration-tests] + orig=
  4. 65.32 s [gammaloop-nextest-binaries-python-api-gammaloop-integration-tests] + [[ -n '' ]]
  5. 65.32 s [gammaloop-nextest-binaries-python-api-gammaloop-integration-tests] + continue
  6. 65.32 s [gammaloop-nextest-binaries-python-api-gammaloop-integration-tests] + for f in *.d
  7. 65.32 s [gammaloop-nextest-binaries-python-api-gammaloop-integration-tests] ++ readlink libgammaloop_ci_test_binary_dependencies_c41dcf427a870814_target_spenso_macros.d
  8. 65.33 s [gammaloop-nextest-binaries-python-api-gammaloop-integration-tests] + orig=
  9. 65.33 s [gammaloop-nextest-binaries-python-api-gammaloop-integration-tests] + [[ -n '' ]]
  10. 65.33 s [gammaloop-nextest-binaries-python-api-gammaloop-integration-tests] + continue
  11. 65.33 s [gammaloop-nextest-binaries-python-api-gammaloop-integration-tests] + for f in *.d
  12. 65.33 s [gammaloop-nextest-binaries-python-api-gammaloop-integration-tests] ++ readlink libgammaloop_ci_test_binary_dependencies_eceb99ce8a91d0e3.d
  13. 65.33 s [gammaloop-nextest-binaries-python-api-gammaloop-integration-tests] + orig=
  14. 65.33 s [gammaloop-nextest-binaries-python-api-gammaloop-integration-tests] + [[ -n '' ]]
  15. 65.33 s [gammaloop-nextest-binaries-python-api-gammaloop-integration-tests] + continue
  16. 65.33 s [gammaloop-nextest-binaries-python-api-gammaloop-integration-tests] + for f in *.d
  17. 65.33 s [gammaloop-nextest-binaries-python-api-gammaloop-integration-tests] ++ readlink libgammaloop_ci_test_binary_dependencies_edb22ac49f29b33b.d
  18. 65.33 s [gammaloop-nextest-binaries-python-api-gammaloop-integration-tests] + orig=
  19. 65.33 s [gammaloop-nextest-binaries-python-api-gammaloop-integration-tests] + [[ -n '' ]]
  20. 65.33 s [gammaloop-nextest-binaries-python-api-gammaloop-integration-tests] + continue
  21. 65.33 s [gammaloop-nextest-binaries-python-api-gammaloop-integration-tests] + for f in *.d
  22. 65.33 s [gammaloop-nextest-binaries-python-api-gammaloop-integration-tests] ++ readlink libgammaloop_ci_test_binary_dependencies_fe00c48b9b12af7f.d
  23. 65.33 s [gammaloop-nextest-binaries-python-api-gammaloop-integration-tests] + orig=
  24. 65.33 s [gammaloop-nextest-binaries-python-api-gammaloop-integration-tests] + [[ -n '' ]]
  25. 65.33 s [gammaloop-nextest-binaries-python-api-gammaloop-integration-tests] + continue
  26. 65.33 s [gammaloop-nextest-binaries-python-api-gammaloop-integration-tests] + for f in *.d
  27. 65.33 s [gammaloop-nextest-binaries-python-api-gammaloop-integration-tests] ++ readlink libgammaloop_ci_test_dependencies_0e21a2f3e307ff5a.d
  28. 65.33 s [gammaloop-nextest-binaries-python-api-gammaloop-integration-tests] + orig=
  29. 65.33 s [gammaloop-nextest-binaries-python-api-gammaloop-integration-tests] + [[ -n '' ]]
  30. 65.33 s [gammaloop-nextest-binaries-python-api-gammaloop-integration-tests] + continue
  31. 65.33 s [gammaloop-nextest-binaries-python-api-gammaloop-integration-tests] + for f in *.d
  32. 65.33 s [gammaloop-nextest-binaries-python-api-gammaloop-integration-tests] ++ readlink libgammaloop_ci_test_dependencies_205f69a77e78f974.d
  33. 65.33 s [gammaloop-nextest-binaries-python-api-gammaloop-integration-tests] + orig=
  34. 65.33 s [gammaloop-nextest-binaries-python-api-gammaloop-integration-tests] + [[ -n '' ]]
  35. 65.33 s [gammaloop-nextest-binaries-python-api-gammaloop-integration-tests] + continue
  36. 65.33 s [gammaloop-nextest-binaries-python-api-gammaloop-integration-tests] + for f in *.d
  37. 65.33 s [gammaloop-nextest-binaries-python-api-gammaloop-integration-tests] ++ readlink libgammaloop_ci_test_dependencies_2d15b14a2386a23f.d
  38. 65.33 s [gammaloop-nextest-binaries-python-api-gammaloop-integration-tests] + orig=
  39. 65.33 s [gammaloop-nextest-binaries-python-api-gammaloop-integration-tests] + [[ -n '' ]]
  40. 65.33 s [gammaloop-nextest-binaries-python-api-gammaloop-integration-tests] + continue
  41. 65.33 s [gammaloop-nextest-binaries-python-api-gammaloop-integration-tests] + for f in *.d
  42. 65.33 s [gammaloop-nextest-binaries-python-api-gammaloop-integration-tests] ++ readlink libgammaloop_ci_test_dependencies_3b75a4e0eb58af7b.d
  43. 65.33 s [gammaloop-nextest-binaries-python-api-gammaloop-integration-tests] + orig=
  44. 65.33 s [gammaloop-nextest-binaries-python-api-gammaloop-integration-tests] + [[ -n '' ]]
  45. 65.33 s [gammaloop-nextest-binaries-python-api-gammaloop-integration-tests] + continue
  46. 65.33 s [gammaloop-nextest-binaries-python-api-gammaloop-integration-tests] + for f in *.d
  47. 65.33 s [gammaloop-nextest-binaries-python-api-gammaloop-integration-tests] ++ readlink libgammaloop_ci_test_dependencies_b035b97e65aab5e2.d
  48. 65.34 s [gammaloop-nextest-binaries-python-api-gammaloop-integration-tests] + orig=
  49. 65.34 s [gammaloop-nextest-binaries-python-api-gammaloop-integration-tests] + [[ -n '' ]]
  50. 65.34 s [gammaloop-nextest-binaries-python-api-gammaloop-integration-tests] + continue
  51. 65.34 s [gammaloop-nextest-binaries-python-api-gammaloop-integration-tests] + for f in *.d
  52. 65.34 s [gammaloop-nextest-binaries-python-api-gammaloop-integration-tests] ++ readlink libgammaloop_ci_test_dependencies_b13cde5d74cccfd3.d
  53. 65.34 s [gammaloop-nextest-binaries-python-api-gammaloop-integration-tests] + orig=
  54. 65.34 s [gammaloop-nextest-binaries-python-api-gammaloop-integration-tests] + [[ -n '' ]]
  55. 65.34 s [gammaloop-nextest-binaries-python-api-gammaloop-integration-tests] + continue
  56. 65.34 s [gammaloop-nextest-binaries-python-api-gammaloop-integration-tests] + for f in *.d
  57. 65.34 s [gammaloop-nextest-binaries-python-api-gammaloop-integration-tests] ++ readlink libgammaloop_ci_test_dependencies_ba40fca986833aca.d
  58. 65.34 s [gammaloop-nextest-binaries-python-api-gammaloop-integration-tests] + orig=
  59. 65.34 s [gammaloop-nextest-binaries-python-api-gammaloop-integration-tests] + [[ -n '' ]]
  60. 65.34 s [gammaloop-nextest-binaries-python-api-gammaloop-integration-tests] + continue
  61. 65.34 s [gammaloop-nextest-binaries-python-api-gammaloop-integration-tests] + for f in *.d
  62. 65.34 s [gammaloop-nextest-binaries-python-api-gammaloop-integration-tests] ++ readlink libgammaloop_ci_test_dependencies_c41dcf427a870814.d
  63. 65.34 s [gammaloop-nextest-binaries-python-api-gammaloop-integration-tests] + orig=
  64. 65.34 s [gammaloop-nextest-binaries-python-api-gammaloop-integration-tests] + [[ -n '' ]]
  65. 65.34 s [gammaloop-nextest-binaries-python-api-gammaloop-integration-tests] + continue
  66. 65.34 s [gammaloop-nextest-binaries-python-api-gammaloop-integration-tests] + for f in *.d
  67. 65.34 s [gammaloop-nextest-binaries-python-api-gammaloop-integration-tests] ++ readlink libgammaloop_ci_test_dependencies_eceb99ce8a91d0e3.d
  68. 65.34 s [gammaloop-nextest-binaries-python-api-gammaloop-integration-tests] + orig=
  69. 65.34 s [gammaloop-nextest-binaries-python-api-gammaloop-integration-tests] + [[ -n '' ]]
  70. 65.34 s [gammaloop-nextest-binaries-python-api-gammaloop-integration-tests] + continue
  71. 65.34 s [gammaloop-nextest-binaries-python-api-gammaloop-integration-tests] + for f in *.d
  72. 65.34 s [gammaloop-nextest-binaries-python-api-gammaloop-integration-tests] ++ readlink libgammaloop_ci_test_dependencies_edb22ac49f29b33b.d
  73. 65.34 s [gammaloop-nextest-binaries-python-api-gammaloop-integration-tests] + orig=
  74. 65.34 s [gammaloop-nextest-binaries-python-api-gammaloop-integration-tests] + [[ -n '' ]]
  75. 65.34 s [gammaloop-nextest-binaries-python-api-gammaloop-integration-tests] + continue
  76. 65.34 s [gammaloop-nextest-binaries-python-api-gammaloop-integration-tests] + for f in *.d
  77. 65.34 s [gammaloop-nextest-binaries-python-api-gammaloop-integration-tests] ++ readlink libgammaloop_ci_test_dependencies_fe00c48b9b12af7f.d
  78. 65.34 s [gammaloop-nextest-binaries-python-api-gammaloop-integration-tests] + orig=
  79. 65.34 s [gammaloop-nextest-binaries-python-api-gammaloop-integration-tests] + [[ -n '' ]]
  80. 65.34 s [gammaloop-nextest-binaries-python-api-gammaloop-integration-tests] + continue
  81. 65.34 s [gammaloop-nextest-binaries-python-api-gammaloop-integration-tests] + for f in *.d
  82. 65.34 s [gammaloop-nextest-binaries-python-api-gammaloop-integration-tests] ++ readlink libgammaloop_integration_tests.d
  83. 65.34 s [gammaloop-nextest-binaries-python-api-gammaloop-integration-tests] + orig=
  84. 65.34 s [gammaloop-nextest-binaries-python-api-gammaloop-integration-tests] + [[ -n '' ]]
  85. 65.34 s [gammaloop-nextest-binaries-python-api-gammaloop-integration-tests] + continue
  86. 65.34 s [gammaloop-nextest-binaries-python-api-gammaloop-integration-tests] + for f in *.d
  87. 65.34 s [gammaloop-nextest-binaries-python-api-gammaloop-integration-tests] ++ readlink libgammaloop_tracing_filter.d
  88. 65.35 s [gammaloop-nextest-binaries-python-api-gammaloop-integration-tests] + orig=
  89. 65.35 s [gammaloop-nextest-binaries-python-api-gammaloop-integration-tests] + [[ -n '' ]]
  90. 65.35 s [gammaloop-nextest-binaries-python-api-gammaloop-integration-tests] + continue
  91. 65.35 s [gammaloop-nextest-binaries-python-api-gammaloop-integration-tests] + for f in *.d
  92. 65.35 s [gammaloop-nextest-binaries-python-api-gammaloop-integration-tests] ++ readlink libgammaloop_tracing_filter_macros.d
  93. 65.35 s [gammaloop-nextest-binaries-python-api-gammaloop-integration-tests] + orig=
  94. 65.35 s [gammaloop-nextest-binaries-python-api-gammaloop-integration-tests] + [[ -n '' ]]
  95. 65.35 s [gammaloop-nextest-binaries-python-api-gammaloop-integration-tests] + continue
  96. 65.35 s [gammaloop-nextest-binaries-python-api-gammaloop-integration-tests] + for f in *.d
  97. 65.35 s [gammaloop-nextest-binaries-python-api-gammaloop-integration-tests] ++ readlink libgammaloop_workspace_hack.d
  98. 65.35 s [gammaloop-nextest-binaries-python-api-gammaloop-integration-tests] + orig=
  99. 65.35 s [gammaloop-nextest-binaries-python-api-gammaloop-integration-tests] + [[ -n '' ]]
  100. 65.35 s [gammaloop-nextest-binaries-python-api-gammaloop-integration-tests] + continue
  101. 65.35 s [gammaloop-nextest-binaries-python-api-gammaloop-integration-tests] + for f in *.d
  102. 65.35 s [gammaloop-nextest-binaries-python-api-gammaloop-integration-tests] ++ readlink libgammalooprs.d
  103. 65.35 s [gammaloop-nextest-binaries-python-api-gammaloop-integration-tests] + orig=
  104. 65.35 s [gammaloop-nextest-binaries-python-api-gammaloop-integration-tests] + [[ -n '' ]]
  105. 65.35 s [gammaloop-nextest-binaries-python-api-gammaloop-integration-tests] + continue
  106. 65.35 s [gammaloop-nextest-binaries-python-api-gammaloop-integration-tests] + for f in *.d
  107. 65.35 s [gammaloop-nextest-binaries-python-api-gammaloop-integration-tests] ++ readlink libidenso.d
  108. 65.35 s [gammaloop-nextest-binaries-python-api-gammaloop-integration-tests] + orig=
  109. 65.35 s [gammaloop-nextest-binaries-python-api-gammaloop-integration-tests] + [[ -n '' ]]
  110. 65.35 s [gammaloop-nextest-binaries-python-api-gammaloop-integration-tests] + continue
  111. 65.35 s [gammaloop-nextest-binaries-python-api-gammaloop-integration-tests] + for f in *.d
  112. 65.35 s [gammaloop-nextest-binaries-python-api-gammaloop-integration-tests] ++ readlink liblinnest.d
  113. 65.35 s [gammaloop-nextest-binaries-python-api-gammaloop-integration-tests] + orig=
  114. 65.35 s [gammaloop-nextest-binaries-python-api-gammaloop-integration-tests] + [[ -n '' ]]
  115. 65.35 s [gammaloop-nextest-binaries-python-api-gammaloop-integration-tests] + continue
  116. 65.35 s [gammaloop-nextest-binaries-python-api-gammaloop-integration-tests] + for f in *.d
  117. 65.35 s [gammaloop-nextest-binaries-python-api-gammaloop-integration-tests] ++ readlink liblinnet.d
  118. 65.35 s [gammaloop-nextest-binaries-python-api-gammaloop-integration-tests] + orig=
  119. 65.35 s [gammaloop-nextest-binaries-python-api-gammaloop-integration-tests] + [[ -n '' ]]
  120. 65.35 s [gammaloop-nextest-binaries-python-api-gammaloop-integration-tests] + continue
  121. 65.35 s [gammaloop-nextest-binaries-python-api-gammaloop-integration-tests] + for f in *.d
  122. 65.35 s [gammaloop-nextest-binaries-python-api-gammaloop-integration-tests] ++ readlink libspenso.d
  123. 65.35 s [gammaloop-nextest-binaries-python-api-gammaloop-integration-tests] + orig=
  124. 65.35 s [gammaloop-nextest-binaries-python-api-gammaloop-integration-tests] + [[ -n '' ]]
  125. 65.35 s [gammaloop-nextest-binaries-python-api-gammaloop-integration-tests] + continue
  126. 65.35 s [gammaloop-nextest-binaries-python-api-gammaloop-integration-tests] + for f in *.d
  127. 65.35 s [gammaloop-nextest-binaries-python-api-gammaloop-integration-tests] ++ readlink libspenso_hep_lib.d
  128. 65.35 s [gammaloop-nextest-binaries-python-api-gammaloop-integration-tests] + orig=
  129. 65.35 s [gammaloop-nextest-binaries-python-api-gammaloop-integration-tests] + [[ -n '' ]]
  130. 65.35 s [gammaloop-nextest-binaries-python-api-gammaloop-integration-tests] + continue
  131. 65.35 s [gammaloop-nextest-binaries-python-api-gammaloop-integration-tests] + for f in *.d
  132. 65.35 s [gammaloop-nextest-binaries-python-api-gammaloop-integration-tests] ++ readlink libspenso_macros.d
  133. 65.36 s [gammaloop-nextest-binaries-python-api-gammaloop-integration-tests] + orig=
  134. 65.36 s [gammaloop-nextest-binaries-python-api-gammaloop-integration-tests] + [[ -n '' ]]
  135. 65.36 s [gammaloop-nextest-binaries-python-api-gammaloop-integration-tests] + continue
  136. 65.36 s [gammaloop-nextest-binaries-python-api-gammaloop-integration-tests] + for f in *.d
  137. 65.36 s [gammaloop-nextest-binaries-python-api-gammaloop-integration-tests] ++ readlink libsymbolica_utils.d
  138. 65.36 s [gammaloop-nextest-binaries-python-api-gammaloop-integration-tests] + orig=
  139. 65.36 s [gammaloop-nextest-binaries-python-api-gammaloop-integration-tests] + [[ -n '' ]]
  140. 65.36 s [gammaloop-nextest-binaries-python-api-gammaloop-integration-tests] + continue
  141. 65.36 s [gammaloop-nextest-binaries-python-api-gammaloop-integration-tests] + for f in *.d
  142. 65.36 s [gammaloop-nextest-binaries-python-api-gammaloop-integration-tests] ++ readlink libvakint.d
  143. 65.36 s [gammaloop-nextest-binaries-python-api-gammaloop-integration-tests] + orig=
  144. 65.36 s [gammaloop-nextest-binaries-python-api-gammaloop-integration-tests] + [[ -n '' ]]
  145. 65.36 s [gammaloop-nextest-binaries-python-api-gammaloop-integration-tests] + continue
  146. 65.36 s [gammaloop-nextest-binaries-python-api-gammaloop-integration-tests] + for f in *.d
  147. 65.36 s [gammaloop-nextest-binaries-python-api-gammaloop-integration-tests] ++ readlink libgammaloop_api.d
  148. 65.36 s [gammaloop-nextest-binaries-python-api-gammaloop-integration-tests] + orig=
  149. 65.36 s [gammaloop-nextest-binaries-python-api-gammaloop-integration-tests] + [[ -n '' ]]
  150. 65.36 s [gammaloop-nextest-binaries-python-api-gammaloop-integration-tests] + continue
  151. 65.36 s [gammaloop-nextest-binaries-python-api-gammaloop-integration-tests] + for f in *.d
  152. 65.36 s [gammaloop-nextest-binaries-python-api-gammaloop-integration-tests] ++ readlink libgammaloop_ci_prebuild.d
  153. 65.36 s [gammaloop-nextest-binaries-python-api-gammaloop-integration-tests] + orig=
  154. 65.36 s [gammaloop-nextest-binaries-python-api-gammaloop-integration-tests] + [[ -n '' ]]
  155. 65.36 s [gammaloop-nextest-binaries-python-api-gammaloop-integration-tests] + continue
  156. 65.36 s [gammaloop-nextest-binaries-python-api-gammaloop-integration-tests] + for f in *.d
  157. 65.36 s [gammaloop-nextest-binaries-python-api-gammaloop-integration-tests] ++ readlink libgammaloop_ci_test_binary_dependencies_0e21a2f3e307ff5a.d
  158. 65.36 s [gammaloop-nextest-binaries-python-api-gammaloop-integration-tests] + orig=
  159. 65.36 s [gammaloop-nextest-binaries-python-api-gammaloop-integration-tests] + [[ -n '' ]]
  160. 65.36 s [gammaloop-nextest-binaries-python-api-gammaloop-integration-tests] + continue
  161. 65.36 s [gammaloop-nextest-binaries-python-api-gammaloop-integration-tests] + for f in *.d
  162. 65.36 s [gammaloop-nextest-binaries-python-api-gammaloop-integration-tests] ++ readlink libgammaloop_ci_test_binary_dependencies_205f69a77e78f974.d
  163. 65.36 s [gammaloop-nextest-binaries-python-api-gammaloop-integration-tests] + orig=
  164. 65.36 s [gammaloop-nextest-binaries-python-api-gammaloop-integration-tests] + [[ -n '' ]]
  165. 65.36 s [gammaloop-nextest-binaries-python-api-gammaloop-integration-tests] + continue
  166. 65.36 s [gammaloop-nextest-binaries-python-api-gammaloop-integration-tests] + for f in *.d
  167. 65.36 s [gammaloop-nextest-binaries-python-api-gammaloop-integration-tests] ++ readlink libgammaloop_ci_test_binary_dependencies_2d15b14a2386a23f.d
  168. 65.37 s [gammaloop-nextest-binaries-python-api-gammaloop-integration-tests] + orig=
  169. 65.37 s [gammaloop-nextest-binaries-python-api-gammaloop-integration-tests] + [[ -n '' ]]
  170. 65.37 s [gammaloop-nextest-binaries-python-api-gammaloop-integration-tests] + continue
  171. 65.37 s [gammaloop-nextest-binaries-python-api-gammaloop-integration-tests] + for f in *.d
  172. 65.37 s [gammaloop-nextest-binaries-python-api-gammaloop-integration-tests] ++ readlink libgammaloop_ci_test_binary_dependencies_2d15b14a2386a23f_host.d
  173. 65.37 s [gammaloop-nextest-binaries-python-api-gammaloop-integration-tests] + orig=
  174. 65.37 s [gammaloop-nextest-binaries-python-api-gammaloop-integration-tests] + [[ -n '' ]]
  175. 65.37 s [gammaloop-nextest-binaries-python-api-gammaloop-integration-tests] + continue
  176. 65.37 s [gammaloop-nextest-binaries-python-api-gammaloop-integration-tests] + for f in *.d
  177. 65.37 s [gammaloop-nextest-binaries-python-api-gammaloop-integration-tests] ++ readlink libgammaloop_ci_test_binary_dependencies_2d15b14a2386a23f_target_gammaloop_tracing_filter_macros.d
  178. 65.37 s [gammaloop-nextest-binaries-python-api-gammaloop-integration-tests] + orig=
  179. 65.37 s [gammaloop-nextest-binaries-python-api-gammaloop-integration-tests] + [[ -n '' ]]
  180. 65.37 s [gammaloop-nextest-binaries-python-api-gammaloop-integration-tests] + continue
  181. 65.37 s [gammaloop-nextest-binaries-python-api-gammaloop-integration-tests] + for f in *.d
  182. 65.37 s [gammaloop-nextest-binaries-python-api-gammaloop-integration-tests] ++ readlink libgammaloop_ci_test_binary_dependencies_3b75a4e0eb58af7b.d
  183. 65.37 s [gammaloop-nextest-binaries-python-api-gammaloop-integration-tests] + orig=
  184. 65.37 s [gammaloop-nextest-binaries-python-api-gammaloop-integration-tests] + [[ -n '' ]]
  185. 65.37 s [gammaloop-nextest-binaries-python-api-gammaloop-integration-tests] + continue
  186. 65.37 s [gammaloop-nextest-binaries-python-api-gammaloop-integration-tests] + for f in *.d
  187. 65.37 s [gammaloop-nextest-binaries-python-api-gammaloop-integration-tests] ++ readlink libgammaloop_ci_test_binary_dependencies_b035b97e65aab5e2.d
  188. 65.37 s [gammaloop-nextest-binaries-python-api-gammaloop-integration-tests] + orig=
  189. 65.37 s [gammaloop-nextest-binaries-python-api-gammaloop-integration-tests] + [[ -n '' ]]
  190. 65.37 s [gammaloop-nextest-binaries-python-api-gammaloop-integration-tests] + continue
  191. 65.37 s [gammaloop-nextest-binaries-python-api-gammaloop-integration-tests] + for f in *.d
  192. 65.37 s [gammaloop-nextest-binaries-python-api-gammaloop-integration-tests] ++ readlink libgammaloop_ci_test_binary_dependencies_b13cde5d74cccfd3.d
  193. 65.37 s [gammaloop-nextest-binaries-python-api-gammaloop-integration-tests] + orig=
  194. 65.37 s [gammaloop-nextest-binaries-python-api-gammaloop-integration-tests] + [[ -n '' ]]
  195. 65.37 s [gammaloop-nextest-binaries-python-api-gammaloop-integration-tests] + continue
  196. 65.37 s [gammaloop-nextest-binaries-python-api-gammaloop-integration-tests] + for f in *.d
  197. 65.37 s [gammaloop-nextest-binaries-python-api-gammaloop-integration-tests] ++ readlink libgammaloop_ci_test_binary_dependencies_ba40fca986833aca.d
  198. 65.37 s [gammaloop-nextest-binaries-python-api-gammaloop-integration-tests] + orig=
  199. 65.37 s [gammaloop-nextest-binaries-python-api-gammaloop-integration-tests] + [[ -n '' ]]
  200. 65.37 s [gammaloop-nextest-binaries-python-api-gammaloop-integration-tests] + continue
  201. 65.37 s [gammaloop-nextest-binaries-python-api-gammaloop-integration-tests] + for f in *.d
  202. 65.37 s [gammaloop-nextest-binaries-python-api-gammaloop-integration-tests] ++ readlink libgammaloop_ci_test_binary_dependencies_c41dcf427a870814.d
  203. 65.37 s [gammaloop-nextest-binaries-python-api-gammaloop-integration-tests] + orig=
  204. 65.37 s [gammaloop-nextest-binaries-python-api-gammaloop-integration-tests] + [[ -n '' ]]
  205. 65.37 s [gammaloop-nextest-binaries-python-api-gammaloop-integration-tests] + continue
  206. 65.37 s [gammaloop-nextest-binaries-python-api-gammaloop-integration-tests] + for f in *.d
  207. 65.37 s [gammaloop-nextest-binaries-python-api-gammaloop-integration-tests] ++ readlink libgammaloop_ci_test_binary_dependencies_c41dcf427a870814_host.d
  208. 65.38 s [gammaloop-nextest-binaries-python-api-gammaloop-integration-tests] + orig=
  209. 65.38 s [gammaloop-nextest-binaries-python-api-gammaloop-integration-tests] + [[ -n '' ]]
  210. 65.38 s [gammaloop-nextest-binaries-python-api-gammaloop-integration-tests] + continue
  211. 65.38 s [gammaloop-nextest-binaries-python-api-gammaloop-integration-tests] + for f in *.d
  212. 65.38 s [gammaloop-nextest-binaries-python-api-gammaloop-integration-tests] ++ readlink libgammaloop_ci_test_binary_dependencies_c41dcf427a870814_target_spenso_macros.d
  213. 65.38 s [gammaloop-nextest-binaries-python-api-gammaloop-integration-tests] + orig=
  214. 65.38 s [gammaloop-nextest-binaries-python-api-gammaloop-integration-tests] + [[ -n '' ]]
  215. 65.38 s [gammaloop-nextest-binaries-python-api-gammaloop-integration-tests] + continue
  216. 65.38 s [gammaloop-nextest-binaries-python-api-gammaloop-integration-tests] + for f in *.d
  217. 65.38 s [gammaloop-nextest-binaries-python-api-gammaloop-integration-tests] ++ readlink libgammaloop_ci_test_binary_dependencies_eceb99ce8a91d0e3.d
  218. 65.38 s [gammaloop-nextest-binaries-python-api-gammaloop-integration-tests] + orig=
  219. 65.38 s [gammaloop-nextest-binaries-python-api-gammaloop-integration-tests] + [[ -n '' ]]
  220. 65.38 s [gammaloop-nextest-binaries-python-api-gammaloop-integration-tests] + continue
  221. 65.38 s [gammaloop-nextest-binaries-python-api-gammaloop-integration-tests] + for f in *.d
  222. 65.38 s [gammaloop-nextest-binaries-python-api-gammaloop-integration-tests] ++ readlink libgammaloop_ci_test_binary_dependencies_edb22ac49f29b33b.d
  223. 65.38 s [gammaloop-nextest-binaries-python-api-gammaloop-integration-tests] + orig=
  224. 65.38 s [gammaloop-nextest-binaries-python-api-gammaloop-integration-tests] + [[ -n '' ]]
  225. 65.38 s [gammaloop-nextest-binaries-python-api-gammaloop-integration-tests] + continue
  226. 65.38 s [gammaloop-nextest-binaries-python-api-gammaloop-integration-tests] + for f in *.d
  227. 65.38 s [gammaloop-nextest-binaries-python-api-gammaloop-integration-tests] ++ readlink libgammaloop_ci_test_binary_dependencies_fe00c48b9b12af7f.d
  228. 65.38 s [gammaloop-nextest-binaries-python-api-gammaloop-integration-tests] + orig=
  229. 65.38 s [gammaloop-nextest-binaries-python-api-gammaloop-integration-tests] + [[ -n '' ]]
  230. 65.38 s [gammaloop-nextest-binaries-python-api-gammaloop-integration-tests] + continue
  231. 65.38 s [gammaloop-nextest-binaries-python-api-gammaloop-integration-tests] + for f in *.d
  232. 65.38 s [gammaloop-nextest-binaries-python-api-gammaloop-integration-tests] ++ readlink libgammaloop_ci_test_dependencies_0e21a2f3e307ff5a.d
  233. 65.38 s [gammaloop-nextest-binaries-python-api-gammaloop-integration-tests] + orig=
  234. 65.38 s [gammaloop-nextest-binaries-python-api-gammaloop-integration-tests] + [[ -n '' ]]
  235. 65.38 s [gammaloop-nextest-binaries-python-api-gammaloop-integration-tests] + continue
  236. 65.38 s [gammaloop-nextest-binaries-python-api-gammaloop-integration-tests] + for f in *.d
  237. 65.38 s [gammaloop-nextest-binaries-python-api-gammaloop-integration-tests] ++ readlink libgammaloop_ci_test_dependencies_205f69a77e78f974.d
  238. 65.38 s [gammaloop-nextest-binaries-python-api-gammaloop-integration-tests] + orig=
  239. 65.38 s [gammaloop-nextest-binaries-python-api-gammaloop-integration-tests] + [[ -n '' ]]
  240. 65.38 s [gammaloop-nextest-binaries-python-api-gammaloop-integration-tests] + continue
  241. 65.38 s [gammaloop-nextest-binaries-python-api-gammaloop-integration-tests] + for f in *.d
  242. 65.38 s [gammaloop-nextest-binaries-python-api-gammaloop-integration-tests] ++ readlink libgammaloop_ci_test_dependencies_2d15b14a2386a23f.d
  243. 65.38 s [gammaloop-nextest-binaries-python-api-gammaloop-integration-tests] + orig=
  244. 65.38 s [gammaloop-nextest-binaries-python-api-gammaloop-integration-tests] + [[ -n '' ]]
  245. 65.38 s [gammaloop-nextest-binaries-python-api-gammaloop-integration-tests] + continue
  246. 65.38 s [gammaloop-nextest-binaries-python-api-gammaloop-integration-tests] + for f in *.d
  247. 65.38 s [gammaloop-nextest-binaries-python-api-gammaloop-integration-tests] ++ readlink libgammaloop_ci_test_dependencies_3b75a4e0eb58af7b.d
  248. 65.38 s [gammaloop-nextest-binaries-python-api-gammaloop-integration-tests] + orig=
  249. 65.38 s [gammaloop-nextest-binaries-python-api-gammaloop-integration-tests] + [[ -n '' ]]
  250. 65.38 s [gammaloop-nextest-binaries-python-api-gammaloop-integration-tests] + continue
  251. 65.39 s [gammaloop-nextest-binaries-python-api-gammaloop-integration-tests] + for f in *.d
  252. 65.39 s [gammaloop-nextest-binaries-python-api-gammaloop-integration-tests] ++ readlink libgammaloop_ci_test_dependencies_b035b97e65aab5e2.d
  253. 65.39 s [gammaloop-nextest-binaries-python-api-gammaloop-integration-tests] + orig=
  254. 65.39 s [gammaloop-nextest-binaries-python-api-gammaloop-integration-tests] + [[ -n '' ]]
  255. 65.39 s [gammaloop-nextest-binaries-python-api-gammaloop-integration-tests] + continue
  256. 65.39 s [gammaloop-nextest-binaries-python-api-gammaloop-integration-tests] + for f in *.d
  257. 65.39 s [gammaloop-nextest-binaries-python-api-gammaloop-integration-tests] ++ readlink libgammaloop_ci_test_dependencies_b13cde5d74cccfd3.d
  258. 65.39 s [gammaloop-nextest-binaries-python-api-gammaloop-integration-tests] + orig=
  259. 65.39 s [gammaloop-nextest-binaries-python-api-gammaloop-integration-tests] + [[ -n '' ]]
  260. 65.39 s [gammaloop-nextest-binaries-python-api-gammaloop-integration-tests] + continue
  261. 65.39 s [gammaloop-nextest-binaries-python-api-gammaloop-integration-tests] + for f in *.d
  262. 65.39 s [gammaloop-nextest-binaries-python-api-gammaloop-integration-tests] ++ readlink libgammaloop_ci_test_dependencies_ba40fca986833aca.d
  263. 65.39 s [gammaloop-nextest-binaries-python-api-gammaloop-integration-tests] + orig=
  264. 65.39 s [gammaloop-nextest-binaries-python-api-gammaloop-integration-tests] + [[ -n '' ]]
  265. 65.39 s [gammaloop-nextest-binaries-python-api-gammaloop-integration-tests] + continue
  266. 65.39 s [gammaloop-nextest-binaries-python-api-gammaloop-integration-tests] + for f in *.d
  267. 65.39 s [gammaloop-nextest-binaries-python-api-gammaloop-integration-tests] ++ readlink libgammaloop_ci_test_dependencies_c41dcf427a870814.d
  268. 65.39 s [gammaloop-nextest-binaries-python-api-gammaloop-integration-tests] + orig=
  269. 65.39 s [gammaloop-nextest-binaries-python-api-gammaloop-integration-tests] + [[ -n '' ]]
  270. 65.39 s [gammaloop-nextest-binaries-python-api-gammaloop-integration-tests] + continue
  271. 65.39 s [gammaloop-nextest-binaries-python-api-gammaloop-integration-tests] + for f in *.d
  272. 65.39 s [gammaloop-nextest-binaries-python-api-gammaloop-integration-tests] ++ readlink libgammaloop_ci_test_dependencies_eceb99ce8a91d0e3.d
  273. 65.39 s [gammaloop-nextest-binaries-python-api-gammaloop-integration-tests] + orig=
  274. 65.39 s [gammaloop-nextest-binaries-python-api-gammaloop-integration-tests] + [[ -n '' ]]
  275. 65.39 s [gammaloop-nextest-binaries-python-api-gammaloop-integration-tests] + continue
  276. 65.39 s [gammaloop-nextest-binaries-python-api-gammaloop-integration-tests] + for f in *.d
  277. 65.39 s [gammaloop-nextest-binaries-python-api-gammaloop-integration-tests] ++ readlink libgammaloop_ci_test_dependencies_edb22ac49f29b33b.d
  278. 65.39 s [gammaloop-nextest-binaries-python-api-gammaloop-integration-tests] + orig=
  279. 65.39 s [gammaloop-nextest-binaries-python-api-gammaloop-integration-tests] + [[ -n '' ]]
  280. 65.39 s [gammaloop-nextest-binaries-python-api-gammaloop-integration-tests] + continue
  281. 65.39 s [gammaloop-nextest-binaries-python-api-gammaloop-integration-tests] + for f in *.d
  282. 65.39 s [gammaloop-nextest-binaries-python-api-gammaloop-integration-tests] ++ readlink libgammaloop_ci_test_dependencies_fe00c48b9b12af7f.d
  283. 65.39 s [gammaloop-nextest-binaries-python-api-gammaloop-integration-tests] + orig=
  284. 65.39 s [gammaloop-nextest-binaries-python-api-gammaloop-integration-tests] + [[ -n '' ]]
  285. 65.39 s [gammaloop-nextest-binaries-python-api-gammaloop-integration-tests] + continue
  286. 65.39 s [gammaloop-nextest-binaries-python-api-gammaloop-integration-tests] + for f in *.d
  287. 65.39 s [gammaloop-nextest-binaries-python-api-gammaloop-integration-tests] ++ readlink libgammaloop_integration_tests.d
  288. 65.39 s [gammaloop-nextest-binaries-python-api-gammaloop-integration-tests] + orig=
  289. 65.39 s [gammaloop-nextest-binaries-python-api-gammaloop-integration-tests] + [[ -n '' ]]
  290. 65.39 s [gammaloop-nextest-binaries-python-api-gammaloop-integration-tests] + continue
  291. 65.39 s [gammaloop-nextest-binaries-python-api-gammaloop-integration-tests] + for f in *.d
  292. 65.39 s [gammaloop-nextest-binaries-python-api-gammaloop-integration-tests] ++ readlink libgammaloop_tracing_filter.d
  293. 65.39 s [gammaloop-nextest-binaries-python-api-gammaloop-integration-tests] + orig=
  294. 65.39 s [gammaloop-nextest-binaries-python-api-gammaloop-integration-tests] + [[ -n '' ]]
  295. 65.39 s [gammaloop-nextest-binaries-python-api-gammaloop-integration-tests] + continue
  296. 65.39 s [gammaloop-nextest-binaries-python-api-gammaloop-integration-tests] + for f in *.d
  297. 65.39 s [gammaloop-nextest-binaries-python-api-gammaloop-integration-tests] ++ readlink libgammaloop_tracing_filter_macros.d
  298. 65.40 s [gammaloop-nextest-binaries-python-api-gammaloop-integration-tests] + orig=
  299. 65.40 s [gammaloop-nextest-binaries-python-api-gammaloop-integration-tests] + [[ -n '' ]]
  300. 65.40 s [gammaloop-nextest-binaries-python-api-gammaloop-integration-tests] + continue
  301. 65.40 s [gammaloop-nextest-binaries-python-api-gammaloop-integration-tests] + for f in *.d
  302. 65.40 s [gammaloop-nextest-binaries-python-api-gammaloop-integration-tests] ++ readlink libgammaloop_workspace_hack.d
  303. 65.40 s [gammaloop-nextest-binaries-python-api-gammaloop-integration-tests] + orig=
  304. 65.40 s [gammaloop-nextest-binaries-python-api-gammaloop-integration-tests] + [[ -n '' ]]
  305. 65.40 s [gammaloop-nextest-binaries-python-api-gammaloop-integration-tests] + continue
  306. 65.40 s [gammaloop-nextest-binaries-python-api-gammaloop-integration-tests] + for f in *.d
  307. 65.40 s [gammaloop-nextest-binaries-python-api-gammaloop-integration-tests] ++ readlink libgammalooprs.d
  308. 65.40 s [gammaloop-nextest-binaries-python-api-gammaloop-integration-tests] + orig=
  309. 65.40 s [gammaloop-nextest-binaries-python-api-gammaloop-integration-tests] + [[ -n '' ]]
  310. 65.40 s [gammaloop-nextest-binaries-python-api-gammaloop-integration-tests] + continue
  311. 65.40 s [gammaloop-nextest-binaries-python-api-gammaloop-integration-tests] + for f in *.d
  312. 65.40 s [gammaloop-nextest-binaries-python-api-gammaloop-integration-tests] ++ readlink libidenso.d
  313. 65.40 s [gammaloop-nextest-binaries-python-api-gammaloop-integration-tests] + orig=
  314. 65.40 s [gammaloop-nextest-binaries-python-api-gammaloop-integration-tests] + [[ -n '' ]]
  315. 65.40 s [gammaloop-nextest-binaries-python-api-gammaloop-integration-tests] + continue
  316. 65.40 s [gammaloop-nextest-binaries-python-api-gammaloop-integration-tests] + for f in *.d
  317. 65.40 s [gammaloop-nextest-binaries-python-api-gammaloop-integration-tests] ++ readlink liblinnest.d
  318. 65.40 s [gammaloop-nextest-binaries-python-api-gammaloop-integration-tests] + orig=
  319. 65.40 s [gammaloop-nextest-binaries-python-api-gammaloop-integration-tests] + [[ -n '' ]]
  320. 65.40 s [gammaloop-nextest-binaries-python-api-gammaloop-integration-tests] + continue
  321. 65.40 s [gammaloop-nextest-binaries-python-api-gammaloop-integration-tests] + for f in *.d
  322. 65.40 s [gammaloop-nextest-binaries-python-api-gammaloop-integration-tests] ++ readlink liblinnet.d
  323. 65.40 s [gammaloop-nextest-binaries-python-api-gammaloop-integration-tests] + orig=
  324. 65.40 s [gammaloop-nextest-binaries-python-api-gammaloop-integration-tests] + [[ -n '' ]]
  325. 65.40 s [gammaloop-nextest-binaries-python-api-gammaloop-integration-tests] + continue
  326. 65.40 s [gammaloop-nextest-binaries-python-api-gammaloop-integration-tests] + for f in *.d
  327. 65.40 s [gammaloop-nextest-binaries-python-api-gammaloop-integration-tests] ++ readlink libspenso.d
  328. 65.40 s [gammaloop-nextest-binaries-python-api-gammaloop-integration-tests] + orig=
  329. 65.40 s [gammaloop-nextest-binaries-python-api-gammaloop-integration-tests] + [[ -n '' ]]
  330. 65.40 s [gammaloop-nextest-binaries-python-api-gammaloop-integration-tests] + continue
  331. 65.40 s [gammaloop-nextest-binaries-python-api-gammaloop-integration-tests] + for f in *.d
  332. 65.40 s [gammaloop-nextest-binaries-python-api-gammaloop-integration-tests] ++ readlink libspenso_hep_lib.d
  333. 65.40 s [gammaloop-nextest-binaries-python-api-gammaloop-integration-tests] + orig=
  334. 65.40 s [gammaloop-nextest-binaries-python-api-gammaloop-integration-tests] + [[ -n '' ]]
  335. 65.40 s [gammaloop-nextest-binaries-python-api-gammaloop-integration-tests] + continue
  336. 65.40 s [gammaloop-nextest-binaries-python-api-gammaloop-integration-tests] + for f in *.d
  337. 65.40 s [gammaloop-nextest-binaries-python-api-gammaloop-integration-tests] ++ readlink libspenso_macros.d
  338. 65.40 s [gammaloop-nextest-binaries-python-api-gammaloop-integration-tests] + orig=
  339. 65.40 s [gammaloop-nextest-binaries-python-api-gammaloop-integration-tests] + [[ -n '' ]]
  340. 65.40 s [gammaloop-nextest-binaries-python-api-gammaloop-integration-tests] + continue
  341. 65.40 s [gammaloop-nextest-binaries-python-api-gammaloop-integration-tests] + for f in *.d
  342. 65.40 s [gammaloop-nextest-binaries-python-api-gammaloop-integration-tests] ++ readlink libsymbolica_utils.d
  343. 65.41 s [gammaloop-nextest-binaries-python-api-gammaloop-integration-tests] + orig=
  344. 65.41 s [gammaloop-nextest-binaries-python-api-gammaloop-integration-tests] + [[ -n '' ]]
  345. 65.41 s [gammaloop-nextest-binaries-python-api-gammaloop-integration-tests] + continue
  346. 65.41 s [gammaloop-nextest-binaries-python-api-gammaloop-integration-tests] + for f in *.d
  347. 65.41 s [gammaloop-nextest-binaries-python-api-gammaloop-integration-tests] ++ readlink libvakint.d
  348. 65.41 s [gammaloop-nextest-binaries-python-api-gammaloop-integration-tests] + orig=
  349. 65.41 s [gammaloop-nextest-binaries-python-api-gammaloop-integration-tests] + [[ -n '' ]]
  350. 65.41 s [gammaloop-nextest-binaries-python-api-gammaloop-integration-tests] + continue
  351. 67.72 s [gammaloop-nextest-binaries-python-api-gammaloop-integration-tests] Executing configureCargoCommonVars
  352. 67.83 s [gammaloop-nextest-binaries-python-api-gammaloop-integration-tests] decompressing cargo artifacts from /nix/store/7f27x832jy30lljldhjs4lgq285rjkk6-gammaloop-crate-test-binaries-gammaloop-integration-tests-edb22ac49f29b33b-deps-0.1.0/target.tar.zst to target
  353. 68.51 s [gammaloop-nextest-binaries-python-api-gammaloop-integration-tests] Phase: updateAutotoolsGnuConfigScriptsPhase
  354. 68.54 s [gammaloop-nextest-binaries-python-api-gammaloop-integration-tests] Phase: configurePhase
  355. 68.54 s [gammaloop-nextest-binaries-python-api-gammaloop-integration-tests] will append /build/source/.cargo-home/config.toml with contents of /nix/store/29aa708jkn8wd8vjwja1a5gh8k8wpi2b-vendor-cargo-deps/config.toml
  356. 68.55 s [gammaloop-nextest-binaries-python-api-gammaloop-integration-tests] default configurePhase, nothing to do
  357. 68.55 s [gammaloop-nextest-binaries-python-api-gammaloop-integration-tests] Phase: buildPhase
  358. 68.55 s [gammaloop-nextest-binaries-python-api-gammaloop-integration-tests] +++ command cargo --version
  359. 68.55 s [gammaloop-nextest-binaries-python-api-gammaloop-integration-tests] cargo 1.98.0 (797e8a9bc 2026-08-05)
  360. 68.60 s [gammaloop-nextest-binaries-python-api-gammaloop-integration-tests] +++ command cargo nextest --version
  361. 68.60 s [gammaloop-nextest-binaries-python-api-gammaloop-integration-tests] cargo-nextest 0.9.143
  362. 68.60 s [gammaloop-nextest-binaries-python-api-gammaloop-integration-tests] release: 0.9.143
  363. 68.60 s [gammaloop-nextest-binaries-python-api-gammaloop-integration-tests] host: x86_64-unknown-linux-gnu
  364. 68.60 s [gammaloop-nextest-binaries-python-api-gammaloop-integration-tests] +++ command cargo nextest archive --cargo-profile ci-optim --offline -p gammaloop-integration-tests --features gammaloop-integration-tests/python-api-tests -E 'package(gammaloop-integration-tests) & binary(test_python_api)' --profile ci_gammaloop --archive-file /nix/store/jwqknvc7h8pp528hm0anqj06w3ig9wja-gammaloop-nextest-binaries-python-api-gammaloop-integration-tests-0.1.0/gammaloop-nextest-python-api-gammaloop-integration-tests.tar.zst
  365. 69.42 s [gammaloop-nextest-binaries-python-api-gammaloop-integration-tests] Compiling gammaloop-integration-tests v0.1.0 (/build/source/tests)
  366. 102.08 s [gammaloop-nextest-binaries-python-api-gammaloop-integration-tests] Finished `ci-optim` profile [optimized] target(s) in 32.97s
  367. 102.22 s [gammaloop-nextest-binaries-python-api-gammaloop-integration-tests] warning: the following packages contain code that will be rejected by a future version of Rust: proc-macro-error2 v2.0.1
  368. 102.22 s [gammaloop-nextest-binaries-python-api-gammaloop-integration-tests] note: to see what the problems were, use the option `--future-incompat-report`, or run `cargo report future-incompatibilities --id 1`
  369. 102.27 s [gammaloop-nextest-binaries-python-api-gammaloop-integration-tests] Archiving 3 binaries (including 2 non-test binaries; 9 test binaries filtered out), 1 build script output directory, 3 linked paths, and 1 standard library to /nix/store/jwqknvc7h8pp528hm0anqj06w3ig9wja-gammaloop-nextest-binaries-python-api-gammaloop-integration-tests-0.1.0/gammaloop-nextest-python-api-gammaloop-integration-tests.tar.zst
  370. 102.45 s [gammaloop-nextest-binaries-python-api-gammaloop-integration-tests] Archived 22 files to /nix/store/jwqknvc7h8pp528hm0anqj06w3ig9wja-gammaloop-nextest-binaries-python-api-gammaloop-integration-tests-0.1.0/gammaloop-nextest-python-api-gammaloop-integration-tests.tar.zst in 0.18s
  371. 102.46 s [gammaloop-nextest-binaries-python-api-gammaloop-integration-tests] buildPhase completed in 34 seconds
  372. 102.46 s [gammaloop-nextest-binaries-python-api-gammaloop-integration-tests] Phase: installPhase
  373. 102.46 s [gammaloop-nextest-binaries-python-api-gammaloop-integration-tests] Phase: fixupPhase
  374. 102.47 s [gammaloop-nextest-binaries-python-api-gammaloop-integration-tests] shrinking RPATHs of ELF executables and libraries in /nix/store/jwqknvc7h8pp528hm0anqj06w3ig9wja-gammaloop-nextest-binaries-python-api-gammaloop-integration-tests-0.1.0
  375. 102.47 s [gammaloop-nextest-binaries-python-api-gammaloop-integration-tests] checking for references to /build/ in /nix/store/jwqknvc7h8pp528hm0anqj06w3ig9wja-gammaloop-nextest-binaries-python-api-gammaloop-integration-tests-0.1.0...
  376. 102.48 s [gammaloop-nextest-binaries-python-api-gammaloop-integration-tests] patching script interpreter paths in /nix/store/jwqknvc7h8pp528hm0anqj06w3ig9wja-gammaloop-nextest-binaries-python-api-gammaloop-integration-tests-0.1.0
  377. 102.82 s [gammaloop-nextest-binaries-python-api-gammaloop-integration-tests:post-build] Uploading to the NixCI cache: /nix/store/jwqknvc7h8pp528hm0anqj06w3ig9wja-gammaloop-nextest-binaries-python-api-gammaloop-integration-tests-0.1.0
  378. 102.85 s [gammaloop-nextest-binaries-python-api-gammaloop-integration-tests:post-build] warning: 'warn-short-path-literals' is deprecated, use 'lint-short-path-literals = ignore' instead
  379. 102.86 s [gammaloop-nextest-binaries-python-api-gammaloop-integration-tests:post-build] copying 1 paths...
  380. 102.86 s [gammaloop-nextest-binaries-python-api-gammaloop-integration-tests:post-build] copying path '/nix/store/jwqknvc7h8pp528hm0anqj06w3ig9wja-gammaloop-nextest-binaries-python-api-gammaloop-integration-tests-0.1.0' to 'https://cache.nix-ci.com'...
  381. 112.35 s [gammaloop-nextest-binaries-python-api-gammaloop-integration-tests:post-build] warning: 'warn-short-path-literals' is deprecated, use 'lint-short-path-literals = ignore' instead
  382. 112.71 s [gammaloop-nextest-binaries-python-api-gammaloop-integration-tests:post-build] copying 1 paths...
  383. 112.71 s [gammaloop-nextest-binaries-python-api-gammaloop-integration-tests:post-build] copying path '/nix/store/pg7gsk898kmp2l1jisfys1a3qmyr2ys2-gammaloop-nextest-binaries-python-api-gammaloop-integration-tests-0.1.0.drv' to 'https://cache.nix-ci.com'...
  384. 112.94 s Uploaded gammaloop-nextest-binaries-python-api-gammaloop-integration-tests in 10.1s
  385. 112.94 s Progress: 4 of 7 built, 18 of 18 downloaded from cache
  386. 112.94 s Built gammaloop-nextest-binaries-python-api-gammaloop-integration-tests in 48.6s
  387. 112.97 s Building /nix/store/myifr2fj0crizpcs27xad57a572zsigd-gammaloop-nextest-binaries-python-api.drv
  388. 113.01 s [gammaloop-nextest-binaries-python-api:post-build] Uploading to the NixCI cache: /nix/store/6ppn2xb828z3vdrc7wvnba998bxllnjw-gammaloop-nextest-binaries-python-api
  389. 113.05 s [gammaloop-nextest-binaries-python-api:post-build] warning: 'warn-short-path-literals' is deprecated, use 'lint-short-path-literals = ignore' instead
  390. 113.27 s [gammaloop-nextest-binaries-python-api:post-build] copying 1 paths...
  391. 113.27 s [gammaloop-nextest-binaries-python-api:post-build] copying path '/nix/store/6ppn2xb828z3vdrc7wvnba998bxllnjw-gammaloop-nextest-binaries-python-api' to 'https://cache.nix-ci.com'...
  392. 113.54 s [gammaloop-nextest-binaries-python-api:post-build] warning: 'warn-short-path-literals' is deprecated, use 'lint-short-path-literals = ignore' instead
  393. 113.84 s [gammaloop-nextest-binaries-python-api:post-build] copying 1 paths...
  394. 113.84 s [gammaloop-nextest-binaries-python-api:post-build] copying path '/nix/store/myifr2fj0crizpcs27xad57a572zsigd-gammaloop-nextest-binaries-python-api.drv' to 'https://cache.nix-ci.com'...
  395. 114.06 s Uploaded gammaloop-nextest-binaries-python-api in 1.0s
  396. 114.06 s Progress: 5 of 7 built, 18 of 18 downloaded from cache
  397. 114.06 s Built gammaloop-nextest-binaries-python-api in 1.0s
  398. 114.09 s Building /nix/store/i7i77b8q8bd8g857bybxvz6ggwx6k47x-nix-ci-check-gammaloop-nextest-python-api.drv
  399. 114.16 s [nix-ci-check-gammaloop-nextest-python-api:post-build] Uploading to the NixCI cache: /nix/store/7s5amkr08n15fm70v2g86sllxpvj3sdi-nix-ci-check-gammaloop-nextest-python-api
  400. 114.19 s [nix-ci-check-gammaloop-nextest-python-api:post-build] warning: 'warn-short-path-literals' is deprecated, use 'lint-short-path-literals = ignore' instead
  401. 114.20 s [nix-ci-check-gammaloop-nextest-python-api:post-build] copying 1 paths...
  402. 114.20 s [nix-ci-check-gammaloop-nextest-python-api:post-build] copying path '/nix/store/7s5amkr08n15fm70v2g86sllxpvj3sdi-nix-ci-check-gammaloop-nextest-python-api' to 'https://cache.nix-ci.com'...
  403. 114.51 s [nix-ci-check-gammaloop-nextest-python-api:post-build] warning: 'warn-short-path-literals' is deprecated, use 'lint-short-path-literals = ignore' instead
  404. 114.83 s [nix-ci-check-gammaloop-nextest-python-api:post-build] copying 1 paths...
  405. 114.83 s [nix-ci-check-gammaloop-nextest-python-api:post-build] copying path '/nix/store/i7i77b8q8bd8g857bybxvz6ggwx6k47x-nix-ci-check-gammaloop-nextest-python-api.drv' to 'https://cache.nix-ci.com'...
  406. 115.06 s Uploaded nix-ci-check-gammaloop-nextest-python-api in 913ms
  407. 115.06 s Progress: 6 of 7 built, 18 of 18 downloaded from cache
  408. 115.06 s Built nix-ci-check-gammaloop-nextest-python-api in 962ms
  409. 115.06 s Progress: 7 of 7 built, 18 of 18 downloaded from cache
  410. 115.32 s evaluating derivation 'gevaluation warning: stdenv.isDarwin is deprecated, use stdenv.hostPlatform.isDarwin instead
  411. 121.28 s copying '/nix/store/s78m evaluating derivation 'g copying '/nix/store/s78m evaluating derivation 'g copying '/nix/store/s78m evaluating derivation 'g copying '/nix/store/s78m evaluating derivation 'g copying '/nix/store/s78m evaluating derivation 'g copying '/nix/store/s78m evaluating derivation 'g copying '/nix/store/s78m evaluating derivation 'g querying gammaloop-nexte [0/1 built, 0.0 KiB DL] [1/0/1 built, 0.0 KiB DLgammaloop-nextest-python-api> Extracting 3 binaries (including 2 non-test binaries), 1 build script output directory, and 3 linked paths to /build/nextest-archive-6DwWQb
  412. 121.50 s gammaloop-nextest-python-api> Extracted 22 files to /build/nextest-archive-6DwWQb in 0.22s
  413. 121.50 s gammaloop-nextest-python-api> ------------
  414. 121.50 s gammaloop-nextest-python-api> Nextest run ID 6271bfc6-5333-4f41-8349-688cc5434175 with nextest profile: ci_gammaloop
  415. 121.50 s gammaloop-nextest-python-api> Starting 5 tests across 1 binary
  416. 121.61 s gammaloop-nextest-python-api> FAIL [ 0.104s] (1/5) gammaloop-integration-tests::test_python_api python_evaluate_sample_preserves_graph_grouping_and_incoming_pdgs
  417. 121.61 s gammaloop-nextest-python-api> stdout ---
  418. 121.61 s gammaloop-nextest-python-api>
  419. 121.61 s gammaloop-nextest-python-api> running 1 test
  420. 121.61 s gammaloop-nextest-python-api> test python_evaluate_sample_preserves_graph_grouping_and_incoming_pdgs ... FAILED
  421. 121.61 s gammaloop-nextest-python-api>
  422. 121.61 s gammaloop-nextest-python-api> failures:
  423. 121.61 s gammaloop-nextest-python-api>
  424. 121.61 s gammaloop-nextest-python-api> failures:
  425. 121.61 s gammaloop-nextest-python-api> python_evaluate_sample_preserves_graph_grouping_and_incoming_pdgs
  426. 121.61 s gammaloop-nextest-python-api>
  427. 121.61 s gammaloop-nextest-python-api> test result: FAILED. 0 passed; 1 failed; 0 ignored; 0 measured; 4 filtered out; finished in 0.10s
  428. 121.61 s gammaloop-nextest-python-api>
  429. 121.61 s gammaloop-nextest-python-api> stderr ---
  430. 121.61 s gammaloop-nextest-python-api> Error: Python API test subprocess failed.
  431. 121.61 s gammaloop-nextest-python-api> stdout:
  432. 121.61 s gammaloop-nextest-python-api> ┌────────────────────────────────────────────────────────┐
  433. 121.61 s gammaloop-nextest-python-api> │ You are running a restricted Symbolica instance. │
  434. 121.61 s gammaloop-nextest-python-api> │ │
  435. 121.61 s gammaloop-nextest-python-api> │ This mode is only permitted for non-commercial use and │
  436. 121.61 s gammaloop-nextest-python-api> │ is limited to one instance and core per machine. │
  437. 121.61 s gammaloop-nextest-python-api> │ │
  438. 121.61 s gammaloop-nextest-python-api> │ Hobbyists can easily acquire a free license key │
  439. 121.61 s gammaloop-nextest-python-api> │ that unlocks all cores and removes this banner: │
  440. 121.61 s gammaloop-nextest-python-api> │ │
  441. 121.61 s gammaloop-nextest-python-api> │ from symbolica import * │
  442. 121.61 s gammaloop-nextest-python-api> │ request_hobbyist_license('YOUR_NAME', 'YOUR_EMAIL') │
  443. 121.61 s gammaloop-nextest-python-api> │ │
  444. 121.61 s gammaloop-nextest-python-api> │ All other users can obtain a free 30-day trial key: │
  445. 121.61 s gammaloop-nextest-python-api> │ │
  446. 121.61 s gammaloop-nextest-python-api> │ from symbolica import * │
  447. 121.61 s gammaloop-nextest-python-api> │ request_trial_license('NAME', 'EMAIL', 'EMPLOYER') │
  448. 121.61 s gammaloop-nextest-python-api> │ │
  449. 121.61 s gammaloop-nextest-python-api> │ See https://symbolica.io/docs/get_started.html#license │
  450. 121.61 s gammaloop-nextest-python-api> └────────────────────────────────────────────────────────┘
  451. 121.61 s gammaloop-nextest-python-api> ┌───────────────────────────────────────────────────────────────────────────────────────────────────────────┐
  452. 121.61 s gammaloop-nextest-python-api> │ Cannot start new unlicensed Symbolica instance since there is already another one running on the machine. │
  453. 121.61 s gammaloop-nextest-python-api> └───────────────────────────────────────────────────────────────────────────────────────────────────────────┘
  454. 121.61 s gammaloop-nextest-python-api>
  455. 121.61 s gammaloop-nextest-python-api> stderr:
  456. 121.61 s gammaloop-nextest-python-api>
  457. 121.61 s gammaloop-nextest-python-api> ┌───────────────────────────────────────────────────────────┐
  458. 121.61 s gammaloop-nextest-python-api> │ Could not resolve the IP of the Symbolica license server. │
  459. 121.61 s gammaloop-nextest-python-api> │ │
  460. 121.61 s gammaloop-nextest-python-api> │ Please check your DNS configuration. │
  461. 121.61 s gammaloop-nextest-python-api> └───────────────────────────────────────────────────────────┘
  462. 121.61 s gammaloop-nextest-python-api> Error: failed to lookup address information: Temporary failure in name resolution
  463. 121.61 s gammaloop-nextest-python-api>
  464. 121.61 s gammaloop-nextest-python-api>
  465. 121.61 s gammaloop-nextest-python-api> Location:
  466. 121.61 s gammaloop-nextest-python-api> tests/tests/test_python_api.rs:156:20
  467. 121.61 s gammaloop-nextest-python-api>
  468. 121.61 s gammaloop-nextest-python-api> FAIL [ 0.109s] (2/5) gammaloop-integration-tests::test_python_api python_session_getters_return_live_toml_and_command_blocks
  469. 121.61 s gammaloop-nextest-python-api> stdout ---
  470. 121.61 s gammaloop-nextest-python-api>
  471. 121.61 s gammaloop-nextest-python-api> running 1 test
  472. 121.61 s gammaloop-nextest-python-api> test python_session_getters_return_live_toml_and_command_blocks ... FAILED
  473. 121.61 s gammaloop-nextest-python-api>
  474. 121.61 s gammaloop-nextest-python-api> failures:
  475. 121.61 s gammaloop-nextest-python-api>
  476. 121.61 s gammaloop-nextest-python-api> failures:
  477. 121.61 s gammaloop-nextest-python-api> python_session_getters_return_live_toml_and_command_blocks
  478. 121.61 s gammaloop-nextest-python-api>
  479. 121.61 s gammaloop-nextest-python-api> test result: FAILED. 0 passed; 1 failed; 0 ignored; 0 measured; 4 filtered out; finished in 0.10s
  480. 121.61 s gammaloop-nextest-python-api>
  481. 121.61 s gammaloop-nextest-python-api> stderr ---
  482. 121.61 s gammaloop-nextest-python-api> Error: Python API test subprocess failed.
  483. 121.61 s gammaloop-nextest-python-api> stdout:
  484. 121.61 s gammaloop-nextest-python-api> ┌────────────────────────────────────────────────────────┐
  485. 121.61 s gammaloop-nextest-python-api> │ You are running a restricted Symbolica instance. │
  486. 121.61 s gammaloop-nextest-python-api> │ │
  487. 121.61 s gammaloop-nextest-python-api> │ This mode is only permitted for non-commercial use and │
  488. 121.61 s gammaloop-nextest-python-api> │ is limited to one instance and core per machine. │
  489. 121.61 s gammaloop-nextest-python-api> │ │
  490. 121.61 s gammaloop-nextest-python-api> │ Hobbyists can easily acquire a free license key │
  491. 121.61 s gammaloop-nextest-python-api> │ that unlocks all cores and removes this banner: │
  492. 121.61 s gammaloop-nextest-python-api> │ │
  493. 121.61 s gammaloop-nextest-python-api> │ from symbolica import * │
  494. 121.61 s gammaloop-nextest-python-api> │ request_hobbyist_license('YOUR_NAME', 'YOUR_EMAIL') │
  495. 121.61 s gammaloop-nextest-python-api> │ │
  496. 121.61 s gammaloop-nextest-python-api> │ All other users can obtain a free 30-day trial key: │
  497. 121.61 s gammaloop-nextest-python-api> │ │
  498. 121.61 s gammaloop-nextest-python-api> │ from symbolica import * │
  499. 121.61 s gammaloop-nextest-python-api> │ request_trial_license('NAME', 'EMAIL', 'EMPLOYER') │
  500. 121.61 s gammaloop-nextest-python-api> │ │
  501. 121.61 s gammaloop-nextest-python-api> │ See https://symbolica.io/docs/get_started.html#license │
  502. 121.61 s gammaloop-nextest-python-api> └────────────────────────────────────────────────────────┘
  503. 121.61 s gammaloop-nextest-python-api> ┌───────────────────────────────────────────────────────────────────────────────────────────────────────────┐
  504. 121.61 s gammaloop-nextest-python-api> │ Cannot start new unlicensed Symbolica instance since there is already another one running on the machine. │
  505. 121.61 s gammaloop-nextest-python-api> └───────────────────────────────────────────────────────────────────────────────────────────────────────────┘
  506. 121.61 s gammaloop-nextest-python-api>
  507. 121.61 s gammaloop-nextest-python-api> stderr:
  508. 121.61 s gammaloop-nextest-python-api>
  509. 121.61 s gammaloop-nextest-python-api> ┌───────────────────────────────────────────────────────────┐
  510. 121.61 s gammaloop-nextest-python-api> │ Could not resolve the IP of the Symbolica license server. │
  511. 121.61 s gammaloop-nextest-python-api> │ │
  512. 121.61 s gammaloop-nextest-python-api> │ Please check your DNS configuration. │
  513. 121.61 s gammaloop-nextest-python-api> └───────────────────────────────────────────────────────────┘
  514. 121.61 s gammaloop-nextest-python-api> Error: failed to lookup address information: Temporary failure in name resolution
  515. 121.61 s gammaloop-nextest-python-api>
  516. 121.61 s gammaloop-nextest-python-api>
  517. 121.61 s gammaloop-nextest-python-api> Location:
  518. 121.61 s gammaloop-nextest-python-api> tests/tests/test_python_api.rs:156:20
  519. 121.61 s gammaloop-nextest-python-api>
  520. 121.63 s gammaloop-nextest-python-api> FAIL [ 0.125s] (3/5) gammaloop-integration-tests::test_python_api python_evaluate_samples_batch_and_momentum_space_have_expected_shape
  521. 121.63 s gammaloop-nextest-python-api> stdout ---
  522. 121.63 s gammaloop-nextest-python-api>
  523. 121.63 s gammaloop-nextest-python-api> running 1 test
  524. 121.63 s gammaloop-nextest-python-api> test python_evaluate_samples_batch_and_momentum_space_have_expected_shape ... FAILED
  525. 121.63 s gammaloop-nextest-python-api>
  526. 121.63 s gammaloop-nextest-python-api> failures:
  527. 121.63 s gammaloop-nextest-python-api>
  528. 121.63 s gammaloop-nextest-python-api> failures:
  529. 121.63 s gammaloop-nextest-python-api> python_evaluate_samples_batch_and_momentum_space_have_expected_shape
  530. 121.63 s gammaloop-nextest-python-api>
  531. 121.63 s gammaloop-nextest-python-api> test result: FAILED. 0 passed; 1 failed; 0 ignored; 0 measured; 4 filtered out; finished in 0.12s
  532. 121.63 s gammaloop-nextest-python-api>
  533. 121.63 s gammaloop-nextest-python-api> stderr ---
  534. 121.63 s gammaloop-nextest-python-api> Error: Python API test subprocess failed.
  535. 121.63 s gammaloop-nextest-python-api> stdout:
  536. 121.63 s gammaloop-nextest-python-api> ┌────────────────────────────────────────────────────────┐
  537. 121.63 s gammaloop-nextest-python-api> │ You are running a restricted Symbolica instance. │
  538. 121.63 s gammaloop-nextest-python-api> │ │
  539. 121.63 s gammaloop-nextest-python-api> │ This mode is only permitted for non-commercial use and │
  540. 121.63 s gammaloop-nextest-python-api> │ is limited to one instance and core per machine. │
  541. 121.63 s gammaloop-nextest-python-api> │ │
  542. 121.63 s gammaloop-nextest-python-api> │ Hobbyists can easily acquire a free license key │
  543. 121.63 s gammaloop-nextest-python-api> │ that unlocks all cores and removes this banner: │
  544. 121.63 s gammaloop-nextest-python-api> │ │
  545. 121.63 s gammaloop-nextest-python-api> │ from symbolica import * │
  546. 121.63 s gammaloop-nextest-python-api> │ request_hobbyist_license('YOUR_NAME', 'YOUR_EMAIL') │
  547. 121.63 s gammaloop-nextest-python-api> │ │
  548. 121.63 s gammaloop-nextest-python-api> │ All other users can obtain a free 30-day trial key: │
  549. 121.63 s gammaloop-nextest-python-api> │ │
  550. 121.63 s gammaloop-nextest-python-api> │ from symbolica import * │
  551. 121.63 s gammaloop-nextest-python-api> │ request_trial_license('NAME', 'EMAIL', 'EMPLOYER') │
  552. 121.63 s gammaloop-nextest-python-api> │ │
  553. 121.63 s gammaloop-nextest-python-api> │ See https://symbolica.io/docs/get_started.html#license │
  554. 121.63 s gammaloop-nextest-python-api> └────────────────────────────────────────────────────────┘
  555. 121.63 s gammaloop-nextest-python-api> ┌───────────────────────────────────────────────────────────────────────────────────────────────────────────┐
  556. 121.63 s gammaloop-nextest-python-api> │ Cannot start new unlicensed Symbolica instance since there is already another one running on the machine. │
  557. 121.63 s gammaloop-nextest-python-api> └───────────────────────────────────────────────────────────────────────────────────────────────────────────┘
  558. 121.63 s gammaloop-nextest-python-api>
  559. 121.63 s gammaloop-nextest-python-api> stderr:
  560. 121.63 s gammaloop-nextest-python-api>
  561. 121.63 s gammaloop-nextest-python-api> ┌───────────────────────────────────────────────────────────┐
  562. 121.63 s gammaloop-nextest-python-api> │ Could not resolve the IP of the Symbolica license server. │
  563. 121.63 s gammaloop-nextest-python-api> │ │
  564. 121.63 s gammaloop-nextest-python-api> │ Please check your DNS configuration. │
  565. 121.63 s gammaloop-nextest-python-api> └───────────────────────────────────────────────────────────┘
  566. 121.63 s gammaloop-nextest-python-api> Error: failed to lookup address information: Temporary failure in name resolution
  567. 121.63 s gammaloop-nextest-python-api>
  568. 121.63 s gammaloop-nextest-python-api>
  569. 121.63 s gammaloop-nextest-python-api> Location:
  570. 121.63 s gammaloop-nextest-python-api> tests/tests/test_python_api.rs:156:20
  571. 121.63 s gammaloop-nextest-python-api>
  572. 121.71 s gammaloop-nextest-python-api> FAIL [ 0.205s] (4/5) gammaloop-integration-tests::test_python_api python_evaluate_sample_honors_generate_events_and_observable_snapshots
  573. 121.71 s gammaloop-nextest-python-api> stdout ---
  574. 121.71 s gammaloop-nextest-python-api>
  575. 121.71 s gammaloop-nextest-python-api> running 1 test
  576. 121.71 s gammaloop-nextest-python-api> test python_evaluate_sample_honors_generate_events_and_observable_snapshots ... FAILED
  577. 121.71 s gammaloop-nextest-python-api>
  578. 121.71 s gammaloop-nextest-python-api> failures:
  579. 121.71 s gammaloop-nextest-python-api>
  580. 121.71 s gammaloop-nextest-python-api> failures:
  581. 121.71 s gammaloop-nextest-python-api> python_evaluate_sample_honors_generate_events_and_observable_snapshots
  582. 121.71 s gammaloop-nextest-python-api>
  583. 121.71 s gammaloop-nextest-python-api> test result: FAILED. 0 passed; 1 failed; 0 ignored; 0 measured; 4 filtered out; finished in 0.20s
  584. 121.71 s gammaloop-nextest-python-api>
  585. 121.71 s gammaloop-nextest-python-api> stderr ---
  586. 121.71 s gammaloop-nextest-python-api> Error: Python API test subprocess failed.
  587. 121.71 s gammaloop-nextest-python-api> stdout:
  588. 121.71 s gammaloop-nextest-python-api> ┌────────────────────────────────────────────────────────┐
  589. 121.71 s gammaloop-nextest-python-api> │ You are running a restricted Symbolica instance. │
  590. 121.71 s gammaloop-nextest-python-api> │ │
  591. 121.71 s gammaloop-nextest-python-api> │ This mode is only permitted for non-commercial use and │
  592. 121.71 s gammaloop-nextest-python-api> │ is limited to one instance and core per machine. │
  593. 121.71 s gammaloop-nextest-python-api> │ │
  594. 121.71 s gammaloop-nextest-python-api> │ Hobbyists can easily acquire a free license key │
  595. 121.71 s gammaloop-nextest-python-api> │ that unlocks all cores and removes this banner: │
  596. 121.71 s gammaloop-nextest-python-api> │ │
  597. 121.71 s gammaloop-nextest-python-api> │ from symbolica import * │
  598. 121.71 s gammaloop-nextest-python-api> │ request_hobbyist_license('YOUR_NAME', 'YOUR_EMAIL') │
  599. 121.71 s gammaloop-nextest-python-api> │ │
  600. 121.71 s gammaloop-nextest-python-api> │ All other users can obtain a free 30-day trial key: │
  601. 121.71 s gammaloop-nextest-python-api> │ │
  602. 121.71 s gammaloop-nextest-python-api> │ from symbolica import * │
  603. 121.71 s gammaloop-nextest-python-api> │ request_trial_license('NAME', 'EMAIL', 'EMPLOYER') │
  604. 121.71 s gammaloop-nextest-python-api> │ │
  605. 121.71 s gammaloop-nextest-python-api> │ See https://symbolica.io/docs/get_started.html#license │
  606. 121.71 s gammaloop-nextest-python-api> └────────────────────────────────────────────────────────┘
  607. 121.71 s gammaloop-nextest-python-api> ┌───────────────────────────────────────────────────────────────────────────────────────────────────────────┐
  608. 121.71 s gammaloop-nextest-python-api> │ Cannot start new unlicensed Symbolica instance since there is already another one running on the machine. │
  609. 121.71 s gammaloop-nextest-python-api> └───────────────────────────────────────────────────────────────────────────────────────────────────────────┘
  610. 121.71 s gammaloop-nextest-python-api>
  611. 121.71 s gammaloop-nextest-python-api> stderr:
  612. 121.71 s gammaloop-nextest-python-api>
  613. 121.71 s gammaloop-nextest-python-api> ┌───────────────────────────────────────────────────────────┐
  614. 121.71 s gammaloop-nextest-python-api> │ Could not resolve the IP of the Symbolica license server. │
  615. 121.71 s gammaloop-nextest-python-api> │ │
  616. 121.71 s gammaloop-nextest-python-api> │ Please check your DNS configuration. │
  617. 121.71 s gammaloop-nextest-python-api> └───────────────────────────────────────────────────────────┘
  618. 121.71 s gammaloop-nextest-python-api> Error: failed to lookup address information: Temporary failure in name resolution
  619. 121.71 s gammaloop-nextest-python-api> [2026-09-03 15:33:22.333] @gammaloop_api::se... INFO : Running command import model sm-default
  620. 121.71 s gammaloop-nextest-python-api> [2026-09-03 15:33:22.333] @import::model INFO : Loading built-in JSON model sm-default
  621. 121.71 s gammaloop-nextest-python-api> [2026-09-03 15:33:22.364] @gammalooprs::model INFO : The following 11 external parameters were forced to zero by the restriction card:
  622. 121.71 s gammaloop-nextest-python-api> lamWS, AWS, rhoWS, etaWS, ymc, yme, ymm, MC, Me, MM, WTau
  623. 121.71 s gammaloop-nextest-python-api> [2026-09-03 15:33:22.364] @gammalooprs::model INFO : The following 34 vertex rules were removed by the restriction card:
  624. 121.71 s gammaloop-nextest-python-api> V_82 -> (c~, d, G+) | V_83 -> (t~, d, G+) | V_84 -> (c~, s, G+) | V_85 -> (t~, s, G+) | V_86 -> (u~, b, G+) | V_87 -> (c~, b, G+) | V_90 -> (c~, d, W+) | V_91 -> (t~, d, W+) | V_92 -> (u~, s, W+) | V_94 -> (t~, s, W+) | V_95 -> (u~, b, W+) | V_96 -> (c~, b, W+) | V_101 -> (e+, e-, G0) | V_102 -> (mu+, mu-, G0) | V_104 -> (e+, e-, H) | V_105 -> (mu+, mu-, H) | V_110 -> (ve~, e-, G+) | V_111 -> (vm~, mu-, G+) | V_116 -> (b~, u, G-) | V_117 -> (d~, c, G-) | V_118 -> (s~, c, G-) | V_119 -> (b~, c, G-) | V_120 -> (d~, t, G-) | V_121 -> (s~, t, G-) | V_124 -> (s~, u, W-) | V_125 -> (b~, u, W-) | V_126 -> (d~, c, W-) | V_128 -> (b~, c, W-) | V_129 -> (d~, t, W-) | V_130 -> (s~, t, W-) | V_138 -> (c~, c, G0) | V_140 -> (c~, c, H) | V_145 -> (e+, ve, G-) | V_146 -> (mu+, vm, G-)
  625. 121.71 s gammaloop-nextest-python-api> [2026-09-03 15:33:22.364] @gammalooprs::model INFO : The following 36 couplings were removed by the restriction card:
  626. 121.71 s gammaloop-nextest-python-api> GC_13, GC_14, GC_16, GC_17, GC_18, GC_19, GC_20, GC_22, GC_23, GC_24, GC_25, GC_26, GC_28, GC_29, GC_42, GC_43, GC_44, GC_46, GC_47, GC_48, GC_84, GC_85, GC_86, GC_87, GC_88, GC_89, GC_90, GC_91, GC_92, GC_93, GC_101, GC_102, GC_103, GC_105, GC_106, GC_107
  627. 121.71 s gammaloop-nextest-python-api> [2026-09-03 15:33:22.364] @gammaloop_api::se... INFO : Running command set default-runtime kv kinematics.externals='{"type":"constant","data":{"momenta":[[32.0,0.0,0.0,32.0],[32.0,0.0,0.0,-32.0]],"helicities":[1,1]}}'
  628. 121.71 s gammaloop-nextest-python-api> [2026-09-03 15:33:22.365] @gammaloop_api::se... INFO : Running command set default-runtime kv subtraction.disable_threshold_subtraction=true
  629. 121.71 s gammaloop-nextest-python-api> [2026-09-03 15:33:22.366] @gammaloop_api::se... INFO : Running command generate xs e+ e- > d d~ g | e- a d g QED^2==4 [{{2}} QCD=0] --numerator-grouping group_identical_graphs_up_to_sign --clear-existing-processes --only-diagrams
  630. 121.71 s gammaloop-nextest-python-api> [2026-09-03 15:33:22.368] @feyngen::diagram_... INFO : 0s | Δ=0s | Starting Feynman graph generation with Symbolica...
  631. 121.71 s gammaloop-nextest-python-api> [2026-09-03 15:33:22.370] @feyngen::diagram_... INFO : 0s | Δ=0s | Number of graphs resulting from Symbolica generation: 246
  632. 121.71 s gammaloop-nextest-python-api> [2026-09-03 15:33:22.370] @feyngen::diagram_... INFO : 0s | Δ=0s | Number of graphs retained after enforcing supergraph particle content: 8
  633. 121.71 s gammaloop-nextest-python-api> [2026-09-03 15:33:22.370] @feyngen::diagram_... INFO : 0s | Δ=0s | Number of graphs retained after removal of vetoed topologies: 8
  634. 121.71 s gammaloop-nextest-python-api> [2026-09-03 15:33:22.371] @feyngen::diagram_... INFO : 0s | Δ=0s | Number of graphs after vertex info assignment: 8
  635. 121.71 s gammaloop-nextest-python-api> [2026-09-03 15:33:22.371] @feyngen::diagram_... INFO : 0s | Δ=0s | Number of graphs after all complete graphs filters are applied: 8
  636. 121.71 s gammaloop-nextest-python-api>
  637. 121.71 s gammaloop-nextest-python-api>
  638. 121.71 s gammaloop-nextest-python-api> Location:
  639. 121.71 s gammaloop-nextest-python-api> tests/tests/test_python_api.rs:156:20
  640. 121.71 s gammaloop-nextest-python-api>
  641. 121.72 s gammaloop-nextest-python-api> FAIL [ 0.219s] (5/5) gammaloop-integration-tests::test_python_api python_settings_wrappers_expose_nested_runtime_and_global_settings
  642. 121.72 s gammaloop-nextest-python-api> stdout ---
  643. 121.72 s gammaloop-nextest-python-api>
  644. 121.72 s gammaloop-nextest-python-api> running 1 test
  645. 121.72 s gammaloop-nextest-python-api> test python_settings_wrappers_expose_nested_runtime_and_global_settings ... FAILED
  646. 121.72 s gammaloop-nextest-python-api>
  647. 121.72 s gammaloop-nextest-python-api> failures:
  648. 121.72 s gammaloop-nextest-python-api>
  649. 121.72 s gammaloop-nextest-python-api> failures:
  650. 121.72 s gammaloop-nextest-python-api> python_settings_wrappers_expose_nested_runtime_and_global_settings
  651. 121.72 s gammaloop-nextest-python-api>
  652. 121.72 s gammaloop-nextest-python-api> test result: FAILED. 0 passed; 1 failed; 0 ignored; 0 measured; 4 filtered out; finished in 0.22s
  653. 121.72 s gammaloop-nextest-python-api>
  654. 121.72 s gammaloop-nextest-python-api> stderr ---
  655. 121.72 s gammaloop-nextest-python-api> Error: Python API test subprocess failed.
  656. 121.72 s gammaloop-nextest-python-api> stdout:
  657. 121.72 s gammaloop-nextest-python-api> ┌────────────────────────────────────────────────────────┐
  658. 121.72 s gammaloop-nextest-python-api> │ You are running a restricted Symbolica instance. │
  659. 121.72 s gammaloop-nextest-python-api> │ │
  660. 121.72 s gammaloop-nextest-python-api> │ This mode is only permitted for non-commercial use and │
  661. 121.72 s gammaloop-nextest-python-api> │ is limited to one instance and core per machine. │
  662. 121.72 s gammaloop-nextest-python-api> │ │
  663. 121.72 s gammaloop-nextest-python-api> │ Hobbyists can easily acquire a free license key │
  664. 121.72 s gammaloop-nextest-python-api> │ that unlocks all cores and removes this banner: │
  665. 121.72 s gammaloop-nextest-python-api> │ │
  666. 121.72 s gammaloop-nextest-python-api> │ from symbolica import * │
  667. 121.72 s gammaloop-nextest-python-api> │ request_hobbyist_license('YOUR_NAME', 'YOUR_EMAIL') │
  668. 121.72 s gammaloop-nextest-python-api> │ │
  669. 121.72 s gammaloop-nextest-python-api> │ All other users can obtain a free 30-day trial key: │
  670. 121.72 s gammaloop-nextest-python-api> │ │
  671. 121.72 s gammaloop-nextest-python-api> │ from symbolica import * │
  672. 121.72 s gammaloop-nextest-python-api> │ request_trial_license('NAME', 'EMAIL', 'EMPLOYER') │
  673. 121.72 s gammaloop-nextest-python-api> │ │
  674. 121.72 s gammaloop-nextest-python-api> │ See https://symbolica.io/docs/get_started.html#license │
  675. 121.72 s gammaloop-nextest-python-api> └────────────────────────────────────────────────────────┘
  676. 121.72 s gammaloop-nextest-python-api> ┌───────────────────────────────────────────────────────────────────────────────────────────────────────────┐
  677. 121.72 s gammaloop-nextest-python-api> │ Cannot start new unlicensed Symbolica instance since there is already another one running on the machine. │
  678. 121.72 s gammaloop-nextest-python-api> └───────────────────────────────────────────────────────────────────────────────────────────────────────────┘
  679. 121.72 s gammaloop-nextest-python-api>
  680. 121.72 s gammaloop-nextest-python-api> stderr:
  681. 121.72 s gammaloop-nextest-python-api>
  682. 121.72 s gammaloop-nextest-python-api> ┌───────────────────────────────────────────────────────────┐
  683. 121.72 s gammaloop-nextest-python-api> │ Could not resolve the IP of the Symbolica license server. │
  684. 121.72 s gammaloop-nextest-python-api> │ │
  685. 121.72 s gammaloop-nextest-python-api> │ Please check your DNS configuration. │
  686. 121.72 s gammaloop-nextest-python-api> └───────────────────────────────────────────────────────────┘
  687. 121.72 s gammaloop-nextest-python-api> Error: failed to lookup address information: Temporary failure in name resolution
  688. 121.72 s gammaloop-nextest-python-api>
  689. 121.72 s gammaloop-nextest-python-api>
  690. 121.72 s gammaloop-nextest-python-api> Location:
  691. 121.72 s gammaloop-nextest-python-api> tests/tests/test_python_api.rs:156:20
  692. 121.72 s gammaloop-nextest-python-api>
  693. 121.72 s gammaloop-nextest-python-api> ------------
  694. 121.72 s gammaloop-nextest-python-api> Summary [ 0.219s] 5 tests run: 0 passed, 5 failed, 0 skipped
  695. 121.72 s gammaloop-nextest-python-api> FAIL [ 0.104s] (1/5) gammaloop-integration-tests::test_python_api python_evaluate_sample_preserves_graph_grouping_and_incoming_pdgs
  696. 121.72 s gammaloop-nextest-python-api> stdout ---
  697. 121.72 s gammaloop-nextest-python-api>
  698. 121.72 s gammaloop-nextest-python-api> running 1 test
  699. 121.72 s gammaloop-nextest-python-api> test python_evaluate_sample_preserves_graph_grouping_and_incoming_pdgs ... FAILED
  700. 121.72 s gammaloop-nextest-python-api>
  701. 121.72 s gammaloop-nextest-python-api> failures:
  702. 121.72 s gammaloop-nextest-python-api>
  703. 121.72 s gammaloop-nextest-python-api> failures:
  704. 121.72 s gammaloop-nextest-python-api> python_evaluate_sample_preserves_graph_grouping_and_incoming_pdgs
  705. 121.72 s gammaloop-nextest-python-api>
  706. 121.72 s gammaloop-nextest-python-api> test result: FAILED. 0 passed; 1 failed; 0 ignored; 0 measured; 4 filtered out; finished in 0.10s
  707. 121.72 s gammaloop-nextest-python-api>
  708. 121.72 s gammaloop-nextest-python-api> stderr ---
  709. 121.72 s gammaloop-nextest-python-api> Error: Python API test subprocess failed.
  710. 121.72 s gammaloop-nextest-python-api> stdout:
  711. 121.72 s gammaloop-nextest-python-api> ┌────────────────────────────────────────────────────────┐
  712. 121.72 s gammaloop-nextest-python-api> │ You are running a restricted Symbolica instance. │
  713. 121.72 s gammaloop-nextest-python-api> │ │
  714. 121.72 s gammaloop-nextest-python-api> │ This mode is only permitted for non-commercial use and │
  715. 121.72 s gammaloop-nextest-python-api> │ is limited to one instance and core per machine. │
  716. 121.72 s gammaloop-nextest-python-api> │ │
  717. 121.72 s gammaloop-nextest-python-api> │ Hobbyists can easily acquire a free license key │
  718. 121.72 s gammaloop-nextest-python-api> │ that unlocks all cores and removes this banner: │
  719. 121.72 s gammaloop-nextest-python-api> │ │
  720. 121.72 s gammaloop-nextest-python-api> │ from symbolica import * │
  721. 121.72 s gammaloop-nextest-python-api> │ request_hobbyist_license('YOUR_NAME', 'YOUR_EMAIL') │
  722. 121.72 s gammaloop-nextest-python-api> │ │
  723. 121.72 s gammaloop-nextest-python-api> │ All other users can obtain a free 30-day trial key: │
  724. 121.72 s gammaloop-nextest-python-api> │ │
  725. 121.73 s gammaloop-nextest-python-api> │ from symbolica import * │
  726. 121.73 s gammaloop-nextest-python-api> │ request_trial_license('NAME', 'EMAIL', 'EMPLOYER') │
  727. 121.73 s gammaloop-nextest-python-api> │ │
  728. 121.73 s gammaloop-nextest-python-api> │ See https://symbolica.io/docs/get_started.html#license │
  729. 121.73 s gammaloop-nextest-python-api> └────────────────────────────────────────────────────────┘
  730. 121.73 s gammaloop-nextest-python-api> ┌───────────────────────────────────────────────────────────────────────────────────────────────────────────┐
  731. 121.73 s gammaloop-nextest-python-api> │ Cannot start new unlicensed Symbolica instance since there is already another one running on the machine. │
  732. 121.73 s gammaloop-nextest-python-api> └───────────────────────────────────────────────────────────────────────────────────────────────────────────┘
  733. 121.73 s gammaloop-nextest-python-api>
  734. 121.73 s gammaloop-nextest-python-api> stderr:
  735. 121.73 s gammaloop-nextest-python-api>
  736. 121.73 s gammaloop-nextest-python-api> ┌───────────────────────────────────────────────────────────┐
  737. 121.73 s gammaloop-nextest-python-api> │ Could not resolve the IP of the Symbolica license server. │
  738. 121.73 s gammaloop-nextest-python-api> │ │
  739. 121.73 s gammaloop-nextest-python-api> │ Please check your DNS configuration. │
  740. 121.73 s gammaloop-nextest-python-api> └───────────────────────────────────────────────────────────┘
  741. 121.73 s gammaloop-nextest-python-api> Error: failed to lookup address information: Temporary failure in name resolution
  742. 121.73 s gammaloop-nextest-python-api>
  743. 121.73 s gammaloop-nextest-python-api>
  744. 121.73 s gammaloop-nextest-python-api> Location:
  745. 121.73 s gammaloop-nextest-python-api> tests/tests/test_python_api.rs:156:20
  746. 121.73 s gammaloop-nextest-python-api>
  747. 121.73 s gammaloop-nextest-python-api> FAIL [ 0.109s] (2/5) gammaloop-integration-tests::test_python_api python_session_getters_return_live_toml_and_command_blocks
  748. 121.73 s gammaloop-nextest-python-api> stdout ---
  749. 121.73 s gammaloop-nextest-python-api>
  750. 121.73 s gammaloop-nextest-python-api> running 1 test
  751. 121.73 s gammaloop-nextest-python-api> test python_session_getters_return_live_toml_and_command_blocks ... FAILED
  752. 121.73 s gammaloop-nextest-python-api>
  753. 121.73 s gammaloop-nextest-python-api> failures:
  754. 121.73 s gammaloop-nextest-python-api>
  755. 121.73 s gammaloop-nextest-python-api> failures:
  756. 121.73 s gammaloop-nextest-python-api> python_session_getters_return_live_toml_and_command_blocks
  757. 121.73 s gammaloop-nextest-python-api>
  758. 121.73 s gammaloop-nextest-python-api> test result: FAILED. 0 passed; 1 failed; 0 ignored; 0 measured; 4 filtered out; finished in 0.10s
  759. 121.73 s gammaloop-nextest-python-api>
  760. 121.73 s gammaloop-nextest-python-api> stderr ---
  761. 121.73 s gammaloop-nextest-python-api> Error: Python API test subprocess failed.
  762. 121.73 s gammaloop-nextest-python-api> stdout:
  763. 121.73 s gammaloop-nextest-python-api> ┌────────────────────────────────────────────────────────┐
  764. 121.73 s gammaloop-nextest-python-api> │ You are running a restricted Symbolica instance. │
  765. 121.73 s gammaloop-nextest-python-api> │ │
  766. 121.73 s gammaloop-nextest-python-api> │ This mode is only permitted for non-commercial use and │
  767. 121.73 s gammaloop-nextest-python-api> │ is limited to one instance and core per machine. │
  768. 121.73 s gammaloop-nextest-python-api> │ │
  769. 121.73 s gammaloop-nextest-python-api> │ Hobbyists can easily acquire a free license key │
  770. 121.73 s gammaloop-nextest-python-api> │ that unlocks all cores and removes this banner: │
  771. 121.73 s gammaloop-nextest-python-api> │ │
  772. 121.73 s gammaloop-nextest-python-api> │ from symbolica import * │
  773. 121.73 s gammaloop-nextest-python-api> │ request_hobbyist_license('YOUR_NAME', 'YOUR_EMAIL') │
  774. 121.73 s gammaloop-nextest-python-api> │ │
  775. 121.73 s gammaloop-nextest-python-api> │ All other users can obtain a free 30-day trial key: │
  776. 121.73 s gammaloop-nextest-python-api> │ │
  777. 121.73 s gammaloop-nextest-python-api> │ from symbolica import * │
  778. 121.73 s gammaloop-nextest-python-api> │ request_trial_license('NAME', 'EMAIL', 'EMPLOYER') │
  779. 121.73 s gammaloop-nextest-python-api> │ │
  780. 121.73 s gammaloop-nextest-python-api> │ See https://symbolica.io/docs/get_started.html#license │
  781. 121.73 s gammaloop-nextest-python-api> └────────────────────────────────────────────────────────┘
  782. 121.73 s gammaloop-nextest-python-api> ┌───────────────────────────────────────────────────────────────────────────────────────────────────────────┐
  783. 121.73 s gammaloop-nextest-python-api> │ Cannot start new unlicensed Symbolica instance since there is already another one running on the machine. │
  784. 121.73 s gammaloop-nextest-python-api> └───────────────────────────────────────────────────────────────────────────────────────────────────────────┘
  785. 121.73 s gammaloop-nextest-python-api>
  786. 121.73 s gammaloop-nextest-python-api> stderr:
  787. 121.73 s gammaloop-nextest-python-api>
  788. 121.73 s gammaloop-nextest-python-api> ┌───────────────────────────────────────────────────────────┐
  789. 121.73 s gammaloop-nextest-python-api> │ Could not resolve the IP of the Symbolica license server. │
  790. 121.73 s gammaloop-nextest-python-api> │ │
  791. 121.73 s gammaloop-nextest-python-api> │ Please check your DNS configuration. │
  792. 121.73 s gammaloop-nextest-python-api> └───────────────────────────────────────────────────────────┘
  793. 121.73 s gammaloop-nextest-python-api> Error: failed to lookup address information: Temporary failure in name resolution
  794. 121.73 s gammaloop-nextest-python-api>
  795. 121.73 s gammaloop-nextest-python-api>
  796. 121.73 s gammaloop-nextest-python-api> Location:
  797. 121.73 s gammaloop-nextest-python-api> tests/tests/test_python_api.rs:156:20
  798. 121.73 s gammaloop-nextest-python-api>
  799. 121.73 s gammaloop-nextest-python-api> FAIL [ 0.125s] (3/5) gammaloop-integration-tests::test_python_api python_evaluate_samples_batch_and_momentum_space_have_expected_shape
  800. 121.73 s gammaloop-nextest-python-api> stdout ---
  801. 121.73 s gammaloop-nextest-python-api>
  802. 121.73 s gammaloop-nextest-python-api> running 1 test
  803. 121.73 s gammaloop-nextest-python-api> test python_evaluate_samples_batch_and_momentum_space_have_expected_shape ... FAILED
  804. 121.73 s gammaloop-nextest-python-api>
  805. 121.73 s gammaloop-nextest-python-api> failures:
  806. 121.73 s gammaloop-nextest-python-api>
  807. 121.73 s gammaloop-nextest-python-api> failures:
  808. 121.73 s gammaloop-nextest-python-api> python_evaluate_samples_batch_and_momentum_space_have_expected_shape
  809. 121.73 s gammaloop-nextest-python-api>
  810. 121.73 s gammaloop-nextest-python-api> test result: FAILED. 0 passed; 1 failed; 0 ignored; 0 measured; 4 filtered out; finished in 0.12s
  811. 121.73 s gammaloop-nextest-python-api>
  812. 121.73 s gammaloop-nextest-python-api> stderr ---
  813. 121.73 s gammaloop-nextest-python-api> Error: Python API test subprocess failed.
  814. 121.73 s gammaloop-nextest-python-api> stdout:
  815. 121.73 s gammaloop-nextest-python-api> ┌────────────────────────────────────────────────────────┐
  816. 121.73 s gammaloop-nextest-python-api> │ You are running a restricted Symbolica instance. │
  817. 121.73 s gammaloop-nextest-python-api> │ │
  818. 121.73 s gammaloop-nextest-python-api> │ This mode is only permitted for non-commercial use and │
  819. 121.73 s gammaloop-nextest-python-api> │ is limited to one instance and core per machine. │
  820. 121.73 s gammaloop-nextest-python-api> │ │
  821. 121.73 s gammaloop-nextest-python-api> │ Hobbyists can easily acquire a free license key │
  822. 121.73 s gammaloop-nextest-python-api> │ that unlocks all cores and removes this banner: │
  823. 121.73 s gammaloop-nextest-python-api> │ │
  824. 121.73 s gammaloop-nextest-python-api> │ from symbolica import * │
  825. 121.73 s gammaloop-nextest-python-api> │ request_hobbyist_license('YOUR_NAME', 'YOUR_EMAIL') │
  826. 121.73 s gammaloop-nextest-python-api> │ │
  827. 121.73 s gammaloop-nextest-python-api> │ All other users can obtain a free 30-day trial key: │
  828. 121.73 s gammaloop-nextest-python-api> │ │
  829. 121.73 s gammaloop-nextest-python-api> │ from symbolica import * │
  830. 121.73 s gammaloop-nextest-python-api> │ request_trial_license('NAME', 'EMAIL', 'EMPLOYER') │
  831. 121.73 s gammaloop-nextest-python-api> │ │
  832. 121.73 s gammaloop-nextest-python-api> │ See https://symbolica.io/docs/get_started.html#license │
  833. 121.73 s gammaloop-nextest-python-api> └────────────────────────────────────────────────────────┘
  834. 121.73 s gammaloop-nextest-python-api> ┌───────────────────────────────────────────────────────────────────────────────────────────────────────────┐
  835. 121.73 s gammaloop-nextest-python-api> │ Cannot start new unlicensed Symbolica instance since there is already another one running on the machine. │
  836. 121.73 s gammaloop-nextest-python-api> └───────────────────────────────────────────────────────────────────────────────────────────────────────────┘
  837. 121.73 s gammaloop-nextest-python-api>
  838. 121.73 s gammaloop-nextest-python-api> stderr:
  839. 121.73 s gammaloop-nextest-python-api>
  840. 121.73 s gammaloop-nextest-python-api> ┌───────────────────────────────────────────────────────────┐
  841. 121.73 s gammaloop-nextest-python-api> │ Could not resolve the IP of the Symbolica license server. │
  842. 121.73 s gammaloop-nextest-python-api> │ │
  843. 121.73 s gammaloop-nextest-python-api> │ Please check your DNS configuration. │
  844. 121.73 s gammaloop-nextest-python-api> └───────────────────────────────────────────────────────────┘
  845. 121.73 s gammaloop-nextest-python-api> Error: failed to lookup address information: Temporary failure in name resolution
  846. 121.73 s gammaloop-nextest-python-api>
  847. 121.73 s gammaloop-nextest-python-api>
  848. 121.73 s gammaloop-nextest-python-api> Location:
  849. 121.73 s gammaloop-nextest-python-api> tests/tests/test_python_api.rs:156:20
  850. 121.73 s gammaloop-nextest-python-api>
  851. 121.73 s gammaloop-nextest-python-api> FAIL [ 0.205s] (4/5) gammaloop-integration-tests::test_python_api python_evaluate_sample_honors_generate_events_and_observable_snapshots
  852. 121.73 s gammaloop-nextest-python-api> stdout ---
  853. 121.73 s gammaloop-nextest-python-api>
  854. 121.73 s gammaloop-nextest-python-api> running 1 test
  855. 121.73 s gammaloop-nextest-python-api> test python_evaluate_sample_honors_generate_events_and_observable_snapshots ... FAILED
  856. 121.73 s gammaloop-nextest-python-api>
  857. 121.73 s gammaloop-nextest-python-api> failures:
  858. 121.73 s gammaloop-nextest-python-api>
  859. 121.73 s gammaloop-nextest-python-api> failures:
  860. 121.73 s gammaloop-nextest-python-api> python_evaluate_sample_honors_generate_events_and_observable_snapshots
  861. 121.73 s gammaloop-nextest-python-api>
  862. 121.73 s gammaloop-nextest-python-api> test result: FAILED. 0 passed; 1 failed; 0 ignored; 0 measured; 4 filtered out; finished in 0.20s
  863. 121.73 s gammaloop-nextest-python-api>
  864. 121.73 s gammaloop-nextest-python-api> stderr ---
  865. 121.73 s gammaloop-nextest-python-api> Error: Python API test subprocess failed.
  866. 121.73 s gammaloop-nextest-python-api> stdout:
  867. 121.73 s gammaloop-nextest-python-api> ┌────────────────────────────────────────────────────────┐
  868. 121.73 s gammaloop-nextest-python-api> │ You are running a restricted Symbolica instance. │
  869. 121.73 s gammaloop-nextest-python-api> │ │
  870. 121.73 s gammaloop-nextest-python-api> │ This mode is only permitted for non-commercial use and │
  871. 121.73 s gammaloop-nextest-python-api> │ is limited to one instance and core per machine. │
  872. 121.73 s gammaloop-nextest-python-api> │ │
  873. 121.73 s gammaloop-nextest-python-api> │ Hobbyists can easily acquire a free license key │
  874. 121.73 s gammaloop-nextest-python-api> │ that unlocks all cores and removes this banner: │
  875. 121.73 s gammaloop-nextest-python-api> │ │
  876. 121.73 s gammaloop-nextest-python-api> │ from symbolica import * │
  877. 121.73 s gammaloop-nextest-python-api> │ request_hobbyist_license('YOUR_NAME', 'YOUR_EMAIL') │
  878. 121.73 s gammaloop-nextest-python-api> │ │
  879. 121.73 s gammaloop-nextest-python-api> │ All other users can obtain a free 30-day trial key: │
  880. 121.73 s gammaloop-nextest-python-api> │ │
  881. 121.73 s gammaloop-nextest-python-api> │ from symbolica import * │
  882. 121.73 s gammaloop-nextest-python-api> │ request_trial_license('NAME', 'EMAIL', 'EMPLOYER') │
  883. 121.73 s gammaloop-nextest-python-api> │ │
  884. 121.73 s gammaloop-nextest-python-api> │ See https://symbolica.io/docs/get_started.html#license │
  885. 121.73 s gammaloop-nextest-python-api> └────────────────────────────────────────────────────────┘
  886. 121.73 s gammaloop-nextest-python-api> ┌───────────────────────────────────────────────────────────────────────────────────────────────────────────┐
  887. 121.73 s gammaloop-nextest-python-api> │ Cannot start new unlicensed Symbolica instance since there is already another one running on the machine. │
  888. 121.73 s gammaloop-nextest-python-api> └───────────────────────────────────────────────────────────────────────────────────────────────────────────┘
  889. 121.73 s gammaloop-nextest-python-api>
  890. 121.73 s gammaloop-nextest-python-api> stderr:
  891. 121.73 s gammaloop-nextest-python-api>
  892. 121.73 s gammaloop-nextest-python-api> ┌───────────────────────────────────────────────────────────┐
  893. 121.73 s gammaloop-nextest-python-api> │ Could not resolve the IP of the Symbolica license server. │
  894. 121.73 s gammaloop-nextest-python-api> │ │
  895. 121.73 s gammaloop-nextest-python-api> │ Please check your DNS configuration. │
  896. 121.73 s gammaloop-nextest-python-api> └───────────────────────────────────────────────────────────┘
  897. 121.73 s gammaloop-nextest-python-api> Error: failed to lookup address information: Temporary failure in name resolution
  898. 121.73 s gammaloop-nextest-python-api> [2026-09-03 15:33:22.333] @gammaloop_api::se... INFO : Running command import model sm-default
  899. 121.73 s gammaloop-nextest-python-api> [2026-09-03 15:33:22.333] @import::model INFO : Loading built-in JSON model sm-default
  900. 121.73 s gammaloop-nextest-python-api> [2026-09-03 15:33:22.364] @gammalooprs::model INFO : The following 11 external parameters were forced to zero by the restriction card:
  901. 121.73 s gammaloop-nextest-python-api> lamWS, AWS, rhoWS, etaWS, ymc, yme, ymm, MC, Me, MM, WTau
  902. 121.73 s gammaloop-nextest-python-api> [2026-09-03 15:33:22.364] @gammalooprs::model INFO : The following 34 vertex rules were removed by the restriction card:
  903. 121.73 s gammaloop-nextest-python-api> V_82 -> (c~, d, G+) | V_83 -> (t~, d, G+) | V_84 -> (c~, s, G+) | V_85 -> (t~, s, G+) | V_86 -> (u~, b, G+) | V_87 -> (c~, b, G+) | V_90 -> (c~, d, W+) | V_91 -> (t~, d, W+) | V_92 -> (u~, s, W+) | V_94 -> (t~, s, W+) | V_95 -> (u~, b, W+) | V_96 -> (c~, b, W+) | V_101 -> (e+, e-, G0) | V_102 -> (mu+, mu-, G0) | V_104 -> (e+, e-, H) | V_105 -> (mu+, mu-, H) | V_110 -> (ve~, e-, G+) | V_111 -> (vm~, mu-, G+) | V_116 -> (b~, u, G-) | V_117 -> (d~, c, G-) | V_118 -> (s~, c, G-) | V_119 -> (b~, c, G-) | V_120 -> (d~, t, G-) | V_121 -> (s~, t, G-) | V_124 -> (s~, u, W-) | V_125 -> (b~, u, W-) | V_126 -> (d~, c, W-) | V_128 -> (b~, c, W-) | V_129 -> (d~, t, W-) | V_130 -> (s~, t, W-) | V_138 -> (c~, c, G0) | V_140 -> (c~, c, H) | V_145 -> (e+, ve, G-) | V_146 -> (mu+, vm, G-)
  904. 121.73 s gammaloop-nextest-python-api> [2026-09-03 15:33:22.364] @gammalooprs::model INFO : The following 36 couplings were removed by the restriction card:
  905. 121.73 s gammaloop-nextest-python-api> GC_13, GC_14, GC_16, GC_17, GC_18, GC_19, GC_20, GC_22, GC_23, GC_24, GC_25, GC_26, GC_28, GC_29, GC_42, GC_43, GC_44, GC_46, GC_47, GC_48, GC_84, GC_85, GC_86, GC_87, GC_88, GC_89, GC_90, GC_91, GC_92, GC_93, GC_101, GC_102, GC_103, GC_105, GC_106, GC_107
  906. 121.73 s gammaloop-nextest-python-api> [2026-09-03 15:33:22.364] @gammaloop_api::se... INFO : Running command set default-runtime kv kinematics.externals='{"type":"constant","data":{"momenta":[[32.0,0.0,0.0,32.0],[32.0,0.0,0.0,-32.0]],"helicities":[1,1]}}'
  907. 121.73 s gammaloop-nextest-python-api> [2026-09-03 15:33:22.365] @gammaloop_api::se... INFO : Running command set default-runtime kv subtraction.disable_threshold_subtraction=true
  908. 121.73 s gammaloop-nextest-python-api> [2026-09-03 15:33:22.366] @gammaloop_api::se... INFO : Running command generate xs e+ e- > d d~ g | e- a d g QED^2==4 [{{2}} QCD=0] --numerator-grouping group_identical_graphs_up_to_sign --clear-existing-processes --only-diagrams
  909. 121.73 s gammaloop-nextest-python-api> [2026-09-03 15:33:22.368] @feyngen::diagram_... INFO : 0s | Δ=0s | Starting Feynman graph generation with Symbolica...
  910. 121.73 s gammaloop-nextest-python-api> [2026-09-03 15:33:22.370] @feyngen::diagram_... INFO : 0s | Δ=0s | Number of graphs resulting from Symbolica generation: 246
  911. 121.73 s gammaloop-nextest-python-api> [2026-09-03 15:33:22.370] @feyngen::diagram_... INFO : 0s | Δ=0s | Number of graphs retained after enforcing supergraph particle content: 8
  912. 121.73 s gammaloop-nextest-python-api> [2026-09-03 15:33:22.370] @feyngen::diagram_... INFO : 0s | Δ=0s | Number of graphs retained after removal of vetoed topologies: 8
  913. 121.73 s gammaloop-nextest-python-api> [2026-09-03 15:33:22.371] @feyngen::diagram_... INFO : 0s | Δ=0s | Number of graphs after vertex info assignment: 8
  914. 121.73 s gammaloop-nextest-python-api> [2026-09-03 15:33:22.371] @feyngen::diagram_... INFO : 0s | Δ=0s | Number of graphs after all complete graphs filters are applied: 8
  915. 121.73 s gammaloop-nextest-python-api>
  916. 121.73 s gammaloop-nextest-python-api>
  917. 121.73 s gammaloop-nextest-python-api> Location:
  918. 121.73 s gammaloop-nextest-python-api> tests/tests/test_python_api.rs:156:20
  919. 121.73 s gammaloop-nextest-python-api>
  920. 121.73 s gammaloop-nextest-python-api> FAIL [ 0.219s] (5/5) gammaloop-integration-tests::test_python_api python_settings_wrappers_expose_nested_runtime_and_global_settings
  921. 121.73 s gammaloop-nextest-python-api> stdout ---
  922. 121.73 s gammaloop-nextest-python-api>
  923. 121.73 s gammaloop-nextest-python-api> running 1 test
  924. 121.73 s gammaloop-nextest-python-api> test python_settings_wrappers_expose_nested_runtime_and_global_settings ... FAILED
  925. 121.73 s gammaloop-nextest-python-api>
  926. 121.73 s gammaloop-nextest-python-api> failures:
  927. 121.73 s gammaloop-nextest-python-api>
  928. 121.73 s gammaloop-nextest-python-api> failures:
  929. 121.73 s gammaloop-nextest-python-api> python_settings_wrappers_expose_nested_runtime_and_global_settings
  930. 121.73 s gammaloop-nextest-python-api>
  931. 121.73 s gammaloop-nextest-python-api> test result: FAILED. 0 passed; 1 failed; 0 ignored; 0 measured; 4 filtered out; finished in 0.22s
  932. 121.73 s gammaloop-nextest-python-api>
  933. 121.73 s gammaloop-nextest-python-api> stderr ---
  934. 121.73 s gammaloop-nextest-python-api> Error: Python API test subprocess failed.
  935. 121.73 s gammaloop-nextest-python-api> stdout:
  936. 121.73 s gammaloop-nextest-python-api> ┌────────────────────────────────────────────────────────┐
  937. 121.73 s gammaloop-nextest-python-api> │ You are running a restricted Symbolica instance. │
  938. 121.73 s gammaloop-nextest-python-api> │ │
  939. 121.73 s gammaloop-nextest-python-api> │ This mode is only permitted for non-commercial use and │
  940. 121.73 s gammaloop-nextest-python-api> │ is limited to one instance and core per machine. │
  941. 121.73 s gammaloop-nextest-python-api> │ │
  942. 121.73 s gammaloop-nextest-python-api> │ Hobbyists can easily acquire a free license key │
  943. 121.73 s gammaloop-nextest-python-api> │ that unlocks all cores and removes this banner: │
  944. 121.73 s gammaloop-nextest-python-api> │ │
  945. 121.73 s gammaloop-nextest-python-api> │ from symbolica import * │
  946. 121.73 s gammaloop-nextest-python-api> │ request_hobbyist_license('YOUR_NAME', 'YOUR_EMAIL') │
  947. 121.73 s gammaloop-nextest-python-api> │ │
  948. 121.73 s gammaloop-nextest-python-api> │ All other users can obtain a free 30-day trial key: │
  949. 121.73 s gammaloop-nextest-python-api> │ │
  950. 121.73 s gammaloop-nextest-python-api> │ from symbolica import * │
  951. 121.73 s gammaloop-nextest-python-api> │ request_trial_license('NAME', 'EMAIL', 'EMPLOYER') │
  952. 121.73 s gammaloop-nextest-python-api> │ │
  953. 121.73 s gammaloop-nextest-python-api> │ See https://symbolica.io/docs/get_started.html#license │
  954. 121.73 s gammaloop-nextest-python-api> └────────────────────────────────────────────────────────┘
  955. 121.73 s gammaloop-nextest-python-api> ┌───────────────────────────────────────────────────────────────────────────────────────────────────────────┐
  956. 121.73 s gammaloop-nextest-python-api> │ Cannot start new unlicensed Symbolica instance since there is already another one running on the machine. │
  957. 121.73 s gammaloop-nextest-python-api> └───────────────────────────────────────────────────────────────────────────────────────────────────────────┘
  958. 121.73 s gammaloop-nextest-python-api>
  959. 121.73 s gammaloop-nextest-python-api> stderr:
  960. 121.73 s gammaloop-nextest-python-api>
  961. 121.73 s gammaloop-nextest-python-api> ┌───────────────────────────────────────────────────────────┐
  962. 121.73 s gammaloop-nextest-python-api> │ Could not resolve the IP of the Symbolica license server. │
  963. 121.73 s gammaloop-nextest-python-api> │ │
  964. 121.73 s gammaloop-nextest-python-api> │ Please check your DNS configuration. │
  965. 121.73 s gammaloop-nextest-python-api> └───────────────────────────────────────────────────────────┘
  966. 121.73 s gammaloop-nextest-python-api> Error: failed to lookup address information: Temporary failure in name resolution
  967. 121.73 s gammaloop-nextest-python-api>
  968. 121.73 s gammaloop-nextest-python-api>
  969. 121.73 s gammaloop-nextest-python-api> Location:
  970. 121.73 s gammaloop-nextest-python-api> tests/tests/test_python_api.rs:156:20
  971. 121.73 s gammaloop-nextest-python-api>
  972. 121.76 s gammaloop-nextest-python-api> error: test run failed
  973. 121.79 s gammaloop-nextest-python-api>
  974. 121.79 s gammaloop-nextest-python-api> ========== nextest test summary ==========
  975. 121.79 s gammaloop-nextest-python-api> report: target/nextest/ci_gammaloop/junit.xml
  976. 121.79 s gammaloop-nextest-python-api> tests: 5, failures: 5, errors: 0
  977. 121.79 s gammaloop-nextest-python-api>
  978. 121.79 s gammaloop-nextest-python-api> 1. gammaloop-integration-tests::test_python_api::python_evaluate_sample_preserves_graph_grouping_and_incoming_pdgs
  979. 121.79 s gammaloop-nextest-python-api> failure: test failure with exit code 101
  980. 121.79 s gammaloop-nextest-python-api> Error: Python API test subprocess failed.
  981. 121.79 s gammaloop-nextest-python-api> stdout:
  982. 121.79 s gammaloop-nextest-python-api> ┌────────────────────────────────────────────────────────┐
  983. 121.79 s gammaloop-nextest-python-api> │ You are running a restricted Symbolica instance. │
  984. 121.79 s gammaloop-nextest-python-api> │ │
  985. 121.79 s gammaloop-nextest-python-api> │ This mode is only permitted for non-commercial use and │
  986. 121.79 s gammaloop-nextest-python-api> │ is limited to one instance and core per machine. │
  987. 121.79 s gammaloop-nextest-python-api> │ │
  988. 121.79 s gammaloop-nextest-python-api> │ Hobbyists can easily acquire a free license key │
  989. 121.79 s gammaloop-nextest-python-api> │ that unlocks all cores and removes this banner: │
  990. 121.79 s gammaloop-nextest-python-api> │ │
  991. 121.79 s gammaloop-nextest-python-api> │ from symbolica import * │
  992. 121.79 s gammaloop-nextest-python-api> │ request_hobbyist_license('YOUR_NAME', 'YOUR_EMAIL') │
  993. 121.79 s gammaloop-nextest-python-api> │ │
  994. 121.79 s gammaloop-nextest-python-api> │ All other users can obtain a free 30-day trial key: │
  995. 121.79 s gammaloop-nextest-python-api> │ │
  996. 121.79 s gammaloop-nextest-python-api> │ from symbolica import * │
  997. 121.79 s gammaloop-nextest-python-api> │ request_trial_license('NAME', 'EMAIL', 'EMPLOYER') │
  998. 121.79 s gammaloop-nextest-python-api> │ │
  999. 121.79 s gammaloop-nextest-python-api> │ See https://symbolica.io/docs/get_started.html#license │
  1000. 121.79 s gammaloop-nextest-python-api> └────────────────────────────────────────────────────────┘
  1001. 121.79 s gammaloop-nextest-python-api> ┌───────────────────────────────────────────────────────────────────────────────────────────────────────────┐
  1002. 121.79 s gammaloop-nextest-python-api> │ Cannot start new unlicensed Symbolica instance since there is already another one running on the machine. │
  1003. 121.79 s gammaloop-nextest-python-api> └───────────────────────────────────────────────────────────────────────────────────────────────────────────┘
  1004. 121.79 s gammaloop-nextest-python-api>
  1005. 121.79 s gammaloop-nextest-python-api> stderr:
  1006. 121.79 s gammaloop-nextest-python-api>
  1007. 121.79 s gammaloop-nextest-python-api> ┌───────────────────────────────────────────────────────────┐
  1008. 121.79 s gammaloop-nextest-python-api> │ Could not resolve the IP of the Symbolica license server. │
  1009. 121.79 s gammaloop-nextest-python-api> │ │
  1010. 121.79 s gammaloop-nextest-python-api> │ Please check your DNS configuration. │
  1011. 121.79 s gammaloop-nextest-python-api> └───────────────────────────────────────────────────────────┘
  1012. 121.79 s gammaloop-nextest-python-api> Error: failed to lookup address information: Temporary failure in name resolution
  1013. 121.79 s gammaloop-nextest-python-api>
  1014. 121.79 s gammaloop-nextest-python-api>
  1015. 121.79 s gammaloop-nextest-python-api> Location:
  1016. 121.79 s gammaloop-nextest-python-api> tests/tests/test_python_api.rs:156:20
  1017. 121.79 s gammaloop-nextest-python-api> system-out
  1018. 121.79 s gammaloop-nextest-python-api> running 1 test
  1019. 121.79 s gammaloop-nextest-python-api> test python_evaluate_sample_preserves_graph_grouping_and_incoming_pdgs ... FAILED
  1020. 121.79 s gammaloop-nextest-python-api>
  1021. 121.79 s gammaloop-nextest-python-api> failures:
  1022. 121.79 s gammaloop-nextest-python-api>
  1023. 121.79 s gammaloop-nextest-python-api> failures:
  1024. 121.79 s gammaloop-nextest-python-api> python_evaluate_sample_preserves_graph_grouping_and_incoming_pdgs
  1025. 121.79 s gammaloop-nextest-python-api>
  1026. 121.79 s gammaloop-nextest-python-api> test result: FAILED. 0 passed; 1 failed; 0 ignored; 0 measured; 4 filtered out; finished in 0.10s
  1027. 121.79 s gammaloop-nextest-python-api> system-err
  1028. 121.79 s gammaloop-nextest-python-api> Error: Python API test subprocess failed.
  1029. 121.79 s gammaloop-nextest-python-api> stdout:
  1030. 121.79 s gammaloop-nextest-python-api> ┌────────────────────────────────────────────────────────┐
  1031. 121.79 s gammaloop-nextest-python-api> │ You are running a restricted Symbolica instance. │
  1032. 121.79 s gammaloop-nextest-python-api> │ │
  1033. 121.79 s gammaloop-nextest-python-api> │ This mode is only permitted for non-commercial use and │
  1034. 121.79 s gammaloop-nextest-python-api> │ is limited to one instance and core per machine. │
  1035. 121.79 s gammaloop-nextest-python-api> │ │
  1036. 121.79 s gammaloop-nextest-python-api> │ Hobbyists can easily acquire a free license key │
  1037. 121.79 s gammaloop-nextest-python-api> │ that unlocks all cores and removes this banner: │
  1038. 121.79 s gammaloop-nextest-python-api> │ │
  1039. 121.79 s gammaloop-nextest-python-api> │ from symbolica import * │
  1040. 121.79 s gammaloop-nextest-python-api> │ request_hobbyist_license('YOUR_NAME', 'YOUR_EMAIL') │
  1041. 121.79 s gammaloop-nextest-python-api> │ │
  1042. 121.79 s gammaloop-nextest-python-api> │ All other users can obtain a free 30-day trial key: │
  1043. 121.79 s gammaloop-nextest-python-api> │ │
  1044. 121.79 s gammaloop-nextest-python-api> │ from symbolica import * │
  1045. 121.79 s gammaloop-nextest-python-api> │ request_trial_license('NAME', 'EMAIL', 'EMPLOYER') │
  1046. 121.79 s gammaloop-nextest-python-api> │ │
  1047. 121.79 s gammaloop-nextest-python-api> │ See https://symbolica.io/docs/get_started.html#license │
  1048. 121.79 s gammaloop-nextest-python-api> └────────────────────────────────────────────────────────┘
  1049. 121.79 s gammaloop-nextest-python-api> ┌───────────────────────────────────────────────────────────────────────────────────────────────────────────┐
  1050. 121.79 s gammaloop-nextest-python-api> │ Cannot start new unlicensed Symbolica instance since there is already another one running on the machine. │
  1051. 121.79 s gammaloop-nextest-python-api> └───────────────────────────────────────────────────────────────────────────────────────────────────────────┘
  1052. 121.79 s gammaloop-nextest-python-api>
  1053. 121.79 s gammaloop-nextest-python-api> stderr:
  1054. 121.79 s gammaloop-nextest-python-api>
  1055. 121.79 s gammaloop-nextest-python-api> ┌───────────────────────────────────────────────────────────┐
  1056. 121.79 s gammaloop-nextest-python-api> │ Could not resolve the IP of the Symbolica license server. │
  1057. 121.79 s gammaloop-nextest-python-api> │ │
  1058. 121.79 s gammaloop-nextest-python-api> │ Please check your DNS configuration. │
  1059. 121.79 s gammaloop-nextest-python-api> └───────────────────────────────────────────────────────────┘
  1060. 121.79 s gammaloop-nextest-python-api> Error: failed to lookup address information: Temporary failure in name resolution
  1061. 121.79 s gammaloop-nextest-python-api>
  1062. 121.79 s gammaloop-nextest-python-api>
  1063. 121.79 s gammaloop-nextest-python-api> Location:
  1064. 121.79 s gammaloop-nextest-python-api> tests/tests/test_python_api.rs:156:20
  1065. 121.79 s gammaloop-nextest-python-api>
  1066. 121.79 s gammaloop-nextest-python-api> 2. gammaloop-integration-tests::test_python_api::python_session_getters_return_live_toml_and_command_blocks
  1067. 121.79 s gammaloop-nextest-python-api> failure: test failure with exit code 101
  1068. 121.79 s gammaloop-nextest-python-api> Error: Python API test subprocess failed.
  1069. 121.79 s gammaloop-nextest-python-api> stdout:
  1070. 121.79 s gammaloop-nextest-python-api> ┌────────────────────────────────────────────────────────┐
  1071. 121.79 s gammaloop-nextest-python-api> │ You are running a restricted Symbolica instance. │
  1072. 121.79 s gammaloop-nextest-python-api> │ │
  1073. 121.79 s gammaloop-nextest-python-api> │ This mode is only permitted for non-commercial use and │
  1074. 121.79 s gammaloop-nextest-python-api> │ is limited to one instance and core per machine. │
  1075. 121.79 s gammaloop-nextest-python-api> │ │
  1076. 121.79 s gammaloop-nextest-python-api> │ Hobbyists can easily acquire a free license key │
  1077. 121.79 s gammaloop-nextest-python-api> │ that unlocks all cores and removes this banner: │
  1078. 121.79 s gammaloop-nextest-python-api> │ │
  1079. 121.79 s gammaloop-nextest-python-api> │ from symbolica import * │
  1080. 121.79 s gammaloop-nextest-python-api> │ request_hobbyist_license('YOUR_NAME', 'YOUR_EMAIL') │
  1081. 121.79 s gammaloop-nextest-python-api> │ │
  1082. 121.79 s gammaloop-nextest-python-api> │ All other users can obtain a free 30-day trial key: │
  1083. 121.79 s gammaloop-nextest-python-api> │ │
  1084. 121.79 s gammaloop-nextest-python-api> │ from symbolica import * │
  1085. 121.79 s gammaloop-nextest-python-api> │ request_trial_license('NAME', 'EMAIL', 'EMPLOYER') │
  1086. 121.79 s gammaloop-nextest-python-api> │ │
  1087. 121.79 s gammaloop-nextest-python-api> │ See https://symbolica.io/docs/get_started.html#license │
  1088. 121.79 s gammaloop-nextest-python-api> └────────────────────────────────────────────────────────┘
  1089. 121.79 s gammaloop-nextest-python-api> ┌───────────────────────────────────────────────────────────────────────────────────────────────────────────┐
  1090. 121.79 s gammaloop-nextest-python-api> │ Cannot start new unlicensed Symbolica instance since there is already another one running on the machine. │
  1091. 121.79 s gammaloop-nextest-python-api> └───────────────────────────────────────────────────────────────────────────────────────────────────────────┘
  1092. 121.79 s gammaloop-nextest-python-api>
  1093. 121.79 s gammaloop-nextest-python-api> stderr:
  1094. 121.79 s gammaloop-nextest-python-api>
  1095. 121.79 s gammaloop-nextest-python-api> ┌───────────────────────────────────────────────────────────┐
  1096. 121.79 s gammaloop-nextest-python-api> │ Could not resolve the IP of the Symbolica license server. │
  1097. 121.79 s gammaloop-nextest-python-api> │ │
  1098. 121.79 s gammaloop-nextest-python-api> │ Please check your DNS configuration. │
  1099. 121.79 s gammaloop-nextest-python-api> └───────────────────────────────────────────────────────────┘
  1100. 121.79 s gammaloop-nextest-python-api> Error: failed to lookup address information: Temporary failure in name resolution
  1101. 121.79 s gammaloop-nextest-python-api>
  1102. 121.79 s gammaloop-nextest-python-api>
  1103. 121.79 s gammaloop-nextest-python-api> Location:
  1104. 121.79 s gammaloop-nextest-python-api> tests/tests/test_python_api.rs:156:20
  1105. 121.79 s gammaloop-nextest-python-api> system-out
  1106. 121.79 s gammaloop-nextest-python-api> running 1 test
  1107. 121.79 s gammaloop-nextest-python-api> test python_session_getters_return_live_toml_and_command_blocks ... FAILED
  1108. 121.79 s gammaloop-nextest-python-api>
  1109. 121.79 s gammaloop-nextest-python-api> failures:
  1110. 121.79 s gammaloop-nextest-python-api>
  1111. 121.79 s gammaloop-nextest-python-api> failures:
  1112. 121.79 s gammaloop-nextest-python-api> python_session_getters_return_live_toml_and_command_blocks
  1113. 121.79 s gammaloop-nextest-python-api>
  1114. 121.79 s gammaloop-nextest-python-api> test result: FAILED. 0 passed; 1 failed; 0 ignored; 0 measured; 4 filtered out; finished in 0.10s
  1115. 121.79 s gammaloop-nextest-python-api> system-err
  1116. 121.79 s gammaloop-nextest-python-api> Error: Python API test subprocess failed.
  1117. 121.79 s gammaloop-nextest-python-api> stdout:
  1118. 121.79 s gammaloop-nextest-python-api> ┌────────────────────────────────────────────────────────┐
  1119. 121.79 s gammaloop-nextest-python-api> │ You are running a restricted Symbolica instance. │
  1120. 121.79 s gammaloop-nextest-python-api> │ │
  1121. 121.79 s gammaloop-nextest-python-api> │ This mode is only permitted for non-commercial use and │
  1122. 121.79 s gammaloop-nextest-python-api> │ is limited to one instance and core per machine. │
  1123. 121.79 s gammaloop-nextest-python-api> │ │
  1124. 121.79 s gammaloop-nextest-python-api> │ Hobbyists can easily acquire a free license key │
  1125. 121.79 s gammaloop-nextest-python-api> │ that unlocks all cores and removes this banner: │
  1126. 121.79 s gammaloop-nextest-python-api> │ │
  1127. 121.79 s gammaloop-nextest-python-api> │ from symbolica import * │
  1128. 121.79 s gammaloop-nextest-python-api> │ request_hobbyist_license('YOUR_NAME', 'YOUR_EMAIL') │
  1129. 121.79 s gammaloop-nextest-python-api> │ │
  1130. 121.79 s gammaloop-nextest-python-api> │ All other users can obtain a free 30-day trial key: │
  1131. 121.79 s gammaloop-nextest-python-api> │ │
  1132. 121.79 s gammaloop-nextest-python-api> │ from symbolica import * │
  1133. 121.79 s gammaloop-nextest-python-api> │ request_trial_license('NAME', 'EMAIL', 'EMPLOYER') │
  1134. 121.79 s gammaloop-nextest-python-api> │ │
  1135. 121.79 s gammaloop-nextest-python-api> │ See https://symbolica.io/docs/get_started.html#license │
  1136. 121.79 s gammaloop-nextest-python-api> └────────────────────────────────────────────────────────┘
  1137. 121.79 s gammaloop-nextest-python-api> ┌───────────────────────────────────────────────────────────────────────────────────────────────────────────┐
  1138. 121.79 s gammaloop-nextest-python-api> │ Cannot start new unlicensed Symbolica instance since there is already another one running on the machine. │
  1139. 121.79 s gammaloop-nextest-python-api> └───────────────────────────────────────────────────────────────────────────────────────────────────────────┘
  1140. 121.79 s gammaloop-nextest-python-api>
  1141. 121.79 s gammaloop-nextest-python-api> stderr:
  1142. 121.79 s gammaloop-nextest-python-api>
  1143. 121.79 s gammaloop-nextest-python-api> ┌───────────────────────────────────────────────────────────┐
  1144. 121.79 s gammaloop-nextest-python-api> │ Could not resolve the IP of the Symbolica license server. │
  1145. 121.79 s gammaloop-nextest-python-api> │ │
  1146. 121.79 s gammaloop-nextest-python-api> │ Please check your DNS configuration. │
  1147. 121.79 s gammaloop-nextest-python-api> └───────────────────────────────────────────────────────────┘
  1148. 121.79 s gammaloop-nextest-python-api> Error: failed to lookup address information: Temporary failure in name resolution
  1149. 121.79 s gammaloop-nextest-python-api>
  1150. 121.79 s gammaloop-nextest-python-api>
  1151. 121.79 s gammaloop-nextest-python-api> Location:
  1152. 121.79 s gammaloop-nextest-python-api> tests/tests/test_python_api.rs:156:20
  1153. 121.79 s gammaloop-nextest-python-api>
  1154. 121.79 s gammaloop-nextest-python-api> 3. gammaloop-integration-tests::test_python_api::python_evaluate_samples_batch_and_momentum_space_have_expected_shape
  1155. 121.79 s gammaloop-nextest-python-api> failure: test failure with exit code 101
  1156. 121.79 s gammaloop-nextest-python-api> Error: Python API test subprocess failed.
  1157. 121.79 s gammaloop-nextest-python-api> stdout:
  1158. 121.79 s gammaloop-nextest-python-api> ┌────────────────────────────────────────────────────────┐
  1159. 121.79 s gammaloop-nextest-python-api> │ You are running a restricted Symbolica instance. │
  1160. 121.79 s gammaloop-nextest-python-api> │ │
  1161. 121.79 s gammaloop-nextest-python-api> │ This mode is only permitted for non-commercial use and │
  1162. 121.79 s gammaloop-nextest-python-api> │ is limited to one instance and core per machine. │
  1163. 121.79 s gammaloop-nextest-python-api> │ │
  1164. 121.79 s gammaloop-nextest-python-api> │ Hobbyists can easily acquire a free license key │
  1165. 121.79 s gammaloop-nextest-python-api> │ that unlocks all cores and removes this banner: │
  1166. 121.79 s gammaloop-nextest-python-api> │ │
  1167. 121.79 s gammaloop-nextest-python-api> │ from symbolica import * │
  1168. 121.79 s gammaloop-nextest-python-api> │ request_hobbyist_license('YOUR_NAME', 'YOUR_EMAIL') │
  1169. 121.79 s gammaloop-nextest-python-api> │ │
  1170. 121.79 s gammaloop-nextest-python-api> │ All other users can obtain a free 30-day trial key: │
  1171. 121.79 s gammaloop-nextest-python-api> │ │
  1172. 121.79 s gammaloop-nextest-python-api> │ from symbolica import * │
  1173. 121.79 s gammaloop-nextest-python-api> │ request_trial_license('NAME', 'EMAIL', 'EMPLOYER') │
  1174. 121.79 s gammaloop-nextest-python-api> │ │
  1175. 121.79 s gammaloop-nextest-python-api> │ See https://symbolica.io/docs/get_started.html#license │
  1176. 121.79 s gammaloop-nextest-python-api> └────────────────────────────────────────────────────────┘
  1177. 121.79 s gammaloop-nextest-python-api> ┌───────────────────────────────────────────────────────────────────────────────────────────────────────────┐
  1178. 121.79 s gammaloop-nextest-python-api> │ Cannot start new unlicensed Symbolica instance since there is already another one running on the machine. │
  1179. 121.79 s gammaloop-nextest-python-api> └───────────────────────────────────────────────────────────────────────────────────────────────────────────┘
  1180. 121.79 s gammaloop-nextest-python-api>
  1181. 121.79 s gammaloop-nextest-python-api> stderr:
  1182. 121.79 s gammaloop-nextest-python-api>
  1183. 121.79 s gammaloop-nextest-python-api> ┌───────────────────────────────────────────────────────────┐
  1184. 121.79 s gammaloop-nextest-python-api> │ Could not resolve the IP of the Symbolica license server. │
  1185. 121.79 s gammaloop-nextest-python-api> │ │
  1186. 121.79 s gammaloop-nextest-python-api> │ Please check your DNS configuration. │
  1187. 121.79 s gammaloop-nextest-python-api> └───────────────────────────────────────────────────────────┘
  1188. 121.79 s gammaloop-nextest-python-api> Error: failed to lookup address information: Temporary failure in name resolution
  1189. 121.79 s gammaloop-nextest-python-api>
  1190. 121.79 s gammaloop-nextest-python-api>
  1191. 121.79 s gammaloop-nextest-python-api> Location:
  1192. 121.79 s gammaloop-nextest-python-api> tests/tests/test_python_api.rs:156:20
  1193. 121.79 s gammaloop-nextest-python-api> system-out
  1194. 121.79 s gammaloop-nextest-python-api> running 1 test
  1195. 121.79 s gammaloop-nextest-python-api> test python_evaluate_samples_batch_and_momentum_space_have_expected_shape ... FAILED
  1196. 121.79 s gammaloop-nextest-python-api>
  1197. 121.79 s gammaloop-nextest-python-api> failures:
  1198. 121.79 s gammaloop-nextest-python-api>
  1199. 121.79 s gammaloop-nextest-python-api> failures:
  1200. 121.79 s gammaloop-nextest-python-api> python_evaluate_samples_batch_and_momentum_space_have_expected_shape
  1201. 121.79 s gammaloop-nextest-python-api>
  1202. 121.79 s gammaloop-nextest-python-api> test result: FAILED. 0 passed; 1 failed; 0 ignored; 0 measured; 4 filtered out; finished in 0.12s
  1203. 121.79 s gammaloop-nextest-python-api> system-err
  1204. 121.79 s gammaloop-nextest-python-api> Error: Python API test subprocess failed.
  1205. 121.79 s gammaloop-nextest-python-api> stdout:
  1206. 121.79 s gammaloop-nextest-python-api> ┌────────────────────────────────────────────────────────┐
  1207. 121.79 s gammaloop-nextest-python-api> │ You are running a restricted Symbolica instance. │
  1208. 121.79 s gammaloop-nextest-python-api> │ │
  1209. 121.79 s gammaloop-nextest-python-api> │ This mode is only permitted for non-commercial use and │
  1210. 121.79 s gammaloop-nextest-python-api> │ is limited to one instance and core per machine. │
  1211. 121.79 s gammaloop-nextest-python-api> │ │
  1212. 121.79 s gammaloop-nextest-python-api> │ Hobbyists can easily acquire a free license key │
  1213. 121.79 s gammaloop-nextest-python-api> │ that unlocks all cores and removes this banner: │
  1214. 121.79 s gammaloop-nextest-python-api> │ │
  1215. 121.79 s gammaloop-nextest-python-api> │ from symbolica import * │
  1216. 121.79 s gammaloop-nextest-python-api> │ request_hobbyist_license('YOUR_NAME', 'YOUR_EMAIL') │
  1217. 121.79 s gammaloop-nextest-python-api> │ │
  1218. 121.79 s gammaloop-nextest-python-api> │ All other users can obtain a free 30-day trial key: │
  1219. 121.79 s gammaloop-nextest-python-api> │ │
  1220. 121.79 s gammaloop-nextest-python-api> │ from symbolica import * │
  1221. 121.79 s gammaloop-nextest-python-api> │ request_trial_license('NAME', 'EMAIL', 'EMPLOYER') │
  1222. 121.79 s gammaloop-nextest-python-api> │ │
  1223. 121.79 s gammaloop-nextest-python-api> │ See https://symbolica.io/docs/get_started.html#license │
  1224. 121.79 s gammaloop-nextest-python-api> └────────────────────────────────────────────────────────┘
  1225. 121.79 s gammaloop-nextest-python-api> ┌───────────────────────────────────────────────────────────────────────────────────────────────────────────┐
  1226. 121.79 s gammaloop-nextest-python-api> │ Cannot start new unlicensed Symbolica instance since there is already another one running on the machine. │
  1227. 121.79 s gammaloop-nextest-python-api> └───────────────────────────────────────────────────────────────────────────────────────────────────────────┘
  1228. 121.79 s gammaloop-nextest-python-api>
  1229. 121.79 s gammaloop-nextest-python-api> stderr:
  1230. 121.79 s gammaloop-nextest-python-api>
  1231. 121.79 s gammaloop-nextest-python-api> ┌───────────────────────────────────────────────────────────┐
  1232. 121.79 s gammaloop-nextest-python-api> │ Could not resolve the IP of the Symbolica license server. │
  1233. 121.79 s gammaloop-nextest-python-api> │ │
  1234. 121.79 s gammaloop-nextest-python-api> │ Please check your DNS configuration. │
  1235. 121.79 s gammaloop-nextest-python-api> └───────────────────────────────────────────────────────────┘
  1236. 121.79 s gammaloop-nextest-python-api> Error: failed to lookup address information: Temporary failure in name resolution
  1237. 121.79 s gammaloop-nextest-python-api>
  1238. 121.79 s gammaloop-nextest-python-api>
  1239. 121.79 s gammaloop-nextest-python-api> Location:
  1240. 121.79 s gammaloop-nextest-python-api> tests/tests/test_python_api.rs:156:20
  1241. 121.79 s gammaloop-nextest-python-api>
  1242. 121.79 s gammaloop-nextest-python-api> 4. gammaloop-integration-tests::test_python_api::python_evaluate_sample_honors_generate_events_and_observable_snapshots
  1243. 121.79 s gammaloop-nextest-python-api> failure: test failure with exit code 101
  1244. 121.79 s gammaloop-nextest-python-api> Error: Python API test subprocess failed.
  1245. 121.79 s gammaloop-nextest-python-api> stdout:
  1246. 121.79 s gammaloop-nextest-python-api> ┌────────────────────────────────────────────────────────┐
  1247. 121.79 s gammaloop-nextest-python-api> │ You are running a restricted Symbolica instance. │
  1248. 121.79 s gammaloop-nextest-python-api> │ │
  1249. 121.79 s gammaloop-nextest-python-api> │ This mode is only permitted for non-commercial use and │
  1250. 121.79 s gammaloop-nextest-python-api> │ is limited to one instance and core per machine. │
  1251. 121.79 s gammaloop-nextest-python-api> │ │
  1252. 121.79 s gammaloop-nextest-python-api> │ Hobbyists can easily acquire a free license key │
  1253. 121.79 s gammaloop-nextest-python-api> │ that unlocks all cores and removes this banner: │
  1254. 121.79 s gammaloop-nextest-python-api> │ │
  1255. 121.79 s gammaloop-nextest-python-api> │ from symbolica import * │
  1256. 121.79 s gammaloop-nextest-python-api> │ request_hobbyist_license('YOUR_NAME', 'YOUR_EMAIL') │
  1257. 121.79 s gammaloop-nextest-python-api> │ │
  1258. 121.79 s gammaloop-nextest-python-api> │ All other users can obtain a free 30-day trial key: │
  1259. 121.79 s gammaloop-nextest-python-api> │ │
  1260. 121.79 s gammaloop-nextest-python-api> │ from symbolica import * │
  1261. 121.79 s gammaloop-nextest-python-api> │ request_trial_license('NAME', 'EMAIL', 'EMPLOYER') │
  1262. 121.79 s gammaloop-nextest-python-api> │ │
  1263. 121.79 s gammaloop-nextest-python-api> │ See https://symbolica.io/docs/get_started.html#license │
  1264. 121.79 s gammaloop-nextest-python-api> └────────────────────────────────────────────────────────┘
  1265. 121.79 s gammaloop-nextest-python-api> ┌───────────────────────────────────────────────────────────────────────────────────────────────────────────┐
  1266. 121.79 s gammaloop-nextest-python-api> │ Cannot start new unlicensed Symbolica instance since there is already another one running on the machine. │
  1267. 121.79 s gammaloop-nextest-python-api> └───────────────────────────────────────────────────────────────────────────────────────────────────────────┘
  1268. 121.79 s gammaloop-nextest-python-api>
  1269. 121.79 s gammaloop-nextest-python-api> stderr:
  1270. 121.79 s gammaloop-nextest-python-api>
  1271. 121.79 s gammaloop-nextest-python-api> ┌───────────────────────────────────────────────────────────┐
  1272. 121.79 s gammaloop-nextest-python-api> │ Could not resolve the IP of the Symbolica license server. │
  1273. 121.79 s gammaloop-nextest-python-api> │ │
  1274. 121.79 s gammaloop-nextest-python-api> │ Please check your DNS configuration. │
  1275. 121.79 s gammaloop-nextest-python-api> └───────────────────────────────────────────────────────────┘
  1276. 121.79 s gammaloop-nextest-python-api> Error: failed to lookup address information: Temporary failure in name resolution
  1277. 121.79 s gammaloop-nextest-python-api> [2026-09-03 15:33:22.333] @gammaloop_api::se... INFO : Running command import model sm-default
  1278. 121.79 s gammaloop-nextest-python-api> [2026-09-03 15:33:22.333] @import::model INFO : Loading built-in JSON model sm-default
  1279. 121.79 s gammaloop-nextest-python-api> [2026-09-03 15:33:22.364] @gammalooprs::model INFO : The following 11 external parameters were forced to zero by the restriction card:
  1280. 121.79 s gammaloop-nextest-python-api> lamWS, AWS, rhoWS, etaWS, ymc, yme, ymm, MC, Me, MM, WTau
  1281. 121.79 s gammaloop-nextest-python-api> [2026-09-03 15:33:22.364] @gammalooprs::model INFO : The following 34 vertex rules were removed by the restriction card:
  1282. 121.79 s gammaloop-nextest-python-api> V_82 -> (c~, d, G+) | V_83 -> (t~, d, G+) | V_84 -> (c~, s, G+) | V_85 -> (t~, s, G+) | V_86 -> (u~, b, G+) | V_87 -> (c~, b, G+) | V_90 -> (c~, d, W+) | V_91 -> (t~, d, W+) | V_92 -> (u~, s, W+) | V_94 -> (t~, s, W+) | V_95 -> (u~, b, W+) | V_96 -> (c~, b, W+) | V_101 -> (e+, e-, G0) | V_102 -> (mu+, mu-, G0) | V_104 -> (e+, e-, H) | V_105 -> (mu+, mu-, H) | V_110 -> (ve~, e-, G+) | V_111 -> (vm~, mu-, G+) | V_116 -> (b~, u, G-) | V_117 -> (d~, c, G-) | V_118 -> (s~, c, G-) | V_119 -> (b~, c, G-) | V_120 -> (d~, t, G-) | V_121 -> (s~, t, G-) | V_124 -> (s~, u, W-) | V_125 -> (b~, u, W-) | V_126 -> (d~, c, W-) | V_128 -> (b~, c, W-) | V_129 -> (d~, t, W-) | V_130 -> (s~, t, W-) | V_138 -> (c~, c, G0) | V_140 -> (c~, c, H) | V_145 -> (e+, ve, G-) | V_146 -> (mu+, vm, G-)
  1283. 121.79 s gammaloop-nextest-python-api> [2026-09-03 15:33:22.364] @gammalooprs::model INFO : The following 36 couplings were removed by the restriction card:
  1284. 121.79 s gammaloop-nextest-python-api> GC_13, GC_14, GC_16, GC_17, GC_18, GC_19, GC_20, GC_22, GC_23, GC_24, GC_25, GC_26, GC_28, GC_29, GC_42, GC_43, GC_44, GC_46, GC_47, GC_48, GC_84, GC_85, GC_86, GC_87, GC_88, GC_89, GC_90, GC_91, GC_92, GC_93, GC_101, GC_102, GC_103, GC_105, GC_106, GC_107
  1285. 121.79 s gammaloop-nextest-python-api> [2026-09-03 15:33:22.364] @gammaloop_api::se... INFO : Running command set default-runtime kv kinematics.externals='{"type":"constant","data":{"momenta":[[32.0,0.0,0.0,32.0],[32.0,0.0,0.0,-32.0]],"helicities":[1,1]}}'
  1286. 121.79 s gammaloop-nextest-python-api> [2026-09-03 15:33:22.365] @gammaloop_api::se... INFO : Running command set default-runtime kv subtraction.disable_threshold_subtraction=true
  1287. 121.79 s gammaloop-nextest-python-api> [2026-09-03 15:33:22.366] @gammaloop_api::se... INFO : Running command generate xs e+ e- > d d~ g | e- a d g QED^2==4 [{{2}} QCD=0] --numerator-grouping group_identical_graphs_up_to_sign --clear-existing-processes --only-diagrams
  1288. 121.79 s gammaloop-nextest-python-api> [2026-09-03 15:33:22.368] @feyngen::diagram_... INFO : 0s | Δ=0s | Starting Feynman graph generation with Symbolica...
  1289. 121.79 s gammaloop-nextest-python-api> [2026-09-03 15:33:22.370] @feyngen::diagram_... INFO : 0s | Δ=0s | Number of graphs resulting from Symbolica generation: 246
  1290. 121.79 s gammaloop-nextest-python-api> [2026-09-03 15:33:22.370] @feyngen::diagram_... INFO : 0s | Δ=0s | Number of graphs retained after enforcing supergraph particle content: 8
  1291. 121.79 s gammaloop-nextest-python-api> [2026-09-03 15:33:22.370] @feyngen::diagram_... INFO : 0s | Δ=0s | Number of graphs retained after removal of vetoed topologies: 8
  1292. 121.79 s gammaloop-nextest-python-api> [2026-09-03 15:33:22.371] @feyngen::diagram_... INFO : 0s | Δ=0s | Number of graphs after vertex info assignment: 8
  1293. 121.79 s gammaloop-nextest-python-api> [2026-09-03 15:33:22.371] @feyngen::diagram_... INFO : 0s | Δ=0s | Number of graphs after all complete graphs filters are applied: 8
  1294. 121.79 s gammaloop-nextest-python-api>
  1295. 121.79 s gammaloop-nextest-python-api>
  1296. 121.79 s gammaloop-nextest-python-api> Location:
  1297. 121.79 s gammaloop-nextest-python-api> tests/tests/test_python_api.rs:156:20
  1298. 121.79 s gammaloop-nextest-python-api> system-out
  1299. 121.79 s gammaloop-nextest-python-api> running 1 test
  1300. 121.79 s gammaloop-nextest-python-api> test python_evaluate_sample_honors_generate_events_and_observable_snapshots ... FAILED
  1301. 121.79 s gammaloop-nextest-python-api>
  1302. 121.79 s gammaloop-nextest-python-api> failures:
  1303. 121.79 s gammaloop-nextest-python-api>
  1304. 121.79 s gammaloop-nextest-python-api> failures:
  1305. 121.79 s gammaloop-nextest-python-api> python_evaluate_sample_honors_generate_events_and_observable_snapshots
  1306. 121.79 s gammaloop-nextest-python-api>
  1307. 121.79 s gammaloop-nextest-python-api> test result: FAILED. 0 passed; 1 failed; 0 ignored; 0 measured; 4 filtered out; finished in 0.20s
  1308. 121.79 s gammaloop-nextest-python-api> system-err
  1309. 121.79 s gammaloop-nextest-python-api> Error: Python API test subprocess failed.
  1310. 121.79 s gammaloop-nextest-python-api> stdout:
  1311. 121.79 s gammaloop-nextest-python-api> ┌────────────────────────────────────────────────────────┐
  1312. 121.79 s gammaloop-nextest-python-api> │ You are running a restricted Symbolica instance. │
  1313. 121.79 s gammaloop-nextest-python-api> │ │
  1314. 121.79 s gammaloop-nextest-python-api> │ This mode is only permitted for non-commercial use and │
  1315. 121.79 s gammaloop-nextest-python-api> │ is limited to one instance and core per machine. │
  1316. 121.79 s gammaloop-nextest-python-api> │ │
  1317. 121.79 s gammaloop-nextest-python-api> │ Hobbyists can easily acquire a free license key │
  1318. 121.79 s gammaloop-nextest-python-api> │ that unlocks all cores and removes this banner: │
  1319. 121.79 s gammaloop-nextest-python-api> │ │
  1320. 121.79 s gammaloop-nextest-python-api> │ from symbolica import * │
  1321. 121.79 s gammaloop-nextest-python-api> │ request_hobbyist_license('YOUR_NAME', 'YOUR_EMAIL') │
  1322. 121.79 s gammaloop-nextest-python-api> │ │
  1323. 121.79 s gammaloop-nextest-python-api> │ All other users can obtain a free 30-day trial key: │
  1324. 121.79 s gammaloop-nextest-python-api> │ │
  1325. 121.79 s gammaloop-nextest-python-api> │ from symbolica import * │
  1326. 121.79 s gammaloop-nextest-python-api> │ request_trial_license('NAME', 'EMAIL', 'EMPLOYER') │
  1327. 121.79 s gammaloop-nextest-python-api> │ │
  1328. 121.79 s gammaloop-nextest-python-api> │ See https://symbolica.io/docs/get_started.html#license │
  1329. 121.79 s gammaloop-nextest-python-api> └────────────────────────────────────────────────────────┘
  1330. 121.79 s gammaloop-nextest-python-api> ┌───────────────────────────────────────────────────────────────────────────────────────────────────────────┐
  1331. 121.79 s gammaloop-nextest-python-api> │ Cannot start new unlicensed Symbolica instance since there is already another one running on the machine. │
  1332. 121.79 s gammaloop-nextest-python-api> └───────────────────────────────────────────────────────────────────────────────────────────────────────────┘
  1333. 121.79 s gammaloop-nextest-python-api>
  1334. 121.79 s gammaloop-nextest-python-api> stderr:
  1335. 121.79 s gammaloop-nextest-python-api>
  1336. 121.79 s gammaloop-nextest-python-api> ┌───────────────────────────────────────────────────────────┐
  1337. 121.79 s gammaloop-nextest-python-api> │ Could not resolve the IP of the Symbolica license server. │
  1338. 121.79 s gammaloop-nextest-python-api> │ │
  1339. 121.79 s gammaloop-nextest-python-api> │ Please check your DNS configuration. │
  1340. 121.79 s gammaloop-nextest-python-api> └───────────────────────────────────────────────────────────┘
  1341. 121.79 s gammaloop-nextest-python-api> Error: failed to lookup address information: Temporary failure in name resolution
  1342. 121.79 s gammaloop-nextest-python-api> [2026-09-03 15:33:22.333] @gammaloop_api::se... INFO : Running command import model sm-default
  1343. 121.79 s gammaloop-nextest-python-api> [2026-09-03 15:33:22.333] @import::model INFO : Loading built-in JSON model sm-default
  1344. 121.79 s gammaloop-nextest-python-api> [2026-09-03 15:33:22.364] @gammalooprs::model INFO : The following 11 external parameters were forced to zero by the restriction card:
  1345. 121.79 s gammaloop-nextest-python-api> lamWS, AWS, rhoWS, etaWS, ymc, yme, ymm, MC, Me, MM, WTau
  1346. 121.79 s gammaloop-nextest-python-api> [2026-09-03 15:33:22.364] @gammalooprs::model INFO : The following 34 vertex rules were removed by the restriction card:
  1347. 121.79 s gammaloop-nextest-python-api> V_82 -> (c~, d, G+) | V_83 -> (t~, d, G+) | V_84 -> (c~, s, G+) | V_85 -> (t~, s, G+) | V_86 -> (u~, b, G+) | V_87 -> (c~, b, G+) | V_90 -> (c~, d, W+) | V_91 -> (t~, d, W+) | V_92 -> (u~, s, W+) | V_94 -> (t~, s, W+) | V_95 -> (u~, b, W+) | V_96 -> (c~, b, W+) | V_101 -> (e+, e-, G0) | V_102 -> (mu+, mu-, G0) | V_104 -> (e+, e-, H) | V_105 -> (mu+, mu-, H) | V_110 -> (ve~, e-, G+) | V_111 -> (vm~, mu-, G+) | V_116 -> (b~, u, G-) | V_117 -> (d~, c, G-) | V_118 -> (s~, c, G-) | V_119 -> (b~, c, G-) | V_120 -> (d~, t, G-) | V_121 -> (s~, t, G-) | V_124 -> (s~, u, W-) | V_125 -> (b~, u, W-) | V_126 -> (d~, c, W-) | V_128 -> (b~, c, W-) | V_129 -> (d~, t, W-) | V_130 -> (s~, t, W-) | V_138 -> (c~, c, G0) | V_140 -> (c~, c, H) | V_145 -> (e+, ve, G-) | V_146 -> (mu+, vm, G-)
  1348. 121.79 s gammaloop-nextest-python-api> [2026-09-03 15:33:22.364] @gammalooprs::model INFO : The following 36 couplings were removed by the restriction card:
  1349. 121.79 s gammaloop-nextest-python-api> GC_13, GC_14, GC_16, GC_17, GC_18, GC_19, GC_20, GC_22, GC_23, GC_24, GC_25, GC_26, GC_28, GC_29, GC_42, GC_43, GC_44, GC_46, GC_47, GC_48, GC_84, GC_85, GC_86, GC_87, GC_88, GC_89, GC_90, GC_91, GC_92, GC_93, GC_101, GC_102, GC_103, GC_105, GC_106, GC_107
  1350. 121.79 s gammaloop-nextest-python-api> [2026-09-03 15:33:22.364] @gammaloop_api::se... INFO : Running command set default-runtime kv kinematics.externals='{"type":"constant","data":{"momenta":[[32.0,0.0,0.0,32.0],[32.0,0.0,0.0,-32.0]],"helicities":[1,1]}}'
  1351. 121.79 s gammaloop-nextest-python-api> [2026-09-03 15:33:22.365] @gammaloop_api::se... INFO : Running command set default-runtime kv subtraction.disable_threshold_subtraction=true
  1352. 121.79 s gammaloop-nextest-python-api> [2026-09-03 15:33:22.366] @gammaloop_api::se... INFO : Running command generate xs e+ e- > d d~ g | e- a d g QED^2==4 [{{2}} QCD=0] --numerator-grouping group_identical_graphs_up_to_sign --clear-existing-processes --only-diagrams
  1353. 121.79 s gammaloop-nextest-python-api> [2026-09-03 15:33:22.368] @feyngen::diagram_... INFO : 0s | Δ=0s | Starting Feynman graph generation with Symbolica...
  1354. 121.79 s gammaloop-nextest-python-api> [2026-09-03 15:33:22.370] @feyngen::diagram_... INFO : 0s | Δ=0s | Number of graphs resulting from Symbolica generation: 246
  1355. 121.79 s gammaloop-nextest-python-api> [2026-09-03 15:33:22.370] @feyngen::diagram_... INFO : 0s | Δ=0s | Number of graphs retained after enforcing supergraph particle content: 8
  1356. 121.79 s gammaloop-nextest-python-api> [2026-09-03 15:33:22.370] @feyngen::diagram_... INFO : 0s | Δ=0s | Number of graphs retained after removal of vetoed topologies: 8
  1357. 121.79 s gammaloop-nextest-python-api> [2026-09-03 15:33:22.371] @feyngen::diagram_... INFO : 0s | Δ=0s | Number of graphs after vertex info assignment: 8
  1358. 121.79 s gammaloop-nextest-python-api> [2026-09-03 15:33:22.371] @feyngen::diagram_... INFO : 0s | Δ=0s | Number of graphs after all complete graphs filters are applied: 8
  1359. 121.79 s gammaloop-nextest-python-api>
  1360. 121.79 s gammaloop-nextest-python-api>
  1361. 121.79 s gammaloop-nextest-python-api> Location:
  1362. 121.79 s gammaloop-nextest-python-api> tests/tests/test_python_api.rs:156:20
  1363. 121.79 s gammaloop-nextest-python-api>
  1364. 121.79 s gammaloop-nextest-python-api> 5. gammaloop-integration-tests::test_python_api::python_settings_wrappers_expose_nested_runtime_and_global_settings
  1365. 121.79 s gammaloop-nextest-python-api> failure: test failure with exit code 101
  1366. 121.79 s gammaloop-nextest-python-api> Error: Python API test subprocess failed.
  1367. 121.79 s gammaloop-nextest-python-api> stdout:
  1368. 121.79 s gammaloop-nextest-python-api> ┌────────────────────────────────────────────────────────┐
  1369. 121.79 s gammaloop-nextest-python-api> │ You are running a restricted Symbolica instance. │
  1370. 121.79 s gammaloop-nextest-python-api> │ │
  1371. 121.79 s gammaloop-nextest-python-api> │ This mode is only permitted for non-commercial use and │
  1372. 121.79 s gammaloop-nextest-python-api> │ is limited to one instance and core per machine. │
  1373. 121.79 s gammaloop-nextest-python-api> │ │
  1374. 121.79 s gammaloop-nextest-python-api> │ Hobbyists can easily acquire a free license key │
  1375. 121.79 s gammaloop-nextest-python-api> │ that unlocks all cores and removes this banner: │
  1376. 121.79 s gammaloop-nextest-python-api> │ │
  1377. 121.79 s gammaloop-nextest-python-api> │ from symbolica import * │
  1378. 121.79 s gammaloop-nextest-python-api> │ request_hobbyist_license('YOUR_NAME', 'YOUR_EMAIL') │
  1379. 121.79 s gammaloop-nextest-python-api> │ │
  1380. 121.79 s gammaloop-nextest-python-api> │ All other users can obtain a free 30-day trial key: │
  1381. 121.79 s gammaloop-nextest-python-api> │ │
  1382. 121.79 s gammaloop-nextest-python-api> │ from symbolica import * │
  1383. 121.79 s gammaloop-nextest-python-api> │ request_trial_license('NAME', 'EMAIL', 'EMPLOYER') │
  1384. 121.79 s gammaloop-nextest-python-api> │ │
  1385. 121.79 s gammaloop-nextest-python-api> │ See https://symbolica.io/docs/get_started.html#license │
  1386. 121.79 s gammaloop-nextest-python-api> └────────────────────────────────────────────────────────┘
  1387. 121.79 s gammaloop-nextest-python-api> ┌───────────────────────────────────────────────────────────────────────────────────────────────────────────┐
  1388. 121.79 s gammaloop-nextest-python-api> │ Cannot start new unlicensed Symbolica instance since there is already another one running on the machine. │
  1389. 121.79 s gammaloop-nextest-python-api> └───────────────────────────────────────────────────────────────────────────────────────────────────────────┘
  1390. 121.79 s gammaloop-nextest-python-api>
  1391. 121.79 s gammaloop-nextest-python-api> stderr:
  1392. 121.79 s gammaloop-nextest-python-api>
  1393. 121.79 s gammaloop-nextest-python-api> ┌───────────────────────────────────────────────────────────┐
  1394. 121.79 s gammaloop-nextest-python-api> │ Could not resolve the IP of the Symbolica license server. │
  1395. 121.79 s gammaloop-nextest-python-api> │ │
  1396. 121.79 s gammaloop-nextest-python-api> │ Please check your DNS configuration. │
  1397. 121.79 s gammaloop-nextest-python-api> └───────────────────────────────────────────────────────────┘
  1398. 121.79 s gammaloop-nextest-python-api> Error: failed to lookup address information: Temporary failure in name resolution
  1399. 121.79 s gammaloop-nextest-python-api>
  1400. 121.79 s gammaloop-nextest-python-api>
  1401. 121.79 s gammaloop-nextest-python-api> Location:
  1402. 121.79 s gammaloop-nextest-python-api> tests/tests/test_python_api.rs:156:20
  1403. 121.79 s gammaloop-nextest-python-api> system-out
  1404. 121.79 s gammaloop-nextest-python-api> running 1 test
  1405. 121.79 s gammaloop-nextest-python-api> test python_settings_wrappers_expose_nested_runtime_and_global_settings ... FAILED
  1406. 121.79 s gammaloop-nextest-python-api>
  1407. 121.79 s gammaloop-nextest-python-api> failures:
  1408. 121.79 s gammaloop-nextest-python-api>
  1409. 121.79 s gammaloop-nextest-python-api> failures:
  1410. 121.79 s gammaloop-nextest-python-api> python_settings_wrappers_expose_nested_runtime_and_global_settings
  1411. 121.79 s gammaloop-nextest-python-api>
  1412. 121.79 s gammaloop-nextest-python-api> test result: FAILED. 0 passed; 1 failed; 0 ignored; 0 measured; 4 filtered out; finished in 0.22s
  1413. 121.79 s gammaloop-nextest-python-api> system-err
  1414. 121.79 s gammaloop-nextest-python-api> Error: Python API test subprocess failed.
  1415. 121.79 s gammaloop-nextest-python-api> stdout:
  1416. 121.79 s gammaloop-nextest-python-api> ┌────────────────────────────────────────────────────────┐
  1417. 121.79 s gammaloop-nextest-python-api> │ You are running a restricted Symbolica instance. │
  1418. 121.79 s gammaloop-nextest-python-api> │ │
  1419. 121.79 s gammaloop-nextest-python-api> │ This mode is only permitted for non-commercial use and │
  1420. 121.79 s gammaloop-nextest-python-api> │ is limited to one instance and core per machine. │
  1421. 121.79 s gammaloop-nextest-python-api> │ │
  1422. 121.79 s gammaloop-nextest-python-api> │ Hobbyists can easily acquire a free license key │
  1423. 121.79 s gammaloop-nextest-python-api> │ that unlocks all cores and removes this banner: │
  1424. 121.79 s gammaloop-nextest-python-api> │ │
  1425. 121.79 s gammaloop-nextest-python-api> │ from symbolica import * │
  1426. 121.79 s gammaloop-nextest-python-api> │ request_hobbyist_license('YOUR_NAME', 'YOUR_EMAIL') │
  1427. 121.79 s gammaloop-nextest-python-api> │ │
  1428. 121.79 s gammaloop-nextest-python-api> │ All other users can obtain a free 30-day trial key: │
  1429. 121.79 s gammaloop-nextest-python-api> │ │
  1430. 121.79 s gammaloop-nextest-python-api> │ from symbolica import * │
  1431. 121.79 s gammaloop-nextest-python-api> │ request_trial_license('NAME', 'EMAIL', 'EMPLOYER') │
  1432. 121.79 s gammaloop-nextest-python-api> │ │
  1433. 121.79 s gammaloop-nextest-python-api> │ See https://symbolica.io/docs/get_started.html#license │
  1434. 121.79 s gammaloop-nextest-python-api> └────────────────────────────────────────────────────────┘
  1435. 121.79 s gammaloop-nextest-python-api> ┌───────────────────────────────────────────────────────────────────────────────────────────────────────────┐
  1436. 121.79 s gammaloop-nextest-python-api> │ Cannot start new unlicensed Symbolica instance since there is already another one running on the machine. │
  1437. 121.79 s gammaloop-nextest-python-api> └───────────────────────────────────────────────────────────────────────────────────────────────────────────┘
  1438. 121.79 s gammaloop-nextest-python-api>
  1439. 121.79 s gammaloop-nextest-python-api> stderr:
  1440. 121.79 s gammaloop-nextest-python-api>
  1441. 121.79 s gammaloop-nextest-python-api> ┌───────────────────────────────────────────────────────────┐
  1442. 121.79 s gammaloop-nextest-python-api> │ Could not resolve the IP of the Symbolica license server. │
  1443. 121.79 s gammaloop-nextest-python-api> │ │
  1444. 121.79 s gammaloop-nextest-python-api> │ Please check your DNS configuration. │
  1445. 121.79 s gammaloop-nextest-python-api> └───────────────────────────────────────────────────────────┘
  1446. 121.79 s gammaloop-nextest-python-api> Error: failed to lookup address information: Temporary failure in name resolution
  1447. 121.79 s gammaloop-nextest-python-api>
  1448. 121.79 s gammaloop-nextest-python-api>
  1449. 121.79 s gammaloop-nextest-python-api> Location:
  1450. 121.79 s gammaloop-nextest-python-api> tests/tests/test_python_api.rs:156:20
  1451. 121.79 s gammaloop-nextest-python-api> =========================================
  1452. 121.84 s error: Cannot build '/nix/store/92rfrz53xqdm3bwmdf3dq8zbdzxy8f7a-gammaloop-nextest-python-api.drv'.
  1453. 121.84 s Reason: builder failed with exit code 100.
  1454. 121.84 s Output paths:
  1455. 121.84 s /nix/store/w3fd1akvf23gm7zw29z27n42xvm2dm2l-gammaloop-nextest-python-api
  1456. 121.84 s Last 1041 log lines:
  1457. 121.84 s > Extracting 3 binaries (including 2 non-test binaries), 1 build script output directory, and 3 linked paths to /build/nextest-archive-6DwWQb
  1458. 121.84 s > Extracted 22 files to /build/nextest-archive-6DwWQb in 0.22s
  1459. 121.84 s > ------------
  1460. 121.84 s > Nextest run ID 6271bfc6-5333-4f41-8349-688cc5434175 with nextest profile: ci_gammaloop
  1461. 121.84 s > Starting 5 tests across 1 binary
  1462. 121.84 s > FAIL [ 0.104s] (1/5) gammaloop-integration-tests::test_python_api python_evaluate_sample_preserves_graph_grouping_and_incoming_pdgs
  1463. 121.84 s > stdout ---
  1464. 121.84 s >
  1465. 121.84 s > running 1 test
  1466. 121.84 s > test python_evaluate_sample_preserves_graph_grouping_and_incoming_pdgs ... FAILED
  1467. 121.84 s >
  1468. 121.84 s > failures:
  1469. 121.84 s >
  1470. 121.84 s > failures:
  1471. 121.84 s > python_evaluate_sample_preserves_graph_grouping_and_incoming_pdgs
  1472. 121.84 s >
  1473. 121.84 s > test result: FAILED. 0 passed; 1 failed; 0 ignored; 0 measured; 4 filtered out; finished in 0.10s
  1474. 121.84 s >
  1475. 121.84 s > stderr ---
  1476. 121.84 s > Error: Python API test subprocess failed.
  1477. 121.84 s > stdout:
  1478. 121.84 s > ┌────────────────────────────────────────────────────────┐
  1479. 121.84 s > │ You are running a restricted Symbolica instance. │
  1480. 121.84 s > │ │
  1481. 121.84 s > │ This mode is only permitted for non-commercial use and │
  1482. 121.84 s > │ is limited to one instance and core per machine. │
  1483. 121.84 s > │ │
  1484. 121.84 s > │ Hobbyists can easily acquire a free license key │
  1485. 121.84 s > │ that unlocks all cores and removes this banner: │
  1486. 121.84 s > │ │
  1487. 121.84 s > │ from symbolica import * │
  1488. 121.84 s > │ request_hobbyist_license('YOUR_NAME', 'YOUR_EMAIL') │
  1489. 121.84 s > │ │
  1490. 121.84 s > │ All other users can obtain a free 30-day trial key: │
  1491. 121.84 s > │ │
  1492. 121.84 s > │ from symbolica import * │
  1493. 121.84 s > │ request_trial_license('NAME', 'EMAIL', 'EMPLOYER') │
  1494. 121.84 s > │ │
  1495. 121.84 s > │ See https://symbolica.io/docs/get_started.html#license │
  1496. 121.84 s > └────────────────────────────────────────────────────────┘
  1497. 121.84 s > ┌───────────────────────────────────────────────────────────────────────────────────────────────────────────┐
  1498. 121.84 s > │ Cannot start new unlicensed Symbolica instance since there is already another one running on the machine. │
  1499. 121.84 s > └───────────────────────────────────────────────────────────────────────────────────────────────────────────┘
  1500. 121.84 s >
  1501. 121.84 s > stderr:
  1502. 121.84 s >
  1503. 121.84 s > ┌───────────────────────────────────────────────────────────┐
  1504. 121.84 s > │ Could not resolve the IP of the Symbolica license server. │
  1505. 121.84 s > │ │
  1506. 121.84 s > │ Please check your DNS configuration. │
  1507. 121.84 s > └───────────────────────────────────────────────────────────┘
  1508. 121.84 s > Error: failed to lookup address information: Temporary failure in name resolution
  1509. 121.84 s >
  1510. 121.84 s >
  1511. 121.84 s > Location:
  1512. 121.84 s > tests/tests/test_python_api.rs:156:20
  1513. 121.84 s >
  1514. 121.84 s > FAIL [ 0.109s] (2/5) gammaloop-integration-tests::test_python_api python_session_getters_return_live_toml_and_command_blocks
  1515. 121.84 s > stdout ---
  1516. 121.84 s >
  1517. 121.84 s > running 1 test
  1518. 121.84 s > test python_session_getters_return_live_toml_and_command_blocks ... FAILED
  1519. 121.84 s >
  1520. 121.84 s > failures:
  1521. 121.84 s >
  1522. 121.84 s > failures:
  1523. 121.84 s > python_session_getters_return_live_toml_and_command_blocks
  1524. 121.84 s >
  1525. 121.84 s > test result: FAILED. 0 passed; 1 failed; 0 ignored; 0 measured; 4 filtered out; finished in 0.10s
  1526. 121.84 s >
  1527. 121.84 s > stderr ---
  1528. 121.84 s > Error: Python API test subprocess failed.
  1529. 121.84 s > stdout:
  1530. 121.84 s > ┌────────────────────────────────────────────────────────┐
  1531. 121.84 s > │ You are running a restricted Symbolica instance. │
  1532. 121.84 s > │ │
  1533. 121.84 s > │ This mode is only permitted for non-commercial use and │
  1534. 121.84 s > │ is limited to one instance and core per machine. │
  1535. 121.84 s > │ │
  1536. 121.84 s > │ Hobbyists can easily acquire a free license key │
  1537. 121.84 s > │ that unlocks all cores and removes this banner: │
  1538. 121.84 s > │ │
  1539. 121.84 s > │ from symbolica import * │
  1540. 121.84 s > │ request_hobbyist_license('YOUR_NAME', 'YOUR_EMAIL') │
  1541. 121.84 s > │ │
  1542. 121.84 s > │ All other users can obtain a free 30-day trial key: │
  1543. 121.84 s > │ │
  1544. 121.84 s > │ from symbolica import * │
  1545. 121.84 s > │ request_trial_license('NAME', 'EMAIL', 'EMPLOYER') │
  1546. 121.84 s > │ │
  1547. 121.84 s > │ See https://symbolica.io/docs/get_started.html#license │
  1548. 121.84 s > └────────────────────────────────────────────────────────┘
  1549. 121.84 s > ┌───────────────────────────────────────────────────────────────────────────────────────────────────────────┐
  1550. 121.84 s > │ Cannot start new unlicensed Symbolica instance since there is already another one running on the machine. │
  1551. 121.84 s > └───────────────────────────────────────────────────────────────────────────────────────────────────────────┘
  1552. 121.84 s >
  1553. 121.84 s > stderr:
  1554. 121.84 s >
  1555. 121.84 s > ┌───────────────────────────────────────────────────────────┐
  1556. 121.84 s > │ Could not resolve the IP of the Symbolica license server. │
  1557. 121.84 s > │ │
  1558. 121.84 s > │ Please check your DNS configuration. │
  1559. 121.84 s > └───────────────────────────────────────────────────────────┘
  1560. 121.84 s > Error: failed to lookup address information: Temporary failure in name resolution
  1561. 121.84 s >
  1562. 121.84 s >
  1563. 121.84 s > Location:
  1564. 121.84 s > tests/tests/test_python_api.rs:156:20
  1565. 121.84 s >
  1566. 121.84 s > FAIL [ 0.125s] (3/5) gammaloop-integration-tests::test_python_api python_evaluate_samples_batch_and_momentum_space_have_expected_shape
  1567. 121.84 s > stdout ---
  1568. 121.84 s >
  1569. 121.84 s > running 1 test
  1570. 121.84 s > test python_evaluate_samples_batch_and_momentum_space_have_expected_shape ... FAILED
  1571. 121.84 s >
  1572. 121.84 s > failures:
  1573. 121.84 s >
  1574. 121.84 s > failures:
  1575. 121.84 s > python_evaluate_samples_batch_and_momentum_space_have_expected_shape
  1576. 121.84 s >
  1577. 121.84 s > test result: FAILED. 0 passed; 1 failed; 0 ignored; 0 measured; 4 filtered out; finished in 0.12s
  1578. 121.84 s >
  1579. 121.84 s > stderr ---
  1580. 121.84 s > Error: Python API test subprocess failed.
  1581. 121.84 s > stdout:
  1582. 121.84 s > ┌────────────────────────────────────────────────────────┐
  1583. 121.84 s > │ You are running a restricted Symbolica instance. │
  1584. 121.84 s > │ │
  1585. 121.84 s > │ This mode is only permitted for non-commercial use and │
  1586. 121.84 s > │ is limited to one instance and core per machine. │
  1587. 121.84 s > │ │
  1588. 121.84 s > │ Hobbyists can easily acquire a free license key │
  1589. 121.84 s > │ that unlocks all cores and removes this banner: │
  1590. 121.84 s > │ │
  1591. 121.84 s > │ from symbolica import * │
  1592. 121.84 s > │ request_hobbyist_license('YOUR_NAME', 'YOUR_EMAIL') │
  1593. 121.84 s > │ │
  1594. 121.84 s > │ All other users can obtain a free 30-day trial key: │
  1595. 121.84 s > │ │
  1596. 121.84 s > │ from symbolica import * │
  1597. 121.84 s > │ request_trial_license('NAME', 'EMAIL', 'EMPLOYER') │
  1598. 121.84 s > │ │
  1599. 121.84 s > │ See https://symbolica.io/docs/get_started.html#license │
  1600. 121.84 s > └────────────────────────────────────────────────────────┘
  1601. 121.84 s > ┌───────────────────────────────────────────────────────────────────────────────────────────────────────────┐
  1602. 121.84 s > │ Cannot start new unlicensed Symbolica instance since there is already another one running on the machine. │
  1603. 121.84 s > └───────────────────────────────────────────────────────────────────────────────────────────────────────────┘
  1604. 121.84 s >
  1605. 121.84 s > stderr:
  1606. 121.84 s >
  1607. 121.84 s > ┌───────────────────────────────────────────────────────────┐
  1608. 121.84 s > │ Could not resolve the IP of the Symbolica license server. │
  1609. 121.84 s > │ │
  1610. 121.84 s > │ Please check your DNS configuration. │
  1611. 121.84 s > └───────────────────────────────────────────────────────────┘
  1612. 121.84 s > Error: failed to lookup address information: Temporary failure in name resolution
  1613. 121.84 s >
  1614. 121.84 s >
  1615. 121.84 s > Location:
  1616. 121.84 s > tests/tests/test_python_api.rs:156:20
  1617. 121.84 s >
  1618. 121.84 s > FAIL [ 0.205s] (4/5) gammaloop-integration-tests::test_python_api python_evaluate_sample_honors_generate_events_and_observable_snapshots
  1619. 121.84 s > stdout ---
  1620. 121.84 s >
  1621. 121.84 s > running 1 test
  1622. 121.84 s > test python_evaluate_sample_honors_generate_events_and_observable_snapshots ... FAILED
  1623. 121.84 s >
  1624. 121.84 s > failures:
  1625. 121.84 s >
  1626. 121.84 s > failures:
  1627. 121.84 s > python_evaluate_sample_honors_generate_events_and_observable_snapshots
  1628. 121.84 s >
  1629. 121.84 s > test result: FAILED. 0 passed; 1 failed; 0 ignored; 0 measured; 4 filtered out; finished in 0.20s
  1630. 121.84 s >
  1631. 121.84 s > stderr ---
  1632. 121.84 s > Error: Python API test subprocess failed.
  1633. 121.84 s > stdout:
  1634. 121.84 s > ┌────────────────────────────────────────────────────────┐
  1635. 121.84 s > │ You are running a restricted Symbolica instance. │
  1636. 121.84 s > │ │
  1637. 121.84 s > │ This mode is only permitted for non-commercial use and │
  1638. 121.84 s > │ is limited to one instance and core per machine. │
  1639. 121.84 s > │ │
  1640. 121.84 s > │ Hobbyists can easily acquire a free license key │
  1641. 121.84 s > │ that unlocks all cores and removes this banner: │
  1642. 121.84 s > │ │
  1643. 121.84 s > │ from symbolica import * │
  1644. 121.84 s > │ request_hobbyist_license('YOUR_NAME', 'YOUR_EMAIL') │
  1645. 121.84 s > │ │
  1646. 121.84 s > │ All other users can obtain a free 30-day trial key: │
  1647. 121.84 s > │ │
  1648. 121.84 s > │ from symbolica import * │
  1649. 121.84 s > │ request_trial_license('NAME', 'EMAIL', 'EMPLOYER') │
  1650. 121.84 s > │ │
  1651. 121.84 s > │ See https://symbolica.io/docs/get_started.html#license │
  1652. 121.84 s > └────────────────────────────────────────────────────────┘
  1653. 121.84 s > ┌───────────────────────────────────────────────────────────────────────────────────────────────────────────┐
  1654. 121.84 s > │ Cannot start new unlicensed Symbolica instance since there is already another one running on the machine. │
  1655. 121.84 s > └───────────────────────────────────────────────────────────────────────────────────────────────────────────┘
  1656. 121.84 s >
  1657. 121.84 s > stderr:
  1658. 121.84 s >
  1659. 121.84 s > ┌───────────────────────────────────────────────────────────┐
  1660. 121.84 s > │ Could not resolve the IP of the Symbolica license server. │
  1661. 121.84 s > │ │
  1662. 121.84 s > │ Please check your DNS configuration. │
  1663. 121.84 s > └───────────────────────────────────────────────────────────┘
  1664. 121.84 s > Error: failed to lookup address information: Temporary failure in name resolution
  1665. 121.84 s > [2026-09-03 15:33:22.333] @gammaloop_api::se... INFO : Running command import model sm-default
  1666. 121.84 s > [2026-09-03 15:33:22.333] @import::model INFO : Loading built-in JSON model sm-default
  1667. 121.84 s > [2026-09-03 15:33:22.364] @gammalooprs::model INFO : The following 11 external parameters were forced to zero by the restriction card:
  1668. 121.84 s > lamWS, AWS, rhoWS, etaWS, ymc, yme, ymm, MC, Me, MM, WTau
  1669. 121.84 s > [2026-09-03 15:33:22.364] @gammalooprs::model INFO : The following 34 vertex rules were removed by the restriction card:
  1670. 121.84 s > V_82 -> (c~, d, G+) | V_83 -> (t~, d, G+) | V_84 -> (c~, s, G+) | V_85 -> (t~, s, G+) | V_86 -> (u~, b, G+) | V_87 -> (c~, b, G+) | V_90 -> (c~, d, W+) | V_91 -> (t~, d, W+) | V_92 -> (u~, s, W+) | V_94 -> (t~, s, W+) | V_95 -> (u~, b, W+) | V_96 -> (c~, b, W+) | V_101 -> (e+, e-, G0) | V_102 -> (mu+, mu-, G0) | V_104 -> (e+, e-, H) | V_105 -> (mu+, mu-, H) | V_110 -> (ve~, e-, G+) | V_111 -> (vm~, mu-, G+) | V_116 -> (b~, u, G-) | V_117 -> (d~, c, G-) | V_118 -> (s~, c, G-) | V_119 -> (b~, c, G-) | V_120 -> (d~, t, G-) | V_121 -> (s~, t, G-) | V_124 -> (s~, u, W-) | V_125 -> (b~, u, W-) | V_126 -> (d~, c, W-) | V_128 -> (b~, c, W-) | V_129 -> (d~, t, W-) | V_130 -> (s~, t, W-) | V_138 -> (c~, c, G0) | V_140 -> (c~, c, H) | V_145 -> (e+, ve, G-) | V_146 -> (mu+, vm, G-)
  1671. 121.84 s > [2026-09-03 15:33:22.364] @gammalooprs::model INFO : The following 36 couplings were removed by the restriction card:
  1672. 121.84 s > GC_13, GC_14, GC_16, GC_17, GC_18, GC_19, GC_20, GC_22, GC_23, GC_24, GC_25, GC_26, GC_28, GC_29, GC_42, GC_43, GC_44, GC_46, GC_47, GC_48, GC_84, GC_85, GC_86, GC_87, GC_88, GC_89, GC_90, GC_91, GC_92, GC_93, GC_101, GC_102, GC_103, GC_105, GC_106, GC_107
  1673. 121.84 s > [2026-09-03 15:33:22.364] @gammaloop_api::se... INFO : Running command set default-runtime kv kinematics.externals='{"type":"constant","data":{"momenta":[[32.0,0.0,0.0,32.0],[32.0,0.0,0.0,-32.0]],"helicities":[1,1]}}'
  1674. 121.84 s > [2026-09-03 15:33:22.365] @gammaloop_api::se... INFO : Running command set default-runtime kv subtraction.disable_threshold_subtraction=true
  1675. 121.84 s > [2026-09-03 15:33:22.366] @gammaloop_api::se... INFO : Running command generate xs e+ e- > d d~ g | e- a d g QED^2==4 [{{2}} QCD=0] --numerator-grouping group_identical_graphs_up_to_sign --clear-existing-processes --only-diagrams
  1676. 121.84 s > [2026-09-03 15:33:22.368] @feyngen::diagram_... INFO : 0s | Δ=0s | Starting Feynman graph generation with Symbolica...
  1677. 121.84 s > [2026-09-03 15:33:22.370] @feyngen::diagram_... INFO : 0s | Δ=0s | Number of graphs resulting from Symbolica generation: 246
  1678. 121.84 s > [2026-09-03 15:33:22.370] @feyngen::diagram_... INFO : 0s | Δ=0s | Number of graphs retained after enforcing supergraph particle content: 8
  1679. 121.84 s > [2026-09-03 15:33:22.370] @feyngen::diagram_... INFO : 0s | Δ=0s | Number of graphs retained after removal of vetoed topologies: 8
  1680. 121.84 s > [2026-09-03 15:33:22.371] @feyngen::diagram_... INFO : 0s | Δ=0s | Number of graphs after vertex info assignment: 8
  1681. 121.84 s > [2026-09-03 15:33:22.371] @feyngen::diagram_... INFO : 0s | Δ=0s | Number of graphs after all complete graphs filters are applied: 8
  1682. 121.84 s >
  1683. 121.84 s >
  1684. 121.84 s > Location:
  1685. 121.84 s > tests/tests/test_python_api.rs:156:20
  1686. 121.84 s >
  1687. 121.84 s > FAIL [ 0.219s] (5/5) gammaloop-integration-tests::test_python_api python_settings_wrappers_expose_nested_runtime_and_global_settings
  1688. 121.84 s > stdout ---
  1689. 121.84 s >
  1690. 121.84 s > running 1 test
  1691. 121.84 s > test python_settings_wrappers_expose_nested_runtime_and_global_settings ... FAILED
  1692. 121.84 s >
  1693. 121.84 s > failures:
  1694. 121.84 s >
  1695. 121.84 s > failures:
  1696. 121.84 s > python_settings_wrappers_expose_nested_runtime_and_global_settings
  1697. 121.84 s >
  1698. 121.84 s > test result: FAILED. 0 passed; 1 failed; 0 ignored; 0 measured; 4 filtered out; finished in 0.22s
  1699. 121.84 s >
  1700. 121.84 s > stderr ---
  1701. 121.84 s > Error: Python API test subprocess failed.
  1702. 121.84 s > stdout:
  1703. 121.84 s > ┌────────────────────────────────────────────────────────┐
  1704. 121.84 s > │ You are running a restricted Symbolica instance. │
  1705. 121.84 s > │ │
  1706. 121.84 s > │ This mode is only permitted for non-commercial use and │
  1707. 121.84 s > │ is limited to one instance and core per machine. │
  1708. 121.84 s > │ │
  1709. 121.84 s > │ Hobbyists can easily acquire a free license key │
  1710. 121.84 s > │ that unlocks all cores and removes this banner: │
  1711. 121.84 s > │ │
  1712. 121.84 s > │ from symbolica import * │
  1713. 121.84 s > │ request_hobbyist_license('YOUR_NAME', 'YOUR_EMAIL') │
  1714. 121.84 s > │ │
  1715. 121.84 s > │ All other users can obtain a free 30-day trial key: │
  1716. 121.84 s > │ │
  1717. 121.84 s > │ from symbolica import * │
  1718. 121.84 s > │ request_trial_license('NAME', 'EMAIL', 'EMPLOYER') │
  1719. 121.84 s > │ │
  1720. 121.84 s > │ See https://symbolica.io/docs/get_started.html#license │
  1721. 121.84 s > └────────────────────────────────────────────────────────┘
  1722. 121.84 s > ┌───────────────────────────────────────────────────────────────────────────────────────────────────────────┐
  1723. 121.84 s > │ Cannot start new unlicensed Symbolica instance since there is already another one running on the machine. │
  1724. 121.84 s > └───────────────────────────────────────────────────────────────────────────────────────────────────────────┘
  1725. 121.84 s >
  1726. 121.84 s > stderr:
  1727. 121.84 s >
  1728. 121.84 s > ┌───────────────────────────────────────────────────────────┐
  1729. 121.84 s > │ Could not resolve the IP of the Symbolica license server. │
  1730. 121.84 s > │ │
  1731. 121.84 s > │ Please check your DNS configuration. │
  1732. 121.84 s > └───────────────────────────────────────────────────────────┘
  1733. 121.84 s > Error: failed to lookup address information: Temporary failure in name resolution
  1734. 121.84 s >
  1735. 121.84 s >
  1736. 121.84 s > Location:
  1737. 121.84 s > tests/tests/test_python_api.rs:156:20
  1738. 121.84 s >
  1739. 121.84 s > ------------
  1740. 121.84 s > Summary [ 0.219s] 5 tests run: 0 passed, 5 failed, 0 skipped
  1741. 121.84 s > FAIL [ 0.104s] (1/5) gammaloop-integration-tests::test_python_api python_evaluate_sample_preserves_graph_grouping_and_incoming_pdgs
  1742. 121.84 s > stdout ---
  1743. 121.84 s >
  1744. 121.84 s > running 1 test
  1745. 121.84 s > test python_evaluate_sample_preserves_graph_grouping_and_incoming_pdgs ... FAILED
  1746. 121.84 s >
  1747. 121.84 s > failures:
  1748. 121.84 s >
  1749. 121.84 s > failures:
  1750. 121.84 s > python_evaluate_sample_preserves_graph_grouping_and_incoming_pdgs
  1751. 121.84 s >
  1752. 121.84 s > test result: FAILED. 0 passed; 1 failed; 0 ignored; 0 measured; 4 filtered out; finished in 0.10s
  1753. 121.84 s >
  1754. 121.84 s > stderr ---
  1755. 121.84 s > Error: Python API test subprocess failed.
  1756. 121.84 s > stdout:
  1757. 121.84 s > ┌────────────────────────────────────────────────────────┐
  1758. 121.84 s > │ You are running a restricted Symbolica instance. │
  1759. 121.84 s > │ │
  1760. 121.84 s > │ This mode is only permitted for non-commercial use and │
  1761. 121.84 s > │ is limited to one instance and core per machine. │
  1762. 121.84 s > │ │
  1763. 121.84 s > │ Hobbyists can easily acquire a free license key │
  1764. 121.84 s > │ that unlocks all cores and removes this banner: │
  1765. 121.84 s > │ │
  1766. 121.84 s > │ from symbolica import * │
  1767. 121.84 s > │ request_hobbyist_license('YOUR_NAME', 'YOUR_EMAIL') │
  1768. 121.84 s > │ │
  1769. 121.84 s > │ All other users can obtain a free 30-day trial key: │
  1770. 121.84 s > │ │
  1771. 121.84 s > │ from symbolica import * │
  1772. 121.84 s > │ request_trial_license('NAME', 'EMAIL', 'EMPLOYER') │
  1773. 121.84 s > │ │
  1774. 121.84 s > │ See https://symbolica.io/docs/get_started.html#license │
  1775. 121.84 s > └────────────────────────────────────────────────────────┘
  1776. 121.84 s > ┌───────────────────────────────────────────────────────────────────────────────────────────────────────────┐
  1777. 121.84 s > │ Cannot start new unlicensed Symbolica instance since there is already another one running on the machine. │
  1778. 121.84 s > └───────────────────────────────────────────────────────────────────────────────────────────────────────────┘
  1779. 121.84 s >
  1780. 121.84 s > stderr:
  1781. 121.84 s >
  1782. 121.84 s > ┌───────────────────────────────────────────────────────────┐
  1783. 121.84 s > │ Could not resolve the IP of the Symbolica license server. │
  1784. 121.84 s > │ │
  1785. 121.84 s > │ Please check your DNS configuration. │
  1786. 121.84 s > └───────────────────────────────────────────────────────────┘
  1787. 121.84 s > Error: failed to lookup address information: Temporary failure in name resolution
  1788. 121.84 s >
  1789. 121.84 s >
  1790. 121.84 s > Location:
  1791. 121.84 s > tests/tests/test_python_api.rs:156:20
  1792. 121.84 s >
  1793. 121.84 s > FAIL [ 0.109s] (2/5) gammaloop-integration-tests::test_python_api python_session_getters_return_live_toml_and_command_blocks
  1794. 121.84 s > stdout ---
  1795. 121.84 s >
  1796. 121.84 s > running 1 test
  1797. 121.84 s > test python_session_getters_return_live_toml_and_command_blocks ... FAILED
  1798. 121.84 s >
  1799. 121.84 s > failures:
  1800. 121.84 s >
  1801. 121.84 s > failures:
  1802. 121.84 s > python_session_getters_return_live_toml_and_command_blocks
  1803. 121.84 s >
  1804. 121.84 s > test result: FAILED. 0 passed; 1 failed; 0 ignored; 0 measured; 4 filtered out; finished in 0.10s
  1805. 121.84 s >
  1806. 121.84 s > stderr ---
  1807. 121.84 s > Error: Python API test subprocess failed.
  1808. 121.84 s > stdout:
  1809. 121.84 s > ┌────────────────────────────────────────────────────────┐
  1810. 121.84 s > │ You are running a restricted Symbolica instance. │
  1811. 121.84 s > │ │
  1812. 121.84 s > │ This mode is only permitted for non-commercial use and │
  1813. 121.84 s > │ is limited to one instance and core per machine. │
  1814. 121.84 s > │ │
  1815. 121.84 s > │ Hobbyists can easily acquire a free license key │
  1816. 121.84 s > │ that unlocks all cores and removes this banner: │
  1817. 121.84 s > │ │
  1818. 121.84 s > │ from symbolica import * │
  1819. 121.84 s > │ request_hobbyist_license('YOUR_NAME', 'YOUR_EMAIL') │
  1820. 121.84 s > │ │
  1821. 121.84 s > │ All other users can obtain a free 30-day trial key: │
  1822. 121.84 s > │ │
  1823. 121.84 s > │ from symbolica import * │
  1824. 121.84 s > │ request_trial_license('NAME', 'EMAIL', 'EMPLOYER') │
  1825. 121.84 s > │ │
  1826. 121.84 s > │ See https://symbolica.io/docs/get_started.html#license │
  1827. 121.84 s > └────────────────────────────────────────────────────────┘
  1828. 121.84 s > ┌───────────────────────────────────────────────────────────────────────────────────────────────────────────┐
  1829. 121.84 s > │ Cannot start new unlicensed Symbolica instance since there is already another one running on the machine. │
  1830. 121.84 s > └───────────────────────────────────────────────────────────────────────────────────────────────────────────┘
  1831. 121.84 s >
  1832. 121.84 s > stderr:
  1833. 121.84 s >
  1834. 121.84 s > ┌───────────────────────────────────────────────────────────┐
  1835. 121.84 s > │ Could not resolve the IP of the Symbolica license server. │
  1836. 121.84 s > │ │
  1837. 121.84 s > │ Please check your DNS configuration. │
  1838. 121.84 s > └───────────────────────────────────────────────────────────┘
  1839. 121.84 s > Error: failed to lookup address information: Temporary failure in name resolution
  1840. 121.84 s >
  1841. 121.84 s >
  1842. 121.84 s > Location:
  1843. 121.84 s > tests/tests/test_python_api.rs:156:20
  1844. 121.84 s >
  1845. 121.84 s > FAIL [ 0.125s] (3/5) gammaloop-integration-tests::test_python_api python_evaluate_samples_batch_and_momentum_space_have_expected_shape
  1846. 121.84 s > stdout ---
  1847. 121.84 s >
  1848. 121.84 s > running 1 test
  1849. 121.84 s > test python_evaluate_samples_batch_and_momentum_space_have_expected_shape ... FAILED
  1850. 121.84 s >
  1851. 121.84 s > failures:
  1852. 121.84 s >
  1853. 121.84 s > failures:
  1854. 121.84 s > python_evaluate_samples_batch_and_momentum_space_have_expected_shape
  1855. 121.84 s >
  1856. 121.84 s > test result: FAILED. 0 passed; 1 failed; 0 ignored; 0 measured; 4 filtered out; finished in 0.12s
  1857. 121.84 s >
  1858. 121.84 s > stderr ---
  1859. 121.84 s > Error: Python API test subprocess failed.
  1860. 121.84 s > stdout:
  1861. 121.84 s > ┌────────────────────────────────────────────────────────┐
  1862. 121.84 s > │ You are running a restricted Symbolica instance. │
  1863. 121.84 s > │ │
  1864. 121.84 s > │ This mode is only permitted for non-commercial use and │
  1865. 121.84 s > │ is limited to one instance and core per machine. │
  1866. 121.84 s > │ │
  1867. 121.84 s > │ Hobbyists can easily acquire a free license key │
  1868. 121.84 s > │ that unlocks all cores and removes this banner: │
  1869. 121.84 s > │ │
  1870. 121.84 s > │ from symbolica import * │
  1871. 121.84 s > │ request_hobbyist_license('YOUR_NAME', 'YOUR_EMAIL') │
  1872. 121.84 s > │ │
  1873. 121.84 s > │ All other users can obtain a free 30-day trial key: │
  1874. 121.84 s > │ │
  1875. 121.84 s > │ from symbolica import * │
  1876. 121.84 s > │ request_trial_license('NAME', 'EMAIL', 'EMPLOYER') │
  1877. 121.84 s > │ │
  1878. 121.84 s > │ See https://symbolica.io/docs/get_started.html#license │
  1879. 121.84 s > └────────────────────────────────────────────────────────┘
  1880. 121.84 s > ┌───────────────────────────────────────────────────────────────────────────────────────────────────────────┐
  1881. 121.84 s > │ Cannot start new unlicensed Symbolica instance since there is already another one running on the machine. │
  1882. 121.84 s > └───────────────────────────────────────────────────────────────────────────────────────────────────────────┘
  1883. 121.84 s >
  1884. 121.84 s > stderr:
  1885. 121.84 s >
  1886. 121.84 s > ┌───────────────────────────────────────────────────────────┐
  1887. 121.84 s > │ Could not resolve the IP of the Symbolica license server. │
  1888. 121.84 s > │ │
  1889. 121.84 s > │ Please check your DNS configuration. │
  1890. 121.84 s > └───────────────────────────────────────────────────────────┘
  1891. 121.84 s > Error: failed to lookup address information: Temporary failure in name resolution
  1892. 121.84 s >
  1893. 121.84 s >
  1894. 121.84 s > Location:
  1895. 121.84 s > tests/tests/test_python_api.rs:156:20
  1896. 121.84 s >
  1897. 121.84 s > FAIL [ 0.205s] (4/5) gammaloop-integration-tests::test_python_api python_evaluate_sample_honors_generate_events_and_observable_snapshots
  1898. 121.84 s > stdout ---
  1899. 121.84 s >
  1900. 121.84 s > running 1 test
  1901. 121.84 s > test python_evaluate_sample_honors_generate_events_and_observable_snapshots ... FAILED
  1902. 121.84 s >
  1903. 121.84 s > failures:
  1904. 121.84 s >
  1905. 121.84 s > failures:
  1906. 121.84 s > python_evaluate_sample_honors_generate_events_and_observable_snapshots
  1907. 121.84 s >
  1908. 121.84 s > test result: FAILED. 0 passed; 1 failed; 0 ignored; 0 measured; 4 filtered out; finished in 0.20s
  1909. 121.84 s >
  1910. 121.84 s > stderr ---
  1911. 121.84 s > Error: Python API test subprocess failed.
  1912. 121.84 s > stdout:
  1913. 121.84 s > ┌────────────────────────────────────────────────────────┐
  1914. 121.84 s > │ You are running a restricted Symbolica instance. │
  1915. 121.84 s > │ │
  1916. 121.84 s > │ This mode is only permitted for non-commercial use and │
  1917. 121.84 s > │ is limited to one instance and core per machine. │
  1918. 121.84 s > │ │
  1919. 121.84 s > │ Hobbyists can easily acquire a free license key │
  1920. 121.84 s > │ that unlocks all cores and removes this banner: │
  1921. 121.84 s > │ │
  1922. 121.84 s > │ from symbolica import * │
  1923. 121.84 s > │ request_hobbyist_license('YOUR_NAME', 'YOUR_EMAIL') │
  1924. 121.84 s > │ │
  1925. 121.84 s > │ All other users can obtain a free 30-day trial key: │
  1926. 121.84 s > │ │
  1927. 121.84 s > │ from symbolica import * │
  1928. 121.84 s > │ request_trial_license('NAME', 'EMAIL', 'EMPLOYER') │
  1929. 121.84 s > │ │
  1930. 121.84 s > │ See https://symbolica.io/docs/get_started.html#license │
  1931. 121.84 s > └────────────────────────────────────────────────────────┘
  1932. 121.84 s > ┌───────────────────────────────────────────────────────────────────────────────────────────────────────────┐
  1933. 121.84 s > │ Cannot start new unlicensed Symbolica instance since there is already another one running on the machine. │
  1934. 121.84 s > └───────────────────────────────────────────────────────────────────────────────────────────────────────────┘
  1935. 121.84 s >
  1936. 121.84 s > stderr:
  1937. 121.84 s >
  1938. 121.84 s > ┌───────────────────────────────────────────────────────────┐
  1939. 121.84 s > │ Could not resolve the IP of the Symbolica license server. │
  1940. 121.84 s > │ │
  1941. 121.84 s > │ Please check your DNS configuration. │
  1942. 121.84 s > └───────────────────────────────────────────────────────────┘
  1943. 121.84 s > Error: failed to lookup address information: Temporary failure in name resolution
  1944. 121.84 s > [2026-09-03 15:33:22.333] @gammaloop_api::se... INFO : Running command import model sm-default
  1945. 121.84 s > [2026-09-03 15:33:22.333] @import::model INFO : Loading built-in JSON model sm-default
  1946. 121.84 s > [2026-09-03 15:33:22.364] @gammalooprs::model INFO : The following 11 external parameters were forced to zero by the restriction card:
  1947. 121.84 s > lamWS, AWS, rhoWS, etaWS, ymc, yme, ymm, MC, Me, MM, WTau
  1948. 121.84 s > [2026-09-03 15:33:22.364] @gammalooprs::model INFO : The following 34 vertex rules were removed by the restriction card:
  1949. 121.84 s > V_82 -> (c~, d, G+) | V_83 -> (t~, d, G+) | V_84 -> (c~, s, G+) | V_85 -> (t~, s, G+) | V_86 -> (u~, b, G+) | V_87 -> (c~, b, G+) | V_90 -> (c~, d, W+) | V_91 -> (t~, d, W+) | V_92 -> (u~, s, W+) | V_94 -> (t~, s, W+) | V_95 -> (u~, b, W+) | V_96 -> (c~, b, W+) | V_101 -> (e+, e-, G0) | V_102 -> (mu+, mu-, G0) | V_104 -> (e+, e-, H) | V_105 -> (mu+, mu-, H) | V_110 -> (ve~, e-, G+) | V_111 -> (vm~, mu-, G+) | V_116 -> (b~, u, G-) | V_117 -> (d~, c, G-) | V_118 -> (s~, c, G-) | V_119 -> (b~, c, G-) | V_120 -> (d~, t, G-) | V_121 -> (s~, t, G-) | V_124 -> (s~, u, W-) | V_125 -> (b~, u, W-) | V_126 -> (d~, c, W-) | V_128 -> (b~, c, W-) | V_129 -> (d~, t, W-) | V_130 -> (s~, t, W-) | V_138 -> (c~, c, G0) | V_140 -> (c~, c, H) | V_145 -> (e+, ve, G-) | V_146 -> (mu+, vm, G-)
  1950. 121.84 s > [2026-09-03 15:33:22.364] @gammalooprs::model INFO : The following 36 couplings were removed by the restriction card:
  1951. 121.84 s > GC_13, GC_14, GC_16, GC_17, GC_18, GC_19, GC_20, GC_22, GC_23, GC_24, GC_25, GC_26, GC_28, GC_29, GC_42, GC_43, GC_44, GC_46, GC_47, GC_48, GC_84, GC_85, GC_86, GC_87, GC_88, GC_89, GC_90, GC_91, GC_92, GC_93, GC_101, GC_102, GC_103, GC_105, GC_106, GC_107
  1952. 121.84 s > [2026-09-03 15:33:22.364] @gammaloop_api::se... INFO : Running command set default-runtime kv kinematics.externals='{"type":"constant","data":{"momenta":[[32.0,0.0,0.0,32.0],[32.0,0.0,0.0,-32.0]],"helicities":[1,1]}}'
  1953. 121.84 s > [2026-09-03 15:33:22.365] @gammaloop_api::se... INFO : Running command set default-runtime kv subtraction.disable_threshold_subtraction=true
  1954. 121.84 s > [2026-09-03 15:33:22.366] @gammaloop_api::se... INFO : Running command generate xs e+ e- > d d~ g | e- a d g QED^2==4 [{{2}} QCD=0] --numerator-grouping group_identical_graphs_up_to_sign --clear-existing-processes --only-diagrams
  1955. 121.84 s > [2026-09-03 15:33:22.368] @feyngen::diagram_... INFO : 0s | Δ=0s | Starting Feynman graph generation with Symbolica...
  1956. 121.84 s > [2026-09-03 15:33:22.370] @feyngen::diagram_... INFO : 0s | Δ=0s | Number of graphs resulting from Symbolica generation: 246
  1957. 121.84 s > [2026-09-03 15:33:22.370] @feyngen::diagram_... INFO : 0s | Δ=0s | Number of graphs retained after enforcing supergraph particle content: 8
  1958. 121.84 s > [2026-09-03 15:33:22.370] @feyngen::diagram_... INFO : 0s | Δ=0s | Number of graphs retained after removal of vetoed topologies: 8
  1959. 121.84 s > [2026-09-03 15:33:22.371] @feyngen::diagram_... INFO : 0s | Δ=0s | Number of graphs after vertex info assignment: 8
  1960. 121.84 s > [2026-09-03 15:33:22.371] @feyngen::diagram_... INFO : 0s | Δ=0s | Number of graphs after all complete graphs filters are applied: 8
  1961. 121.84 s >
  1962. 121.84 s >
  1963. 121.84 s > Location:
  1964. 121.84 s > tests/tests/test_python_api.rs:156:20
  1965. 121.84 s >
  1966. 121.84 s > FAIL [ 0.219s] (5/5) gammaloop-integration-tests::test_python_api python_settings_wrappers_expose_nested_runtime_and_global_settings
  1967. 121.84 s > stdout ---
  1968. 121.84 s >
  1969. 121.84 s > running 1 test
  1970. 121.84 s > test python_settings_wrappers_expose_nested_runtime_and_global_settings ... FAILED
  1971. 121.84 s >
  1972. 121.84 s > failures:
  1973. 121.84 s >
  1974. 121.84 s > failures:
  1975. 121.84 s > python_settings_wrappers_expose_nested_runtime_and_global_settings
  1976. 121.84 s >
  1977. 121.84 s > test result: FAILED. 0 passed; 1 failed; 0 ignored; 0 measured; 4 filtered out; finished in 0.22s
  1978. 121.84 s >
  1979. 121.84 s > stderr ---
  1980. 121.84 s > Error: Python API test subprocess failed.
  1981. 121.84 s > stdout:
  1982. 121.84 s > ┌────────────────────────────────────────────────────────┐
  1983. 121.84 s > │ You are running a restricted Symbolica instance. │
  1984. 121.84 s > │ │
  1985. 121.84 s > │ This mode is only permitted for non-commercial use and │
  1986. 121.84 s > │ is limited to one instance and core per machine. │
  1987. 121.84 s > │ │
  1988. 121.84 s > │ Hobbyists can easily acquire a free license key │
  1989. 121.84 s > │ that unlocks all cores and removes this banner: │
  1990. 121.84 s > │ │
  1991. 121.84 s > │ from symbolica import * │
  1992. 121.84 s > │ request_hobbyist_license('YOUR_NAME', 'YOUR_EMAIL') │
  1993. 121.84 s > │ │
  1994. 121.84 s > │ All other users can obtain a free 30-day trial key: │
  1995. 121.84 s > │ │
  1996. 121.84 s > │ from symbolica import * │
  1997. 121.84 s > │ request_trial_license('NAME', 'EMAIL', 'EMPLOYER') │
  1998. 121.84 s > │ │
  1999. 121.84 s > │ See https://symbolica.io/docs/get_started.html#license │
  2000. 121.84 s > └────────────────────────────────────────────────────────┘
  2001. 121.84 s > ┌───────────────────────────────────────────────────────────────────────────────────────────────────────────┐
  2002. 121.84 s > │ Cannot start new unlicensed Symbolica instance since there is already another one running on the machine. │
  2003. 121.84 s > └───────────────────────────────────────────────────────────────────────────────────────────────────────────┘
  2004. 121.84 s >
  2005. 121.84 s > stderr:
  2006. 121.84 s >
  2007. 121.84 s > ┌───────────────────────────────────────────────────────────┐
  2008. 121.84 s > │ Could not resolve the IP of the Symbolica license server. │
  2009. 121.84 s > │ │
  2010. 121.84 s > │ Please check your DNS configuration. │
  2011. 121.84 s > └───────────────────────────────────────────────────────────┘
  2012. 121.84 s > Error: failed to lookup address information: Temporary failure in name resolution
  2013. 121.84 s >
  2014. 121.84 s >
  2015. 121.84 s > Location:
  2016. 121.84 s > tests/tests/test_python_api.rs:156:20
  2017. 121.84 s >
  2018. 121.84 s > error: test run failed
  2019. 121.84 s >
  2020. 121.84 s > ========== nextest test summary ==========
  2021. 121.84 s > report: target/nextest/ci_gammaloop/junit.xml
  2022. 121.84 s > tests: 5, failures: 5, errors: 0
  2023. 121.84 s >
  2024. 121.84 s > 1. gammaloop-integration-tests::test_python_api::python_evaluate_sample_preserves_graph_grouping_and_incoming_pdgs
  2025. 121.84 s > failure: test failure with exit code 101
  2026. 121.84 s > Error: Python API test subprocess failed.
  2027. 121.84 s > stdout:
  2028. 121.84 s > ┌────────────────────────────────────────────────────────┐
  2029. 121.84 s > │ You are running a restricted Symbolica instance. │
  2030. 121.84 s > │ │
  2031. 121.84 s > │ This mode is only permitted for non-commercial use and │
  2032. 121.84 s > │ is limited to one instance and core per machine. │
  2033. 121.84 s > │ │
  2034. 121.84 s > │ Hobbyists can easily acquire a free license key │
  2035. 121.84 s > │ that unlocks all cores and removes this banner: │
  2036. 121.84 s > │ │
  2037. 121.84 s > │ from symbolica import * │
  2038. 121.84 s > │ request_hobbyist_license('YOUR_NAME', 'YOUR_EMAIL') │
  2039. 121.84 s > │ │
  2040. 121.84 s > │ All other users can obtain a free 30-day trial key: │
  2041. 121.84 s > │ │
  2042. 121.84 s > │ from symbolica import * │
  2043. 121.84 s > │ request_trial_license('NAME', 'EMAIL', 'EMPLOYER') │
  2044. 121.84 s > │ │
  2045. 121.84 s > │ See https://symbolica.io/docs/get_started.html#license │
  2046. 121.84 s > └────────────────────────────────────────────────────────┘
  2047. 121.84 s > ┌───────────────────────────────────────────────────────────────────────────────────────────────────────────┐
  2048. 121.84 s > │ Cannot start new unlicensed Symbolica instance since there is already another one running on the machine. │
  2049. 121.84 s > └───────────────────────────────────────────────────────────────────────────────────────────────────────────┘
  2050. 121.84 s >
  2051. 121.84 s > stderr:
  2052. 121.84 s >
  2053. 121.84 s > ┌───────────────────────────────────────────────────────────┐
  2054. 121.84 s > │ Could not resolve the IP of the Symbolica license server. │
  2055. 121.84 s > │ │
  2056. 121.84 s > │ Please check your DNS configuration. │
  2057. 121.84 s > └───────────────────────────────────────────────────────────┘
  2058. 121.84 s > Error: failed to lookup address information: Temporary failure in name resolution
  2059. 121.84 s >
  2060. 121.84 s >
  2061. 121.84 s > Location:
  2062. 121.84 s > tests/tests/test_python_api.rs:156:20
  2063. 121.84 s > system-out
  2064. 121.84 s > running 1 test
  2065. 121.84 s > test python_evaluate_sample_preserves_graph_grouping_and_incoming_pdgs ... FAILED
  2066. 121.84 s >
  2067. 121.84 s > failures:
  2068. 121.84 s >
  2069. 121.84 s > failures:
  2070. 121.84 s > python_evaluate_sample_preserves_graph_grouping_and_incoming_pdgs
  2071. 121.84 s >
  2072. 121.84 s > test result: FAILED. 0 passed; 1 failed; 0 ignored; 0 measured; 4 filtered out; finished in 0.10s
  2073. 121.84 s > system-err
  2074. 121.84 s > Error: Python API test subprocess failed.
  2075. 121.84 s > stdout:
  2076. 121.84 s > ┌────────────────────────────────────────────────────────┐
  2077. 121.84 s > │ You are running a restricted Symbolica instance. │
  2078. 121.84 s > │ │
  2079. 121.84 s > │ This mode is only permitted for non-commercial use and │
  2080. 121.84 s > │ is limited to one instance and core per machine. │
  2081. 121.84 s > │ │
  2082. 121.84 s > │ Hobbyists can easily acquire a free license key │
  2083. 121.84 s > │ that unlocks all cores and removes this banner: │
  2084. 121.84 s > │ │
  2085. 121.84 s > │ from symbolica import * │
  2086. 121.84 s > │ request_hobbyist_license('YOUR_NAME', 'YOUR_EMAIL') │
  2087. 121.84 s > │ │
  2088. 121.84 s > │ All other users can obtain a free 30-day trial key: │
  2089. 121.84 s > │ │
  2090. 121.84 s > │ from symbolica import * │
  2091. 121.84 s > │ request_trial_license('NAME', 'EMAIL', 'EMPLOYER') │
  2092. 121.84 s > │ │
  2093. 121.84 s > │ See https://symbolica.io/docs/get_started.html#license │
  2094. 121.84 s > └────────────────────────────────────────────────────────┘
  2095. 121.84 s > ┌───────────────────────────────────────────────────────────────────────────────────────────────────────────┐
  2096. 121.84 s > │ Cannot start new unlicensed Symbolica instance since there is already another one running on the machine. │
  2097. 121.84 s > └───────────────────────────────────────────────────────────────────────────────────────────────────────────┘
  2098. 121.84 s >
  2099. 121.84 s > stderr:
  2100. 121.84 s >
  2101. 121.84 s > ┌───────────────────────────────────────────────────────────┐
  2102. 121.84 s > │ Could not resolve the IP of the Symbolica license server. │
  2103. 121.84 s > │ │
  2104. 121.84 s > │ Please check your DNS configuration. │
  2105. 121.84 s > └───────────────────────────────────────────────────────────┘
  2106. 121.84 s > Error: failed to lookup address information: Temporary failure in name resolution
  2107. 121.84 s >
  2108. 121.84 s >
  2109. 121.84 s > Location:
  2110. 121.84 s > tests/tests/test_python_api.rs:156:20
  2111. 121.84 s >
  2112. 121.84 s > 2. gammaloop-integration-tests::test_python_api::python_session_getters_return_live_toml_and_command_blocks
  2113. 121.84 s > failure: test failure with exit code 101
  2114. 121.84 s > Error: Python API test subprocess failed.
  2115. 121.84 s > stdout:
  2116. 121.84 s > ┌────────────────────────────────────────────────────────┐
  2117. 121.84 s > │ You are running a restricted Symbolica instance. │
  2118. 121.84 s > │ │
  2119. 121.84 s > │ This mode is only permitted for non-commercial use and │
  2120. 121.84 s > │ is limited to one instance and core per machine. │
  2121. 121.84 s > │ │
  2122. 121.84 s > │ Hobbyists can easily acquire a free license key │
  2123. 121.84 s > │ that unlocks all cores and removes this banner: │
  2124. 121.84 s > │ │
  2125. 121.84 s > │ from symbolica import * │
  2126. 121.84 s > │ request_hobbyist_license('YOUR_NAME', 'YOUR_EMAIL') │
  2127. 121.84 s > │ │
  2128. 121.84 s > │ All other users can obtain a free 30-day trial key: │
  2129. 121.84 s > │ │
  2130. 121.84 s > │ from symbolica import * │
  2131. 121.84 s > │ request_trial_license('NAME', 'EMAIL', 'EMPLOYER') │
  2132. 121.84 s > │ │
  2133. 121.84 s > │ See https://symbolica.io/docs/get_started.html#license │
  2134. 121.84 s > └────────────────────────────────────────────────────────┘
  2135. 121.84 s > ┌───────────────────────────────────────────────────────────────────────────────────────────────────────────┐
  2136. 121.84 s > │ Cannot start new unlicensed Symbolica instance since there is already another one running on the machine. │
  2137. 121.84 s > └───────────────────────────────────────────────────────────────────────────────────────────────────────────┘
  2138. 121.84 s >
  2139. 121.84 s > stderr:
  2140. 121.84 s >
  2141. 121.84 s > ┌───────────────────────────────────────────────────────────┐
  2142. 121.84 s > │ Could not resolve the IP of the Symbolica license server. │
  2143. 121.84 s > │ │
  2144. 121.84 s > │ Please check your DNS configuration. │
  2145. 121.84 s > └───────────────────────────────────────────────────────────┘
  2146. 121.84 s > Error: failed to lookup address information: Temporary failure in name resolution
  2147. 121.84 s >
  2148. 121.84 s >
  2149. 121.84 s > Location:
  2150. 121.84 s > tests/tests/test_python_api.rs:156:20
  2151. 121.84 s > system-out
  2152. 121.84 s > running 1 test
  2153. 121.84 s > test python_session_getters_return_live_toml_and_command_blocks ... FAILED
  2154. 121.84 s >
  2155. 121.84 s > failures:
  2156. 121.84 s >
  2157. 121.84 s > failures:
  2158. 121.84 s > python_session_getters_return_live_toml_and_command_blocks
  2159. 121.84 s >
  2160. 121.84 s > test result: FAILED. 0 passed; 1 failed; 0 ignored; 0 measured; 4 filtered out; finished in 0.10s
  2161. 121.84 s > system-err
  2162. 121.84 s > Error: Python API test subprocess failed.
  2163. 121.84 s > stdout:
  2164. 121.84 s > ┌────────────────────────────────────────────────────────┐
  2165. 121.84 s > │ You are running a restricted Symbolica instance. │
  2166. 121.84 s > │ │
  2167. 121.84 s > │ This mode is only permitted for non-commercial use and │
  2168. 121.84 s > │ is limited to one instance and core per machine. │
  2169. 121.84 s > │ │
  2170. 121.84 s > │ Hobbyists can easily acquire a free license key │
  2171. 121.84 s > │ that unlocks all cores and removes this banner: │
  2172. 121.84 s > │ │
  2173. 121.84 s > │ from symbolica import * │
  2174. 121.84 s > │ request_hobbyist_license('YOUR_NAME', 'YOUR_EMAIL') │
  2175. 121.84 s > │ │
  2176. 121.84 s > │ All other users can obtain a free 30-day trial key: │
  2177. 121.84 s > │ │
  2178. 121.84 s > │ from symbolica import * │
  2179. 121.84 s > │ request_trial_license('NAME', 'EMAIL', 'EMPLOYER') │
  2180. 121.84 s > │ │
  2181. 121.84 s > │ See https://symbolica.io/docs/get_started.html#license │
  2182. 121.84 s > └────────────────────────────────────────────────────────┘
  2183. 121.84 s > ┌───────────────────────────────────────────────────────────────────────────────────────────────────────────┐
  2184. 121.84 s > │ Cannot start new unlicensed Symbolica instance since there is already another one running on the machine. │
  2185. 121.84 s > └───────────────────────────────────────────────────────────────────────────────────────────────────────────┘
  2186. 121.84 s >
  2187. 121.84 s > stderr:
  2188. 121.84 s >
  2189. 121.84 s > ┌───────────────────────────────────────────────────────────┐
  2190. 121.84 s > │ Could not resolve the IP of the Symbolica license server. │
  2191. 121.84 s > │ │
  2192. 121.84 s > │ Please check your DNS configuration. │
  2193. 121.84 s > └───────────────────────────────────────────────────────────┘
  2194. 121.84 s > Error: failed to lookup address information: Temporary failure in name resolution
  2195. 121.84 s >
  2196. 121.84 s >
  2197. 121.84 s > Location:
  2198. 121.84 s > tests/tests/test_python_api.rs:156:20
  2199. 121.84 s >
  2200. 121.84 s > 3. gammaloop-integration-tests::test_python_api::python_evaluate_samples_batch_and_momentum_space_have_expected_shape
  2201. 121.84 s > failure: test failure with exit code 101
  2202. 121.84 s > Error: Python API test subprocess failed.
  2203. 121.84 s > stdout:
  2204. 121.84 s > ┌────────────────────────────────────────────────────────┐
  2205. 121.84 s > │ You are running a restricted Symbolica instance. │
  2206. 121.84 s > │ │
  2207. 121.84 s > │ This mode is only permitted for non-commercial use and │
  2208. 121.84 s > │ is limited to one instance and core per machine. │
  2209. 121.84 s > │ │
  2210. 121.84 s > │ Hobbyists can easily acquire a free license key │
  2211. 121.84 s > │ that unlocks all cores and removes this banner: │
  2212. 121.84 s > │ │
  2213. 121.84 s > │ from symbolica import * │
  2214. 121.84 s > │ request_hobbyist_license('YOUR_NAME', 'YOUR_EMAIL') │
  2215. 121.84 s > │ │
  2216. 121.84 s > │ All other users can obtain a free 30-day trial key: │
  2217. 121.84 s > │ │
  2218. 121.84 s > │ from symbolica import * │
  2219. 121.84 s > │ request_trial_license('NAME', 'EMAIL', 'EMPLOYER') │
  2220. 121.84 s > │ │
  2221. 121.84 s > │ See https://symbolica.io/docs/get_started.html#license │
  2222. 121.84 s > └────────────────────────────────────────────────────────┘
  2223. 121.84 s > ┌───────────────────────────────────────────────────────────────────────────────────────────────────────────┐
  2224. 121.84 s > │ Cannot start new unlicensed Symbolica instance since there is already another one running on the machine. │
  2225. 121.84 s > └───────────────────────────────────────────────────────────────────────────────────────────────────────────┘
  2226. 121.84 s >
  2227. 121.84 s > stderr:
  2228. 121.84 s >
  2229. 121.84 s > ┌───────────────────────────────────────────────────────────┐
  2230. 121.84 s > │ Could not resolve the IP of the Symbolica license server. │
  2231. 121.84 s > │ │
  2232. 121.84 s > │ Please check your DNS configuration. │
  2233. 121.84 s > └───────────────────────────────────────────────────────────┘
  2234. 121.84 s > Error: failed to lookup address information: Temporary failure in name resolution
  2235. 121.84 s >
  2236. 121.84 s >
  2237. 121.84 s > Location:
  2238. 121.84 s > tests/tests/test_python_api.rs:156:20
  2239. 121.84 s > system-out
  2240. 121.84 s > running 1 test
  2241. 121.84 s > test python_evaluate_samples_batch_and_momentum_space_have_expected_shape ... FAILED
  2242. 121.84 s >
  2243. 121.84 s > failures:
  2244. 121.84 s >
  2245. 121.84 s > failures:
  2246. 121.84 s > python_evaluate_samples_batch_and_momentum_space_have_expected_shape
  2247. 121.84 s >
  2248. 121.84 s > test result: FAILED. 0 passed; 1 failed; 0 ignored; 0 measured; 4 filtered out; finished in 0.12s
  2249. 121.84 s > system-err
  2250. 121.84 s > Error: Python API test subprocess failed.
  2251. 121.84 s > stdout:
  2252. 121.84 s > ┌────────────────────────────────────────────────────────┐
  2253. 121.84 s > │ You are running a restricted Symbolica instance. │
  2254. 121.84 s > │ │
  2255. 121.84 s > │ This mode is only permitted for non-commercial use and │
  2256. 121.84 s > │ is limited to one instance and core per machine. │
  2257. 121.84 s > │ │
  2258. 121.84 s > │ Hobbyists can easily acquire a free license key │
  2259. 121.84 s > │ that unlocks all cores and removes this banner: │
  2260. 121.84 s > │ │
  2261. 121.84 s > │ from symbolica import * │
  2262. 121.84 s > │ request_hobbyist_license('YOUR_NAME', 'YOUR_EMAIL') │
  2263. 121.84 s > │ │
  2264. 121.84 s > │ All other users can obtain a free 30-day trial key: │
  2265. 121.84 s > │ │
  2266. 121.84 s > │ from symbolica import * │
  2267. 121.84 s > │ request_trial_license('NAME', 'EMAIL', 'EMPLOYER') │
  2268. 121.84 s > │ │
  2269. 121.84 s > │ See https://symbolica.io/docs/get_started.html#license │
  2270. 121.84 s > └────────────────────────────────────────────────────────┘
  2271. 121.84 s > ┌───────────────────────────────────────────────────────────────────────────────────────────────────────────┐
  2272. 121.84 s > │ Cannot start new unlicensed Symbolica instance since there is already another one running on the machine. │
  2273. 121.84 s > └───────────────────────────────────────────────────────────────────────────────────────────────────────────┘
  2274. 121.84 s >
  2275. 121.84 s > stderr:
  2276. 121.84 s >
  2277. 121.84 s > ┌───────────────────────────────────────────────────────────┐
  2278. 121.84 s > │ Could not resolve the IP of the Symbolica license server. │
  2279. 121.84 s > │ │
  2280. 121.84 s > │ Please check your DNS configuration. │
  2281. 121.84 s > └───────────────────────────────────────────────────────────┘
  2282. 121.84 s > Error: failed to lookup address information: Temporary failure in name resolution
  2283. 121.84 s >
  2284. 121.84 s >
  2285. 121.84 s > Location:
  2286. 121.84 s > tests/tests/test_python_api.rs:156:20
  2287. 121.84 s >
  2288. 121.84 s > 4. gammaloop-integration-tests::test_python_api::python_evaluate_sample_honors_generate_events_and_observable_snapshots
  2289. 121.84 s > failure: test failure with exit code 101
  2290. 121.84 s > Error: Python API test subprocess failed.
  2291. 121.84 s > stdout:
  2292. 121.84 s > ┌────────────────────────────────────────────────────────┐
  2293. 121.84 s > │ You are running a restricted Symbolica instance. │
  2294. 121.84 s > │ │
  2295. 121.84 s > │ This mode is only permitted for non-commercial use and │
  2296. 121.84 s > │ is limited to one instance and core per machine. │
  2297. 121.84 s > │ │
  2298. 121.84 s > │ Hobbyists can easily acquire a free license key │
  2299. 121.84 s > │ that unlocks all cores and removes this banner: │
  2300. 121.84 s > │ │
  2301. 121.84 s > │ from symbolica import * │
  2302. 121.84 s > │ request_hobbyist_license('YOUR_NAME', 'YOUR_EMAIL') │
  2303. 121.84 s > │ │
  2304. 121.84 s > │ All other users can obtain a free 30-day trial key: │
  2305. 121.84 s > │ │
  2306. 121.84 s > │ from symbolica import * │
  2307. 121.84 s > │ request_trial_license('NAME', 'EMAIL', 'EMPLOYER') │
  2308. 121.84 s > │ │
  2309. 121.84 s > │ See https://symbolica.io/docs/get_started.html#license │
  2310. 121.84 s > └────────────────────────────────────────────────────────┘
  2311. 121.84 s > ┌───────────────────────────────────────────────────────────────────────────────────────────────────────────┐
  2312. 121.84 s > │ Cannot start new unlicensed Symbolica instance since there is already another one running on the machine. │
  2313. 121.84 s > └───────────────────────────────────────────────────────────────────────────────────────────────────────────┘
  2314. 121.84 s >
  2315. 121.84 s > stderr:
  2316. 121.84 s >
  2317. 121.84 s > ┌───────────────────────────────────────────────────────────┐
  2318. 121.84 s > │ Could not resolve the IP of the Symbolica license server. │
  2319. 121.84 s > │ │
  2320. 121.84 s > │ Please check your DNS configuration. │
  2321. 121.84 s > └───────────────────────────────────────────────────────────┘
  2322. 121.84 s > Error: failed to lookup address information: Temporary failure in name resolution
  2323. 121.84 s > [2026-09-03 15:33:22.333] @gammaloop_api::se... INFO : Running command import model sm-default
  2324. 121.84 s > [2026-09-03 15:33:22.333] @import::model INFO : Loading built-in JSON model sm-default
  2325. 121.84 s > [2026-09-03 15:33:22.364] @gammalooprs::model INFO : The following 11 external parameters were forced to zero by the restriction card:
  2326. 121.84 s > lamWS, AWS, rhoWS, etaWS, ymc, yme, ymm, MC, Me, MM, WTau
  2327. 121.84 s > [2026-09-03 15:33:22.364] @gammalooprs::model INFO : The following 34 vertex rules were removed by the restriction card:
  2328. 121.84 s > V_82 -> (c~, d, G+) | V_83 -> (t~, d, G+) | V_84 -> (c~, s, G+) | V_85 -> (t~, s, G+) | V_86 -> (u~, b, G+) | V_87 -> (c~, b, G+) | V_90 -> (c~, d, W+) | V_91 -> (t~, d, W+) | V_92 -> (u~, s, W+) | V_94 -> (t~, s, W+) | V_95 -> (u~, b, W+) | V_96 -> (c~, b, W+) | V_101 -> (e+, e-, G0) | V_102 -> (mu+, mu-, G0) | V_104 -> (e+, e-, H) | V_105 -> (mu+, mu-, H) | V_110 -> (ve~, e-, G+) | V_111 -> (vm~, mu-, G+) | V_116 -> (b~, u, G-) | V_117 -> (d~, c, G-) | V_118 -> (s~, c, G-) | V_119 -> (b~, c, G-) | V_120 -> (d~, t, G-) | V_121 -> (s~, t, G-) | V_124 -> (s~, u, W-) | V_125 -> (b~, u, W-) | V_126 -> (d~, c, W-) | V_128 -> (b~, c, W-) | V_129 -> (d~, t, W-) | V_130 -> (s~, t, W-) | V_138 -> (c~, c, G0) | V_140 -> (c~, c, H) | V_145 -> (e+, ve, G-) | V_146 -> (mu+, vm, G-)
  2329. 121.84 s > [2026-09-03 15:33:22.364] @gammalooprs::model INFO : The following 36 couplings were removed by the restriction card:
  2330. 121.84 s > GC_13, GC_14, GC_16, GC_17, GC_18, GC_19, GC_20, GC_22, GC_23, GC_24, GC_25, GC_26, GC_28, GC_29, GC_42, GC_43, GC_44, GC_46, GC_47, GC_48, GC_84, GC_85, GC_86, GC_87, GC_88, GC_89, GC_90, GC_91, GC_92, GC_93, GC_101, GC_102, GC_103, GC_105, GC_106, GC_107
  2331. 121.84 s > [2026-09-03 15:33:22.364] @gammaloop_api::se... INFO : Running command set default-runtime kv kinematics.externals='{"type":"constant","data":{"momenta":[[32.0,0.0,0.0,32.0],[32.0,0.0,0.0,-32.0]],"helicities":[1,1]}}'
  2332. 121.84 s > [2026-09-03 15:33:22.365] @gammaloop_api::se... INFO : Running command set default-runtime kv subtraction.disable_threshold_subtraction=true
  2333. 121.84 s > [2026-09-03 15:33:22.366] @gammaloop_api::se... INFO : Running command generate xs e+ e- > d d~ g | e- a d g QED^2==4 [{{2}} QCD=0] --numerator-grouping group_identical_graphs_up_to_sign --clear-existing-processes --only-diagrams
  2334. 121.84 s > [2026-09-03 15:33:22.368] @feyngen::diagram_... INFO : 0s | Δ=0s | Starting Feynman graph generation with Symbolica...
  2335. 121.84 s > [2026-09-03 15:33:22.370] @feyngen::diagram_... INFO : 0s | Δ=0s | Number of graphs resulting from Symbolica generation: 246
  2336. 121.84 s > [2026-09-03 15:33:22.370] @feyngen::diagram_... INFO : 0s | Δ=0s | Number of graphs retained after enforcing supergraph particle content: 8
  2337. 121.84 s > [2026-09-03 15:33:22.370] @feyngen::diagram_... INFO : 0s | Δ=0s | Number of graphs retained after removal of vetoed topologies: 8
  2338. 121.84 s > [2026-09-03 15:33:22.371] @feyngen::diagram_... INFO : 0s | Δ=0s | Number of graphs after vertex info assignment: 8
  2339. 121.84 s > [2026-09-03 15:33:22.371] @feyngen::diagram_... INFO : 0s | Δ=0s | Number of graphs after all complete graphs filters are applied: 8
  2340. 121.84 s >
  2341. 121.84 s >
  2342. 121.84 s > Location:
  2343. 121.84 s > tests/tests/test_python_api.rs:156:20
  2344. 121.84 s > system-out
  2345. 121.84 s > running 1 test
  2346. 121.84 s > test python_evaluate_sample_honors_generate_events_and_observable_snapshots ... FAILED
  2347. 121.84 s >
  2348. 121.84 s > failures:
  2349. 121.84 s >
  2350. 121.84 s > failures:
  2351. 121.84 s > python_evaluate_sample_honors_generate_events_and_observable_snapshots
  2352. 121.84 s >
  2353. 121.84 s > test result: FAILED. 0 passed; 1 failed; 0 ignored; 0 measured; 4 filtered out; finished in 0.20s
  2354. 121.84 s > system-err
  2355. 121.84 s > Error: Python API test subprocess failed.
  2356. 121.84 s > stdout:
  2357. 121.84 s > ┌────────────────────────────────────────────────────────┐
  2358. 121.84 s > │ You are running a restricted Symbolica instance. │
  2359. 121.84 s > │ │
  2360. 121.84 s > │ This mode is only permitted for non-commercial use and │
  2361. 121.84 s > │ is limited to one instance and core per machine. │
  2362. 121.84 s > │ │
  2363. 121.84 s > │ Hobbyists can easily acquire a free license key │
  2364. 121.84 s > │ that unlocks all cores and removes this banner: │
  2365. 121.84 s > │ │
  2366. 121.84 s > │ from symbolica import * │
  2367. 121.84 s > │ request_hobbyist_license('YOUR_NAME', 'YOUR_EMAIL') │
  2368. 121.84 s > │ │
  2369. 121.84 s > │ All other users can obtain a free 30-day trial key: │
  2370. 121.84 s > │ │
  2371. 121.84 s > │ from symbolica import * │
  2372. 121.84 s > │ request_trial_license('NAME', 'EMAIL', 'EMPLOYER') │
  2373. 121.84 s > │ │
  2374. 121.84 s > │ See https://symbolica.io/docs/get_started.html#license │
  2375. 121.84 s > └────────────────────────────────────────────────────────┘
  2376. 121.84 s > ┌───────────────────────────────────────────────────────────────────────────────────────────────────────────┐
  2377. 121.84 s > │ Cannot start new unlicensed Symbolica instance since there is already another one running on the machine. │
  2378. 121.84 s > └───────────────────────────────────────────────────────────────────────────────────────────────────────────┘
  2379. 121.84 s >
  2380. 121.84 s > stderr:
  2381. 121.84 s >
  2382. 121.84 s > ┌───────────────────────────────────────────────────────────┐
  2383. 121.84 s > │ Could not resolve the IP of the Symbolica license server. │
  2384. 121.84 s > │ │
  2385. 121.84 s > │ Please check your DNS configuration. │
  2386. 121.84 s > └───────────────────────────────────────────────────────────┘
  2387. 121.84 s > Error: failed to lookup address information: Temporary failure in name resolution
  2388. 121.84 s > [2026-09-03 15:33:22.333] @gammaloop_api::se... INFO : Running command import model sm-default
  2389. 121.84 s > [2026-09-03 15:33:22.333] @import::model INFO : Loading built-in JSON model sm-default
  2390. 121.84 s > [2026-09-03 15:33:22.364] @gammalooprs::model INFO : The following 11 external parameters were forced to zero by the restriction card:
  2391. 121.84 s > lamWS, AWS, rhoWS, etaWS, ymc, yme, ymm, MC, Me, MM, WTau
  2392. 121.84 s > [2026-09-03 15:33:22.364] @gammalooprs::model INFO : The following 34 vertex rules were removed by the restriction card:
  2393. 121.84 s > V_82 -> (c~, d, G+) | V_83 -> (t~, d, G+) | V_84 -> (c~, s, G+) | V_85 -> (t~, s, G+) | V_86 -> (u~, b, G+) | V_87 -> (c~, b, G+) | V_90 -> (c~, d, W+) | V_91 -> (t~, d, W+) | V_92 -> (u~, s, W+) | V_94 -> (t~, s, W+) | V_95 -> (u~, b, W+) | V_96 -> (c~, b, W+) | V_101 -> (e+, e-, G0) | V_102 -> (mu+, mu-, G0) | V_104 -> (e+, e-, H) | V_105 -> (mu+, mu-, H) | V_110 -> (ve~, e-, G+) | V_111 -> (vm~, mu-, G+) | V_116 -> (b~, u, G-) | V_117 -> (d~, c, G-) | V_118 -> (s~, c, G-) | V_119 -> (b~, c, G-) | V_120 -> (d~, t, G-) | V_121 -> (s~, t, G-) | V_124 -> (s~, u, W-) | V_125 -> (b~, u, W-) | V_126 -> (d~, c, W-) | V_128 -> (b~, c, W-) | V_129 -> (d~, t, W-) | V_130 -> (s~, t, W-) | V_138 -> (c~, c, G0) | V_140 -> (c~, c, H) | V_145 -> (e+, ve, G-) | V_146 -> (mu+, vm, G-)
  2394. 121.84 s > [2026-09-03 15:33:22.364] @gammalooprs::model INFO : The following 36 couplings were removed by the restriction card:
  2395. 121.84 s > GC_13, GC_14, GC_16, GC_17, GC_18, GC_19, GC_20, GC_22, GC_23, GC_24, GC_25, GC_26, GC_28, GC_29, GC_42, GC_43, GC_44, GC_46, GC_47, GC_48, GC_84, GC_85, GC_86, GC_87, GC_88, GC_89, GC_90, GC_91, GC_92, GC_93, GC_101, GC_102, GC_103, GC_105, GC_106, GC_107
  2396. 121.84 s > [2026-09-03 15:33:22.364] @gammaloop_api::se... INFO : Running command set default-runtime kv kinematics.externals='{"type":"constant","data":{"momenta":[[32.0,0.0,0.0,32.0],[32.0,0.0,0.0,-32.0]],"helicities":[1,1]}}'
  2397. 121.84 s > [2026-09-03 15:33:22.365] @gammaloop_api::se... INFO : Running command set default-runtime kv subtraction.disable_threshold_subtraction=true
  2398. 121.84 s > [2026-09-03 15:33:22.366] @gammaloop_api::se... INFO : Running command generate xs e+ e- > d d~ g | e- a d g QED^2==4 [{{2}} QCD=0] --numerator-grouping group_identical_graphs_up_to_sign --clear-existing-processes --only-diagrams
  2399. 121.84 s > [2026-09-03 15:33:22.368] @feyngen::diagram_... INFO : 0s | Δ=0s | Starting Feynman graph generation with Symbolica...
  2400. 121.84 s > [2026-09-03 15:33:22.370] @feyngen::diagram_... INFO : 0s | Δ=0s | Number of graphs resulting from Symbolica generation: 246
  2401. 121.84 s > [2026-09-03 15:33:22.370] @feyngen::diagram_... INFO : 0s | Δ=0s | Number of graphs retained after enforcing supergraph particle content: 8
  2402. 121.84 s > [2026-09-03 15:33:22.370] @feyngen::diagram_... INFO : 0s | Δ=0s | Number of graphs retained after removal of vetoed topologies: 8
  2403. 121.84 s > [2026-09-03 15:33:22.371] @feyngen::diagram_... INFO : 0s | Δ=0s | Number of graphs after vertex info assignment: 8
  2404. 121.84 s > [2026-09-03 15:33:22.371] @feyngen::diagram_... INFO : 0s | Δ=0s | Number of graphs after all complete graphs filters are applied: 8
  2405. 121.84 s >
  2406. 121.84 s >
  2407. 121.84 s > Location:
  2408. 121.84 s > tests/tests/test_python_api.rs:156:20
  2409. 121.84 s >
  2410. 121.84 s > 5. gammaloop-integration-tests::test_python_api::python_settings_wrappers_expose_nested_runtime_and_global_settings
  2411. 121.84 s > failure: test failure with exit code 101
  2412. 121.84 s > Error: Python API test subprocess failed.
  2413. 121.84 s > stdout:
  2414. 121.84 s > ┌────────────────────────────────────────────────────────┐
  2415. 121.84 s > │ You are running a restricted Symbolica instance. │
  2416. 121.84 s > │ │
  2417. 121.84 s > │ This mode is only permitted for non-commercial use and │
  2418. 121.84 s > │ is limited to one instance and core per machine. │
  2419. 121.84 s > │ │
  2420. 121.84 s > │ Hobbyists can easily acquire a free license key │
  2421. 121.84 s > │ that unlocks all cores and removes this banner: │
  2422. 121.84 s > │ │
  2423. 121.84 s > │ from symbolica import * │
  2424. 121.84 s > │ request_hobbyist_license('YOUR_NAME', 'YOUR_EMAIL') │
  2425. 121.84 s > │ │
  2426. 121.84 s > │ All other users can obtain a free 30-day trial key: │
  2427. 121.84 s > │ │
  2428. 121.84 s > │ from symbolica import * │
  2429. 121.84 s > │ request_trial_license('NAME', 'EMAIL', 'EMPLOYER') │
  2430. 121.84 s > │ │
  2431. 121.84 s > │ See https://symbolica.io/docs/get_started.html#license │
  2432. 121.84 s > └────────────────────────────────────────────────────────┘
  2433. 121.84 s > ┌───────────────────────────────────────────────────────────────────────────────────────────────────────────┐
  2434. 121.84 s > │ Cannot start new unlicensed Symbolica instance since there is already another one running on the machine. │
  2435. 121.84 s > └───────────────────────────────────────────────────────────────────────────────────────────────────────────┘
  2436. 121.84 s >
  2437. 121.84 s > stderr:
  2438. 121.84 s >
  2439. 121.84 s > ┌───────────────────────────────────────────────────────────┐
  2440. 121.84 s > │ Could not resolve the IP of the Symbolica license server. │
  2441. 121.84 s > │ │
  2442. 121.84 s > │ Please check your DNS configuration. │
  2443. 121.84 s > └───────────────────────────────────────────────────────────┘
  2444. 121.84 s > Error: failed to lookup address information: Temporary failure in name resolution
  2445. 121.84 s >
  2446. 121.84 s >
  2447. 121.84 s > Location:
  2448. 121.84 s > tests/tests/test_python_api.rs:156:20
  2449. 121.84 s > system-out
  2450. 121.84 s > running 1 test
  2451. 121.84 s > test python_settings_wrappers_expose_nested_runtime_and_global_settings ... FAILED
  2452. 121.84 s >
  2453. 121.84 s > failures:
  2454. 121.84 s >
  2455. 121.84 s > failures:
  2456. 121.84 s > python_settings_wrappers_expose_nested_runtime_and_global_settings
  2457. 121.84 s >
  2458. 121.84 s > test result: FAILED. 0 passed; 1 failed; 0 ignored; 0 measured; 4 filtered out; finished in 0.22s
  2459. 121.84 s > system-err
  2460. 121.84 s > Error: Python API test subprocess failed.
  2461. 121.84 s > stdout:
  2462. 121.84 s > ┌────────────────────────────────────────────────────────┐
  2463. 121.84 s > │ You are running a restricted Symbolica instance. │
  2464. 121.84 s > │ │
  2465. 121.84 s > │ This mode is only permitted for non-commercial use and │
  2466. 121.84 s > │ is limited to one instance and core per machine. │
  2467. 121.84 s > │ │
  2468. 121.84 s > │ Hobbyists can easily acquire a free license key │
  2469. 121.84 s > │ that unlocks all cores and removes this banner: │
  2470. 121.84 s > │ │
  2471. 121.84 s > │ from symbolica import * │
  2472. 121.84 s > │ request_hobbyist_license('YOUR_NAME', 'YOUR_EMAIL') │
  2473. 121.84 s > │ │
  2474. 121.84 s > │ All other users can obtain a free 30-day trial key: │
  2475. 121.84 s > │ │
  2476. 121.84 s > │ from symbolica import * │
  2477. 121.84 s > │ request_trial_license('NAME', 'EMAIL', 'EMPLOYER') │
  2478. 121.84 s > │ │
  2479. 121.84 s > │ See https://symbolica.io/docs/get_started.html#license │
  2480. 121.84 s > └────────────────────────────────────────────────────────┘
  2481. 121.84 s > ┌───────────────────────────────────────────────────────────────────────────────────────────────────────────┐
  2482. 121.84 s > │ Cannot start new unlicensed Symbolica instance since there is already another one running on the machine. │
  2483. 121.84 s > └───────────────────────────────────────────────────────────────────────────────────────────────────────────┘
  2484. 121.84 s >
  2485. 121.84 s > stderr:
  2486. 121.84 s >
  2487. 121.84 s > ┌───────────────────────────────────────────────────────────┐
  2488. 121.84 s > │ Could not resolve the IP of the Symbolica license server. │
  2489. 121.84 s > │ │
  2490. 121.84 s > │ Please check your DNS configuration. │
  2491. 121.84 s > └───────────────────────────────────────────────────────────┘
  2492. 121.84 s > Error: failed to lookup address information: Temporary failure in name resolution
  2493. 121.84 s >
  2494. 121.84 s >
  2495. 121.84 s > Location:
  2496. 121.84 s > tests/tests/test_python_api.rs:156:20
  2497. 121.84 s > =========================================
  2498. 121.84 s For full logs, run:
  2499. 121.84 s nix log /nix/store/92rfrz53xqdm3bwmdf3dq8zbdzxy8f7a-gammaloop-nextest-python-api.drv
  2500. 121.95 s [0 built (1 failed), 0.0Run failed.