0.93 s
$ /nix/store/9ypz3flqsrl5xl495mm8h645gadjsxi1-coreutils-9.11/bin/timeout --kill-after=15s 7200s /nix/store/23zk8sgzamrbmj1fday15szf7f2279s8-nix-2.34.7/bin/nix --extra-experimental-features nix-command --extra-experimental-features flakes flake clone git+https://github.com/alphal00p/gammaloop --dest /tmp/nix-ci-worker/stable-pwd/repo/
0.96 s
Cloning into '/tmp/nix-ci-worker/stable-pwd/repo'...
1.45 s
remote: Enumerating objects: 73453, done.
1.68 s
remote: Counting objects: 0% (1/9296)
remote: Counting objects: 1% (93/9296)
remote: Counting objects: 2% (186/9296)
remote: Counting objects: 3% (279/9296)
remote: Counting objects: 4% (372/9296)
remote: Counting objects: 5% (465/9296)
remote: Counting objects: 6% (558/9296)
remote: Counting objects: 7% (651/9296)
remote: Counting objects: 8% (744/9296)
remote: Counting objects: 9% (837/9296)
remote: Counting objects: 10% (930/9296)
remote: Counting objects: 11% (1023/9296)
remote: Counting objects: 12% (1116/9296)
remote: Counting objects: 13% (1209/9296)
remote: Counting objects: 14% (1302/9296)
remote: Counting objects: 15% (1395/9296)
remote: Counting objects: 16% (1488/9296)
remote: Counting objects: 17% (1581/9296)
remote: Counting objects: 18% (1674/9296)
remote: Counting objects: 19% (1767/9296)
remote: Counting objects: 20% (1860/9296)
remote: Counting objects: 21% (1953/9296)
remote: Counting objects: 22% (2046/9296)
remote: Counting objects: 23% (2139/9296)
remote: Counting objects: 24% (2232/9296)
remote: Counting objects: 25% (2324/9296)
remote: Counting objects: 26% (2417/9296)
remote: Counting objects: 27% (2510/9296)
remote: Counting objects: 28% (2603/9296)
remote: Counting objects: 29% (2696/9296)
remote: Counting objects: 30% (2789/9296)
remote: Counting objects: 31% (2882/9296)
remote: Counting objects: 32% (2975/9296)
remote: Counting objects: 33% (3068/9296)
remote: Counting objects: 34% (3161/9296)
remote: Counting objects: 35% (3254/9296)
remote: Counting objects: 36% (3347/9296)
remote: Counting objects: 37% (3440/9296)
remote: Counting objects: 38% (3533/9296)
remote: Counting objects: 39% (3626/9296)
remote: Counting objects: 40% (3719/9296)
remote: Counting objects: 41% (3812/9296)
remote: Counting objects: 42% (3905/9296)
remote: Counting objects: 43% (3998/9296)
remote: Counting objects: 44% (4091/9296)
remote: Counting objects: 45% (4184/9296)
remote: Counting objects: 46% (4277/9296)
remote: Counting objects: 47% (4370/9296)
remote: Counting objects: 48% (4463/9296)
remote: Counting objects: 49% (4556/9296)
remote: Counting objects: 50% (4648/9296)
remote: Counting objects: 51% (4741/9296)
remote: Counting objects: 52% (4834/9296)
remote: Counting objects: 53% (4927/9296)
remote: Counting objects: 54% (5020/9296)
remote: Counting objects: 55% (5113/9296)
remote: Counting objects: 56% (5206/9296)
remote: Counting objects: 57% (5299/9296)
remote: Counting objects: 58% (5392/9296)
remote: Counting objects: 59% (5485/9296)
remote: Counting objects: 60% (5578/9296)
remote: Counting objects: 61% (5671/9296)
remote: Counting objects: 62% (5764/9296)
remote: Counting objects: 63% (5857/9296)
remote: Counting objects: 64% (5950/9296)
remote: Counting objects: 65% (6043/9296)
remote: Counting objects: 66% (6136/9296)
remote: Counting objects: 67% (6229/9296)
remote: Counting objects: 68% (6322/9296)
remote: Counting objects: 69% (6415/9296)
remote: Counting objects: 70% (6508/9296)
remote: Counting objects: 71% (6601/9296)
remote: Counting objects: 72% (6694/9296)
remote: Counting objects: 73% (6787/9296)
remote: Counting objects: 74% (6880/9296)
remote: Counting objects: 75% (6972/9296)
remote: Counting objects: 76% (7065/9296)
remote: Counting objects: 77% (7158/9296)
remote: Counting objects: 78% (7251/9296)
remote: Counting objects: 79% (7344/9296)
remote: Counting objects: 80% (7437/9296)
remote: Counting objects: 81% (7530/9296)
remote: Counting objects: 82% (7623/9296)
remote: Counting objects: 83% (7716/9296)
remote: Counting objects: 84% (7809/9296)
remote: Counting objects: 85% (7902/9296)
remote: Counting objects: 86% (7995/9296)
remote: Counting objects: 87% (8088/9296)
remote: Counting objects: 88% (8181/9296)
remote: Counting objects: 89% (8274/9296)
remote: Counting objects: 90% (8367/9296)
remote: Counting objects: 91% (8460/9296)
remote: Counting objects: 92% (8553/9296)
remote: Counting objects: 93% (8646/9296)
remote: Counting objects: 94% (8739/9296)
remote: Counting objects: 95% (8832/9296)
remote: Counting objects: 96% (8925/9296)
remote: Counting objects: 97% (9018/9296)
remote: Counting objects: 98% (9111/9296)
remote: Counting objects: 99% (9204/9296)
remote: Counting objects: 100% (9296/9296)
remote: Counting objects: 100% (9296/9296), done.
3.54 s
remote: Compressing objects: 0% (1/1922)
remote: Compressing objects: 1% (20/1922)
remote: Compressing objects: 2% (39/1922)
remote: Compressing objects: 3% (58/1922)
remote: Compressing objects: 4% (77/1922)
remote: Compressing objects: 5% (97/1922)
remote: Compressing objects: 6% (116/1922)
remote: Compressing objects: 7% (135/1922)
remote: Compressing objects: 8% (154/1922)
remote: Compressing objects: 9% (173/1922)
remote: Compressing objects: 10% (193/1922)
remote: Compressing objects: 11% (212/1922)
remote: Compressing objects: 12% (231/1922)
remote: Compressing objects: 13% (250/1922)
remote: Compressing objects: 14% (270/1922)
remote: Compressing objects: 15% (289/1922)
remote: Compressing objects: 16% (308/1922)
remote: Compressing objects: 17% (327/1922)
remote: Compressing objects: 17% (333/1922)
remote: Compressing objects: 18% (346/1922)
remote: Compressing objects: 19% (366/1922)
remote: Compressing objects: 20% (385/1922)
remote: Compressing objects: 21% (404/1922)
remote: Compressing objects: 22% (423/1922)
remote: Compressing objects: 23% (443/1922)
remote: Compressing objects: 24% (462/1922)
remote: Compressing objects: 25% (481/1922)
remote: Compressing objects: 26% (500/1922)
remote: Compressing objects: 27% (519/1922)
remote: Compressing objects: 28% (539/1922)
remote: Compressing objects: 29% (558/1922)
remote: Compressing objects: 30% (577/1922)
remote: Compressing objects: 31% (596/1922)
remote: Compressing objects: 32% (616/1922)
remote: Compressing objects: 33% (635/1922)
remote: Compressing objects: 34% (654/1922)
remote: Compressing objects: 35% (673/1922)
remote: Compressing objects: 36% (692/1922)
remote: Compressing objects: 36% (698/1922)
remote: Compressing objects: 37% (712/1922)
remote: Compressing objects: 38% (731/1922)
remote: Compressing objects: 39% (750/1922)
remote: Compressing objects: 40% (769/1922)
remote: Compressing objects: 41% (789/1922)
remote: Compressing objects: 42% (808/1922)
remote: Compressing objects: 43% (827/1922)
remote: Compressing objects: 44% (846/1922)
remote: Compressing objects: 45% (865/1922)
remote: Compressing objects: 46% (885/1922)
remote: Compressing objects: 47% (904/1922)
remote: Compressing objects: 48% (923/1922)
remote: Compressing objects: 49% (942/1922)
remote: Compressing objects: 50% (961/1922)
remote: Compressing objects: 51% (981/1922)
remote: Compressing objects: 52% (1000/1922)
remote: Compressing objects: 53% (1019/1922)
remote: Compressing objects: 54% (1038/1922)
remote: Compressing objects: 55% (1058/1922)
remote: Compressing objects: 56% (1077/1922)
remote: Compressing objects: 57% (1096/1922)
remote: Compressing objects: 58% (1115/1922)
remote: Compressing objects: 59% (1134/1922)
remote: Compressing objects: 60% (1154/1922)
remote: Compressing objects: 61% (1173/1922)
remote: Compressing objects: 62% (1192/1922)
remote: Compressing objects: 63% (1211/1922)
remote: Compressing objects: 64% (1231/1922)
remote: Compressing objects: 65% (1250/1922)
remote: Compressing objects: 66% (1269/1922)
remote: Compressing objects: 67% (1288/1922)
remote: Compressing objects: 68% (1307/1922)
remote: Compressing objects: 69% (1327/1922)
remote: Compressing objects: 70% (1346/1922)
remote: Compressing objects: 71% (1365/1922)
remote: Compressing objects: 72% (1384/1922)
remote: Compressing objects: 73% (1404/1922)
remote: Compressing objects: 74% (1423/1922)
remote: Compressing objects: 75% (1442/1922)
remote: Compressing objects: 76% (1461/1922)
remote: Compressing objects: 77% (1480/1922)
remote: Compressing objects: 78% (1500/1922)
remote: Compressing objects: 79% (1519/1922)
remote: Compressing objects: 80% (1538/1922)
remote: Compressing objects: 81% (1557/1922)
remote: Compressing objects: 82% (1577/1922)
remote: Compressing objects: 83% (1596/1922)
remote: Compressing objects: 84% (1615/1922)
remote: Compressing objects: 85% (1634/1922)
remote: Compressing objects: 86% (1653/1922)
remote: Compressing objects: 87% (1673/1922)
remote: Compressing objects: 88% (1692/1922)
remote: Compressing objects: 89% (1711/1922)
remote: Compressing objects: 90% (1730/1922)
remote: Compressing objects: 91% (1750/1922)
remote: Compressing objects: 92% (1769/1922)
remote: Compressing objects: 93% (1788/1922)
remote: Compressing objects: 94% (1807/1922)
remote: Compressing objects: 95% (1826/1922)
remote: Compressing objects: 96% (1846/1922)
remote: Compressing objects: 97% (1865/1922)
remote: Compressing objects: 98% (1884/1922)
remote: Compressing objects: 99% (1903/1922)
remote: Compressing objects: 100% (1922/1922)
remote: Compressing objects: 100% (1922/1922), done.
7.25 s
Receiving objects: 0% (1/73453)
Receiving objects: 1% (735/73453)
Receiving objects: 2% (1470/73453)
Receiving objects: 3% (2204/73453)
Receiving objects: 4% (2939/73453)
Receiving objects: 5% (3673/73453)
Receiving objects: 6% (4408/73453)
Receiving objects: 7% (5142/73453)
Receiving objects: 8% (5877/73453)
Receiving objects: 9% (6611/73453)
Receiving objects: 10% (7346/73453), 11.43 MiB | 22.85 MiB/s
Receiving objects: 11% (8080/73453), 11.43 MiB | 22.85 MiB/s
Receiving objects: 12% (8815/73453), 11.43 MiB | 22.85 MiB/s
Receiving objects: 13% (9549/73453), 11.43 MiB | 22.85 MiB/s
Receiving objects: 14% (10284/73453), 11.43 MiB | 22.85 MiB/s
Receiving objects: 15% (11018/73453), 11.43 MiB | 22.85 MiB/s
Receiving objects: 16% (11753/73453), 11.43 MiB | 22.85 MiB/s
Receiving objects: 17% (12488/73453), 11.43 MiB | 22.85 MiB/s
Receiving objects: 18% (13222/73453), 11.43 MiB | 22.85 MiB/s
Receiving objects: 19% (13957/73453), 11.43 MiB | 22.85 MiB/s
Receiving objects: 20% (14691/73453), 11.43 MiB | 22.85 MiB/s
Receiving objects: 21% (15426/73453), 11.43 MiB | 22.85 MiB/s
Receiving objects: 22% (16160/73453), 11.43 MiB | 22.85 MiB/s
Receiving objects: 23% (16895/73453), 11.43 MiB | 22.85 MiB/s
Receiving objects: 24% (17629/73453), 11.43 MiB | 22.85 MiB/s
Receiving objects: 25% (18364/73453), 11.43 MiB | 22.85 MiB/s
Receiving objects: 26% (19098/73453), 11.43 MiB | 22.85 MiB/s
Receiving objects: 27% (19833/73453), 11.43 MiB | 22.85 MiB/s
Receiving objects: 28% (20567/73453), 11.43 MiB | 22.85 MiB/s
Receiving objects: 29% (21302/73453), 11.43 MiB | 22.85 MiB/s
Receiving objects: 30% (22036/73453), 11.43 MiB | 22.85 MiB/s
Receiving objects: 31% (22771/73453), 11.43 MiB | 22.85 MiB/s
Receiving objects: 32% (23505/73453), 11.43 MiB | 22.85 MiB/s
Receiving objects: 33% (24240/73453), 11.43 MiB | 22.85 MiB/s
Receiving objects: 34% (24975/73453), 11.43 MiB | 22.85 MiB/s
Receiving objects: 35% (25709/73453), 11.43 MiB | 22.85 MiB/s
Receiving objects: 36% (26444/73453), 11.43 MiB | 22.85 MiB/s
Receiving objects: 37% (27178/73453), 11.43 MiB | 22.85 MiB/s
Receiving objects: 38% (27913/73453), 11.43 MiB | 22.85 MiB/s
Receiving objects: 39% (28647/73453), 11.43 MiB | 22.85 MiB/s
Receiving objects: 40% (29382/73453), 11.43 MiB | 22.85 MiB/s
Receiving objects: 41% (30116/73453), 11.43 MiB | 22.85 MiB/s
Receiving objects: 42% (30851/73453), 11.43 MiB | 22.85 MiB/s
Receiving objects: 42% (31549/73453), 29.39 MiB | 29.38 MiB/s
Receiving objects: 43% (31585/73453), 29.39 MiB | 29.38 MiB/s
Receiving objects: 44% (32320/73453), 29.39 MiB | 29.38 MiB/s
Receiving objects: 45% (33054/73453), 29.39 MiB | 29.38 MiB/s
Receiving objects: 46% (33789/73453), 29.39 MiB | 29.38 MiB/s
Receiving objects: 47% (34523/73453), 29.39 MiB | 29.38 MiB/s
Receiving objects: 48% (35258/73453), 29.39 MiB | 29.38 MiB/s
Receiving objects: 49% (35992/73453), 29.39 MiB | 29.38 MiB/s
Receiving objects: 50% (36727/73453), 29.39 MiB | 29.38 MiB/s
Receiving objects: 51% (37462/73453), 29.39 MiB | 29.38 MiB/s
Receiving objects: 52% (38196/73453), 29.39 MiB | 29.38 MiB/s
Receiving objects: 53% (38931/73453), 29.39 MiB | 29.38 MiB/s
Receiving objects: 54% (39665/73453), 44.71 MiB | 29.82 MiB/s
Receiving objects: 55% (40400/73453), 44.71 MiB | 29.82 MiB/s
Receiving objects: 56% (41134/73453), 44.71 MiB | 29.82 MiB/s
Receiving objects: 57% (41869/73453), 44.71 MiB | 29.82 MiB/s
Receiving objects: 58% (42603/73453), 44.71 MiB | 29.82 MiB/s
Receiving objects: 59% (43338/73453), 44.71 MiB | 29.82 MiB/s
Receiving objects: 60% (44072/73453), 44.71 MiB | 29.82 MiB/s
Receiving objects: 61% (44807/73453), 44.71 MiB | 29.82 MiB/s
Receiving objects: 62% (45541/73453), 44.71 MiB | 29.82 MiB/s
Receiving objects: 63% (46276/73453), 44.71 MiB | 29.82 MiB/s
Receiving objects: 64% (47010/73453), 44.71 MiB | 29.82 MiB/s
Receiving objects: 65% (47745/73453), 44.71 MiB | 29.82 MiB/s
Receiving objects: 66% (48479/73453), 44.71 MiB | 29.82 MiB/s
Receiving objects: 66% (48898/73453), 61.75 MiB | 30.57 MiB/s
Receiving objects: 67% (49214/73453), 61.75 MiB | 30.57 MiB/s
Receiving objects: 68% (49949/73453), 61.75 MiB | 30.57 MiB/s
Receiving objects: 69% (50683/73453), 61.75 MiB | 30.57 MiB/s
Receiving objects: 70% (51418/73453), 61.75 MiB | 30.57 MiB/s
Receiving objects: 71% (52152/73453), 61.75 MiB | 30.57 MiB/s
Receiving objects: 72% (52887/73453), 61.75 MiB | 30.57 MiB/s
Receiving objects: 73% (53621/73453), 61.75 MiB | 30.57 MiB/s
Receiving objects: 74% (54356/73453), 78.19 MiB | 31.03 MiB/s
Receiving objects: 75% (55090/73453), 78.19 MiB | 31.03 MiB/s
Receiving objects: 76% (55825/73453), 78.19 MiB | 31.03 MiB/s
Receiving objects: 77% (56559/73453), 78.19 MiB | 31.03 MiB/s
Receiving objects: 78% (57294/73453), 78.19 MiB | 31.03 MiB/s
Receiving objects: 79% (58028/73453), 78.19 MiB | 31.03 MiB/s
Receiving objects: 80% (58763/73453), 78.19 MiB | 31.03 MiB/s
Receiving objects: 81% (59497/73453), 78.19 MiB | 31.03 MiB/s
Receiving objects: 82% (60232/73453), 78.19 MiB | 31.03 MiB/s
Receiving objects: 83% (60966/73453), 78.19 MiB | 31.03 MiB/s
Receiving objects: 84% (61701/73453), 78.19 MiB | 31.03 MiB/s
Receiving objects: 85% (62436/73453), 78.19 MiB | 31.03 MiB/s
Receiving objects: 85% (62626/73453), 95.60 MiB | 31.43 MiB/s
Receiving objects: 86% (63170/73453), 95.60 MiB | 31.43 MiB/s
Receiving objects: 87% (63905/73453), 95.60 MiB | 31.43 MiB/s
Receiving objects: 88% (64639/73453), 95.60 MiB | 31.43 MiB/s
Receiving objects: 89% (65374/73453), 95.60 MiB | 31.43 MiB/s
Receiving objects: 90% (66108/73453), 95.60 MiB | 31.43 MiB/s
Receiving objects: 91% (66843/73453), 95.60 MiB | 31.43 MiB/s
Receiving objects: 92% (67577/73453), 95.60 MiB | 31.43 MiB/s
Receiving objects: 93% (68312/73453), 95.60 MiB | 31.43 MiB/s
Receiving objects: 94% (69046/73453), 95.60 MiB | 31.43 MiB/s
Receiving objects: 95% (69781/73453), 95.60 MiB | 31.43 MiB/s
Receiving objects: 96% (70515/73453), 95.60 MiB | 31.43 MiB/s
Receiving objects: 97% (71250/73453), 95.60 MiB | 31.43 MiB/s
Receiving objects: 98% (71984/73453), 112.31 MiB | 31.71 MiB/s
Receiving objects: 99% (72719/73453), 112.31 MiB | 31.71 MiB/s
remote: Total 73453 (delta 7532), reused 7642 (delta 6847), pack-reused 64157 (from 2)
7.32 s
Receiving objects: 100% (73453/73453), 112.31 MiB | 31.71 MiB/s
Receiving objects: 100% (73453/73453), 117.19 MiB | 31.76 MiB/s, done.
8.05 s
Resolving deltas: 0% (0/50830)
Resolving deltas: 1% (509/50830)
Resolving deltas: 2% (1017/50830)
Resolving deltas: 3% (1525/50830)
Resolving deltas: 4% (2034/50830)
Resolving deltas: 5% (2542/50830)
Resolving deltas: 6% (3050/50830)
Resolving deltas: 7% (3559/50830)
Resolving deltas: 8% (4067/50830)
Resolving deltas: 9% (4575/50830)
Resolving deltas: 10% (5083/50830)
Resolving deltas: 11% (5592/50830)
Resolving deltas: 12% (6100/50830)
Resolving deltas: 13% (6609/50830)
Resolving deltas: 14% (7117/50830)
Resolving deltas: 15% (7625/50830)
Resolving deltas: 16% (8133/50830)
Resolving deltas: 17% (8643/50830)
Resolving deltas: 18% (9151/50830)
Resolving deltas: 19% (9660/50830)
Resolving deltas: 20% (10167/50830)
Resolving deltas: 21% (10675/50830)
Resolving deltas: 22% (11183/50830)
Resolving deltas: 23% (11691/50830)
Resolving deltas: 24% (12200/50830)
Resolving deltas: 25% (12708/50830)
Resolving deltas: 26% (13216/50830)
Resolving deltas: 27% (13725/50830)
Resolving deltas: 28% (14233/50830)
Resolving deltas: 29% (14742/50830)
Resolving deltas: 30% (15249/50830)
Resolving deltas: 31% (15758/50830)
Resolving deltas: 32% (16266/50830)
Resolving deltas: 33% (16775/50830)
Resolving deltas: 34% (17283/50830)
Resolving deltas: 35% (17791/50830)
Resolving deltas: 36% (18299/50830)
Resolving deltas: 37% (18808/50830)
Resolving deltas: 38% (19317/50830)
Resolving deltas: 39% (19824/50830)
Resolving deltas: 40% (20332/50830)
Resolving deltas: 41% (20841/50830)
Resolving deltas: 42% (21349/50830)
Resolving deltas: 43% (21857/50830)
Resolving deltas: 44% (22366/50830)
Resolving deltas: 45% (22874/50830)
Resolving deltas: 46% (23382/50830)
Resolving deltas: 47% (23891/50830)
Resolving deltas: 48% (24400/50830)
Resolving deltas: 49% (24907/50830)
Resolving deltas: 50% (25416/50830)
Resolving deltas: 51% (25924/50830)
Resolving deltas: 52% (26434/50830)
Resolving deltas: 53% (26940/50830)
Resolving deltas: 54% (27450/50830)
Resolving deltas: 55% (27957/50830)
Resolving deltas: 56% (28465/50830)
Resolving deltas: 57% (28974/50830)
Resolving deltas: 58% (29482/50830)
Resolving deltas: 59% (29990/50830)
Resolving deltas: 60% (30499/50830)
Resolving deltas: 61% (31007/50830)
Resolving deltas: 62% (31515/50830)
Resolving deltas: 63% (32023/50830)
Resolving deltas: 64% (32532/50830)
Resolving deltas: 65% (33040/50830)
Resolving deltas: 66% (33549/50830)
Resolving deltas: 67% (34057/50830)
Resolving deltas: 68% (34565/50830)
Resolving deltas: 69% (35073/50830)
Resolving deltas: 70% (35581/50830)
Resolving deltas: 71% (36090/50830)
Resolving deltas: 72% (36598/50830)
Resolving deltas: 73% (37106/50830)
Resolving deltas: 74% (37615/50830)
Resolving deltas: 75% (38123/50830)
Resolving deltas: 76% (38632/50830)
Resolving deltas: 77% (39140/50830)
Resolving deltas: 78% (39648/50830)
Resolving deltas: 79% (40156/50830)
Resolving deltas: 80% (40664/50830)
Resolving deltas: 81% (41173/50830)
Resolving deltas: 82% (41681/50830)
Resolving deltas: 83% (42189/50830)
Resolving deltas: 84% (42698/50830)
Resolving deltas: 85% (43207/50830)
Resolving deltas: 86% (43714/50830)
Resolving deltas: 87% (44223/50830)
Resolving deltas: 88% (44731/50830)
Resolving deltas: 89% (45239/50830)
Resolving deltas: 90% (45749/50830)
Resolving deltas: 91% (46256/50830)
Resolving deltas: 92% (46764/50830)
Resolving deltas: 93% (47272/50830)
Resolving deltas: 94% (47781/50830)
Resolving deltas: 95% (48289/50830)
Resolving deltas: 96% (48797/50830)
Resolving deltas: 97% (49306/50830)
Resolving deltas: 98% (49814/50830)
Resolving deltas: 99% (50322/50830)
Resolving deltas: 100% (50830/50830)
Resolving deltas: 100% (50830/50830), done.
8.34 s
Fetching commit 36f5c8d96254ee19f0c0bbc3f6a6e49b5d9777aa for docs ...
8.34 s
$ /nix/store/bcnisk3ydfgv26v2gw3zlky24g00yww2-git-2.54.0/bin/git fetch origin 36f5c8d96254ee19f0c0bbc3f6a6e49b5d9777aa
9.07 s
From https://github.com/alphal00p/gammaloop
9.07 s
* branch 36f5c8d96254ee19f0c0bbc3f6a6e49b5d9777aa -> FETCH_HEAD
9.08 s
$ /nix/store/9ypz3flqsrl5xl495mm8h645gadjsxi1-coreutils-9.11/bin/timeout --kill-after=15s 7200s /nix/store/bcnisk3ydfgv26v2gw3zlky24g00yww2-git-2.54.0/bin/git -c advice.detachedHead=false checkout 36f5c8d96254ee19f0c0bbc3f6a6e49b5d9777aa
9.23 s
HEAD is now at 36f5c8d96 move portal pages from Rust into native Typst
9.24 s
$ /nix/store/9ypz3flqsrl5xl495mm8h645gadjsxi1-coreutils-9.11/bin/timeout --kill-after=15s 7200s /nix/store/23zk8sgzamrbmj1fday15szf7f2279s8-nix-2.34.7/bin/nix --extra-experimental-features nix-command --extra-experimental-features flakes --log-format internal-json run .#packages.x86_64-linux.nix-ci-check-gammaloop-nextest-python-api --print-build-logs
9.46 s
stdenv.isDarwin is deprecated, use stdenv.hostPlatform.isDarwin instead
16.07 s
16.94 s
Downloading cached gammaloop-python-module from https://cache.nix-ci.com
16.98 s
Downloading cached gammaloop-ci-test-binary-dependencies-edb22ac49f29b33b-Cargo.toml from https://cache.nix-ci.com
16.98 s
Downloading cached bin from https://cache.nix-ci.com
16.98 s
Downloading cached check-phase-thread-limit-hook from https://cache.nix-ci.com
16.98 s
Downloading cached die-hook from https://cache.nix-ci.com
16.98 s
Downloading cached gammaloop-crate-test-dependencies-edb22ac49f29b33b-inputs from https://cache.nix-ci.com
16.98 s
Downloading cached libxcrypt from https://cache.nix-ci.com
16.98 s
Downloading cached openblas from https://cache.nix-ci.com
17.00 s
Building /nix/store/d40qcs7byr1sx1fgwi59wpn4hb8d29js-gammaloop-ci-test-binary-dependencies-edb22ac49f29b33b-gammaloop-integration-tests-dev-dependency.toml.drv
17.04 s
Building /nix/store/5349m8w9wspk4wk6q435fm525dd0854z-builder.pl.drv
17.05 s
Downloaded cached gammaloop-ci-test-binary-dependencies-edb22ac49f29b33b-Cargo.toml (1224 B) in 69ms
17.06 s
[gammaloop-ci-test-binary-dependencies-edb22ac49f29b33b-gammaloop-integration-tests-dev-dependency.toml:post-build] Uploading to the NixCI cache: /nix/store/zn42yb076sbq2h8n23qih0bky956n62f-gammaloop-ci-test-binary-dependencies-edb22ac49f29b33b-gammaloop-integration-tests-dev-dependency.toml
17.06 s
Downloaded cached bin (264 B) in 77ms
17.06 s
Downloaded cached check-phase-thread-limit-hook (1552 B) in 77ms
17.07 s
Downloaded cached libxcrypt (141 KiB) in 88ms
17.08 s
Downloaded cached die-hook (928 B) in 93ms
17.09 s
[gammaloop-ci-test-binary-dependencies-edb22ac49f29b33b-gammaloop-integration-tests-dev-dependency.toml:post-build] warning: 'warn-short-path-literals' is deprecated, use 'lint-short-path-literals = ignore' instead
17.20 s
[gammaloop-ci-test-binary-dependencies-edb22ac49f29b33b-gammaloop-integration-tests-dev-dependency.toml:post-build] copying 0 paths...
17.25 s
[gammaloop-ci-test-binary-dependencies-edb22ac49f29b33b-gammaloop-integration-tests-dev-dependency.toml:post-build] warning: 'warn-short-path-literals' is deprecated, use 'lint-short-path-literals = ignore' instead
17.27 s
Downloaded cached openblas (32.6 MiB) in 282ms
17.36 s
[gammaloop-ci-test-binary-dependencies-edb22ac49f29b33b-gammaloop-integration-tests-dev-dependency.toml:post-build] copying 0 paths...
17.37 s
Uploaded gammaloop-ci-test-binary-dependencies-edb22ac49f29b33b-gammaloop-integration-tests-dev-dependency.toml in 333ms
17.37 s
Progress: 1 of 14 built (1 building), 0 of 18 downloaded from cache (8 downloading)
17.37 s
Built gammaloop-ci-test-binary-dependencies-edb22ac49f29b33b-gammaloop-integration-tests-dev-dependency.toml in 374ms
17.37 s
Progress: 1 of 13 built (1 building), 1 of 18 downloaded from cache (7 downloading)
17.37 s
Progress: 1 of 13 built (1 building), 2 of 18 downloaded from cache (6 downloading)
17.37 s
Progress: 1 of 13 built (1 building), 3 of 18 downloaded from cache (5 downloading)
17.38 s
Progress: 1 of 13 built (1 building), 4 of 18 downloaded from cache (4 downloading)
17.38 s
Progress: 1 of 13 built (1 building), 5 of 18 downloaded from cache (3 downloading)
17.38 s
Progress: 1 of 13 built (1 building), 6 of 18 downloaded from cache (2 downloading)
17.38 s
[builder.pl] Phase: patchPhase
17.38 s
[builder.pl] Phase: updateAutotoolsGnuConfigScriptsPhase
17.38 s
[builder.pl] Phase: configurePhase
17.38 s
[builder.pl] no configure script, doing nothing
17.38 s
[builder.pl] Phase: buildPhase
17.38 s
[builder.pl] Phase: checkPhase
17.38 s
[builder.pl] Phase: installPhase
17.38 s
[builder.pl] no Makefile or custom installPhase, doing nothing
17.38 s
[builder.pl] Phase: fixupPhase
17.38 s
[builder.pl] shrinking RPATHs of ELF executables and libraries in /nix/store/654vgnw02gp7qz9lnaa6mypnmbgp8473-builder.pl
17.38 s
[builder.pl] checking for references to /build/ in /nix/store/654vgnw02gp7qz9lnaa6mypnmbgp8473-builder.pl...
17.38 s
[builder.pl] patching script interpreter paths in /nix/store/654vgnw02gp7qz9lnaa6mypnmbgp8473-builder.pl
17.38 s
Downloading cached blas from https://cache.nix-ci.com
17.38 s
Downloading cached lapack from https://cache.nix-ci.com
17.38 s
Downloading cached make-binary-wrapper-hook from https://cache.nix-ci.com
17.38 s
Downloading cached perl from https://cache.nix-ci.com
17.39 s
[builder.pl:post-build] Uploading to the NixCI cache: /nix/store/654vgnw02gp7qz9lnaa6mypnmbgp8473-builder.pl
17.43 s
[builder.pl:post-build] warning: 'warn-short-path-literals' is deprecated, use 'lint-short-path-literals = ignore' instead
17.45 s
Downloaded cached make-binary-wrapper-hook (18 KiB) in 77ms
17.54 s
[builder.pl:post-build] copying 0 paths...
17.60 s
[builder.pl:post-build] warning: 'warn-short-path-literals' is deprecated, use 'lint-short-path-literals = ignore' instead
17.64 s
[builder.pl:post-build] copying 0 paths...
17.65 s
Uploaded builder.pl in 272ms
17.65 s
Progress: 2 of 12 built, 6 of 18 downloaded from cache (6 downloading)
17.65 s
Built builder.pl in 616ms
17.65 s
Progress: 2 of 11 built, 7 of 18 downloaded from cache (5 downloading)
18.10 s
Downloaded cached gammaloop-python-module (133.4 MiB) in 1.1s
18.10 s
Progress: 2 of 10 built, 8 of 18 downloaded from cache (4 downloading)
18.31 s
Downloaded cached perl (55.1 MiB) in 930ms
18.31 s
Progress: 2 of 9 built, 9 of 18 downloaded from cache (3 downloading)
18.46 s
Downloaded cached blas (66.3 MiB) in 1.0s
18.46 s
Progress: 2 of 8 built, 10 of 18 downloaded from cache (2 downloading)
18.46 s
Downloading cached blas-3-dev from https://cache.nix-ci.com
18.46 s
Downloaded cached lapack (66.3 MiB) in 1.0s
18.46 s
Progress: 2 of 8 built, 11 of 18 downloaded from cache (2 downloading)
18.47 s
Downloading cached lapack-3-dev from https://cache.nix-ci.com
18.53 s
Downloaded cached blas-3-dev (37 KiB) in 69ms
18.53 s
Progress: 2 of 8 built, 12 of 18 downloaded from cache (2 downloading)
18.56 s
Downloaded cached lapack-3-dev (1.6 MiB) in 92ms
18.56 s
Progress: 2 of 8 built, 13 of 18 downloaded from cache (1 downloading)
18.56 s
Downloading cached python3.13-numpy from https://cache.nix-ci.com
18.93 s
Downloaded cached python3.13-numpy (50.3 MiB) in 372ms
18.93 s
Progress: 2 of 8 built, 14 of 18 downloaded from cache (1 downloading)
18.96 s
Building /nix/store/4s28bf6d866bmm7j8wby33073hph0r4k-python3-3.13.15-env.drv
18.97 s
[python3-3.13.15-env] structuredAttrs is enabled
19.03 s
[python3-3.13.15-env] created 227 symlinks in user environment
19.90 s
[python3-3.13.15-env:post-build] Uploading to the NixCI cache: /nix/store/v67wpyflacy0i2gvzasrxvw2gkz4mr12-python3-3.13.15-env
19.94 s
[python3-3.13.15-env:post-build] warning: 'warn-short-path-literals' is deprecated, use 'lint-short-path-literals = ignore' instead
20.04 s
[python3-3.13.15-env:post-build] copying 0 paths...
20.10 s
[python3-3.13.15-env:post-build] warning: 'warn-short-path-literals' is deprecated, use 'lint-short-path-literals = ignore' instead
20.30 s
[python3-3.13.15-env:post-build] copying 0 paths...
20.32 s
Uploaded python3-3.13.15-env in 431ms
20.32 s
Progress: 3 of 8 built, 14 of 18 downloaded from cache (1 downloading)
20.32 s
Built python3-3.13.15-env in 1.3s
39.21 s
Downloaded cached gammaloop-crate-test-dependencies-edb22ac49f29b33b-inputs (3.7 GiB) in 22.2s
39.26 s
Progress: 3 of 7 built, 15 of 18 downloaded from cache
39.26 s
Downloading cached gammaloop-crate-test-dependencies-edb22ac49f29b33b-deps from https://cache.nix-ci.com
39.88 s
Downloaded cached gammaloop-crate-test-dependencies-edb22ac49f29b33b-deps (28.7 MiB) in 619ms
39.88 s
Progress: 3 of 7 built, 16 of 18 downloaded from cache
39.88 s
Downloading cached gammaloop-crate-test-binaries-gammaloop-integration-tests-edb22ac49f29b33b-inputs from https://cache.nix-ci.com
61.51 s
Downloaded cached gammaloop-crate-test-binaries-gammaloop-integration-tests-edb22ac49f29b33b-inputs (3.7 GiB) in 21.6s
61.55 s
Progress: 3 of 7 built, 17 of 18 downloaded from cache
61.55 s
Downloading cached gammaloop-crate-test-binaries-gammaloop-integration-tests-edb22ac49f29b33b-deps from https://cache.nix-ci.com
64.18 s
Downloaded cached gammaloop-crate-test-binaries-gammaloop-integration-tests-edb22ac49f29b33b-deps (251.1 MiB) in 2.6s
64.18 s
Progress: 3 of 7 built, 18 of 18 downloaded from cache
64.31 s
Building /nix/store/pg7gsk898kmp2l1jisfys1a3qmyr2ys2-gammaloop-nextest-binaries-python-api-gammaloop-integration-tests-0.1.0.drv
64.37 s
[gammaloop-nextest-binaries-python-api-gammaloop-integration-tests] Phase: unpackPhase
64.38 s
[gammaloop-nextest-binaries-python-api-gammaloop-integration-tests] unpacking source archive /nix/store/kdhin0rmz5azvb38jfgcqfcbvgjd86n8-source
64.42 s
[gammaloop-nextest-binaries-python-api-gammaloop-integration-tests] source root is source
64.43 s
[gammaloop-nextest-binaries-python-api-gammaloop-integration-tests] Phase: patchPhase
64.51 s
[gammaloop-nextest-binaries-python-api-gammaloop-integration-tests] copying cargo artifacts from /nix/store/5c20cdxasswplb1q977bh6zjdgzzj34d-gammaloop-crate-test-binaries-gammaloop-integration-tests-edb22ac49f29b33b-inputs/target to target
65.31 s
[gammaloop-nextest-binaries-python-api-gammaloop-integration-tests] + for f in *.d
65.31 s
[gammaloop-nextest-binaries-python-api-gammaloop-integration-tests] ++ readlink libgammaloop_api.d
65.31 s
[gammaloop-nextest-binaries-python-api-gammaloop-integration-tests] + orig=
65.31 s
[gammaloop-nextest-binaries-python-api-gammaloop-integration-tests] + [[ -n '' ]]
65.31 s
[gammaloop-nextest-binaries-python-api-gammaloop-integration-tests] + continue
65.31 s
[gammaloop-nextest-binaries-python-api-gammaloop-integration-tests] + for f in *.d
65.31 s
[gammaloop-nextest-binaries-python-api-gammaloop-integration-tests] ++ readlink libgammaloop_ci_prebuild.d
65.31 s
[gammaloop-nextest-binaries-python-api-gammaloop-integration-tests] + orig=
65.31 s
[gammaloop-nextest-binaries-python-api-gammaloop-integration-tests] + [[ -n '' ]]
65.31 s
[gammaloop-nextest-binaries-python-api-gammaloop-integration-tests] + continue
65.31 s
[gammaloop-nextest-binaries-python-api-gammaloop-integration-tests] + for f in *.d
65.31 s
[gammaloop-nextest-binaries-python-api-gammaloop-integration-tests] ++ readlink libgammaloop_ci_test_binary_dependencies_0e21a2f3e307ff5a.d
65.31 s
[gammaloop-nextest-binaries-python-api-gammaloop-integration-tests] + orig=
65.31 s
[gammaloop-nextest-binaries-python-api-gammaloop-integration-tests] + [[ -n '' ]]
65.31 s
[gammaloop-nextest-binaries-python-api-gammaloop-integration-tests] + continue
65.31 s
[gammaloop-nextest-binaries-python-api-gammaloop-integration-tests] + for f in *.d
65.31 s
[gammaloop-nextest-binaries-python-api-gammaloop-integration-tests] ++ readlink libgammaloop_ci_test_binary_dependencies_205f69a77e78f974.d
65.31 s
[gammaloop-nextest-binaries-python-api-gammaloop-integration-tests] + orig=
65.31 s
[gammaloop-nextest-binaries-python-api-gammaloop-integration-tests] + [[ -n '' ]]
65.31 s
[gammaloop-nextest-binaries-python-api-gammaloop-integration-tests] + continue
65.31 s
[gammaloop-nextest-binaries-python-api-gammaloop-integration-tests] + for f in *.d
65.31 s
[gammaloop-nextest-binaries-python-api-gammaloop-integration-tests] ++ readlink libgammaloop_ci_test_binary_dependencies_2d15b14a2386a23f.d
65.31 s
[gammaloop-nextest-binaries-python-api-gammaloop-integration-tests] + orig=
65.31 s
[gammaloop-nextest-binaries-python-api-gammaloop-integration-tests] + [[ -n '' ]]
65.31 s
[gammaloop-nextest-binaries-python-api-gammaloop-integration-tests] + continue
65.31 s
[gammaloop-nextest-binaries-python-api-gammaloop-integration-tests] + for f in *.d
65.31 s
[gammaloop-nextest-binaries-python-api-gammaloop-integration-tests] ++ readlink libgammaloop_ci_test_binary_dependencies_2d15b14a2386a23f_host.d
65.32 s
[gammaloop-nextest-binaries-python-api-gammaloop-integration-tests] + orig=
65.32 s
[gammaloop-nextest-binaries-python-api-gammaloop-integration-tests] + [[ -n '' ]]
65.32 s
[gammaloop-nextest-binaries-python-api-gammaloop-integration-tests] + continue
65.32 s
[gammaloop-nextest-binaries-python-api-gammaloop-integration-tests] + for f in *.d
65.32 s
[gammaloop-nextest-binaries-python-api-gammaloop-integration-tests] ++ readlink libgammaloop_ci_test_binary_dependencies_2d15b14a2386a23f_target_gammaloop_tracing_filter_macros.d
65.32 s
[gammaloop-nextest-binaries-python-api-gammaloop-integration-tests] + orig=
65.32 s
[gammaloop-nextest-binaries-python-api-gammaloop-integration-tests] + [[ -n '' ]]
65.32 s
[gammaloop-nextest-binaries-python-api-gammaloop-integration-tests] + continue
65.32 s
[gammaloop-nextest-binaries-python-api-gammaloop-integration-tests] + for f in *.d
65.32 s
[gammaloop-nextest-binaries-python-api-gammaloop-integration-tests] ++ readlink libgammaloop_ci_test_binary_dependencies_3b75a4e0eb58af7b.d
65.32 s
[gammaloop-nextest-binaries-python-api-gammaloop-integration-tests] + orig=
65.32 s
[gammaloop-nextest-binaries-python-api-gammaloop-integration-tests] + [[ -n '' ]]
65.32 s
[gammaloop-nextest-binaries-python-api-gammaloop-integration-tests] + continue
65.32 s
[gammaloop-nextest-binaries-python-api-gammaloop-integration-tests] + for f in *.d
65.32 s
[gammaloop-nextest-binaries-python-api-gammaloop-integration-tests] ++ readlink libgammaloop_ci_test_binary_dependencies_b035b97e65aab5e2.d
65.32 s
[gammaloop-nextest-binaries-python-api-gammaloop-integration-tests] + orig=
65.32 s
[gammaloop-nextest-binaries-python-api-gammaloop-integration-tests] + [[ -n '' ]]
65.32 s
[gammaloop-nextest-binaries-python-api-gammaloop-integration-tests] + continue
65.32 s
[gammaloop-nextest-binaries-python-api-gammaloop-integration-tests] + for f in *.d
65.32 s
[gammaloop-nextest-binaries-python-api-gammaloop-integration-tests] ++ readlink libgammaloop_ci_test_binary_dependencies_b13cde5d74cccfd3.d
65.32 s
[gammaloop-nextest-binaries-python-api-gammaloop-integration-tests] + orig=
65.32 s
[gammaloop-nextest-binaries-python-api-gammaloop-integration-tests] + [[ -n '' ]]
65.32 s
[gammaloop-nextest-binaries-python-api-gammaloop-integration-tests] + continue
65.32 s
[gammaloop-nextest-binaries-python-api-gammaloop-integration-tests] + for f in *.d
65.32 s
[gammaloop-nextest-binaries-python-api-gammaloop-integration-tests] ++ readlink libgammaloop_ci_test_binary_dependencies_ba40fca986833aca.d
65.32 s
[gammaloop-nextest-binaries-python-api-gammaloop-integration-tests] + orig=
65.32 s
[gammaloop-nextest-binaries-python-api-gammaloop-integration-tests] + [[ -n '' ]]
65.32 s
[gammaloop-nextest-binaries-python-api-gammaloop-integration-tests] + continue
65.32 s
[gammaloop-nextest-binaries-python-api-gammaloop-integration-tests] + for f in *.d
65.32 s
[gammaloop-nextest-binaries-python-api-gammaloop-integration-tests] ++ readlink libgammaloop_ci_test_binary_dependencies_c41dcf427a870814.d
65.32 s
[gammaloop-nextest-binaries-python-api-gammaloop-integration-tests] + orig=
65.32 s
[gammaloop-nextest-binaries-python-api-gammaloop-integration-tests] + [[ -n '' ]]
65.32 s
[gammaloop-nextest-binaries-python-api-gammaloop-integration-tests] + continue
65.32 s
[gammaloop-nextest-binaries-python-api-gammaloop-integration-tests] + for f in *.d
65.32 s
[gammaloop-nextest-binaries-python-api-gammaloop-integration-tests] ++ readlink libgammaloop_ci_test_binary_dependencies_c41dcf427a870814_host.d
65.32 s
[gammaloop-nextest-binaries-python-api-gammaloop-integration-tests] + orig=
65.32 s
[gammaloop-nextest-binaries-python-api-gammaloop-integration-tests] + [[ -n '' ]]
65.32 s
[gammaloop-nextest-binaries-python-api-gammaloop-integration-tests] + continue
65.32 s
[gammaloop-nextest-binaries-python-api-gammaloop-integration-tests] + for f in *.d
65.32 s
[gammaloop-nextest-binaries-python-api-gammaloop-integration-tests] ++ readlink libgammaloop_ci_test_binary_dependencies_c41dcf427a870814_target_spenso_macros.d
65.33 s
[gammaloop-nextest-binaries-python-api-gammaloop-integration-tests] + orig=
65.33 s
[gammaloop-nextest-binaries-python-api-gammaloop-integration-tests] + [[ -n '' ]]
65.33 s
[gammaloop-nextest-binaries-python-api-gammaloop-integration-tests] + continue
65.33 s
[gammaloop-nextest-binaries-python-api-gammaloop-integration-tests] + for f in *.d
65.33 s
[gammaloop-nextest-binaries-python-api-gammaloop-integration-tests] ++ readlink libgammaloop_ci_test_binary_dependencies_eceb99ce8a91d0e3.d
65.33 s
[gammaloop-nextest-binaries-python-api-gammaloop-integration-tests] + orig=
65.33 s
[gammaloop-nextest-binaries-python-api-gammaloop-integration-tests] + [[ -n '' ]]
65.33 s
[gammaloop-nextest-binaries-python-api-gammaloop-integration-tests] + continue
65.33 s
[gammaloop-nextest-binaries-python-api-gammaloop-integration-tests] + for f in *.d
65.33 s
[gammaloop-nextest-binaries-python-api-gammaloop-integration-tests] ++ readlink libgammaloop_ci_test_binary_dependencies_edb22ac49f29b33b.d
65.33 s
[gammaloop-nextest-binaries-python-api-gammaloop-integration-tests] + orig=
65.33 s
[gammaloop-nextest-binaries-python-api-gammaloop-integration-tests] + [[ -n '' ]]
65.33 s
[gammaloop-nextest-binaries-python-api-gammaloop-integration-tests] + continue
65.33 s
[gammaloop-nextest-binaries-python-api-gammaloop-integration-tests] + for f in *.d
65.33 s
[gammaloop-nextest-binaries-python-api-gammaloop-integration-tests] ++ readlink libgammaloop_ci_test_binary_dependencies_fe00c48b9b12af7f.d
65.33 s
[gammaloop-nextest-binaries-python-api-gammaloop-integration-tests] + orig=
65.33 s
[gammaloop-nextest-binaries-python-api-gammaloop-integration-tests] + [[ -n '' ]]
65.33 s
[gammaloop-nextest-binaries-python-api-gammaloop-integration-tests] + continue
65.33 s
[gammaloop-nextest-binaries-python-api-gammaloop-integration-tests] + for f in *.d
65.33 s
[gammaloop-nextest-binaries-python-api-gammaloop-integration-tests] ++ readlink libgammaloop_ci_test_dependencies_0e21a2f3e307ff5a.d
65.33 s
[gammaloop-nextest-binaries-python-api-gammaloop-integration-tests] + orig=
65.33 s
[gammaloop-nextest-binaries-python-api-gammaloop-integration-tests] + [[ -n '' ]]
65.33 s
[gammaloop-nextest-binaries-python-api-gammaloop-integration-tests] + continue
65.33 s
[gammaloop-nextest-binaries-python-api-gammaloop-integration-tests] + for f in *.d
65.33 s
[gammaloop-nextest-binaries-python-api-gammaloop-integration-tests] ++ readlink libgammaloop_ci_test_dependencies_205f69a77e78f974.d
65.33 s
[gammaloop-nextest-binaries-python-api-gammaloop-integration-tests] + orig=
65.33 s
[gammaloop-nextest-binaries-python-api-gammaloop-integration-tests] + [[ -n '' ]]
65.33 s
[gammaloop-nextest-binaries-python-api-gammaloop-integration-tests] + continue
65.33 s
[gammaloop-nextest-binaries-python-api-gammaloop-integration-tests] + for f in *.d
65.33 s
[gammaloop-nextest-binaries-python-api-gammaloop-integration-tests] ++ readlink libgammaloop_ci_test_dependencies_2d15b14a2386a23f.d
65.33 s
[gammaloop-nextest-binaries-python-api-gammaloop-integration-tests] + orig=
65.33 s
[gammaloop-nextest-binaries-python-api-gammaloop-integration-tests] + [[ -n '' ]]
65.33 s
[gammaloop-nextest-binaries-python-api-gammaloop-integration-tests] + continue
65.33 s
[gammaloop-nextest-binaries-python-api-gammaloop-integration-tests] + for f in *.d
65.33 s
[gammaloop-nextest-binaries-python-api-gammaloop-integration-tests] ++ readlink libgammaloop_ci_test_dependencies_3b75a4e0eb58af7b.d
65.33 s
[gammaloop-nextest-binaries-python-api-gammaloop-integration-tests] + orig=
65.33 s
[gammaloop-nextest-binaries-python-api-gammaloop-integration-tests] + [[ -n '' ]]
65.33 s
[gammaloop-nextest-binaries-python-api-gammaloop-integration-tests] + continue
65.33 s
[gammaloop-nextest-binaries-python-api-gammaloop-integration-tests] + for f in *.d
65.33 s
[gammaloop-nextest-binaries-python-api-gammaloop-integration-tests] ++ readlink libgammaloop_ci_test_dependencies_b035b97e65aab5e2.d
65.34 s
[gammaloop-nextest-binaries-python-api-gammaloop-integration-tests] + orig=
65.34 s
[gammaloop-nextest-binaries-python-api-gammaloop-integration-tests] + [[ -n '' ]]
65.34 s
[gammaloop-nextest-binaries-python-api-gammaloop-integration-tests] + continue
65.34 s
[gammaloop-nextest-binaries-python-api-gammaloop-integration-tests] + for f in *.d
65.34 s
[gammaloop-nextest-binaries-python-api-gammaloop-integration-tests] ++ readlink libgammaloop_ci_test_dependencies_b13cde5d74cccfd3.d
65.34 s
[gammaloop-nextest-binaries-python-api-gammaloop-integration-tests] + orig=
65.34 s
[gammaloop-nextest-binaries-python-api-gammaloop-integration-tests] + [[ -n '' ]]
65.34 s
[gammaloop-nextest-binaries-python-api-gammaloop-integration-tests] + continue
65.34 s
[gammaloop-nextest-binaries-python-api-gammaloop-integration-tests] + for f in *.d
65.34 s
[gammaloop-nextest-binaries-python-api-gammaloop-integration-tests] ++ readlink libgammaloop_ci_test_dependencies_ba40fca986833aca.d
65.34 s
[gammaloop-nextest-binaries-python-api-gammaloop-integration-tests] + orig=
65.34 s
[gammaloop-nextest-binaries-python-api-gammaloop-integration-tests] + [[ -n '' ]]
65.34 s
[gammaloop-nextest-binaries-python-api-gammaloop-integration-tests] + continue
65.34 s
[gammaloop-nextest-binaries-python-api-gammaloop-integration-tests] + for f in *.d
65.34 s
[gammaloop-nextest-binaries-python-api-gammaloop-integration-tests] ++ readlink libgammaloop_ci_test_dependencies_c41dcf427a870814.d
65.34 s
[gammaloop-nextest-binaries-python-api-gammaloop-integration-tests] + orig=
65.34 s
[gammaloop-nextest-binaries-python-api-gammaloop-integration-tests] + [[ -n '' ]]
65.34 s
[gammaloop-nextest-binaries-python-api-gammaloop-integration-tests] + continue
65.34 s
[gammaloop-nextest-binaries-python-api-gammaloop-integration-tests] + for f in *.d
65.34 s
[gammaloop-nextest-binaries-python-api-gammaloop-integration-tests] ++ readlink libgammaloop_ci_test_dependencies_eceb99ce8a91d0e3.d
65.34 s
[gammaloop-nextest-binaries-python-api-gammaloop-integration-tests] + orig=
65.34 s
[gammaloop-nextest-binaries-python-api-gammaloop-integration-tests] + [[ -n '' ]]
65.34 s
[gammaloop-nextest-binaries-python-api-gammaloop-integration-tests] + continue
65.34 s
[gammaloop-nextest-binaries-python-api-gammaloop-integration-tests] + for f in *.d
65.34 s
[gammaloop-nextest-binaries-python-api-gammaloop-integration-tests] ++ readlink libgammaloop_ci_test_dependencies_edb22ac49f29b33b.d
65.34 s
[gammaloop-nextest-binaries-python-api-gammaloop-integration-tests] + orig=
65.34 s
[gammaloop-nextest-binaries-python-api-gammaloop-integration-tests] + [[ -n '' ]]
65.34 s
[gammaloop-nextest-binaries-python-api-gammaloop-integration-tests] + continue
65.34 s
[gammaloop-nextest-binaries-python-api-gammaloop-integration-tests] + for f in *.d
65.34 s
[gammaloop-nextest-binaries-python-api-gammaloop-integration-tests] ++ readlink libgammaloop_ci_test_dependencies_fe00c48b9b12af7f.d
65.34 s
[gammaloop-nextest-binaries-python-api-gammaloop-integration-tests] + orig=
65.34 s
[gammaloop-nextest-binaries-python-api-gammaloop-integration-tests] + [[ -n '' ]]
65.34 s
[gammaloop-nextest-binaries-python-api-gammaloop-integration-tests] + continue
65.34 s
[gammaloop-nextest-binaries-python-api-gammaloop-integration-tests] + for f in *.d
65.34 s
[gammaloop-nextest-binaries-python-api-gammaloop-integration-tests] ++ readlink libgammaloop_integration_tests.d
65.34 s
[gammaloop-nextest-binaries-python-api-gammaloop-integration-tests] + orig=
65.34 s
[gammaloop-nextest-binaries-python-api-gammaloop-integration-tests] + [[ -n '' ]]
65.34 s
[gammaloop-nextest-binaries-python-api-gammaloop-integration-tests] + continue
65.34 s
[gammaloop-nextest-binaries-python-api-gammaloop-integration-tests] + for f in *.d
65.34 s
[gammaloop-nextest-binaries-python-api-gammaloop-integration-tests] ++ readlink libgammaloop_tracing_filter.d
65.35 s
[gammaloop-nextest-binaries-python-api-gammaloop-integration-tests] + orig=
65.35 s
[gammaloop-nextest-binaries-python-api-gammaloop-integration-tests] + [[ -n '' ]]
65.35 s
[gammaloop-nextest-binaries-python-api-gammaloop-integration-tests] + continue
65.35 s
[gammaloop-nextest-binaries-python-api-gammaloop-integration-tests] + for f in *.d
65.35 s
[gammaloop-nextest-binaries-python-api-gammaloop-integration-tests] ++ readlink libgammaloop_tracing_filter_macros.d
65.35 s
[gammaloop-nextest-binaries-python-api-gammaloop-integration-tests] + orig=
65.35 s
[gammaloop-nextest-binaries-python-api-gammaloop-integration-tests] + [[ -n '' ]]
65.35 s
[gammaloop-nextest-binaries-python-api-gammaloop-integration-tests] + continue
65.35 s
[gammaloop-nextest-binaries-python-api-gammaloop-integration-tests] + for f in *.d
65.35 s
[gammaloop-nextest-binaries-python-api-gammaloop-integration-tests] ++ readlink libgammaloop_workspace_hack.d
65.35 s
[gammaloop-nextest-binaries-python-api-gammaloop-integration-tests] + orig=
65.35 s
[gammaloop-nextest-binaries-python-api-gammaloop-integration-tests] + [[ -n '' ]]
65.35 s
[gammaloop-nextest-binaries-python-api-gammaloop-integration-tests] + continue
65.35 s
[gammaloop-nextest-binaries-python-api-gammaloop-integration-tests] + for f in *.d
65.35 s
[gammaloop-nextest-binaries-python-api-gammaloop-integration-tests] ++ readlink libgammalooprs.d
65.35 s
[gammaloop-nextest-binaries-python-api-gammaloop-integration-tests] + orig=
65.35 s
[gammaloop-nextest-binaries-python-api-gammaloop-integration-tests] + [[ -n '' ]]
65.35 s
[gammaloop-nextest-binaries-python-api-gammaloop-integration-tests] + continue
65.35 s
[gammaloop-nextest-binaries-python-api-gammaloop-integration-tests] + for f in *.d
65.35 s
[gammaloop-nextest-binaries-python-api-gammaloop-integration-tests] ++ readlink libidenso.d
65.35 s
[gammaloop-nextest-binaries-python-api-gammaloop-integration-tests] + orig=
65.35 s
[gammaloop-nextest-binaries-python-api-gammaloop-integration-tests] + [[ -n '' ]]
65.35 s
[gammaloop-nextest-binaries-python-api-gammaloop-integration-tests] + continue
65.35 s
[gammaloop-nextest-binaries-python-api-gammaloop-integration-tests] + for f in *.d
65.35 s
[gammaloop-nextest-binaries-python-api-gammaloop-integration-tests] ++ readlink liblinnest.d
65.35 s
[gammaloop-nextest-binaries-python-api-gammaloop-integration-tests] + orig=
65.35 s
[gammaloop-nextest-binaries-python-api-gammaloop-integration-tests] + [[ -n '' ]]
65.35 s
[gammaloop-nextest-binaries-python-api-gammaloop-integration-tests] + continue
65.35 s
[gammaloop-nextest-binaries-python-api-gammaloop-integration-tests] + for f in *.d
65.35 s
[gammaloop-nextest-binaries-python-api-gammaloop-integration-tests] ++ readlink liblinnet.d
65.35 s
[gammaloop-nextest-binaries-python-api-gammaloop-integration-tests] + orig=
65.35 s
[gammaloop-nextest-binaries-python-api-gammaloop-integration-tests] + [[ -n '' ]]
65.35 s
[gammaloop-nextest-binaries-python-api-gammaloop-integration-tests] + continue
65.35 s
[gammaloop-nextest-binaries-python-api-gammaloop-integration-tests] + for f in *.d
65.35 s
[gammaloop-nextest-binaries-python-api-gammaloop-integration-tests] ++ readlink libspenso.d
65.35 s
[gammaloop-nextest-binaries-python-api-gammaloop-integration-tests] + orig=
65.35 s
[gammaloop-nextest-binaries-python-api-gammaloop-integration-tests] + [[ -n '' ]]
65.35 s
[gammaloop-nextest-binaries-python-api-gammaloop-integration-tests] + continue
65.35 s
[gammaloop-nextest-binaries-python-api-gammaloop-integration-tests] + for f in *.d
65.35 s
[gammaloop-nextest-binaries-python-api-gammaloop-integration-tests] ++ readlink libspenso_hep_lib.d
65.35 s
[gammaloop-nextest-binaries-python-api-gammaloop-integration-tests] + orig=
65.35 s
[gammaloop-nextest-binaries-python-api-gammaloop-integration-tests] + [[ -n '' ]]
65.35 s
[gammaloop-nextest-binaries-python-api-gammaloop-integration-tests] + continue
65.35 s
[gammaloop-nextest-binaries-python-api-gammaloop-integration-tests] + for f in *.d
65.35 s
[gammaloop-nextest-binaries-python-api-gammaloop-integration-tests] ++ readlink libspenso_macros.d
65.36 s
[gammaloop-nextest-binaries-python-api-gammaloop-integration-tests] + orig=
65.36 s
[gammaloop-nextest-binaries-python-api-gammaloop-integration-tests] + [[ -n '' ]]
65.36 s
[gammaloop-nextest-binaries-python-api-gammaloop-integration-tests] + continue
65.36 s
[gammaloop-nextest-binaries-python-api-gammaloop-integration-tests] + for f in *.d
65.36 s
[gammaloop-nextest-binaries-python-api-gammaloop-integration-tests] ++ readlink libsymbolica_utils.d
65.36 s
[gammaloop-nextest-binaries-python-api-gammaloop-integration-tests] + orig=
65.36 s
[gammaloop-nextest-binaries-python-api-gammaloop-integration-tests] + [[ -n '' ]]
65.36 s
[gammaloop-nextest-binaries-python-api-gammaloop-integration-tests] + continue
65.36 s
[gammaloop-nextest-binaries-python-api-gammaloop-integration-tests] + for f in *.d
65.36 s
[gammaloop-nextest-binaries-python-api-gammaloop-integration-tests] ++ readlink libvakint.d
65.36 s
[gammaloop-nextest-binaries-python-api-gammaloop-integration-tests] + orig=
65.36 s
[gammaloop-nextest-binaries-python-api-gammaloop-integration-tests] + [[ -n '' ]]
65.36 s
[gammaloop-nextest-binaries-python-api-gammaloop-integration-tests] + continue
65.36 s
[gammaloop-nextest-binaries-python-api-gammaloop-integration-tests] + for f in *.d
65.36 s
[gammaloop-nextest-binaries-python-api-gammaloop-integration-tests] ++ readlink libgammaloop_api.d
65.36 s
[gammaloop-nextest-binaries-python-api-gammaloop-integration-tests] + orig=
65.36 s
[gammaloop-nextest-binaries-python-api-gammaloop-integration-tests] + [[ -n '' ]]
65.36 s
[gammaloop-nextest-binaries-python-api-gammaloop-integration-tests] + continue
65.36 s
[gammaloop-nextest-binaries-python-api-gammaloop-integration-tests] + for f in *.d
65.36 s
[gammaloop-nextest-binaries-python-api-gammaloop-integration-tests] ++ readlink libgammaloop_ci_prebuild.d
65.36 s
[gammaloop-nextest-binaries-python-api-gammaloop-integration-tests] + orig=
65.36 s
[gammaloop-nextest-binaries-python-api-gammaloop-integration-tests] + [[ -n '' ]]
65.36 s
[gammaloop-nextest-binaries-python-api-gammaloop-integration-tests] + continue
65.36 s
[gammaloop-nextest-binaries-python-api-gammaloop-integration-tests] + for f in *.d
65.36 s
[gammaloop-nextest-binaries-python-api-gammaloop-integration-tests] ++ readlink libgammaloop_ci_test_binary_dependencies_0e21a2f3e307ff5a.d
65.36 s
[gammaloop-nextest-binaries-python-api-gammaloop-integration-tests] + orig=
65.36 s
[gammaloop-nextest-binaries-python-api-gammaloop-integration-tests] + [[ -n '' ]]
65.36 s
[gammaloop-nextest-binaries-python-api-gammaloop-integration-tests] + continue
65.36 s
[gammaloop-nextest-binaries-python-api-gammaloop-integration-tests] + for f in *.d
65.36 s
[gammaloop-nextest-binaries-python-api-gammaloop-integration-tests] ++ readlink libgammaloop_ci_test_binary_dependencies_205f69a77e78f974.d
65.36 s
[gammaloop-nextest-binaries-python-api-gammaloop-integration-tests] + orig=
65.36 s
[gammaloop-nextest-binaries-python-api-gammaloop-integration-tests] + [[ -n '' ]]
65.36 s
[gammaloop-nextest-binaries-python-api-gammaloop-integration-tests] + continue
65.36 s
[gammaloop-nextest-binaries-python-api-gammaloop-integration-tests] + for f in *.d
65.36 s
[gammaloop-nextest-binaries-python-api-gammaloop-integration-tests] ++ readlink libgammaloop_ci_test_binary_dependencies_2d15b14a2386a23f.d
65.37 s
[gammaloop-nextest-binaries-python-api-gammaloop-integration-tests] + orig=
65.37 s
[gammaloop-nextest-binaries-python-api-gammaloop-integration-tests] + [[ -n '' ]]
65.37 s
[gammaloop-nextest-binaries-python-api-gammaloop-integration-tests] + continue
65.37 s
[gammaloop-nextest-binaries-python-api-gammaloop-integration-tests] + for f in *.d
65.37 s
[gammaloop-nextest-binaries-python-api-gammaloop-integration-tests] ++ readlink libgammaloop_ci_test_binary_dependencies_2d15b14a2386a23f_host.d
65.37 s
[gammaloop-nextest-binaries-python-api-gammaloop-integration-tests] + orig=
65.37 s
[gammaloop-nextest-binaries-python-api-gammaloop-integration-tests] + [[ -n '' ]]
65.37 s
[gammaloop-nextest-binaries-python-api-gammaloop-integration-tests] + continue
65.37 s
[gammaloop-nextest-binaries-python-api-gammaloop-integration-tests] + for f in *.d
65.37 s
[gammaloop-nextest-binaries-python-api-gammaloop-integration-tests] ++ readlink libgammaloop_ci_test_binary_dependencies_2d15b14a2386a23f_target_gammaloop_tracing_filter_macros.d
65.37 s
[gammaloop-nextest-binaries-python-api-gammaloop-integration-tests] + orig=
65.37 s
[gammaloop-nextest-binaries-python-api-gammaloop-integration-tests] + [[ -n '' ]]
65.37 s
[gammaloop-nextest-binaries-python-api-gammaloop-integration-tests] + continue
65.37 s
[gammaloop-nextest-binaries-python-api-gammaloop-integration-tests] + for f in *.d
65.37 s
[gammaloop-nextest-binaries-python-api-gammaloop-integration-tests] ++ readlink libgammaloop_ci_test_binary_dependencies_3b75a4e0eb58af7b.d
65.37 s
[gammaloop-nextest-binaries-python-api-gammaloop-integration-tests] + orig=
65.37 s
[gammaloop-nextest-binaries-python-api-gammaloop-integration-tests] + [[ -n '' ]]
65.37 s
[gammaloop-nextest-binaries-python-api-gammaloop-integration-tests] + continue
65.37 s
[gammaloop-nextest-binaries-python-api-gammaloop-integration-tests] + for f in *.d
65.37 s
[gammaloop-nextest-binaries-python-api-gammaloop-integration-tests] ++ readlink libgammaloop_ci_test_binary_dependencies_b035b97e65aab5e2.d
65.37 s
[gammaloop-nextest-binaries-python-api-gammaloop-integration-tests] + orig=
65.37 s
[gammaloop-nextest-binaries-python-api-gammaloop-integration-tests] + [[ -n '' ]]
65.37 s
[gammaloop-nextest-binaries-python-api-gammaloop-integration-tests] + continue
65.37 s
[gammaloop-nextest-binaries-python-api-gammaloop-integration-tests] + for f in *.d
65.37 s
[gammaloop-nextest-binaries-python-api-gammaloop-integration-tests] ++ readlink libgammaloop_ci_test_binary_dependencies_b13cde5d74cccfd3.d
65.37 s
[gammaloop-nextest-binaries-python-api-gammaloop-integration-tests] + orig=
65.37 s
[gammaloop-nextest-binaries-python-api-gammaloop-integration-tests] + [[ -n '' ]]
65.37 s
[gammaloop-nextest-binaries-python-api-gammaloop-integration-tests] + continue
65.37 s
[gammaloop-nextest-binaries-python-api-gammaloop-integration-tests] + for f in *.d
65.37 s
[gammaloop-nextest-binaries-python-api-gammaloop-integration-tests] ++ readlink libgammaloop_ci_test_binary_dependencies_ba40fca986833aca.d
65.37 s
[gammaloop-nextest-binaries-python-api-gammaloop-integration-tests] + orig=
65.37 s
[gammaloop-nextest-binaries-python-api-gammaloop-integration-tests] + [[ -n '' ]]
65.37 s
[gammaloop-nextest-binaries-python-api-gammaloop-integration-tests] + continue
65.37 s
[gammaloop-nextest-binaries-python-api-gammaloop-integration-tests] + for f in *.d
65.37 s
[gammaloop-nextest-binaries-python-api-gammaloop-integration-tests] ++ readlink libgammaloop_ci_test_binary_dependencies_c41dcf427a870814.d
65.37 s
[gammaloop-nextest-binaries-python-api-gammaloop-integration-tests] + orig=
65.37 s
[gammaloop-nextest-binaries-python-api-gammaloop-integration-tests] + [[ -n '' ]]
65.37 s
[gammaloop-nextest-binaries-python-api-gammaloop-integration-tests] + continue
65.37 s
[gammaloop-nextest-binaries-python-api-gammaloop-integration-tests] + for f in *.d
65.37 s
[gammaloop-nextest-binaries-python-api-gammaloop-integration-tests] ++ readlink libgammaloop_ci_test_binary_dependencies_c41dcf427a870814_host.d
65.38 s
[gammaloop-nextest-binaries-python-api-gammaloop-integration-tests] + orig=
65.38 s
[gammaloop-nextest-binaries-python-api-gammaloop-integration-tests] + [[ -n '' ]]
65.38 s
[gammaloop-nextest-binaries-python-api-gammaloop-integration-tests] + continue
65.38 s
[gammaloop-nextest-binaries-python-api-gammaloop-integration-tests] + for f in *.d
65.38 s
[gammaloop-nextest-binaries-python-api-gammaloop-integration-tests] ++ readlink libgammaloop_ci_test_binary_dependencies_c41dcf427a870814_target_spenso_macros.d
65.38 s
[gammaloop-nextest-binaries-python-api-gammaloop-integration-tests] + orig=
65.38 s
[gammaloop-nextest-binaries-python-api-gammaloop-integration-tests] + [[ -n '' ]]
65.38 s
[gammaloop-nextest-binaries-python-api-gammaloop-integration-tests] + continue
65.38 s
[gammaloop-nextest-binaries-python-api-gammaloop-integration-tests] + for f in *.d
65.38 s
[gammaloop-nextest-binaries-python-api-gammaloop-integration-tests] ++ readlink libgammaloop_ci_test_binary_dependencies_eceb99ce8a91d0e3.d
65.38 s
[gammaloop-nextest-binaries-python-api-gammaloop-integration-tests] + orig=
65.38 s
[gammaloop-nextest-binaries-python-api-gammaloop-integration-tests] + [[ -n '' ]]
65.38 s
[gammaloop-nextest-binaries-python-api-gammaloop-integration-tests] + continue
65.38 s
[gammaloop-nextest-binaries-python-api-gammaloop-integration-tests] + for f in *.d
65.38 s
[gammaloop-nextest-binaries-python-api-gammaloop-integration-tests] ++ readlink libgammaloop_ci_test_binary_dependencies_edb22ac49f29b33b.d
65.38 s
[gammaloop-nextest-binaries-python-api-gammaloop-integration-tests] + orig=
65.38 s
[gammaloop-nextest-binaries-python-api-gammaloop-integration-tests] + [[ -n '' ]]
65.38 s
[gammaloop-nextest-binaries-python-api-gammaloop-integration-tests] + continue
65.38 s
[gammaloop-nextest-binaries-python-api-gammaloop-integration-tests] + for f in *.d
65.38 s
[gammaloop-nextest-binaries-python-api-gammaloop-integration-tests] ++ readlink libgammaloop_ci_test_binary_dependencies_fe00c48b9b12af7f.d
65.38 s
[gammaloop-nextest-binaries-python-api-gammaloop-integration-tests] + orig=
65.38 s
[gammaloop-nextest-binaries-python-api-gammaloop-integration-tests] + [[ -n '' ]]
65.38 s
[gammaloop-nextest-binaries-python-api-gammaloop-integration-tests] + continue
65.38 s
[gammaloop-nextest-binaries-python-api-gammaloop-integration-tests] + for f in *.d
65.38 s
[gammaloop-nextest-binaries-python-api-gammaloop-integration-tests] ++ readlink libgammaloop_ci_test_dependencies_0e21a2f3e307ff5a.d
65.38 s
[gammaloop-nextest-binaries-python-api-gammaloop-integration-tests] + orig=
65.38 s
[gammaloop-nextest-binaries-python-api-gammaloop-integration-tests] + [[ -n '' ]]
65.38 s
[gammaloop-nextest-binaries-python-api-gammaloop-integration-tests] + continue
65.38 s
[gammaloop-nextest-binaries-python-api-gammaloop-integration-tests] + for f in *.d
65.38 s
[gammaloop-nextest-binaries-python-api-gammaloop-integration-tests] ++ readlink libgammaloop_ci_test_dependencies_205f69a77e78f974.d
65.38 s
[gammaloop-nextest-binaries-python-api-gammaloop-integration-tests] + orig=
65.38 s
[gammaloop-nextest-binaries-python-api-gammaloop-integration-tests] + [[ -n '' ]]
65.38 s
[gammaloop-nextest-binaries-python-api-gammaloop-integration-tests] + continue
65.38 s
[gammaloop-nextest-binaries-python-api-gammaloop-integration-tests] + for f in *.d
65.38 s
[gammaloop-nextest-binaries-python-api-gammaloop-integration-tests] ++ readlink libgammaloop_ci_test_dependencies_2d15b14a2386a23f.d
65.38 s
[gammaloop-nextest-binaries-python-api-gammaloop-integration-tests] + orig=
65.38 s
[gammaloop-nextest-binaries-python-api-gammaloop-integration-tests] + [[ -n '' ]]
65.38 s
[gammaloop-nextest-binaries-python-api-gammaloop-integration-tests] + continue
65.38 s
[gammaloop-nextest-binaries-python-api-gammaloop-integration-tests] + for f in *.d
65.38 s
[gammaloop-nextest-binaries-python-api-gammaloop-integration-tests] ++ readlink libgammaloop_ci_test_dependencies_3b75a4e0eb58af7b.d
65.38 s
[gammaloop-nextest-binaries-python-api-gammaloop-integration-tests] + orig=
65.38 s
[gammaloop-nextest-binaries-python-api-gammaloop-integration-tests] + [[ -n '' ]]
65.38 s
[gammaloop-nextest-binaries-python-api-gammaloop-integration-tests] + continue
65.39 s
[gammaloop-nextest-binaries-python-api-gammaloop-integration-tests] + for f in *.d
65.39 s
[gammaloop-nextest-binaries-python-api-gammaloop-integration-tests] ++ readlink libgammaloop_ci_test_dependencies_b035b97e65aab5e2.d
65.39 s
[gammaloop-nextest-binaries-python-api-gammaloop-integration-tests] + orig=
65.39 s
[gammaloop-nextest-binaries-python-api-gammaloop-integration-tests] + [[ -n '' ]]
65.39 s
[gammaloop-nextest-binaries-python-api-gammaloop-integration-tests] + continue
65.39 s
[gammaloop-nextest-binaries-python-api-gammaloop-integration-tests] + for f in *.d
65.39 s
[gammaloop-nextest-binaries-python-api-gammaloop-integration-tests] ++ readlink libgammaloop_ci_test_dependencies_b13cde5d74cccfd3.d
65.39 s
[gammaloop-nextest-binaries-python-api-gammaloop-integration-tests] + orig=
65.39 s
[gammaloop-nextest-binaries-python-api-gammaloop-integration-tests] + [[ -n '' ]]
65.39 s
[gammaloop-nextest-binaries-python-api-gammaloop-integration-tests] + continue
65.39 s
[gammaloop-nextest-binaries-python-api-gammaloop-integration-tests] + for f in *.d
65.39 s
[gammaloop-nextest-binaries-python-api-gammaloop-integration-tests] ++ readlink libgammaloop_ci_test_dependencies_ba40fca986833aca.d
65.39 s
[gammaloop-nextest-binaries-python-api-gammaloop-integration-tests] + orig=
65.39 s
[gammaloop-nextest-binaries-python-api-gammaloop-integration-tests] + [[ -n '' ]]
65.39 s
[gammaloop-nextest-binaries-python-api-gammaloop-integration-tests] + continue
65.39 s
[gammaloop-nextest-binaries-python-api-gammaloop-integration-tests] + for f in *.d
65.39 s
[gammaloop-nextest-binaries-python-api-gammaloop-integration-tests] ++ readlink libgammaloop_ci_test_dependencies_c41dcf427a870814.d
65.39 s
[gammaloop-nextest-binaries-python-api-gammaloop-integration-tests] + orig=
65.39 s
[gammaloop-nextest-binaries-python-api-gammaloop-integration-tests] + [[ -n '' ]]
65.39 s
[gammaloop-nextest-binaries-python-api-gammaloop-integration-tests] + continue
65.39 s
[gammaloop-nextest-binaries-python-api-gammaloop-integration-tests] + for f in *.d
65.39 s
[gammaloop-nextest-binaries-python-api-gammaloop-integration-tests] ++ readlink libgammaloop_ci_test_dependencies_eceb99ce8a91d0e3.d
65.39 s
[gammaloop-nextest-binaries-python-api-gammaloop-integration-tests] + orig=
65.39 s
[gammaloop-nextest-binaries-python-api-gammaloop-integration-tests] + [[ -n '' ]]
65.39 s
[gammaloop-nextest-binaries-python-api-gammaloop-integration-tests] + continue
65.39 s
[gammaloop-nextest-binaries-python-api-gammaloop-integration-tests] + for f in *.d
65.39 s
[gammaloop-nextest-binaries-python-api-gammaloop-integration-tests] ++ readlink libgammaloop_ci_test_dependencies_edb22ac49f29b33b.d
65.39 s
[gammaloop-nextest-binaries-python-api-gammaloop-integration-tests] + orig=
65.39 s
[gammaloop-nextest-binaries-python-api-gammaloop-integration-tests] + [[ -n '' ]]
65.39 s
[gammaloop-nextest-binaries-python-api-gammaloop-integration-tests] + continue
65.39 s
[gammaloop-nextest-binaries-python-api-gammaloop-integration-tests] + for f in *.d
65.39 s
[gammaloop-nextest-binaries-python-api-gammaloop-integration-tests] ++ readlink libgammaloop_ci_test_dependencies_fe00c48b9b12af7f.d
65.39 s
[gammaloop-nextest-binaries-python-api-gammaloop-integration-tests] + orig=
65.39 s
[gammaloop-nextest-binaries-python-api-gammaloop-integration-tests] + [[ -n '' ]]
65.39 s
[gammaloop-nextest-binaries-python-api-gammaloop-integration-tests] + continue
65.39 s
[gammaloop-nextest-binaries-python-api-gammaloop-integration-tests] + for f in *.d
65.39 s
[gammaloop-nextest-binaries-python-api-gammaloop-integration-tests] ++ readlink libgammaloop_integration_tests.d
65.39 s
[gammaloop-nextest-binaries-python-api-gammaloop-integration-tests] + orig=
65.39 s
[gammaloop-nextest-binaries-python-api-gammaloop-integration-tests] + [[ -n '' ]]
65.39 s
[gammaloop-nextest-binaries-python-api-gammaloop-integration-tests] + continue
65.39 s
[gammaloop-nextest-binaries-python-api-gammaloop-integration-tests] + for f in *.d
65.39 s
[gammaloop-nextest-binaries-python-api-gammaloop-integration-tests] ++ readlink libgammaloop_tracing_filter.d
65.39 s
[gammaloop-nextest-binaries-python-api-gammaloop-integration-tests] + orig=
65.39 s
[gammaloop-nextest-binaries-python-api-gammaloop-integration-tests] + [[ -n '' ]]
65.39 s
[gammaloop-nextest-binaries-python-api-gammaloop-integration-tests] + continue
65.39 s
[gammaloop-nextest-binaries-python-api-gammaloop-integration-tests] + for f in *.d
65.39 s
[gammaloop-nextest-binaries-python-api-gammaloop-integration-tests] ++ readlink libgammaloop_tracing_filter_macros.d
65.40 s
[gammaloop-nextest-binaries-python-api-gammaloop-integration-tests] + orig=
65.40 s
[gammaloop-nextest-binaries-python-api-gammaloop-integration-tests] + [[ -n '' ]]
65.40 s
[gammaloop-nextest-binaries-python-api-gammaloop-integration-tests] + continue
65.40 s
[gammaloop-nextest-binaries-python-api-gammaloop-integration-tests] + for f in *.d
65.40 s
[gammaloop-nextest-binaries-python-api-gammaloop-integration-tests] ++ readlink libgammaloop_workspace_hack.d
65.40 s
[gammaloop-nextest-binaries-python-api-gammaloop-integration-tests] + orig=
65.40 s
[gammaloop-nextest-binaries-python-api-gammaloop-integration-tests] + [[ -n '' ]]
65.40 s
[gammaloop-nextest-binaries-python-api-gammaloop-integration-tests] + continue
65.40 s
[gammaloop-nextest-binaries-python-api-gammaloop-integration-tests] + for f in *.d
65.40 s
[gammaloop-nextest-binaries-python-api-gammaloop-integration-tests] ++ readlink libgammalooprs.d
65.40 s
[gammaloop-nextest-binaries-python-api-gammaloop-integration-tests] + orig=
65.40 s
[gammaloop-nextest-binaries-python-api-gammaloop-integration-tests] + [[ -n '' ]]
65.40 s
[gammaloop-nextest-binaries-python-api-gammaloop-integration-tests] + continue
65.40 s
[gammaloop-nextest-binaries-python-api-gammaloop-integration-tests] + for f in *.d
65.40 s
[gammaloop-nextest-binaries-python-api-gammaloop-integration-tests] ++ readlink libidenso.d
65.40 s
[gammaloop-nextest-binaries-python-api-gammaloop-integration-tests] + orig=
65.40 s
[gammaloop-nextest-binaries-python-api-gammaloop-integration-tests] + [[ -n '' ]]
65.40 s
[gammaloop-nextest-binaries-python-api-gammaloop-integration-tests] + continue
65.40 s
[gammaloop-nextest-binaries-python-api-gammaloop-integration-tests] + for f in *.d
65.40 s
[gammaloop-nextest-binaries-python-api-gammaloop-integration-tests] ++ readlink liblinnest.d
65.40 s
[gammaloop-nextest-binaries-python-api-gammaloop-integration-tests] + orig=
65.40 s
[gammaloop-nextest-binaries-python-api-gammaloop-integration-tests] + [[ -n '' ]]
65.40 s
[gammaloop-nextest-binaries-python-api-gammaloop-integration-tests] + continue
65.40 s
[gammaloop-nextest-binaries-python-api-gammaloop-integration-tests] + for f in *.d
65.40 s
[gammaloop-nextest-binaries-python-api-gammaloop-integration-tests] ++ readlink liblinnet.d
65.40 s
[gammaloop-nextest-binaries-python-api-gammaloop-integration-tests] + orig=
65.40 s
[gammaloop-nextest-binaries-python-api-gammaloop-integration-tests] + [[ -n '' ]]
65.40 s
[gammaloop-nextest-binaries-python-api-gammaloop-integration-tests] + continue
65.40 s
[gammaloop-nextest-binaries-python-api-gammaloop-integration-tests] + for f in *.d
65.40 s
[gammaloop-nextest-binaries-python-api-gammaloop-integration-tests] ++ readlink libspenso.d
65.40 s
[gammaloop-nextest-binaries-python-api-gammaloop-integration-tests] + orig=
65.40 s
[gammaloop-nextest-binaries-python-api-gammaloop-integration-tests] + [[ -n '' ]]
65.40 s
[gammaloop-nextest-binaries-python-api-gammaloop-integration-tests] + continue
65.40 s
[gammaloop-nextest-binaries-python-api-gammaloop-integration-tests] + for f in *.d
65.40 s
[gammaloop-nextest-binaries-python-api-gammaloop-integration-tests] ++ readlink libspenso_hep_lib.d
65.40 s
[gammaloop-nextest-binaries-python-api-gammaloop-integration-tests] + orig=
65.40 s
[gammaloop-nextest-binaries-python-api-gammaloop-integration-tests] + [[ -n '' ]]
65.40 s
[gammaloop-nextest-binaries-python-api-gammaloop-integration-tests] + continue
65.40 s
[gammaloop-nextest-binaries-python-api-gammaloop-integration-tests] + for f in *.d
65.40 s
[gammaloop-nextest-binaries-python-api-gammaloop-integration-tests] ++ readlink libspenso_macros.d
65.40 s
[gammaloop-nextest-binaries-python-api-gammaloop-integration-tests] + orig=
65.40 s
[gammaloop-nextest-binaries-python-api-gammaloop-integration-tests] + [[ -n '' ]]
65.40 s
[gammaloop-nextest-binaries-python-api-gammaloop-integration-tests] + continue
65.40 s
[gammaloop-nextest-binaries-python-api-gammaloop-integration-tests] + for f in *.d
65.40 s
[gammaloop-nextest-binaries-python-api-gammaloop-integration-tests] ++ readlink libsymbolica_utils.d
65.41 s
[gammaloop-nextest-binaries-python-api-gammaloop-integration-tests] + orig=
65.41 s
[gammaloop-nextest-binaries-python-api-gammaloop-integration-tests] + [[ -n '' ]]
65.41 s
[gammaloop-nextest-binaries-python-api-gammaloop-integration-tests] + continue
65.41 s
[gammaloop-nextest-binaries-python-api-gammaloop-integration-tests] + for f in *.d
65.41 s
[gammaloop-nextest-binaries-python-api-gammaloop-integration-tests] ++ readlink libvakint.d
65.41 s
[gammaloop-nextest-binaries-python-api-gammaloop-integration-tests] + orig=
65.41 s
[gammaloop-nextest-binaries-python-api-gammaloop-integration-tests] + [[ -n '' ]]
65.41 s
[gammaloop-nextest-binaries-python-api-gammaloop-integration-tests] + continue
67.72 s
[gammaloop-nextest-binaries-python-api-gammaloop-integration-tests] Executing configureCargoCommonVars
67.83 s
[gammaloop-nextest-binaries-python-api-gammaloop-integration-tests] decompressing cargo artifacts from /nix/store/7f27x832jy30lljldhjs4lgq285rjkk6-gammaloop-crate-test-binaries-gammaloop-integration-tests-edb22ac49f29b33b-deps-0.1.0/target.tar.zst to target
68.51 s
[gammaloop-nextest-binaries-python-api-gammaloop-integration-tests] Phase: updateAutotoolsGnuConfigScriptsPhase
68.54 s
[gammaloop-nextest-binaries-python-api-gammaloop-integration-tests] Phase: configurePhase
68.54 s
[gammaloop-nextest-binaries-python-api-gammaloop-integration-tests] will append /build/source/.cargo-home/config.toml with contents of /nix/store/29aa708jkn8wd8vjwja1a5gh8k8wpi2b-vendor-cargo-deps/config.toml
68.55 s
[gammaloop-nextest-binaries-python-api-gammaloop-integration-tests] default configurePhase, nothing to do
68.55 s
[gammaloop-nextest-binaries-python-api-gammaloop-integration-tests] Phase: buildPhase
68.55 s
[gammaloop-nextest-binaries-python-api-gammaloop-integration-tests] +++ command cargo --version
68.55 s
[gammaloop-nextest-binaries-python-api-gammaloop-integration-tests] cargo 1.98.0 (797e8a9bc 2026-08-05)
68.60 s
[gammaloop-nextest-binaries-python-api-gammaloop-integration-tests] +++ command cargo nextest --version
68.60 s
[gammaloop-nextest-binaries-python-api-gammaloop-integration-tests] cargo-nextest 0.9.143
68.60 s
[gammaloop-nextest-binaries-python-api-gammaloop-integration-tests] release: 0.9.143
68.60 s
[gammaloop-nextest-binaries-python-api-gammaloop-integration-tests] host: x86_64-unknown-linux-gnu
68.60 s
[gammaloop-nextest-binaries-python-api-gammaloop-integration-tests] +++ command cargo nextest archive --cargo-profile ci-optim --offline -p gammaloop-integration-tests --features gammaloop-integration-tests/python-api-tests -E 'package(gammaloop-integration-tests) & binary(test_python_api)' --profile ci_gammaloop --archive-file /nix/store/jwqknvc7h8pp528hm0anqj06w3ig9wja-gammaloop-nextest-binaries-python-api-gammaloop-integration-tests-0.1.0/gammaloop-nextest-python-api-gammaloop-integration-tests.tar.zst
69.42 s
[gammaloop-nextest-binaries-python-api-gammaloop-integration-tests] Compiling gammaloop-integration-tests v0.1.0 (/build/source/tests)
102.08 s
[gammaloop-nextest-binaries-python-api-gammaloop-integration-tests] Finished `ci-optim` profile [optimized] target(s) in 32.97s
102.22 s
[gammaloop-nextest-binaries-python-api-gammaloop-integration-tests] warning : the following packages contain code that will be rejected by a future version of Rust: proc-macro-error2 v2.0.1
102.22 s
[gammaloop-nextest-binaries-python-api-gammaloop-integration-tests] note : to see what the problems were, use the option `--future-incompat-report`, or run `cargo report future-incompatibilities --id 1`
102.27 s
[gammaloop-nextest-binaries-python-api-gammaloop-integration-tests] Archiving 3 binaries (including 2 non-test binaries; 9 test binaries filtered out), 1 build script output directory, 3 linked paths, and 1 standard library to /nix/store/jwqknvc7h8pp528hm0anqj06w3ig9wja-gammaloop-nextest-binaries-python-api-gammaloop-integration-tests-0.1.0/gammaloop-nextest-python-api-gammaloop-integration-tests.tar.zst
102.45 s
[gammaloop-nextest-binaries-python-api-gammaloop-integration-tests] Archived 22 files to /nix/store/jwqknvc7h8pp528hm0anqj06w3ig9wja-gammaloop-nextest-binaries-python-api-gammaloop-integration-tests-0.1.0/gammaloop-nextest-python-api-gammaloop-integration-tests.tar.zst in 0.18s
102.46 s
[gammaloop-nextest-binaries-python-api-gammaloop-integration-tests] buildPhase completed in 34 seconds
102.46 s
[gammaloop-nextest-binaries-python-api-gammaloop-integration-tests] Phase: installPhase
102.46 s
[gammaloop-nextest-binaries-python-api-gammaloop-integration-tests] Phase: fixupPhase
102.47 s
[gammaloop-nextest-binaries-python-api-gammaloop-integration-tests] shrinking RPATHs of ELF executables and libraries in /nix/store/jwqknvc7h8pp528hm0anqj06w3ig9wja-gammaloop-nextest-binaries-python-api-gammaloop-integration-tests-0.1.0
102.47 s
[gammaloop-nextest-binaries-python-api-gammaloop-integration-tests] checking for references to /build/ in /nix/store/jwqknvc7h8pp528hm0anqj06w3ig9wja-gammaloop-nextest-binaries-python-api-gammaloop-integration-tests-0.1.0...
102.48 s
[gammaloop-nextest-binaries-python-api-gammaloop-integration-tests] patching script interpreter paths in /nix/store/jwqknvc7h8pp528hm0anqj06w3ig9wja-gammaloop-nextest-binaries-python-api-gammaloop-integration-tests-0.1.0
102.82 s
[gammaloop-nextest-binaries-python-api-gammaloop-integration-tests:post-build] Uploading to the NixCI cache: /nix/store/jwqknvc7h8pp528hm0anqj06w3ig9wja-gammaloop-nextest-binaries-python-api-gammaloop-integration-tests-0.1.0
102.85 s
[gammaloop-nextest-binaries-python-api-gammaloop-integration-tests:post-build] warning: 'warn-short-path-literals' is deprecated, use 'lint-short-path-literals = ignore' instead
102.86 s
[gammaloop-nextest-binaries-python-api-gammaloop-integration-tests:post-build] copying 1 paths...
102.86 s
[gammaloop-nextest-binaries-python-api-gammaloop-integration-tests:post-build] copying path '/nix/store/jwqknvc7h8pp528hm0anqj06w3ig9wja-gammaloop-nextest-binaries-python-api-gammaloop-integration-tests-0.1.0' to 'https://cache.nix-ci.com'...
112.35 s
[gammaloop-nextest-binaries-python-api-gammaloop-integration-tests:post-build] warning: 'warn-short-path-literals' is deprecated, use 'lint-short-path-literals = ignore' instead
112.71 s
[gammaloop-nextest-binaries-python-api-gammaloop-integration-tests:post-build] copying 1 paths...
112.71 s
[gammaloop-nextest-binaries-python-api-gammaloop-integration-tests:post-build] copying path '/nix/store/pg7gsk898kmp2l1jisfys1a3qmyr2ys2-gammaloop-nextest-binaries-python-api-gammaloop-integration-tests-0.1.0.drv' to 'https://cache.nix-ci.com'...
112.94 s
Uploaded gammaloop-nextest-binaries-python-api-gammaloop-integration-tests in 10.1s
112.94 s
Progress: 4 of 7 built, 18 of 18 downloaded from cache
112.94 s
Built gammaloop-nextest-binaries-python-api-gammaloop-integration-tests in 48.6s
112.97 s
Building /nix/store/myifr2fj0crizpcs27xad57a572zsigd-gammaloop-nextest-binaries-python-api.drv
113.01 s
[gammaloop-nextest-binaries-python-api:post-build] Uploading to the NixCI cache: /nix/store/6ppn2xb828z3vdrc7wvnba998bxllnjw-gammaloop-nextest-binaries-python-api
113.05 s
[gammaloop-nextest-binaries-python-api:post-build] warning: 'warn-short-path-literals' is deprecated, use 'lint-short-path-literals = ignore' instead
113.27 s
[gammaloop-nextest-binaries-python-api:post-build] copying 1 paths...
113.27 s
[gammaloop-nextest-binaries-python-api:post-build] copying path '/nix/store/6ppn2xb828z3vdrc7wvnba998bxllnjw-gammaloop-nextest-binaries-python-api' to 'https://cache.nix-ci.com'...
113.54 s
[gammaloop-nextest-binaries-python-api:post-build] warning: 'warn-short-path-literals' is deprecated, use 'lint-short-path-literals = ignore' instead
113.84 s
[gammaloop-nextest-binaries-python-api:post-build] copying 1 paths...
113.84 s
[gammaloop-nextest-binaries-python-api:post-build] copying path '/nix/store/myifr2fj0crizpcs27xad57a572zsigd-gammaloop-nextest-binaries-python-api.drv' to 'https://cache.nix-ci.com'...
114.06 s
Uploaded gammaloop-nextest-binaries-python-api in 1.0s
114.06 s
Progress: 5 of 7 built, 18 of 18 downloaded from cache
114.06 s
Built gammaloop-nextest-binaries-python-api in 1.0s
114.09 s
Building /nix/store/i7i77b8q8bd8g857bybxvz6ggwx6k47x-nix-ci-check-gammaloop-nextest-python-api.drv
114.16 s
[nix-ci-check-gammaloop-nextest-python-api:post-build] Uploading to the NixCI cache: /nix/store/7s5amkr08n15fm70v2g86sllxpvj3sdi-nix-ci-check-gammaloop-nextest-python-api
114.19 s
[nix-ci-check-gammaloop-nextest-python-api:post-build] warning: 'warn-short-path-literals' is deprecated, use 'lint-short-path-literals = ignore' instead
114.20 s
[nix-ci-check-gammaloop-nextest-python-api:post-build] copying 1 paths...
114.20 s
[nix-ci-check-gammaloop-nextest-python-api:post-build] copying path '/nix/store/7s5amkr08n15fm70v2g86sllxpvj3sdi-nix-ci-check-gammaloop-nextest-python-api' to 'https://cache.nix-ci.com'...
114.51 s
[nix-ci-check-gammaloop-nextest-python-api:post-build] warning: 'warn-short-path-literals' is deprecated, use 'lint-short-path-literals = ignore' instead
114.83 s
[nix-ci-check-gammaloop-nextest-python-api:post-build] copying 1 paths...
114.83 s
[nix-ci-check-gammaloop-nextest-python-api:post-build] copying path '/nix/store/i7i77b8q8bd8g857bybxvz6ggwx6k47x-nix-ci-check-gammaloop-nextest-python-api.drv' to 'https://cache.nix-ci.com'...
115.06 s
Uploaded nix-ci-check-gammaloop-nextest-python-api in 913ms
115.06 s
Progress: 6 of 7 built, 18 of 18 downloaded from cache
115.06 s
Built nix-ci-check-gammaloop-nextest-python-api in 962ms
115.06 s
Progress: 7 of 7 built, 18 of 18 downloaded from cache
115.32 s
evaluating derivation 'gevaluation warning: stdenv.isDarwin is deprecated, use stdenv.hostPlatform.isDarwin instead
121.28 s
copying '/nix/store/s78m
evaluating derivation 'g
copying '/nix/store/s78m
evaluating derivation 'g
copying '/nix/store/s78m
evaluating derivation 'g
copying '/nix/store/s78m
evaluating derivation 'g
copying '/nix/store/s78m
evaluating derivation 'g
copying '/nix/store/s78m
evaluating derivation 'g
copying '/nix/store/s78m
evaluating derivation 'g
querying gammaloop-nexte
[0 /1 built, 0.0 KiB DL]
[1 /0 /1 built, 0.0 KiB DLgammaloop-nextest-python-api> Extracting 3 binaries (including 2 non-test binaries), 1 build script output directory, and 3 linked paths to /build/nextest-archive-6DwWQb
121.50 s
gammaloop-nextest-python-api> Extracted 22 files to /build/nextest-archive-6DwWQb in 0.22s
121.50 s
gammaloop-nextest-python-api> ------------
121.50 s
gammaloop-nextest-python-api> Nextest run ID 6271bfc6-5333-4f41-8349-688cc5434175 with nextest profile: ci_gammaloop
121.50 s
gammaloop-nextest-python-api> Starting 5 tests across 1 binary
121.61 s
gammaloop-nextest-python-api> FAIL [ 0.104s] (1/5) gammaloop-integration-tests::test_python_api python_evaluate_sample_preserves_graph_grouping_and_incoming_pdgs
121.61 s
gammaloop-nextest-python-api> stdout ---
121.61 s
gammaloop-nextest-python-api>
121.61 s
gammaloop-nextest-python-api> running 1 test
121.61 s
gammaloop-nextest-python-api> test python_evaluate_sample_preserves_graph_grouping_and_incoming_pdgs ... FAILED
121.61 s
gammaloop-nextest-python-api>
121.61 s
gammaloop-nextest-python-api> failures:
121.61 s
gammaloop-nextest-python-api>
121.61 s
gammaloop-nextest-python-api> failures:
121.61 s
gammaloop-nextest-python-api> python_evaluate_sample_preserves_graph_grouping_and_incoming_pdgs
121.61 s
gammaloop-nextest-python-api>
121.61 s
gammaloop-nextest-python-api> test result: FAILED. 0 passed; 1 failed; 0 ignored; 0 measured; 4 filtered out; finished in 0.10s
121.61 s
gammaloop-nextest-python-api>
121.61 s
gammaloop-nextest-python-api> stderr ---
121.61 s
gammaloop-nextest-python-api> Error: Python API test subprocess failed.
121.61 s
gammaloop-nextest-python-api> stdout:
121.61 s
gammaloop-nextest-python-api> ┌────────────────────────────────────────────────────────┐
121.61 s
gammaloop-nextest-python-api> │ You are running a restricted Symbolica instance. │
121.61 s
gammaloop-nextest-python-api> │ │
121.61 s
gammaloop-nextest-python-api> │ This mode is only permitted for non-commercial use and │
121.61 s
gammaloop-nextest-python-api> │ is limited to one instance and core per machine. │
121.61 s
gammaloop-nextest-python-api> │ │
121.61 s
gammaloop-nextest-python-api> │ Hobbyists can easily acquire a free license key │
121.61 s
gammaloop-nextest-python-api> │ that unlocks all cores and removes this banner: │
121.61 s
gammaloop-nextest-python-api> │ │
121.61 s
gammaloop-nextest-python-api> │ from symbolica import * │
121.61 s
gammaloop-nextest-python-api> │ request_hobbyist_license('YOUR_NAME', 'YOUR_EMAIL') │
121.61 s
gammaloop-nextest-python-api> │ │
121.61 s
gammaloop-nextest-python-api> │ All other users can obtain a free 30-day trial key: │
121.61 s
gammaloop-nextest-python-api> │ │
121.61 s
gammaloop-nextest-python-api> │ from symbolica import * │
121.61 s
gammaloop-nextest-python-api> │ request_trial_license('NAME', 'EMAIL', 'EMPLOYER') │
121.61 s
gammaloop-nextest-python-api> │ │
121.61 s
gammaloop-nextest-python-api> │ See https://symbolica.io/docs/get_started.html#license │
121.61 s
gammaloop-nextest-python-api> └────────────────────────────────────────────────────────┘
121.61 s
gammaloop-nextest-python-api> ┌───────────────────────────────────────────────────────────────────────────────────────────────────────────┐
121.61 s
gammaloop-nextest-python-api> │ Cannot start new unlicensed Symbolica instance since there is already another one running on the machine. │
121.61 s
gammaloop-nextest-python-api> └───────────────────────────────────────────────────────────────────────────────────────────────────────────┘
121.61 s
gammaloop-nextest-python-api>
121.61 s
gammaloop-nextest-python-api> stderr:
121.61 s
gammaloop-nextest-python-api>
121.61 s
gammaloop-nextest-python-api> ┌───────────────────────────────────────────────────────────┐
121.61 s
gammaloop-nextest-python-api> │ Could not resolve the IP of the Symbolica license server. │
121.61 s
gammaloop-nextest-python-api> │ │
121.61 s
gammaloop-nextest-python-api> │ Please check your DNS configuration. │
121.61 s
gammaloop-nextest-python-api> └───────────────────────────────────────────────────────────┘
121.61 s
gammaloop-nextest-python-api> Error: failed to lookup address information: Temporary failure in name resolution
121.61 s
gammaloop-nextest-python-api>
121.61 s
gammaloop-nextest-python-api>
121.61 s
gammaloop-nextest-python-api> Location:
121.61 s
gammaloop-nextest-python-api> tests/tests/test_python_api.rs:156:20
121.61 s
gammaloop-nextest-python-api>
121.61 s
gammaloop-nextest-python-api> FAIL [ 0.109s] (2/5) gammaloop-integration-tests::test_python_api python_session_getters_return_live_toml_and_command_blocks
121.61 s
gammaloop-nextest-python-api> stdout ---
121.61 s
gammaloop-nextest-python-api>
121.61 s
gammaloop-nextest-python-api> running 1 test
121.61 s
gammaloop-nextest-python-api> test python_session_getters_return_live_toml_and_command_blocks ... FAILED
121.61 s
gammaloop-nextest-python-api>
121.61 s
gammaloop-nextest-python-api> failures:
121.61 s
gammaloop-nextest-python-api>
121.61 s
gammaloop-nextest-python-api> failures:
121.61 s
gammaloop-nextest-python-api> python_session_getters_return_live_toml_and_command_blocks
121.61 s
gammaloop-nextest-python-api>
121.61 s
gammaloop-nextest-python-api> test result: FAILED. 0 passed; 1 failed; 0 ignored; 0 measured; 4 filtered out; finished in 0.10s
121.61 s
gammaloop-nextest-python-api>
121.61 s
gammaloop-nextest-python-api> stderr ---
121.61 s
gammaloop-nextest-python-api> Error: Python API test subprocess failed.
121.61 s
gammaloop-nextest-python-api> stdout:
121.61 s
gammaloop-nextest-python-api> ┌────────────────────────────────────────────────────────┐
121.61 s
gammaloop-nextest-python-api> │ You are running a restricted Symbolica instance. │
121.61 s
gammaloop-nextest-python-api> │ │
121.61 s
gammaloop-nextest-python-api> │ This mode is only permitted for non-commercial use and │
121.61 s
gammaloop-nextest-python-api> │ is limited to one instance and core per machine. │
121.61 s
gammaloop-nextest-python-api> │ │
121.61 s
gammaloop-nextest-python-api> │ Hobbyists can easily acquire a free license key │
121.61 s
gammaloop-nextest-python-api> │ that unlocks all cores and removes this banner: │
121.61 s
gammaloop-nextest-python-api> │ │
121.61 s
gammaloop-nextest-python-api> │ from symbolica import * │
121.61 s
gammaloop-nextest-python-api> │ request_hobbyist_license('YOUR_NAME', 'YOUR_EMAIL') │
121.61 s
gammaloop-nextest-python-api> │ │
121.61 s
gammaloop-nextest-python-api> │ All other users can obtain a free 30-day trial key: │
121.61 s
gammaloop-nextest-python-api> │ │
121.61 s
gammaloop-nextest-python-api> │ from symbolica import * │
121.61 s
gammaloop-nextest-python-api> │ request_trial_license('NAME', 'EMAIL', 'EMPLOYER') │
121.61 s
gammaloop-nextest-python-api> │ │
121.61 s
gammaloop-nextest-python-api> │ See https://symbolica.io/docs/get_started.html#license │
121.61 s
gammaloop-nextest-python-api> └────────────────────────────────────────────────────────┘
121.61 s
gammaloop-nextest-python-api> ┌───────────────────────────────────────────────────────────────────────────────────────────────────────────┐
121.61 s
gammaloop-nextest-python-api> │ Cannot start new unlicensed Symbolica instance since there is already another one running on the machine. │
121.61 s
gammaloop-nextest-python-api> └───────────────────────────────────────────────────────────────────────────────────────────────────────────┘
121.61 s
gammaloop-nextest-python-api>
121.61 s
gammaloop-nextest-python-api> stderr:
121.61 s
gammaloop-nextest-python-api>
121.61 s
gammaloop-nextest-python-api> ┌───────────────────────────────────────────────────────────┐
121.61 s
gammaloop-nextest-python-api> │ Could not resolve the IP of the Symbolica license server. │
121.61 s
gammaloop-nextest-python-api> │ │
121.61 s
gammaloop-nextest-python-api> │ Please check your DNS configuration. │
121.61 s
gammaloop-nextest-python-api> └───────────────────────────────────────────────────────────┘
121.61 s
gammaloop-nextest-python-api> Error: failed to lookup address information: Temporary failure in name resolution
121.61 s
gammaloop-nextest-python-api>
121.61 s
gammaloop-nextest-python-api>
121.61 s
gammaloop-nextest-python-api> Location:
121.61 s
gammaloop-nextest-python-api> tests/tests/test_python_api.rs:156:20
121.61 s
gammaloop-nextest-python-api>
121.63 s
gammaloop-nextest-python-api> FAIL [ 0.125s] (3/5) gammaloop-integration-tests::test_python_api python_evaluate_samples_batch_and_momentum_space_have_expected_shape
121.63 s
gammaloop-nextest-python-api> stdout ---
121.63 s
gammaloop-nextest-python-api>
121.63 s
gammaloop-nextest-python-api> running 1 test
121.63 s
gammaloop-nextest-python-api> test python_evaluate_samples_batch_and_momentum_space_have_expected_shape ... FAILED
121.63 s
gammaloop-nextest-python-api>
121.63 s
gammaloop-nextest-python-api> failures:
121.63 s
gammaloop-nextest-python-api>
121.63 s
gammaloop-nextest-python-api> failures:
121.63 s
gammaloop-nextest-python-api> python_evaluate_samples_batch_and_momentum_space_have_expected_shape
121.63 s
gammaloop-nextest-python-api>
121.63 s
gammaloop-nextest-python-api> test result: FAILED. 0 passed; 1 failed; 0 ignored; 0 measured; 4 filtered out; finished in 0.12s
121.63 s
gammaloop-nextest-python-api>
121.63 s
gammaloop-nextest-python-api> stderr ---
121.63 s
gammaloop-nextest-python-api> Error: Python API test subprocess failed.
121.63 s
gammaloop-nextest-python-api> stdout:
121.63 s
gammaloop-nextest-python-api> ┌────────────────────────────────────────────────────────┐
121.63 s
gammaloop-nextest-python-api> │ You are running a restricted Symbolica instance. │
121.63 s
gammaloop-nextest-python-api> │ │
121.63 s
gammaloop-nextest-python-api> │ This mode is only permitted for non-commercial use and │
121.63 s
gammaloop-nextest-python-api> │ is limited to one instance and core per machine. │
121.63 s
gammaloop-nextest-python-api> │ │
121.63 s
gammaloop-nextest-python-api> │ Hobbyists can easily acquire a free license key │
121.63 s
gammaloop-nextest-python-api> │ that unlocks all cores and removes this banner: │
121.63 s
gammaloop-nextest-python-api> │ │
121.63 s
gammaloop-nextest-python-api> │ from symbolica import * │
121.63 s
gammaloop-nextest-python-api> │ request_hobbyist_license('YOUR_NAME', 'YOUR_EMAIL') │
121.63 s
gammaloop-nextest-python-api> │ │
121.63 s
gammaloop-nextest-python-api> │ All other users can obtain a free 30-day trial key: │
121.63 s
gammaloop-nextest-python-api> │ │
121.63 s
gammaloop-nextest-python-api> │ from symbolica import * │
121.63 s
gammaloop-nextest-python-api> │ request_trial_license('NAME', 'EMAIL', 'EMPLOYER') │
121.63 s
gammaloop-nextest-python-api> │ │
121.63 s
gammaloop-nextest-python-api> │ See https://symbolica.io/docs/get_started.html#license │
121.63 s
gammaloop-nextest-python-api> └────────────────────────────────────────────────────────┘
121.63 s
gammaloop-nextest-python-api> ┌───────────────────────────────────────────────────────────────────────────────────────────────────────────┐
121.63 s
gammaloop-nextest-python-api> │ Cannot start new unlicensed Symbolica instance since there is already another one running on the machine. │
121.63 s
gammaloop-nextest-python-api> └───────────────────────────────────────────────────────────────────────────────────────────────────────────┘
121.63 s
gammaloop-nextest-python-api>
121.63 s
gammaloop-nextest-python-api> stderr:
121.63 s
gammaloop-nextest-python-api>
121.63 s
gammaloop-nextest-python-api> ┌───────────────────────────────────────────────────────────┐
121.63 s
gammaloop-nextest-python-api> │ Could not resolve the IP of the Symbolica license server. │
121.63 s
gammaloop-nextest-python-api> │ │
121.63 s
gammaloop-nextest-python-api> │ Please check your DNS configuration. │
121.63 s
gammaloop-nextest-python-api> └───────────────────────────────────────────────────────────┘
121.63 s
gammaloop-nextest-python-api> Error: failed to lookup address information: Temporary failure in name resolution
121.63 s
gammaloop-nextest-python-api>
121.63 s
gammaloop-nextest-python-api>
121.63 s
gammaloop-nextest-python-api> Location:
121.63 s
gammaloop-nextest-python-api> tests/tests/test_python_api.rs:156:20
121.63 s
gammaloop-nextest-python-api>
121.71 s
gammaloop-nextest-python-api> FAIL [ 0.205s] (4/5) gammaloop-integration-tests::test_python_api python_evaluate_sample_honors_generate_events_and_observable_snapshots
121.71 s
gammaloop-nextest-python-api> stdout ---
121.71 s
gammaloop-nextest-python-api>
121.71 s
gammaloop-nextest-python-api> running 1 test
121.71 s
gammaloop-nextest-python-api> test python_evaluate_sample_honors_generate_events_and_observable_snapshots ... FAILED
121.71 s
gammaloop-nextest-python-api>
121.71 s
gammaloop-nextest-python-api> failures:
121.71 s
gammaloop-nextest-python-api>
121.71 s
gammaloop-nextest-python-api> failures:
121.71 s
gammaloop-nextest-python-api> python_evaluate_sample_honors_generate_events_and_observable_snapshots
121.71 s
gammaloop-nextest-python-api>
121.71 s
gammaloop-nextest-python-api> test result: FAILED. 0 passed; 1 failed; 0 ignored; 0 measured; 4 filtered out; finished in 0.20s
121.71 s
gammaloop-nextest-python-api>
121.71 s
gammaloop-nextest-python-api> stderr ---
121.71 s
gammaloop-nextest-python-api> Error: Python API test subprocess failed.
121.71 s
gammaloop-nextest-python-api> stdout:
121.71 s
gammaloop-nextest-python-api> ┌────────────────────────────────────────────────────────┐
121.71 s
gammaloop-nextest-python-api> │ You are running a restricted Symbolica instance. │
121.71 s
gammaloop-nextest-python-api> │ │
121.71 s
gammaloop-nextest-python-api> │ This mode is only permitted for non-commercial use and │
121.71 s
gammaloop-nextest-python-api> │ is limited to one instance and core per machine. │
121.71 s
gammaloop-nextest-python-api> │ │
121.71 s
gammaloop-nextest-python-api> │ Hobbyists can easily acquire a free license key │
121.71 s
gammaloop-nextest-python-api> │ that unlocks all cores and removes this banner: │
121.71 s
gammaloop-nextest-python-api> │ │
121.71 s
gammaloop-nextest-python-api> │ from symbolica import * │
121.71 s
gammaloop-nextest-python-api> │ request_hobbyist_license('YOUR_NAME', 'YOUR_EMAIL') │
121.71 s
gammaloop-nextest-python-api> │ │
121.71 s
gammaloop-nextest-python-api> │ All other users can obtain a free 30-day trial key: │
121.71 s
gammaloop-nextest-python-api> │ │
121.71 s
gammaloop-nextest-python-api> │ from symbolica import * │
121.71 s
gammaloop-nextest-python-api> │ request_trial_license('NAME', 'EMAIL', 'EMPLOYER') │
121.71 s
gammaloop-nextest-python-api> │ │
121.71 s
gammaloop-nextest-python-api> │ See https://symbolica.io/docs/get_started.html#license │
121.71 s
gammaloop-nextest-python-api> └────────────────────────────────────────────────────────┘
121.71 s
gammaloop-nextest-python-api> ┌───────────────────────────────────────────────────────────────────────────────────────────────────────────┐
121.71 s
gammaloop-nextest-python-api> │ Cannot start new unlicensed Symbolica instance since there is already another one running on the machine. │
121.71 s
gammaloop-nextest-python-api> └───────────────────────────────────────────────────────────────────────────────────────────────────────────┘
121.71 s
gammaloop-nextest-python-api>
121.71 s
gammaloop-nextest-python-api> stderr:
121.71 s
gammaloop-nextest-python-api>
121.71 s
gammaloop-nextest-python-api> ┌───────────────────────────────────────────────────────────┐
121.71 s
gammaloop-nextest-python-api> │ Could not resolve the IP of the Symbolica license server. │
121.71 s
gammaloop-nextest-python-api> │ │
121.71 s
gammaloop-nextest-python-api> │ Please check your DNS configuration. │
121.71 s
gammaloop-nextest-python-api> └───────────────────────────────────────────────────────────┘
121.71 s
gammaloop-nextest-python-api> Error: failed to lookup address information: Temporary failure in name resolution
121.71 s
gammaloop-nextest-python-api> [2026-09-03 15:33:22.333] @gammaloop_api::se... INFO : Running command import model sm-default
121.71 s
gammaloop-nextest-python-api> [2026-09-03 15:33:22.333] @import::model INFO : Loading built-in JSON model sm-default
121.71 s
gammaloop-nextest-python-api> [2026-09-03 15:33:22.364] @gammalooprs::model INFO : The following 11 external parameters were forced to zero by the restriction card:
121.71 s
gammaloop-nextest-python-api> lamWS, AWS, rhoWS, etaWS, ymc, yme, ymm, MC, Me, MM, WTau
121.71 s
gammaloop-nextest-python-api> [2026-09-03 15:33:22.364] @gammalooprs::model INFO : The following 34 vertex rules were removed by the restriction card:
121.71 s
gammaloop-nextest-python-api> V_82 -> (c~, d, G+) | V_83 -> (t~, d, G+) | V_84 -> (c~, s, G+) | V_85 -> (t~, s, G+) | V_86 -> (u~, b, G+) | V_87 -> (c~, b, G+) | V_90 -> (c~, d, W+) | V_91 -> (t~, d, W+) | V_92 -> (u~, s, W+) | V_94 -> (t~, s, W+) | V_95 -> (u~, b, W+) | V_96 -> (c~, b, W+) | V_101 -> (e+, e-, G0) | V_102 -> (mu+, mu-, G0) | V_104 -> (e+, e-, H) | V_105 -> (mu+, mu-, H) | V_110 -> (ve~, e-, G+) | V_111 -> (vm~, mu-, G+) | V_116 -> (b~, u, G-) | V_117 -> (d~, c, G-) | V_118 -> (s~, c, G-) | V_119 -> (b~, c, G-) | V_120 -> (d~, t, G-) | V_121 -> (s~, t, G-) | V_124 -> (s~, u, W-) | V_125 -> (b~, u, W-) | V_126 -> (d~, c, W-) | V_128 -> (b~, c, W-) | V_129 -> (d~, t, W-) | V_130 -> (s~, t, W-) | V_138 -> (c~, c, G0) | V_140 -> (c~, c, H) | V_145 -> (e+, ve, G-) | V_146 -> (mu+, vm, G-)
121.71 s
gammaloop-nextest-python-api> [2026-09-03 15:33:22.364] @gammalooprs::model INFO : The following 36 couplings were removed by the restriction card:
121.71 s
gammaloop-nextest-python-api> GC_13, GC_14, GC_16, GC_17, GC_18, GC_19, GC_20, GC_22, GC_23, GC_24, GC_25, GC_26, GC_28, GC_29, GC_42, GC_43, GC_44, GC_46, GC_47, GC_48, GC_84, GC_85, GC_86, GC_87, GC_88, GC_89, GC_90, GC_91, GC_92, GC_93, GC_101, GC_102, GC_103, GC_105, GC_106, GC_107
121.71 s
gammaloop-nextest-python-api> [2026-09-03 15:33:22.364] @gammaloop_api::se... INFO : Running command set default-runtime kv kinematics.externals='{"type":"constant","data":{"momenta":[[32.0,0.0,0.0,32.0],[32.0,0.0,0.0,-32.0]],"helicities":[1,1]}}'
121.71 s
gammaloop-nextest-python-api> [2026-09-03 15:33:22.365] @gammaloop_api::se... INFO : Running command set default-runtime kv subtraction.disable_threshold_subtraction=true
121.71 s
gammaloop-nextest-python-api> [2026-09-03 15:33:22.366] @gammaloop_api::se... INFO : Running command generate xs e+ e- > d d~ g | e- a d g QED^2==4 [{{2}} QCD=0] --numerator-grouping group_identical_graphs_up_to_sign --clear-existing-processes --only-diagrams
121.71 s
gammaloop-nextest-python-api> [2026-09-03 15:33:22.368] @feyngen::diagram_... INFO : 0s | Δ=0s | Starting Feynman graph generation with Symbolica...
121.71 s
gammaloop-nextest-python-api> [2026-09-03 15:33:22.370] @feyngen::diagram_... INFO : 0s | Δ=0s | Number of graphs resulting from Symbolica generation: 246
121.71 s
gammaloop-nextest-python-api> [2026-09-03 15:33:22.370] @feyngen::diagram_... INFO : 0s | Δ=0s | Number of graphs retained after enforcing supergraph particle content: 8
121.71 s
gammaloop-nextest-python-api> [2026-09-03 15:33:22.370] @feyngen::diagram_... INFO : 0s | Δ=0s | Number of graphs retained after removal of vetoed topologies: 8
121.71 s
gammaloop-nextest-python-api> [2026-09-03 15:33:22.371] @feyngen::diagram_... INFO : 0s | Δ=0s | Number of graphs after vertex info assignment: 8
121.71 s
gammaloop-nextest-python-api> [2026-09-03 15:33:22.371] @feyngen::diagram_... INFO : 0s | Δ=0s | Number of graphs after all complete graphs filters are applied: 8
121.71 s
gammaloop-nextest-python-api>
121.71 s
gammaloop-nextest-python-api>
121.71 s
gammaloop-nextest-python-api> Location:
121.71 s
gammaloop-nextest-python-api> tests/tests/test_python_api.rs:156:20
121.71 s
gammaloop-nextest-python-api>
121.72 s
gammaloop-nextest-python-api> FAIL [ 0.219s] (5/5) gammaloop-integration-tests::test_python_api python_settings_wrappers_expose_nested_runtime_and_global_settings
121.72 s
gammaloop-nextest-python-api> stdout ---
121.72 s
gammaloop-nextest-python-api>
121.72 s
gammaloop-nextest-python-api> running 1 test
121.72 s
gammaloop-nextest-python-api> test python_settings_wrappers_expose_nested_runtime_and_global_settings ... FAILED
121.72 s
gammaloop-nextest-python-api>
121.72 s
gammaloop-nextest-python-api> failures:
121.72 s
gammaloop-nextest-python-api>
121.72 s
gammaloop-nextest-python-api> failures:
121.72 s
gammaloop-nextest-python-api> python_settings_wrappers_expose_nested_runtime_and_global_settings
121.72 s
gammaloop-nextest-python-api>
121.72 s
gammaloop-nextest-python-api> test result: FAILED. 0 passed; 1 failed; 0 ignored; 0 measured; 4 filtered out; finished in 0.22s
121.72 s
gammaloop-nextest-python-api>
121.72 s
gammaloop-nextest-python-api> stderr ---
121.72 s
gammaloop-nextest-python-api> Error: Python API test subprocess failed.
121.72 s
gammaloop-nextest-python-api> stdout:
121.72 s
gammaloop-nextest-python-api> ┌────────────────────────────────────────────────────────┐
121.72 s
gammaloop-nextest-python-api> │ You are running a restricted Symbolica instance. │
121.72 s
gammaloop-nextest-python-api> │ │
121.72 s
gammaloop-nextest-python-api> │ This mode is only permitted for non-commercial use and │
121.72 s
gammaloop-nextest-python-api> │ is limited to one instance and core per machine. │
121.72 s
gammaloop-nextest-python-api> │ │
121.72 s
gammaloop-nextest-python-api> │ Hobbyists can easily acquire a free license key │
121.72 s
gammaloop-nextest-python-api> │ that unlocks all cores and removes this banner: │
121.72 s
gammaloop-nextest-python-api> │ │
121.72 s
gammaloop-nextest-python-api> │ from symbolica import * │
121.72 s
gammaloop-nextest-python-api> │ request_hobbyist_license('YOUR_NAME', 'YOUR_EMAIL') │
121.72 s
gammaloop-nextest-python-api> │ │
121.72 s
gammaloop-nextest-python-api> │ All other users can obtain a free 30-day trial key: │
121.72 s
gammaloop-nextest-python-api> │ │
121.72 s
gammaloop-nextest-python-api> │ from symbolica import * │
121.72 s
gammaloop-nextest-python-api> │ request_trial_license('NAME', 'EMAIL', 'EMPLOYER') │
121.72 s
gammaloop-nextest-python-api> │ │
121.72 s
gammaloop-nextest-python-api> │ See https://symbolica.io/docs/get_started.html#license │
121.72 s
gammaloop-nextest-python-api> └────────────────────────────────────────────────────────┘
121.72 s
gammaloop-nextest-python-api> ┌───────────────────────────────────────────────────────────────────────────────────────────────────────────┐
121.72 s
gammaloop-nextest-python-api> │ Cannot start new unlicensed Symbolica instance since there is already another one running on the machine. │
121.72 s
gammaloop-nextest-python-api> └───────────────────────────────────────────────────────────────────────────────────────────────────────────┘
121.72 s
gammaloop-nextest-python-api>
121.72 s
gammaloop-nextest-python-api> stderr:
121.72 s
gammaloop-nextest-python-api>
121.72 s
gammaloop-nextest-python-api> ┌───────────────────────────────────────────────────────────┐
121.72 s
gammaloop-nextest-python-api> │ Could not resolve the IP of the Symbolica license server. │
121.72 s
gammaloop-nextest-python-api> │ │
121.72 s
gammaloop-nextest-python-api> │ Please check your DNS configuration. │
121.72 s
gammaloop-nextest-python-api> └───────────────────────────────────────────────────────────┘
121.72 s
gammaloop-nextest-python-api> Error: failed to lookup address information: Temporary failure in name resolution
121.72 s
gammaloop-nextest-python-api>
121.72 s
gammaloop-nextest-python-api>
121.72 s
gammaloop-nextest-python-api> Location:
121.72 s
gammaloop-nextest-python-api> tests/tests/test_python_api.rs:156:20
121.72 s
gammaloop-nextest-python-api>
121.72 s
gammaloop-nextest-python-api> ------------
121.72 s
gammaloop-nextest-python-api> Summary [ 0.219s] 5 tests run: 0 passed , 5 failed , 0 skipped
121.72 s
gammaloop-nextest-python-api> FAIL [ 0.104s] (1/5) gammaloop-integration-tests::test_python_api python_evaluate_sample_preserves_graph_grouping_and_incoming_pdgs
121.72 s
gammaloop-nextest-python-api> stdout ---
121.72 s
gammaloop-nextest-python-api>
121.72 s
gammaloop-nextest-python-api> running 1 test
121.72 s
gammaloop-nextest-python-api> test python_evaluate_sample_preserves_graph_grouping_and_incoming_pdgs ... FAILED
121.72 s
gammaloop-nextest-python-api>
121.72 s
gammaloop-nextest-python-api> failures:
121.72 s
gammaloop-nextest-python-api>
121.72 s
gammaloop-nextest-python-api> failures:
121.72 s
gammaloop-nextest-python-api> python_evaluate_sample_preserves_graph_grouping_and_incoming_pdgs
121.72 s
gammaloop-nextest-python-api>
121.72 s
gammaloop-nextest-python-api> test result: FAILED. 0 passed; 1 failed; 0 ignored; 0 measured; 4 filtered out; finished in 0.10s
121.72 s
gammaloop-nextest-python-api>
121.72 s
gammaloop-nextest-python-api> stderr ---
121.72 s
gammaloop-nextest-python-api> Error: Python API test subprocess failed.
121.72 s
gammaloop-nextest-python-api> stdout:
121.72 s
gammaloop-nextest-python-api> ┌────────────────────────────────────────────────────────┐
121.72 s
gammaloop-nextest-python-api> │ You are running a restricted Symbolica instance. │
121.72 s
gammaloop-nextest-python-api> │ │
121.72 s
gammaloop-nextest-python-api> │ This mode is only permitted for non-commercial use and │
121.72 s
gammaloop-nextest-python-api> │ is limited to one instance and core per machine. │
121.72 s
gammaloop-nextest-python-api> │ │
121.72 s
gammaloop-nextest-python-api> │ Hobbyists can easily acquire a free license key │
121.72 s
gammaloop-nextest-python-api> │ that unlocks all cores and removes this banner: │
121.72 s
gammaloop-nextest-python-api> │ │
121.72 s
gammaloop-nextest-python-api> │ from symbolica import * │
121.72 s
gammaloop-nextest-python-api> │ request_hobbyist_license('YOUR_NAME', 'YOUR_EMAIL') │
121.72 s
gammaloop-nextest-python-api> │ │
121.72 s
gammaloop-nextest-python-api> │ All other users can obtain a free 30-day trial key: │
121.72 s
gammaloop-nextest-python-api> │ │
121.73 s
gammaloop-nextest-python-api> │ from symbolica import * │
121.73 s
gammaloop-nextest-python-api> │ request_trial_license('NAME', 'EMAIL', 'EMPLOYER') │
121.73 s
gammaloop-nextest-python-api> │ │
121.73 s
gammaloop-nextest-python-api> │ See https://symbolica.io/docs/get_started.html#license │
121.73 s
gammaloop-nextest-python-api> └────────────────────────────────────────────────────────┘
121.73 s
gammaloop-nextest-python-api> ┌───────────────────────────────────────────────────────────────────────────────────────────────────────────┐
121.73 s
gammaloop-nextest-python-api> │ Cannot start new unlicensed Symbolica instance since there is already another one running on the machine. │
121.73 s
gammaloop-nextest-python-api> └───────────────────────────────────────────────────────────────────────────────────────────────────────────┘
121.73 s
gammaloop-nextest-python-api>
121.73 s
gammaloop-nextest-python-api> stderr:
121.73 s
gammaloop-nextest-python-api>
121.73 s
gammaloop-nextest-python-api> ┌───────────────────────────────────────────────────────────┐
121.73 s
gammaloop-nextest-python-api> │ Could not resolve the IP of the Symbolica license server. │
121.73 s
gammaloop-nextest-python-api> │ │
121.73 s
gammaloop-nextest-python-api> │ Please check your DNS configuration. │
121.73 s
gammaloop-nextest-python-api> └───────────────────────────────────────────────────────────┘
121.73 s
gammaloop-nextest-python-api> Error: failed to lookup address information: Temporary failure in name resolution
121.73 s
gammaloop-nextest-python-api>
121.73 s
gammaloop-nextest-python-api>
121.73 s
gammaloop-nextest-python-api> Location:
121.73 s
gammaloop-nextest-python-api> tests/tests/test_python_api.rs:156:20
121.73 s
gammaloop-nextest-python-api>
121.73 s
gammaloop-nextest-python-api> FAIL [ 0.109s] (2/5) gammaloop-integration-tests::test_python_api python_session_getters_return_live_toml_and_command_blocks
121.73 s
gammaloop-nextest-python-api> stdout ---
121.73 s
gammaloop-nextest-python-api>
121.73 s
gammaloop-nextest-python-api> running 1 test
121.73 s
gammaloop-nextest-python-api> test python_session_getters_return_live_toml_and_command_blocks ... FAILED
121.73 s
gammaloop-nextest-python-api>
121.73 s
gammaloop-nextest-python-api> failures:
121.73 s
gammaloop-nextest-python-api>
121.73 s
gammaloop-nextest-python-api> failures:
121.73 s
gammaloop-nextest-python-api> python_session_getters_return_live_toml_and_command_blocks
121.73 s
gammaloop-nextest-python-api>
121.73 s
gammaloop-nextest-python-api> test result: FAILED. 0 passed; 1 failed; 0 ignored; 0 measured; 4 filtered out; finished in 0.10s
121.73 s
gammaloop-nextest-python-api>
121.73 s
gammaloop-nextest-python-api> stderr ---
121.73 s
gammaloop-nextest-python-api> Error: Python API test subprocess failed.
121.73 s
gammaloop-nextest-python-api> stdout:
121.73 s
gammaloop-nextest-python-api> ┌────────────────────────────────────────────────────────┐
121.73 s
gammaloop-nextest-python-api> │ You are running a restricted Symbolica instance. │
121.73 s
gammaloop-nextest-python-api> │ │
121.73 s
gammaloop-nextest-python-api> │ This mode is only permitted for non-commercial use and │
121.73 s
gammaloop-nextest-python-api> │ is limited to one instance and core per machine. │
121.73 s
gammaloop-nextest-python-api> │ │
121.73 s
gammaloop-nextest-python-api> │ Hobbyists can easily acquire a free license key │
121.73 s
gammaloop-nextest-python-api> │ that unlocks all cores and removes this banner: │
121.73 s
gammaloop-nextest-python-api> │ │
121.73 s
gammaloop-nextest-python-api> │ from symbolica import * │
121.73 s
gammaloop-nextest-python-api> │ request_hobbyist_license('YOUR_NAME', 'YOUR_EMAIL') │
121.73 s
gammaloop-nextest-python-api> │ │
121.73 s
gammaloop-nextest-python-api> │ All other users can obtain a free 30-day trial key: │
121.73 s
gammaloop-nextest-python-api> │ │
121.73 s
gammaloop-nextest-python-api> │ from symbolica import * │
121.73 s
gammaloop-nextest-python-api> │ request_trial_license('NAME', 'EMAIL', 'EMPLOYER') │
121.73 s
gammaloop-nextest-python-api> │ │
121.73 s
gammaloop-nextest-python-api> │ See https://symbolica.io/docs/get_started.html#license │
121.73 s
gammaloop-nextest-python-api> └────────────────────────────────────────────────────────┘
121.73 s
gammaloop-nextest-python-api> ┌───────────────────────────────────────────────────────────────────────────────────────────────────────────┐
121.73 s
gammaloop-nextest-python-api> │ Cannot start new unlicensed Symbolica instance since there is already another one running on the machine. │
121.73 s
gammaloop-nextest-python-api> └───────────────────────────────────────────────────────────────────────────────────────────────────────────┘
121.73 s
gammaloop-nextest-python-api>
121.73 s
gammaloop-nextest-python-api> stderr:
121.73 s
gammaloop-nextest-python-api>
121.73 s
gammaloop-nextest-python-api> ┌───────────────────────────────────────────────────────────┐
121.73 s
gammaloop-nextest-python-api> │ Could not resolve the IP of the Symbolica license server. │
121.73 s
gammaloop-nextest-python-api> │ │
121.73 s
gammaloop-nextest-python-api> │ Please check your DNS configuration. │
121.73 s
gammaloop-nextest-python-api> └───────────────────────────────────────────────────────────┘
121.73 s
gammaloop-nextest-python-api> Error: failed to lookup address information: Temporary failure in name resolution
121.73 s
gammaloop-nextest-python-api>
121.73 s
gammaloop-nextest-python-api>
121.73 s
gammaloop-nextest-python-api> Location:
121.73 s
gammaloop-nextest-python-api> tests/tests/test_python_api.rs:156:20
121.73 s
gammaloop-nextest-python-api>
121.73 s
gammaloop-nextest-python-api> FAIL [ 0.125s] (3/5) gammaloop-integration-tests::test_python_api python_evaluate_samples_batch_and_momentum_space_have_expected_shape
121.73 s
gammaloop-nextest-python-api> stdout ---
121.73 s
gammaloop-nextest-python-api>
121.73 s
gammaloop-nextest-python-api> running 1 test
121.73 s
gammaloop-nextest-python-api> test python_evaluate_samples_batch_and_momentum_space_have_expected_shape ... FAILED
121.73 s
gammaloop-nextest-python-api>
121.73 s
gammaloop-nextest-python-api> failures:
121.73 s
gammaloop-nextest-python-api>
121.73 s
gammaloop-nextest-python-api> failures:
121.73 s
gammaloop-nextest-python-api> python_evaluate_samples_batch_and_momentum_space_have_expected_shape
121.73 s
gammaloop-nextest-python-api>
121.73 s
gammaloop-nextest-python-api> test result: FAILED. 0 passed; 1 failed; 0 ignored; 0 measured; 4 filtered out; finished in 0.12s
121.73 s
gammaloop-nextest-python-api>
121.73 s
gammaloop-nextest-python-api> stderr ---
121.73 s
gammaloop-nextest-python-api> Error: Python API test subprocess failed.
121.73 s
gammaloop-nextest-python-api> stdout:
121.73 s
gammaloop-nextest-python-api> ┌────────────────────────────────────────────────────────┐
121.73 s
gammaloop-nextest-python-api> │ You are running a restricted Symbolica instance. │
121.73 s
gammaloop-nextest-python-api> │ │
121.73 s
gammaloop-nextest-python-api> │ This mode is only permitted for non-commercial use and │
121.73 s
gammaloop-nextest-python-api> │ is limited to one instance and core per machine. │
121.73 s
gammaloop-nextest-python-api> │ │
121.73 s
gammaloop-nextest-python-api> │ Hobbyists can easily acquire a free license key │
121.73 s
gammaloop-nextest-python-api> │ that unlocks all cores and removes this banner: │
121.73 s
gammaloop-nextest-python-api> │ │
121.73 s
gammaloop-nextest-python-api> │ from symbolica import * │
121.73 s
gammaloop-nextest-python-api> │ request_hobbyist_license('YOUR_NAME', 'YOUR_EMAIL') │
121.73 s
gammaloop-nextest-python-api> │ │
121.73 s
gammaloop-nextest-python-api> │ All other users can obtain a free 30-day trial key: │
121.73 s
gammaloop-nextest-python-api> │ │
121.73 s
gammaloop-nextest-python-api> │ from symbolica import * │
121.73 s
gammaloop-nextest-python-api> │ request_trial_license('NAME', 'EMAIL', 'EMPLOYER') │
121.73 s
gammaloop-nextest-python-api> │ │
121.73 s
gammaloop-nextest-python-api> │ See https://symbolica.io/docs/get_started.html#license │
121.73 s
gammaloop-nextest-python-api> └────────────────────────────────────────────────────────┘
121.73 s
gammaloop-nextest-python-api> ┌───────────────────────────────────────────────────────────────────────────────────────────────────────────┐
121.73 s
gammaloop-nextest-python-api> │ Cannot start new unlicensed Symbolica instance since there is already another one running on the machine. │
121.73 s
gammaloop-nextest-python-api> └───────────────────────────────────────────────────────────────────────────────────────────────────────────┘
121.73 s
gammaloop-nextest-python-api>
121.73 s
gammaloop-nextest-python-api> stderr:
121.73 s
gammaloop-nextest-python-api>
121.73 s
gammaloop-nextest-python-api> ┌───────────────────────────────────────────────────────────┐
121.73 s
gammaloop-nextest-python-api> │ Could not resolve the IP of the Symbolica license server. │
121.73 s
gammaloop-nextest-python-api> │ │
121.73 s
gammaloop-nextest-python-api> │ Please check your DNS configuration. │
121.73 s
gammaloop-nextest-python-api> └───────────────────────────────────────────────────────────┘
121.73 s
gammaloop-nextest-python-api> Error: failed to lookup address information: Temporary failure in name resolution
121.73 s
gammaloop-nextest-python-api>
121.73 s
gammaloop-nextest-python-api>
121.73 s
gammaloop-nextest-python-api> Location:
121.73 s
gammaloop-nextest-python-api> tests/tests/test_python_api.rs:156:20
121.73 s
gammaloop-nextest-python-api>
121.73 s
gammaloop-nextest-python-api> FAIL [ 0.205s] (4/5) gammaloop-integration-tests::test_python_api python_evaluate_sample_honors_generate_events_and_observable_snapshots
121.73 s
gammaloop-nextest-python-api> stdout ---
121.73 s
gammaloop-nextest-python-api>
121.73 s
gammaloop-nextest-python-api> running 1 test
121.73 s
gammaloop-nextest-python-api> test python_evaluate_sample_honors_generate_events_and_observable_snapshots ... FAILED
121.73 s
gammaloop-nextest-python-api>
121.73 s
gammaloop-nextest-python-api> failures:
121.73 s
gammaloop-nextest-python-api>
121.73 s
gammaloop-nextest-python-api> failures:
121.73 s
gammaloop-nextest-python-api> python_evaluate_sample_honors_generate_events_and_observable_snapshots
121.73 s
gammaloop-nextest-python-api>
121.73 s
gammaloop-nextest-python-api> test result: FAILED. 0 passed; 1 failed; 0 ignored; 0 measured; 4 filtered out; finished in 0.20s
121.73 s
gammaloop-nextest-python-api>
121.73 s
gammaloop-nextest-python-api> stderr ---
121.73 s
gammaloop-nextest-python-api> Error: Python API test subprocess failed.
121.73 s
gammaloop-nextest-python-api> stdout:
121.73 s
gammaloop-nextest-python-api> ┌────────────────────────────────────────────────────────┐
121.73 s
gammaloop-nextest-python-api> │ You are running a restricted Symbolica instance. │
121.73 s
gammaloop-nextest-python-api> │ │
121.73 s
gammaloop-nextest-python-api> │ This mode is only permitted for non-commercial use and │
121.73 s
gammaloop-nextest-python-api> │ is limited to one instance and core per machine. │
121.73 s
gammaloop-nextest-python-api> │ │
121.73 s
gammaloop-nextest-python-api> │ Hobbyists can easily acquire a free license key │
121.73 s
gammaloop-nextest-python-api> │ that unlocks all cores and removes this banner: │
121.73 s
gammaloop-nextest-python-api> │ │
121.73 s
gammaloop-nextest-python-api> │ from symbolica import * │
121.73 s
gammaloop-nextest-python-api> │ request_hobbyist_license('YOUR_NAME', 'YOUR_EMAIL') │
121.73 s
gammaloop-nextest-python-api> │ │
121.73 s
gammaloop-nextest-python-api> │ All other users can obtain a free 30-day trial key: │
121.73 s
gammaloop-nextest-python-api> │ │
121.73 s
gammaloop-nextest-python-api> │ from symbolica import * │
121.73 s
gammaloop-nextest-python-api> │ request_trial_license('NAME', 'EMAIL', 'EMPLOYER') │
121.73 s
gammaloop-nextest-python-api> │ │
121.73 s
gammaloop-nextest-python-api> │ See https://symbolica.io/docs/get_started.html#license │
121.73 s
gammaloop-nextest-python-api> └────────────────────────────────────────────────────────┘
121.73 s
gammaloop-nextest-python-api> ┌───────────────────────────────────────────────────────────────────────────────────────────────────────────┐
121.73 s
gammaloop-nextest-python-api> │ Cannot start new unlicensed Symbolica instance since there is already another one running on the machine. │
121.73 s
gammaloop-nextest-python-api> └───────────────────────────────────────────────────────────────────────────────────────────────────────────┘
121.73 s
gammaloop-nextest-python-api>
121.73 s
gammaloop-nextest-python-api> stderr:
121.73 s
gammaloop-nextest-python-api>
121.73 s
gammaloop-nextest-python-api> ┌───────────────────────────────────────────────────────────┐
121.73 s
gammaloop-nextest-python-api> │ Could not resolve the IP of the Symbolica license server. │
121.73 s
gammaloop-nextest-python-api> │ │
121.73 s
gammaloop-nextest-python-api> │ Please check your DNS configuration. │
121.73 s
gammaloop-nextest-python-api> └───────────────────────────────────────────────────────────┘
121.73 s
gammaloop-nextest-python-api> Error: failed to lookup address information: Temporary failure in name resolution
121.73 s
gammaloop-nextest-python-api> [2026-09-03 15:33:22.333] @gammaloop_api::se... INFO : Running command import model sm-default
121.73 s
gammaloop-nextest-python-api> [2026-09-03 15:33:22.333] @import::model INFO : Loading built-in JSON model sm-default
121.73 s
gammaloop-nextest-python-api> [2026-09-03 15:33:22.364] @gammalooprs::model INFO : The following 11 external parameters were forced to zero by the restriction card:
121.73 s
gammaloop-nextest-python-api> lamWS, AWS, rhoWS, etaWS, ymc, yme, ymm, MC, Me, MM, WTau
121.73 s
gammaloop-nextest-python-api> [2026-09-03 15:33:22.364] @gammalooprs::model INFO : The following 34 vertex rules were removed by the restriction card:
121.73 s
gammaloop-nextest-python-api> V_82 -> (c~, d, G+) | V_83 -> (t~, d, G+) | V_84 -> (c~, s, G+) | V_85 -> (t~, s, G+) | V_86 -> (u~, b, G+) | V_87 -> (c~, b, G+) | V_90 -> (c~, d, W+) | V_91 -> (t~, d, W+) | V_92 -> (u~, s, W+) | V_94 -> (t~, s, W+) | V_95 -> (u~, b, W+) | V_96 -> (c~, b, W+) | V_101 -> (e+, e-, G0) | V_102 -> (mu+, mu-, G0) | V_104 -> (e+, e-, H) | V_105 -> (mu+, mu-, H) | V_110 -> (ve~, e-, G+) | V_111 -> (vm~, mu-, G+) | V_116 -> (b~, u, G-) | V_117 -> (d~, c, G-) | V_118 -> (s~, c, G-) | V_119 -> (b~, c, G-) | V_120 -> (d~, t, G-) | V_121 -> (s~, t, G-) | V_124 -> (s~, u, W-) | V_125 -> (b~, u, W-) | V_126 -> (d~, c, W-) | V_128 -> (b~, c, W-) | V_129 -> (d~, t, W-) | V_130 -> (s~, t, W-) | V_138 -> (c~, c, G0) | V_140 -> (c~, c, H) | V_145 -> (e+, ve, G-) | V_146 -> (mu+, vm, G-)
121.73 s
gammaloop-nextest-python-api> [2026-09-03 15:33:22.364] @gammalooprs::model INFO : The following 36 couplings were removed by the restriction card:
121.73 s
gammaloop-nextest-python-api> GC_13, GC_14, GC_16, GC_17, GC_18, GC_19, GC_20, GC_22, GC_23, GC_24, GC_25, GC_26, GC_28, GC_29, GC_42, GC_43, GC_44, GC_46, GC_47, GC_48, GC_84, GC_85, GC_86, GC_87, GC_88, GC_89, GC_90, GC_91, GC_92, GC_93, GC_101, GC_102, GC_103, GC_105, GC_106, GC_107
121.73 s
gammaloop-nextest-python-api> [2026-09-03 15:33:22.364] @gammaloop_api::se... INFO : Running command set default-runtime kv kinematics.externals='{"type":"constant","data":{"momenta":[[32.0,0.0,0.0,32.0],[32.0,0.0,0.0,-32.0]],"helicities":[1,1]}}'
121.73 s
gammaloop-nextest-python-api> [2026-09-03 15:33:22.365] @gammaloop_api::se... INFO : Running command set default-runtime kv subtraction.disable_threshold_subtraction=true
121.73 s
gammaloop-nextest-python-api> [2026-09-03 15:33:22.366] @gammaloop_api::se... INFO : Running command generate xs e+ e- > d d~ g | e- a d g QED^2==4 [{{2}} QCD=0] --numerator-grouping group_identical_graphs_up_to_sign --clear-existing-processes --only-diagrams
121.73 s
gammaloop-nextest-python-api> [2026-09-03 15:33:22.368] @feyngen::diagram_... INFO : 0s | Δ=0s | Starting Feynman graph generation with Symbolica...
121.73 s
gammaloop-nextest-python-api> [2026-09-03 15:33:22.370] @feyngen::diagram_... INFO : 0s | Δ=0s | Number of graphs resulting from Symbolica generation: 246
121.73 s
gammaloop-nextest-python-api> [2026-09-03 15:33:22.370] @feyngen::diagram_... INFO : 0s | Δ=0s | Number of graphs retained after enforcing supergraph particle content: 8
121.73 s
gammaloop-nextest-python-api> [2026-09-03 15:33:22.370] @feyngen::diagram_... INFO : 0s | Δ=0s | Number of graphs retained after removal of vetoed topologies: 8
121.73 s
gammaloop-nextest-python-api> [2026-09-03 15:33:22.371] @feyngen::diagram_... INFO : 0s | Δ=0s | Number of graphs after vertex info assignment: 8
121.73 s
gammaloop-nextest-python-api> [2026-09-03 15:33:22.371] @feyngen::diagram_... INFO : 0s | Δ=0s | Number of graphs after all complete graphs filters are applied: 8
121.73 s
gammaloop-nextest-python-api>
121.73 s
gammaloop-nextest-python-api>
121.73 s
gammaloop-nextest-python-api> Location:
121.73 s
gammaloop-nextest-python-api> tests/tests/test_python_api.rs:156:20
121.73 s
gammaloop-nextest-python-api>
121.73 s
gammaloop-nextest-python-api> FAIL [ 0.219s] (5/5) gammaloop-integration-tests::test_python_api python_settings_wrappers_expose_nested_runtime_and_global_settings
121.73 s
gammaloop-nextest-python-api> stdout ---
121.73 s
gammaloop-nextest-python-api>
121.73 s
gammaloop-nextest-python-api> running 1 test
121.73 s
gammaloop-nextest-python-api> test python_settings_wrappers_expose_nested_runtime_and_global_settings ... FAILED
121.73 s
gammaloop-nextest-python-api>
121.73 s
gammaloop-nextest-python-api> failures:
121.73 s
gammaloop-nextest-python-api>
121.73 s
gammaloop-nextest-python-api> failures:
121.73 s
gammaloop-nextest-python-api> python_settings_wrappers_expose_nested_runtime_and_global_settings
121.73 s
gammaloop-nextest-python-api>
121.73 s
gammaloop-nextest-python-api> test result: FAILED. 0 passed; 1 failed; 0 ignored; 0 measured; 4 filtered out; finished in 0.22s
121.73 s
gammaloop-nextest-python-api>
121.73 s
gammaloop-nextest-python-api> stderr ---
121.73 s
gammaloop-nextest-python-api> Error: Python API test subprocess failed.
121.73 s
gammaloop-nextest-python-api> stdout:
121.73 s
gammaloop-nextest-python-api> ┌────────────────────────────────────────────────────────┐
121.73 s
gammaloop-nextest-python-api> │ You are running a restricted Symbolica instance. │
121.73 s
gammaloop-nextest-python-api> │ │
121.73 s
gammaloop-nextest-python-api> │ This mode is only permitted for non-commercial use and │
121.73 s
gammaloop-nextest-python-api> │ is limited to one instance and core per machine. │
121.73 s
gammaloop-nextest-python-api> │ │
121.73 s
gammaloop-nextest-python-api> │ Hobbyists can easily acquire a free license key │
121.73 s
gammaloop-nextest-python-api> │ that unlocks all cores and removes this banner: │
121.73 s
gammaloop-nextest-python-api> │ │
121.73 s
gammaloop-nextest-python-api> │ from symbolica import * │
121.73 s
gammaloop-nextest-python-api> │ request_hobbyist_license('YOUR_NAME', 'YOUR_EMAIL') │
121.73 s
gammaloop-nextest-python-api> │ │
121.73 s
gammaloop-nextest-python-api> │ All other users can obtain a free 30-day trial key: │
121.73 s
gammaloop-nextest-python-api> │ │
121.73 s
gammaloop-nextest-python-api> │ from symbolica import * │
121.73 s
gammaloop-nextest-python-api> │ request_trial_license('NAME', 'EMAIL', 'EMPLOYER') │
121.73 s
gammaloop-nextest-python-api> │ │
121.73 s
gammaloop-nextest-python-api> │ See https://symbolica.io/docs/get_started.html#license │
121.73 s
gammaloop-nextest-python-api> └────────────────────────────────────────────────────────┘
121.73 s
gammaloop-nextest-python-api> ┌───────────────────────────────────────────────────────────────────────────────────────────────────────────┐
121.73 s
gammaloop-nextest-python-api> │ Cannot start new unlicensed Symbolica instance since there is already another one running on the machine. │
121.73 s
gammaloop-nextest-python-api> └───────────────────────────────────────────────────────────────────────────────────────────────────────────┘
121.73 s
gammaloop-nextest-python-api>
121.73 s
gammaloop-nextest-python-api> stderr:
121.73 s
gammaloop-nextest-python-api>
121.73 s
gammaloop-nextest-python-api> ┌───────────────────────────────────────────────────────────┐
121.73 s
gammaloop-nextest-python-api> │ Could not resolve the IP of the Symbolica license server. │
121.73 s
gammaloop-nextest-python-api> │ │
121.73 s
gammaloop-nextest-python-api> │ Please check your DNS configuration. │
121.73 s
gammaloop-nextest-python-api> └───────────────────────────────────────────────────────────┘
121.73 s
gammaloop-nextest-python-api> Error: failed to lookup address information: Temporary failure in name resolution
121.73 s
gammaloop-nextest-python-api>
121.73 s
gammaloop-nextest-python-api>
121.73 s
gammaloop-nextest-python-api> Location:
121.73 s
gammaloop-nextest-python-api> tests/tests/test_python_api.rs:156:20
121.73 s
gammaloop-nextest-python-api>
121.76 s
gammaloop-nextest-python-api> error : test run failed
121.79 s
gammaloop-nextest-python-api>
121.79 s
gammaloop-nextest-python-api> ========== nextest test summary ==========
121.79 s
gammaloop-nextest-python-api> report: target/nextest/ci_gammaloop/junit.xml
121.79 s
gammaloop-nextest-python-api> tests: 5, failures: 5, errors: 0
121.79 s
gammaloop-nextest-python-api>
121.79 s
gammaloop-nextest-python-api> 1. gammaloop-integration-tests::test_python_api::python_evaluate_sample_preserves_graph_grouping_and_incoming_pdgs
121.79 s
gammaloop-nextest-python-api> failure: test failure with exit code 101
121.79 s
gammaloop-nextest-python-api> Error: Python API test subprocess failed.
121.79 s
gammaloop-nextest-python-api> stdout:
121.79 s
gammaloop-nextest-python-api> ┌────────────────────────────────────────────────────────┐
121.79 s
gammaloop-nextest-python-api> │ You are running a restricted Symbolica instance. │
121.79 s
gammaloop-nextest-python-api> │ │
121.79 s
gammaloop-nextest-python-api> │ This mode is only permitted for non-commercial use and │
121.79 s
gammaloop-nextest-python-api> │ is limited to one instance and core per machine. │
121.79 s
gammaloop-nextest-python-api> │ │
121.79 s
gammaloop-nextest-python-api> │ Hobbyists can easily acquire a free license key │
121.79 s
gammaloop-nextest-python-api> │ that unlocks all cores and removes this banner: │
121.79 s
gammaloop-nextest-python-api> │ │
121.79 s
gammaloop-nextest-python-api> │ from symbolica import * │
121.79 s
gammaloop-nextest-python-api> │ request_hobbyist_license('YOUR_NAME', 'YOUR_EMAIL') │
121.79 s
gammaloop-nextest-python-api> │ │
121.79 s
gammaloop-nextest-python-api> │ All other users can obtain a free 30-day trial key: │
121.79 s
gammaloop-nextest-python-api> │ │
121.79 s
gammaloop-nextest-python-api> │ from symbolica import * │
121.79 s
gammaloop-nextest-python-api> │ request_trial_license('NAME', 'EMAIL', 'EMPLOYER') │
121.79 s
gammaloop-nextest-python-api> │ │
121.79 s
gammaloop-nextest-python-api> │ See https://symbolica.io/docs/get_started.html#license │
121.79 s
gammaloop-nextest-python-api> └────────────────────────────────────────────────────────┘
121.79 s
gammaloop-nextest-python-api> ┌───────────────────────────────────────────────────────────────────────────────────────────────────────────┐
121.79 s
gammaloop-nextest-python-api> │ Cannot start new unlicensed Symbolica instance since there is already another one running on the machine. │
121.79 s
gammaloop-nextest-python-api> └───────────────────────────────────────────────────────────────────────────────────────────────────────────┘
121.79 s
gammaloop-nextest-python-api>
121.79 s
gammaloop-nextest-python-api> stderr:
121.79 s
gammaloop-nextest-python-api>
121.79 s
gammaloop-nextest-python-api> ┌───────────────────────────────────────────────────────────┐
121.79 s
gammaloop-nextest-python-api> │ Could not resolve the IP of the Symbolica license server. │
121.79 s
gammaloop-nextest-python-api> │ │
121.79 s
gammaloop-nextest-python-api> │ Please check your DNS configuration. │
121.79 s
gammaloop-nextest-python-api> └───────────────────────────────────────────────────────────┘
121.79 s
gammaloop-nextest-python-api> Error: failed to lookup address information: Temporary failure in name resolution
121.79 s
gammaloop-nextest-python-api>
121.79 s
gammaloop-nextest-python-api>
121.79 s
gammaloop-nextest-python-api> Location:
121.79 s
gammaloop-nextest-python-api> tests/tests/test_python_api.rs:156:20
121.79 s
gammaloop-nextest-python-api> system-out
121.79 s
gammaloop-nextest-python-api> running 1 test
121.79 s
gammaloop-nextest-python-api> test python_evaluate_sample_preserves_graph_grouping_and_incoming_pdgs ... FAILED
121.79 s
gammaloop-nextest-python-api>
121.79 s
gammaloop-nextest-python-api> failures:
121.79 s
gammaloop-nextest-python-api>
121.79 s
gammaloop-nextest-python-api> failures:
121.79 s
gammaloop-nextest-python-api> python_evaluate_sample_preserves_graph_grouping_and_incoming_pdgs
121.79 s
gammaloop-nextest-python-api>
121.79 s
gammaloop-nextest-python-api> test result: FAILED. 0 passed; 1 failed; 0 ignored; 0 measured; 4 filtered out; finished in 0.10s
121.79 s
gammaloop-nextest-python-api> system-err
121.79 s
gammaloop-nextest-python-api> Error: Python API test subprocess failed.
121.79 s
gammaloop-nextest-python-api> stdout:
121.79 s
gammaloop-nextest-python-api> ┌────────────────────────────────────────────────────────┐
121.79 s
gammaloop-nextest-python-api> │ You are running a restricted Symbolica instance. │
121.79 s
gammaloop-nextest-python-api> │ │
121.79 s
gammaloop-nextest-python-api> │ This mode is only permitted for non-commercial use and │
121.79 s
gammaloop-nextest-python-api> │ is limited to one instance and core per machine. │
121.79 s
gammaloop-nextest-python-api> │ │
121.79 s
gammaloop-nextest-python-api> │ Hobbyists can easily acquire a free license key │
121.79 s
gammaloop-nextest-python-api> │ that unlocks all cores and removes this banner: │
121.79 s
gammaloop-nextest-python-api> │ │
121.79 s
gammaloop-nextest-python-api> │ from symbolica import * │
121.79 s
gammaloop-nextest-python-api> │ request_hobbyist_license('YOUR_NAME', 'YOUR_EMAIL') │
121.79 s
gammaloop-nextest-python-api> │ │
121.79 s
gammaloop-nextest-python-api> │ All other users can obtain a free 30-day trial key: │
121.79 s
gammaloop-nextest-python-api> │ │
121.79 s
gammaloop-nextest-python-api> │ from symbolica import * │
121.79 s
gammaloop-nextest-python-api> │ request_trial_license('NAME', 'EMAIL', 'EMPLOYER') │
121.79 s
gammaloop-nextest-python-api> │ │
121.79 s
gammaloop-nextest-python-api> │ See https://symbolica.io/docs/get_started.html#license │
121.79 s
gammaloop-nextest-python-api> └────────────────────────────────────────────────────────┘
121.79 s
gammaloop-nextest-python-api> ┌───────────────────────────────────────────────────────────────────────────────────────────────────────────┐
121.79 s
gammaloop-nextest-python-api> │ Cannot start new unlicensed Symbolica instance since there is already another one running on the machine. │
121.79 s
gammaloop-nextest-python-api> └───────────────────────────────────────────────────────────────────────────────────────────────────────────┘
121.79 s
gammaloop-nextest-python-api>
121.79 s
gammaloop-nextest-python-api> stderr:
121.79 s
gammaloop-nextest-python-api>
121.79 s
gammaloop-nextest-python-api> ┌───────────────────────────────────────────────────────────┐
121.79 s
gammaloop-nextest-python-api> │ Could not resolve the IP of the Symbolica license server. │
121.79 s
gammaloop-nextest-python-api> │ │
121.79 s
gammaloop-nextest-python-api> │ Please check your DNS configuration. │
121.79 s
gammaloop-nextest-python-api> └───────────────────────────────────────────────────────────┘
121.79 s
gammaloop-nextest-python-api> Error: failed to lookup address information: Temporary failure in name resolution
121.79 s
gammaloop-nextest-python-api>
121.79 s
gammaloop-nextest-python-api>
121.79 s
gammaloop-nextest-python-api> Location:
121.79 s
gammaloop-nextest-python-api> tests/tests/test_python_api.rs:156:20
121.79 s
gammaloop-nextest-python-api>
121.79 s
gammaloop-nextest-python-api> 2. gammaloop-integration-tests::test_python_api::python_session_getters_return_live_toml_and_command_blocks
121.79 s
gammaloop-nextest-python-api> failure: test failure with exit code 101
121.79 s
gammaloop-nextest-python-api> Error: Python API test subprocess failed.
121.79 s
gammaloop-nextest-python-api> stdout:
121.79 s
gammaloop-nextest-python-api> ┌────────────────────────────────────────────────────────┐
121.79 s
gammaloop-nextest-python-api> │ You are running a restricted Symbolica instance. │
121.79 s
gammaloop-nextest-python-api> │ │
121.79 s
gammaloop-nextest-python-api> │ This mode is only permitted for non-commercial use and │
121.79 s
gammaloop-nextest-python-api> │ is limited to one instance and core per machine. │
121.79 s
gammaloop-nextest-python-api> │ │
121.79 s
gammaloop-nextest-python-api> │ Hobbyists can easily acquire a free license key │
121.79 s
gammaloop-nextest-python-api> │ that unlocks all cores and removes this banner: │
121.79 s
gammaloop-nextest-python-api> │ │
121.79 s
gammaloop-nextest-python-api> │ from symbolica import * │
121.79 s
gammaloop-nextest-python-api> │ request_hobbyist_license('YOUR_NAME', 'YOUR_EMAIL') │
121.79 s
gammaloop-nextest-python-api> │ │
121.79 s
gammaloop-nextest-python-api> │ All other users can obtain a free 30-day trial key: │
121.79 s
gammaloop-nextest-python-api> │ │
121.79 s
gammaloop-nextest-python-api> │ from symbolica import * │
121.79 s
gammaloop-nextest-python-api> │ request_trial_license('NAME', 'EMAIL', 'EMPLOYER') │
121.79 s
gammaloop-nextest-python-api> │ │
121.79 s
gammaloop-nextest-python-api> │ See https://symbolica.io/docs/get_started.html#license │
121.79 s
gammaloop-nextest-python-api> └────────────────────────────────────────────────────────┘
121.79 s
gammaloop-nextest-python-api> ┌───────────────────────────────────────────────────────────────────────────────────────────────────────────┐
121.79 s
gammaloop-nextest-python-api> │ Cannot start new unlicensed Symbolica instance since there is already another one running on the machine. │
121.79 s
gammaloop-nextest-python-api> └───────────────────────────────────────────────────────────────────────────────────────────────────────────┘
121.79 s
gammaloop-nextest-python-api>
121.79 s
gammaloop-nextest-python-api> stderr:
121.79 s
gammaloop-nextest-python-api>
121.79 s
gammaloop-nextest-python-api> ┌───────────────────────────────────────────────────────────┐
121.79 s
gammaloop-nextest-python-api> │ Could not resolve the IP of the Symbolica license server. │
121.79 s
gammaloop-nextest-python-api> │ │
121.79 s
gammaloop-nextest-python-api> │ Please check your DNS configuration. │
121.79 s
gammaloop-nextest-python-api> └───────────────────────────────────────────────────────────┘
121.79 s
gammaloop-nextest-python-api> Error: failed to lookup address information: Temporary failure in name resolution
121.79 s
gammaloop-nextest-python-api>
121.79 s
gammaloop-nextest-python-api>
121.79 s
gammaloop-nextest-python-api> Location:
121.79 s
gammaloop-nextest-python-api> tests/tests/test_python_api.rs:156:20
121.79 s
gammaloop-nextest-python-api> system-out
121.79 s
gammaloop-nextest-python-api> running 1 test
121.79 s
gammaloop-nextest-python-api> test python_session_getters_return_live_toml_and_command_blocks ... FAILED
121.79 s
gammaloop-nextest-python-api>
121.79 s
gammaloop-nextest-python-api> failures:
121.79 s
gammaloop-nextest-python-api>
121.79 s
gammaloop-nextest-python-api> failures:
121.79 s
gammaloop-nextest-python-api> python_session_getters_return_live_toml_and_command_blocks
121.79 s
gammaloop-nextest-python-api>
121.79 s
gammaloop-nextest-python-api> test result: FAILED. 0 passed; 1 failed; 0 ignored; 0 measured; 4 filtered out; finished in 0.10s
121.79 s
gammaloop-nextest-python-api> system-err
121.79 s
gammaloop-nextest-python-api> Error: Python API test subprocess failed.
121.79 s
gammaloop-nextest-python-api> stdout:
121.79 s
gammaloop-nextest-python-api> ┌────────────────────────────────────────────────────────┐
121.79 s
gammaloop-nextest-python-api> │ You are running a restricted Symbolica instance. │
121.79 s
gammaloop-nextest-python-api> │ │
121.79 s
gammaloop-nextest-python-api> │ This mode is only permitted for non-commercial use and │
121.79 s
gammaloop-nextest-python-api> │ is limited to one instance and core per machine. │
121.79 s
gammaloop-nextest-python-api> │ │
121.79 s
gammaloop-nextest-python-api> │ Hobbyists can easily acquire a free license key │
121.79 s
gammaloop-nextest-python-api> │ that unlocks all cores and removes this banner: │
121.79 s
gammaloop-nextest-python-api> │ │
121.79 s
gammaloop-nextest-python-api> │ from symbolica import * │
121.79 s
gammaloop-nextest-python-api> │ request_hobbyist_license('YOUR_NAME', 'YOUR_EMAIL') │
121.79 s
gammaloop-nextest-python-api> │ │
121.79 s
gammaloop-nextest-python-api> │ All other users can obtain a free 30-day trial key: │
121.79 s
gammaloop-nextest-python-api> │ │
121.79 s
gammaloop-nextest-python-api> │ from symbolica import * │
121.79 s
gammaloop-nextest-python-api> │ request_trial_license('NAME', 'EMAIL', 'EMPLOYER') │
121.79 s
gammaloop-nextest-python-api> │ │
121.79 s
gammaloop-nextest-python-api> │ See https://symbolica.io/docs/get_started.html#license │
121.79 s
gammaloop-nextest-python-api> └────────────────────────────────────────────────────────┘
121.79 s
gammaloop-nextest-python-api> ┌───────────────────────────────────────────────────────────────────────────────────────────────────────────┐
121.79 s
gammaloop-nextest-python-api> │ Cannot start new unlicensed Symbolica instance since there is already another one running on the machine. │
121.79 s
gammaloop-nextest-python-api> └───────────────────────────────────────────────────────────────────────────────────────────────────────────┘
121.79 s
gammaloop-nextest-python-api>
121.79 s
gammaloop-nextest-python-api> stderr:
121.79 s
gammaloop-nextest-python-api>
121.79 s
gammaloop-nextest-python-api> ┌───────────────────────────────────────────────────────────┐
121.79 s
gammaloop-nextest-python-api> │ Could not resolve the IP of the Symbolica license server. │
121.79 s
gammaloop-nextest-python-api> │ │
121.79 s
gammaloop-nextest-python-api> │ Please check your DNS configuration. │
121.79 s
gammaloop-nextest-python-api> └───────────────────────────────────────────────────────────┘
121.79 s
gammaloop-nextest-python-api> Error: failed to lookup address information: Temporary failure in name resolution
121.79 s
gammaloop-nextest-python-api>
121.79 s
gammaloop-nextest-python-api>
121.79 s
gammaloop-nextest-python-api> Location:
121.79 s
gammaloop-nextest-python-api> tests/tests/test_python_api.rs:156:20
121.79 s
gammaloop-nextest-python-api>
121.79 s
gammaloop-nextest-python-api> 3. gammaloop-integration-tests::test_python_api::python_evaluate_samples_batch_and_momentum_space_have_expected_shape
121.79 s
gammaloop-nextest-python-api> failure: test failure with exit code 101
121.79 s
gammaloop-nextest-python-api> Error: Python API test subprocess failed.
121.79 s
gammaloop-nextest-python-api> stdout:
121.79 s
gammaloop-nextest-python-api> ┌────────────────────────────────────────────────────────┐
121.79 s
gammaloop-nextest-python-api> │ You are running a restricted Symbolica instance. │
121.79 s
gammaloop-nextest-python-api> │ │
121.79 s
gammaloop-nextest-python-api> │ This mode is only permitted for non-commercial use and │
121.79 s
gammaloop-nextest-python-api> │ is limited to one instance and core per machine. │
121.79 s
gammaloop-nextest-python-api> │ │
121.79 s
gammaloop-nextest-python-api> │ Hobbyists can easily acquire a free license key │
121.79 s
gammaloop-nextest-python-api> │ that unlocks all cores and removes this banner: │
121.79 s
gammaloop-nextest-python-api> │ │
121.79 s
gammaloop-nextest-python-api> │ from symbolica import * │
121.79 s
gammaloop-nextest-python-api> │ request_hobbyist_license('YOUR_NAME', 'YOUR_EMAIL') │
121.79 s
gammaloop-nextest-python-api> │ │
121.79 s
gammaloop-nextest-python-api> │ All other users can obtain a free 30-day trial key: │
121.79 s
gammaloop-nextest-python-api> │ │
121.79 s
gammaloop-nextest-python-api> │ from symbolica import * │
121.79 s
gammaloop-nextest-python-api> │ request_trial_license('NAME', 'EMAIL', 'EMPLOYER') │
121.79 s
gammaloop-nextest-python-api> │ │
121.79 s
gammaloop-nextest-python-api> │ See https://symbolica.io/docs/get_started.html#license │
121.79 s
gammaloop-nextest-python-api> └────────────────────────────────────────────────────────┘
121.79 s
gammaloop-nextest-python-api> ┌───────────────────────────────────────────────────────────────────────────────────────────────────────────┐
121.79 s
gammaloop-nextest-python-api> │ Cannot start new unlicensed Symbolica instance since there is already another one running on the machine. │
121.79 s
gammaloop-nextest-python-api> └───────────────────────────────────────────────────────────────────────────────────────────────────────────┘
121.79 s
gammaloop-nextest-python-api>
121.79 s
gammaloop-nextest-python-api> stderr:
121.79 s
gammaloop-nextest-python-api>
121.79 s
gammaloop-nextest-python-api> ┌───────────────────────────────────────────────────────────┐
121.79 s
gammaloop-nextest-python-api> │ Could not resolve the IP of the Symbolica license server. │
121.79 s
gammaloop-nextest-python-api> │ │
121.79 s
gammaloop-nextest-python-api> │ Please check your DNS configuration. │
121.79 s
gammaloop-nextest-python-api> └───────────────────────────────────────────────────────────┘
121.79 s
gammaloop-nextest-python-api> Error: failed to lookup address information: Temporary failure in name resolution
121.79 s
gammaloop-nextest-python-api>
121.79 s
gammaloop-nextest-python-api>
121.79 s
gammaloop-nextest-python-api> Location:
121.79 s
gammaloop-nextest-python-api> tests/tests/test_python_api.rs:156:20
121.79 s
gammaloop-nextest-python-api> system-out
121.79 s
gammaloop-nextest-python-api> running 1 test
121.79 s
gammaloop-nextest-python-api> test python_evaluate_samples_batch_and_momentum_space_have_expected_shape ... FAILED
121.79 s
gammaloop-nextest-python-api>
121.79 s
gammaloop-nextest-python-api> failures:
121.79 s
gammaloop-nextest-python-api>
121.79 s
gammaloop-nextest-python-api> failures:
121.79 s
gammaloop-nextest-python-api> python_evaluate_samples_batch_and_momentum_space_have_expected_shape
121.79 s
gammaloop-nextest-python-api>
121.79 s
gammaloop-nextest-python-api> test result: FAILED. 0 passed; 1 failed; 0 ignored; 0 measured; 4 filtered out; finished in 0.12s
121.79 s
gammaloop-nextest-python-api> system-err
121.79 s
gammaloop-nextest-python-api> Error: Python API test subprocess failed.
121.79 s
gammaloop-nextest-python-api> stdout:
121.79 s
gammaloop-nextest-python-api> ┌────────────────────────────────────────────────────────┐
121.79 s
gammaloop-nextest-python-api> │ You are running a restricted Symbolica instance. │
121.79 s
gammaloop-nextest-python-api> │ │
121.79 s
gammaloop-nextest-python-api> │ This mode is only permitted for non-commercial use and │
121.79 s
gammaloop-nextest-python-api> │ is limited to one instance and core per machine. │
121.79 s
gammaloop-nextest-python-api> │ │
121.79 s
gammaloop-nextest-python-api> │ Hobbyists can easily acquire a free license key │
121.79 s
gammaloop-nextest-python-api> │ that unlocks all cores and removes this banner: │
121.79 s
gammaloop-nextest-python-api> │ │
121.79 s
gammaloop-nextest-python-api> │ from symbolica import * │
121.79 s
gammaloop-nextest-python-api> │ request_hobbyist_license('YOUR_NAME', 'YOUR_EMAIL') │
121.79 s
gammaloop-nextest-python-api> │ │
121.79 s
gammaloop-nextest-python-api> │ All other users can obtain a free 30-day trial key: │
121.79 s
gammaloop-nextest-python-api> │ │
121.79 s
gammaloop-nextest-python-api> │ from symbolica import * │
121.79 s
gammaloop-nextest-python-api> │ request_trial_license('NAME', 'EMAIL', 'EMPLOYER') │
121.79 s
gammaloop-nextest-python-api> │ │
121.79 s
gammaloop-nextest-python-api> │ See https://symbolica.io/docs/get_started.html#license │
121.79 s
gammaloop-nextest-python-api> └────────────────────────────────────────────────────────┘
121.79 s
gammaloop-nextest-python-api> ┌───────────────────────────────────────────────────────────────────────────────────────────────────────────┐
121.79 s
gammaloop-nextest-python-api> │ Cannot start new unlicensed Symbolica instance since there is already another one running on the machine. │
121.79 s
gammaloop-nextest-python-api> └───────────────────────────────────────────────────────────────────────────────────────────────────────────┘
121.79 s
gammaloop-nextest-python-api>
121.79 s
gammaloop-nextest-python-api> stderr:
121.79 s
gammaloop-nextest-python-api>
121.79 s
gammaloop-nextest-python-api> ┌───────────────────────────────────────────────────────────┐
121.79 s
gammaloop-nextest-python-api> │ Could not resolve the IP of the Symbolica license server. │
121.79 s
gammaloop-nextest-python-api> │ │
121.79 s
gammaloop-nextest-python-api> │ Please check your DNS configuration. │
121.79 s
gammaloop-nextest-python-api> └───────────────────────────────────────────────────────────┘
121.79 s
gammaloop-nextest-python-api> Error: failed to lookup address information: Temporary failure in name resolution
121.79 s
gammaloop-nextest-python-api>
121.79 s
gammaloop-nextest-python-api>
121.79 s
gammaloop-nextest-python-api> Location:
121.79 s
gammaloop-nextest-python-api> tests/tests/test_python_api.rs:156:20
121.79 s
gammaloop-nextest-python-api>
121.79 s
gammaloop-nextest-python-api> 4. gammaloop-integration-tests::test_python_api::python_evaluate_sample_honors_generate_events_and_observable_snapshots
121.79 s
gammaloop-nextest-python-api> failure: test failure with exit code 101
121.79 s
gammaloop-nextest-python-api> Error: Python API test subprocess failed.
121.79 s
gammaloop-nextest-python-api> stdout:
121.79 s
gammaloop-nextest-python-api> ┌────────────────────────────────────────────────────────┐
121.79 s
gammaloop-nextest-python-api> │ You are running a restricted Symbolica instance. │
121.79 s
gammaloop-nextest-python-api> │ │
121.79 s
gammaloop-nextest-python-api> │ This mode is only permitted for non-commercial use and │
121.79 s
gammaloop-nextest-python-api> │ is limited to one instance and core per machine. │
121.79 s
gammaloop-nextest-python-api> │ │
121.79 s
gammaloop-nextest-python-api> │ Hobbyists can easily acquire a free license key │
121.79 s
gammaloop-nextest-python-api> │ that unlocks all cores and removes this banner: │
121.79 s
gammaloop-nextest-python-api> │ │
121.79 s
gammaloop-nextest-python-api> │ from symbolica import * │
121.79 s
gammaloop-nextest-python-api> │ request_hobbyist_license('YOUR_NAME', 'YOUR_EMAIL') │
121.79 s
gammaloop-nextest-python-api> │ │
121.79 s
gammaloop-nextest-python-api> │ All other users can obtain a free 30-day trial key: │
121.79 s
gammaloop-nextest-python-api> │ │
121.79 s
gammaloop-nextest-python-api> │ from symbolica import * │
121.79 s
gammaloop-nextest-python-api> │ request_trial_license('NAME', 'EMAIL', 'EMPLOYER') │
121.79 s
gammaloop-nextest-python-api> │ │
121.79 s
gammaloop-nextest-python-api> │ See https://symbolica.io/docs/get_started.html#license │
121.79 s
gammaloop-nextest-python-api> └────────────────────────────────────────────────────────┘
121.79 s
gammaloop-nextest-python-api> ┌───────────────────────────────────────────────────────────────────────────────────────────────────────────┐
121.79 s
gammaloop-nextest-python-api> │ Cannot start new unlicensed Symbolica instance since there is already another one running on the machine. │
121.79 s
gammaloop-nextest-python-api> └───────────────────────────────────────────────────────────────────────────────────────────────────────────┘
121.79 s
gammaloop-nextest-python-api>
121.79 s
gammaloop-nextest-python-api> stderr:
121.79 s
gammaloop-nextest-python-api>
121.79 s
gammaloop-nextest-python-api> ┌───────────────────────────────────────────────────────────┐
121.79 s
gammaloop-nextest-python-api> │ Could not resolve the IP of the Symbolica license server. │
121.79 s
gammaloop-nextest-python-api> │ │
121.79 s
gammaloop-nextest-python-api> │ Please check your DNS configuration. │
121.79 s
gammaloop-nextest-python-api> └───────────────────────────────────────────────────────────┘
121.79 s
gammaloop-nextest-python-api> Error: failed to lookup address information: Temporary failure in name resolution
121.79 s
gammaloop-nextest-python-api> [2026-09-03 15:33:22.333] @gammaloop_api::se... INFO : Running command import model sm-default
121.79 s
gammaloop-nextest-python-api> [2026-09-03 15:33:22.333] @import::model INFO : Loading built-in JSON model sm-default
121.79 s
gammaloop-nextest-python-api> [2026-09-03 15:33:22.364] @gammalooprs::model INFO : The following 11 external parameters were forced to zero by the restriction card:
121.79 s
gammaloop-nextest-python-api> lamWS, AWS, rhoWS, etaWS, ymc, yme, ymm, MC, Me, MM, WTau
121.79 s
gammaloop-nextest-python-api> [2026-09-03 15:33:22.364] @gammalooprs::model INFO : The following 34 vertex rules were removed by the restriction card:
121.79 s
gammaloop-nextest-python-api> V_82 -> (c~, d, G+) | V_83 -> (t~, d, G+) | V_84 -> (c~, s, G+) | V_85 -> (t~, s, G+) | V_86 -> (u~, b, G+) | V_87 -> (c~, b, G+) | V_90 -> (c~, d, W+) | V_91 -> (t~, d, W+) | V_92 -> (u~, s, W+) | V_94 -> (t~, s, W+) | V_95 -> (u~, b, W+) | V_96 -> (c~, b, W+) | V_101 -> (e+, e-, G0) | V_102 -> (mu+, mu-, G0) | V_104 -> (e+, e-, H) | V_105 -> (mu+, mu-, H) | V_110 -> (ve~, e-, G+) | V_111 -> (vm~, mu-, G+) | V_116 -> (b~, u, G-) | V_117 -> (d~, c, G-) | V_118 -> (s~, c, G-) | V_119 -> (b~, c, G-) | V_120 -> (d~, t, G-) | V_121 -> (s~, t, G-) | V_124 -> (s~, u, W-) | V_125 -> (b~, u, W-) | V_126 -> (d~, c, W-) | V_128 -> (b~, c, W-) | V_129 -> (d~, t, W-) | V_130 -> (s~, t, W-) | V_138 -> (c~, c, G0) | V_140 -> (c~, c, H) | V_145 -> (e+, ve, G-) | V_146 -> (mu+, vm, G-)
121.79 s
gammaloop-nextest-python-api> [2026-09-03 15:33:22.364] @gammalooprs::model INFO : The following 36 couplings were removed by the restriction card:
121.79 s
gammaloop-nextest-python-api> GC_13, GC_14, GC_16, GC_17, GC_18, GC_19, GC_20, GC_22, GC_23, GC_24, GC_25, GC_26, GC_28, GC_29, GC_42, GC_43, GC_44, GC_46, GC_47, GC_48, GC_84, GC_85, GC_86, GC_87, GC_88, GC_89, GC_90, GC_91, GC_92, GC_93, GC_101, GC_102, GC_103, GC_105, GC_106, GC_107
121.79 s
gammaloop-nextest-python-api> [2026-09-03 15:33:22.364] @gammaloop_api::se... INFO : Running command set default-runtime kv kinematics.externals='{"type":"constant","data":{"momenta":[[32.0,0.0,0.0,32.0],[32.0,0.0,0.0,-32.0]],"helicities":[1,1]}}'
121.79 s
gammaloop-nextest-python-api> [2026-09-03 15:33:22.365] @gammaloop_api::se... INFO : Running command set default-runtime kv subtraction.disable_threshold_subtraction=true
121.79 s
gammaloop-nextest-python-api> [2026-09-03 15:33:22.366] @gammaloop_api::se... INFO : Running command generate xs e+ e- > d d~ g | e- a d g QED^2==4 [{{2}} QCD=0] --numerator-grouping group_identical_graphs_up_to_sign --clear-existing-processes --only-diagrams
121.79 s
gammaloop-nextest-python-api> [2026-09-03 15:33:22.368] @feyngen::diagram_... INFO : 0s | Δ=0s | Starting Feynman graph generation with Symbolica...
121.79 s
gammaloop-nextest-python-api> [2026-09-03 15:33:22.370] @feyngen::diagram_... INFO : 0s | Δ=0s | Number of graphs resulting from Symbolica generation: 246
121.79 s
gammaloop-nextest-python-api> [2026-09-03 15:33:22.370] @feyngen::diagram_... INFO : 0s | Δ=0s | Number of graphs retained after enforcing supergraph particle content: 8
121.79 s
gammaloop-nextest-python-api> [2026-09-03 15:33:22.370] @feyngen::diagram_... INFO : 0s | Δ=0s | Number of graphs retained after removal of vetoed topologies: 8
121.79 s
gammaloop-nextest-python-api> [2026-09-03 15:33:22.371] @feyngen::diagram_... INFO : 0s | Δ=0s | Number of graphs after vertex info assignment: 8
121.79 s
gammaloop-nextest-python-api> [2026-09-03 15:33:22.371] @feyngen::diagram_... INFO : 0s | Δ=0s | Number of graphs after all complete graphs filters are applied: 8
121.79 s
gammaloop-nextest-python-api>
121.79 s
gammaloop-nextest-python-api>
121.79 s
gammaloop-nextest-python-api> Location:
121.79 s
gammaloop-nextest-python-api> tests/tests/test_python_api.rs:156:20
121.79 s
gammaloop-nextest-python-api> system-out
121.79 s
gammaloop-nextest-python-api> running 1 test
121.79 s
gammaloop-nextest-python-api> test python_evaluate_sample_honors_generate_events_and_observable_snapshots ... FAILED
121.79 s
gammaloop-nextest-python-api>
121.79 s
gammaloop-nextest-python-api> failures:
121.79 s
gammaloop-nextest-python-api>
121.79 s
gammaloop-nextest-python-api> failures:
121.79 s
gammaloop-nextest-python-api> python_evaluate_sample_honors_generate_events_and_observable_snapshots
121.79 s
gammaloop-nextest-python-api>
121.79 s
gammaloop-nextest-python-api> test result: FAILED. 0 passed; 1 failed; 0 ignored; 0 measured; 4 filtered out; finished in 0.20s
121.79 s
gammaloop-nextest-python-api> system-err
121.79 s
gammaloop-nextest-python-api> Error: Python API test subprocess failed.
121.79 s
gammaloop-nextest-python-api> stdout:
121.79 s
gammaloop-nextest-python-api> ┌────────────────────────────────────────────────────────┐
121.79 s
gammaloop-nextest-python-api> │ You are running a restricted Symbolica instance. │
121.79 s
gammaloop-nextest-python-api> │ │
121.79 s
gammaloop-nextest-python-api> │ This mode is only permitted for non-commercial use and │
121.79 s
gammaloop-nextest-python-api> │ is limited to one instance and core per machine. │
121.79 s
gammaloop-nextest-python-api> │ │
121.79 s
gammaloop-nextest-python-api> │ Hobbyists can easily acquire a free license key │
121.79 s
gammaloop-nextest-python-api> │ that unlocks all cores and removes this banner: │
121.79 s
gammaloop-nextest-python-api> │ │
121.79 s
gammaloop-nextest-python-api> │ from symbolica import * │
121.79 s
gammaloop-nextest-python-api> │ request_hobbyist_license('YOUR_NAME', 'YOUR_EMAIL') │
121.79 s
gammaloop-nextest-python-api> │ │
121.79 s
gammaloop-nextest-python-api> │ All other users can obtain a free 30-day trial key: │
121.79 s
gammaloop-nextest-python-api> │ │
121.79 s
gammaloop-nextest-python-api> │ from symbolica import * │
121.79 s
gammaloop-nextest-python-api> │ request_trial_license('NAME', 'EMAIL', 'EMPLOYER') │
121.79 s
gammaloop-nextest-python-api> │ │
121.79 s
gammaloop-nextest-python-api> │ See https://symbolica.io/docs/get_started.html#license │
121.79 s
gammaloop-nextest-python-api> └────────────────────────────────────────────────────────┘
121.79 s
gammaloop-nextest-python-api> ┌───────────────────────────────────────────────────────────────────────────────────────────────────────────┐
121.79 s
gammaloop-nextest-python-api> │ Cannot start new unlicensed Symbolica instance since there is already another one running on the machine. │
121.79 s
gammaloop-nextest-python-api> └───────────────────────────────────────────────────────────────────────────────────────────────────────────┘
121.79 s
gammaloop-nextest-python-api>
121.79 s
gammaloop-nextest-python-api> stderr:
121.79 s
gammaloop-nextest-python-api>
121.79 s
gammaloop-nextest-python-api> ┌───────────────────────────────────────────────────────────┐
121.79 s
gammaloop-nextest-python-api> │ Could not resolve the IP of the Symbolica license server. │
121.79 s
gammaloop-nextest-python-api> │ │
121.79 s
gammaloop-nextest-python-api> │ Please check your DNS configuration. │
121.79 s
gammaloop-nextest-python-api> └───────────────────────────────────────────────────────────┘
121.79 s
gammaloop-nextest-python-api> Error: failed to lookup address information: Temporary failure in name resolution
121.79 s
gammaloop-nextest-python-api> [2026-09-03 15:33:22.333] @gammaloop_api::se... INFO : Running command import model sm-default
121.79 s
gammaloop-nextest-python-api> [2026-09-03 15:33:22.333] @import::model INFO : Loading built-in JSON model sm-default
121.79 s
gammaloop-nextest-python-api> [2026-09-03 15:33:22.364] @gammalooprs::model INFO : The following 11 external parameters were forced to zero by the restriction card:
121.79 s
gammaloop-nextest-python-api> lamWS, AWS, rhoWS, etaWS, ymc, yme, ymm, MC, Me, MM, WTau
121.79 s
gammaloop-nextest-python-api> [2026-09-03 15:33:22.364] @gammalooprs::model INFO : The following 34 vertex rules were removed by the restriction card:
121.79 s
gammaloop-nextest-python-api> V_82 -> (c~, d, G+) | V_83 -> (t~, d, G+) | V_84 -> (c~, s, G+) | V_85 -> (t~, s, G+) | V_86 -> (u~, b, G+) | V_87 -> (c~, b, G+) | V_90 -> (c~, d, W+) | V_91 -> (t~, d, W+) | V_92 -> (u~, s, W+) | V_94 -> (t~, s, W+) | V_95 -> (u~, b, W+) | V_96 -> (c~, b, W+) | V_101 -> (e+, e-, G0) | V_102 -> (mu+, mu-, G0) | V_104 -> (e+, e-, H) | V_105 -> (mu+, mu-, H) | V_110 -> (ve~, e-, G+) | V_111 -> (vm~, mu-, G+) | V_116 -> (b~, u, G-) | V_117 -> (d~, c, G-) | V_118 -> (s~, c, G-) | V_119 -> (b~, c, G-) | V_120 -> (d~, t, G-) | V_121 -> (s~, t, G-) | V_124 -> (s~, u, W-) | V_125 -> (b~, u, W-) | V_126 -> (d~, c, W-) | V_128 -> (b~, c, W-) | V_129 -> (d~, t, W-) | V_130 -> (s~, t, W-) | V_138 -> (c~, c, G0) | V_140 -> (c~, c, H) | V_145 -> (e+, ve, G-) | V_146 -> (mu+, vm, G-)
121.79 s
gammaloop-nextest-python-api> [2026-09-03 15:33:22.364] @gammalooprs::model INFO : The following 36 couplings were removed by the restriction card:
121.79 s
gammaloop-nextest-python-api> GC_13, GC_14, GC_16, GC_17, GC_18, GC_19, GC_20, GC_22, GC_23, GC_24, GC_25, GC_26, GC_28, GC_29, GC_42, GC_43, GC_44, GC_46, GC_47, GC_48, GC_84, GC_85, GC_86, GC_87, GC_88, GC_89, GC_90, GC_91, GC_92, GC_93, GC_101, GC_102, GC_103, GC_105, GC_106, GC_107
121.79 s
gammaloop-nextest-python-api> [2026-09-03 15:33:22.364] @gammaloop_api::se... INFO : Running command set default-runtime kv kinematics.externals='{"type":"constant","data":{"momenta":[[32.0,0.0,0.0,32.0],[32.0,0.0,0.0,-32.0]],"helicities":[1,1]}}'
121.79 s
gammaloop-nextest-python-api> [2026-09-03 15:33:22.365] @gammaloop_api::se... INFO : Running command set default-runtime kv subtraction.disable_threshold_subtraction=true
121.79 s
gammaloop-nextest-python-api> [2026-09-03 15:33:22.366] @gammaloop_api::se... INFO : Running command generate xs e+ e- > d d~ g | e- a d g QED^2==4 [{{2}} QCD=0] --numerator-grouping group_identical_graphs_up_to_sign --clear-existing-processes --only-diagrams
121.79 s
gammaloop-nextest-python-api> [2026-09-03 15:33:22.368] @feyngen::diagram_... INFO : 0s | Δ=0s | Starting Feynman graph generation with Symbolica...
121.79 s
gammaloop-nextest-python-api> [2026-09-03 15:33:22.370] @feyngen::diagram_... INFO : 0s | Δ=0s | Number of graphs resulting from Symbolica generation: 246
121.79 s
gammaloop-nextest-python-api> [2026-09-03 15:33:22.370] @feyngen::diagram_... INFO : 0s | Δ=0s | Number of graphs retained after enforcing supergraph particle content: 8
121.79 s
gammaloop-nextest-python-api> [2026-09-03 15:33:22.370] @feyngen::diagram_... INFO : 0s | Δ=0s | Number of graphs retained after removal of vetoed topologies: 8
121.79 s
gammaloop-nextest-python-api> [2026-09-03 15:33:22.371] @feyngen::diagram_... INFO : 0s | Δ=0s | Number of graphs after vertex info assignment: 8
121.79 s
gammaloop-nextest-python-api> [2026-09-03 15:33:22.371] @feyngen::diagram_... INFO : 0s | Δ=0s | Number of graphs after all complete graphs filters are applied: 8
121.79 s
gammaloop-nextest-python-api>
121.79 s
gammaloop-nextest-python-api>
121.79 s
gammaloop-nextest-python-api> Location:
121.79 s
gammaloop-nextest-python-api> tests/tests/test_python_api.rs:156:20
121.79 s
gammaloop-nextest-python-api>
121.79 s
gammaloop-nextest-python-api> 5. gammaloop-integration-tests::test_python_api::python_settings_wrappers_expose_nested_runtime_and_global_settings
121.79 s
gammaloop-nextest-python-api> failure: test failure with exit code 101
121.79 s
gammaloop-nextest-python-api> Error: Python API test subprocess failed.
121.79 s
gammaloop-nextest-python-api> stdout:
121.79 s
gammaloop-nextest-python-api> ┌────────────────────────────────────────────────────────┐
121.79 s
gammaloop-nextest-python-api> │ You are running a restricted Symbolica instance. │
121.79 s
gammaloop-nextest-python-api> │ │
121.79 s
gammaloop-nextest-python-api> │ This mode is only permitted for non-commercial use and │
121.79 s
gammaloop-nextest-python-api> │ is limited to one instance and core per machine. │
121.79 s
gammaloop-nextest-python-api> │ │
121.79 s
gammaloop-nextest-python-api> │ Hobbyists can easily acquire a free license key │
121.79 s
gammaloop-nextest-python-api> │ that unlocks all cores and removes this banner: │
121.79 s
gammaloop-nextest-python-api> │ │
121.79 s
gammaloop-nextest-python-api> │ from symbolica import * │
121.79 s
gammaloop-nextest-python-api> │ request_hobbyist_license('YOUR_NAME', 'YOUR_EMAIL') │
121.79 s
gammaloop-nextest-python-api> │ │
121.79 s
gammaloop-nextest-python-api> │ All other users can obtain a free 30-day trial key: │
121.79 s
gammaloop-nextest-python-api> │ │
121.79 s
gammaloop-nextest-python-api> │ from symbolica import * │
121.79 s
gammaloop-nextest-python-api> │ request_trial_license('NAME', 'EMAIL', 'EMPLOYER') │
121.79 s
gammaloop-nextest-python-api> │ │
121.79 s
gammaloop-nextest-python-api> │ See https://symbolica.io/docs/get_started.html#license │
121.79 s
gammaloop-nextest-python-api> └────────────────────────────────────────────────────────┘
121.79 s
gammaloop-nextest-python-api> ┌───────────────────────────────────────────────────────────────────────────────────────────────────────────┐
121.79 s
gammaloop-nextest-python-api> │ Cannot start new unlicensed Symbolica instance since there is already another one running on the machine. │
121.79 s
gammaloop-nextest-python-api> └───────────────────────────────────────────────────────────────────────────────────────────────────────────┘
121.79 s
gammaloop-nextest-python-api>
121.79 s
gammaloop-nextest-python-api> stderr:
121.79 s
gammaloop-nextest-python-api>
121.79 s
gammaloop-nextest-python-api> ┌───────────────────────────────────────────────────────────┐
121.79 s
gammaloop-nextest-python-api> │ Could not resolve the IP of the Symbolica license server. │
121.79 s
gammaloop-nextest-python-api> │ │
121.79 s
gammaloop-nextest-python-api> │ Please check your DNS configuration. │
121.79 s
gammaloop-nextest-python-api> └───────────────────────────────────────────────────────────┘
121.79 s
gammaloop-nextest-python-api> Error: failed to lookup address information: Temporary failure in name resolution
121.79 s
gammaloop-nextest-python-api>
121.79 s
gammaloop-nextest-python-api>
121.79 s
gammaloop-nextest-python-api> Location:
121.79 s
gammaloop-nextest-python-api> tests/tests/test_python_api.rs:156:20
121.79 s
gammaloop-nextest-python-api> system-out
121.79 s
gammaloop-nextest-python-api> running 1 test
121.79 s
gammaloop-nextest-python-api> test python_settings_wrappers_expose_nested_runtime_and_global_settings ... FAILED
121.79 s
gammaloop-nextest-python-api>
121.79 s
gammaloop-nextest-python-api> failures:
121.79 s
gammaloop-nextest-python-api>
121.79 s
gammaloop-nextest-python-api> failures:
121.79 s
gammaloop-nextest-python-api> python_settings_wrappers_expose_nested_runtime_and_global_settings
121.79 s
gammaloop-nextest-python-api>
121.79 s
gammaloop-nextest-python-api> test result: FAILED. 0 passed; 1 failed; 0 ignored; 0 measured; 4 filtered out; finished in 0.22s
121.79 s
gammaloop-nextest-python-api> system-err
121.79 s
gammaloop-nextest-python-api> Error: Python API test subprocess failed.
121.79 s
gammaloop-nextest-python-api> stdout:
121.79 s
gammaloop-nextest-python-api> ┌────────────────────────────────────────────────────────┐
121.79 s
gammaloop-nextest-python-api> │ You are running a restricted Symbolica instance. │
121.79 s
gammaloop-nextest-python-api> │ │
121.79 s
gammaloop-nextest-python-api> │ This mode is only permitted for non-commercial use and │
121.79 s
gammaloop-nextest-python-api> │ is limited to one instance and core per machine. │
121.79 s
gammaloop-nextest-python-api> │ │
121.79 s
gammaloop-nextest-python-api> │ Hobbyists can easily acquire a free license key │
121.79 s
gammaloop-nextest-python-api> │ that unlocks all cores and removes this banner: │
121.79 s
gammaloop-nextest-python-api> │ │
121.79 s
gammaloop-nextest-python-api> │ from symbolica import * │
121.79 s
gammaloop-nextest-python-api> │ request_hobbyist_license('YOUR_NAME', 'YOUR_EMAIL') │
121.79 s
gammaloop-nextest-python-api> │ │
121.79 s
gammaloop-nextest-python-api> │ All other users can obtain a free 30-day trial key: │
121.79 s
gammaloop-nextest-python-api> │ │
121.79 s
gammaloop-nextest-python-api> │ from symbolica import * │
121.79 s
gammaloop-nextest-python-api> │ request_trial_license('NAME', 'EMAIL', 'EMPLOYER') │
121.79 s
gammaloop-nextest-python-api> │ │
121.79 s
gammaloop-nextest-python-api> │ See https://symbolica.io/docs/get_started.html#license │
121.79 s
gammaloop-nextest-python-api> └────────────────────────────────────────────────────────┘
121.79 s
gammaloop-nextest-python-api> ┌───────────────────────────────────────────────────────────────────────────────────────────────────────────┐
121.79 s
gammaloop-nextest-python-api> │ Cannot start new unlicensed Symbolica instance since there is already another one running on the machine. │
121.79 s
gammaloop-nextest-python-api> └───────────────────────────────────────────────────────────────────────────────────────────────────────────┘
121.79 s
gammaloop-nextest-python-api>
121.79 s
gammaloop-nextest-python-api> stderr:
121.79 s
gammaloop-nextest-python-api>
121.79 s
gammaloop-nextest-python-api> ┌───────────────────────────────────────────────────────────┐
121.79 s
gammaloop-nextest-python-api> │ Could not resolve the IP of the Symbolica license server. │
121.79 s
gammaloop-nextest-python-api> │ │
121.79 s
gammaloop-nextest-python-api> │ Please check your DNS configuration. │
121.79 s
gammaloop-nextest-python-api> └───────────────────────────────────────────────────────────┘
121.79 s
gammaloop-nextest-python-api> Error: failed to lookup address information: Temporary failure in name resolution
121.79 s
gammaloop-nextest-python-api>
121.79 s
gammaloop-nextest-python-api>
121.79 s
gammaloop-nextest-python-api> Location:
121.79 s
gammaloop-nextest-python-api> tests/tests/test_python_api.rs:156:20
121.79 s
gammaloop-nextest-python-api> =========================================
121.84 s
error: Cannot build '/nix/store/92rfrz53xqdm3bwmdf3dq8zbdzxy8f7a-gammaloop-nextest-python-api.drv '.
121.84 s
Reason: builder failed with exit code 100 .
121.84 s
Output paths:
121.84 s
/nix/store/w3fd1akvf23gm7zw29z27n42xvm2dm2l-gammaloop-nextest-python-api
121.84 s
Last 1041 log lines:
121.84 s
> Extracting 3 binaries (including 2 non-test binaries), 1 build script output directory, and 3 linked paths to /build/nextest-archive-6DwWQb
121.84 s
> Extracted 22 files to /build/nextest-archive-6DwWQb in 0.22s
121.84 s
> ------------
121.84 s
> Nextest run ID 6271bfc6-5333-4f41-8349-688cc5434175 with nextest profile: ci_gammaloop
121.84 s
> Starting 5 tests across 1 binary
121.84 s
> FAIL [ 0.104s] (1/5) gammaloop-integration-tests::test_python_api python_evaluate_sample_preserves_graph_grouping_and_incoming_pdgs
121.84 s
> stdout ---
121.84 s
>
121.84 s
> running 1 test
121.84 s
> test python_evaluate_sample_preserves_graph_grouping_and_incoming_pdgs ... FAILED
121.84 s
>
121.84 s
> failures:
121.84 s
>
121.84 s
> failures:
121.84 s
> python_evaluate_sample_preserves_graph_grouping_and_incoming_pdgs
121.84 s
>
121.84 s
> test result: FAILED. 0 passed; 1 failed; 0 ignored; 0 measured; 4 filtered out; finished in 0.10s
121.84 s
>
121.84 s
> stderr ---
121.84 s
> Error: Python API test subprocess failed.
121.84 s
> stdout:
121.84 s
> ┌────────────────────────────────────────────────────────┐
121.84 s
> │ You are running a restricted Symbolica instance. │
121.84 s
> │ │
121.84 s
> │ This mode is only permitted for non-commercial use and │
121.84 s
> │ is limited to one instance and core per machine. │
121.84 s
> │ │
121.84 s
> │ Hobbyists can easily acquire a free license key │
121.84 s
> │ that unlocks all cores and removes this banner: │
121.84 s
> │ │
121.84 s
> │ from symbolica import * │
121.84 s
> │ request_hobbyist_license('YOUR_NAME', 'YOUR_EMAIL') │
121.84 s
> │ │
121.84 s
> │ All other users can obtain a free 30-day trial key: │
121.84 s
> │ │
121.84 s
> │ from symbolica import * │
121.84 s
> │ request_trial_license('NAME', 'EMAIL', 'EMPLOYER') │
121.84 s
> │ │
121.84 s
> │ See https://symbolica.io/docs/get_started.html#license │
121.84 s
> └────────────────────────────────────────────────────────┘
121.84 s
> ┌───────────────────────────────────────────────────────────────────────────────────────────────────────────┐
121.84 s
> │ Cannot start new unlicensed Symbolica instance since there is already another one running on the machine. │
121.84 s
> └───────────────────────────────────────────────────────────────────────────────────────────────────────────┘
121.84 s
>
121.84 s
> stderr:
121.84 s
>
121.84 s
> ┌───────────────────────────────────────────────────────────┐
121.84 s
> │ Could not resolve the IP of the Symbolica license server. │
121.84 s
> │ │
121.84 s
> │ Please check your DNS configuration. │
121.84 s
> └───────────────────────────────────────────────────────────┘
121.84 s
> Error: failed to lookup address information: Temporary failure in name resolution
121.84 s
>
121.84 s
>
121.84 s
> Location:
121.84 s
> tests/tests/test_python_api.rs:156:20
121.84 s
>
121.84 s
> FAIL [ 0.109s] (2/5) gammaloop-integration-tests::test_python_api python_session_getters_return_live_toml_and_command_blocks
121.84 s
> stdout ---
121.84 s
>
121.84 s
> running 1 test
121.84 s
> test python_session_getters_return_live_toml_and_command_blocks ... FAILED
121.84 s
>
121.84 s
> failures:
121.84 s
>
121.84 s
> failures:
121.84 s
> python_session_getters_return_live_toml_and_command_blocks
121.84 s
>
121.84 s
> test result: FAILED. 0 passed; 1 failed; 0 ignored; 0 measured; 4 filtered out; finished in 0.10s
121.84 s
>
121.84 s
> stderr ---
121.84 s
> Error: Python API test subprocess failed.
121.84 s
> stdout:
121.84 s
> ┌────────────────────────────────────────────────────────┐
121.84 s
> │ You are running a restricted Symbolica instance. │
121.84 s
> │ │
121.84 s
> │ This mode is only permitted for non-commercial use and │
121.84 s
> │ is limited to one instance and core per machine. │
121.84 s
> │ │
121.84 s
> │ Hobbyists can easily acquire a free license key │
121.84 s
> │ that unlocks all cores and removes this banner: │
121.84 s
> │ │
121.84 s
> │ from symbolica import * │
121.84 s
> │ request_hobbyist_license('YOUR_NAME', 'YOUR_EMAIL') │
121.84 s
> │ │
121.84 s
> │ All other users can obtain a free 30-day trial key: │
121.84 s
> │ │
121.84 s
> │ from symbolica import * │
121.84 s
> │ request_trial_license('NAME', 'EMAIL', 'EMPLOYER') │
121.84 s
> │ │
121.84 s
> │ See https://symbolica.io/docs/get_started.html#license │
121.84 s
> └────────────────────────────────────────────────────────┘
121.84 s
> ┌───────────────────────────────────────────────────────────────────────────────────────────────────────────┐
121.84 s
> │ Cannot start new unlicensed Symbolica instance since there is already another one running on the machine. │
121.84 s
> └───────────────────────────────────────────────────────────────────────────────────────────────────────────┘
121.84 s
>
121.84 s
> stderr:
121.84 s
>
121.84 s
> ┌───────────────────────────────────────────────────────────┐
121.84 s
> │ Could not resolve the IP of the Symbolica license server. │
121.84 s
> │ │
121.84 s
> │ Please check your DNS configuration. │
121.84 s
> └───────────────────────────────────────────────────────────┘
121.84 s
> Error: failed to lookup address information: Temporary failure in name resolution
121.84 s
>
121.84 s
>
121.84 s
> Location:
121.84 s
> tests/tests/test_python_api.rs:156:20
121.84 s
>
121.84 s
> FAIL [ 0.125s] (3/5) gammaloop-integration-tests::test_python_api python_evaluate_samples_batch_and_momentum_space_have_expected_shape
121.84 s
> stdout ---
121.84 s
>
121.84 s
> running 1 test
121.84 s
> test python_evaluate_samples_batch_and_momentum_space_have_expected_shape ... FAILED
121.84 s
>
121.84 s
> failures:
121.84 s
>
121.84 s
> failures:
121.84 s
> python_evaluate_samples_batch_and_momentum_space_have_expected_shape
121.84 s
>
121.84 s
> test result: FAILED. 0 passed; 1 failed; 0 ignored; 0 measured; 4 filtered out; finished in 0.12s
121.84 s
>
121.84 s
> stderr ---
121.84 s
> Error: Python API test subprocess failed.
121.84 s
> stdout:
121.84 s
> ┌────────────────────────────────────────────────────────┐
121.84 s
> │ You are running a restricted Symbolica instance. │
121.84 s
> │ │
121.84 s
> │ This mode is only permitted for non-commercial use and │
121.84 s
> │ is limited to one instance and core per machine. │
121.84 s
> │ │
121.84 s
> │ Hobbyists can easily acquire a free license key │
121.84 s
> │ that unlocks all cores and removes this banner: │
121.84 s
> │ │
121.84 s
> │ from symbolica import * │
121.84 s
> │ request_hobbyist_license('YOUR_NAME', 'YOUR_EMAIL') │
121.84 s
> │ │
121.84 s
> │ All other users can obtain a free 30-day trial key: │
121.84 s
> │ │
121.84 s
> │ from symbolica import * │
121.84 s
> │ request_trial_license('NAME', 'EMAIL', 'EMPLOYER') │
121.84 s
> │ │
121.84 s
> │ See https://symbolica.io/docs/get_started.html#license │
121.84 s
> └────────────────────────────────────────────────────────┘
121.84 s
> ┌───────────────────────────────────────────────────────────────────────────────────────────────────────────┐
121.84 s
> │ Cannot start new unlicensed Symbolica instance since there is already another one running on the machine. │
121.84 s
> └───────────────────────────────────────────────────────────────────────────────────────────────────────────┘
121.84 s
>
121.84 s
> stderr:
121.84 s
>
121.84 s
> ┌───────────────────────────────────────────────────────────┐
121.84 s
> │ Could not resolve the IP of the Symbolica license server. │
121.84 s
> │ │
121.84 s
> │ Please check your DNS configuration. │
121.84 s
> └───────────────────────────────────────────────────────────┘
121.84 s
> Error: failed to lookup address information: Temporary failure in name resolution
121.84 s
>
121.84 s
>
121.84 s
> Location:
121.84 s
> tests/tests/test_python_api.rs:156:20
121.84 s
>
121.84 s
> FAIL [ 0.205s] (4/5) gammaloop-integration-tests::test_python_api python_evaluate_sample_honors_generate_events_and_observable_snapshots
121.84 s
> stdout ---
121.84 s
>
121.84 s
> running 1 test
121.84 s
> test python_evaluate_sample_honors_generate_events_and_observable_snapshots ... FAILED
121.84 s
>
121.84 s
> failures:
121.84 s
>
121.84 s
> failures:
121.84 s
> python_evaluate_sample_honors_generate_events_and_observable_snapshots
121.84 s
>
121.84 s
> test result: FAILED. 0 passed; 1 failed; 0 ignored; 0 measured; 4 filtered out; finished in 0.20s
121.84 s
>
121.84 s
> stderr ---
121.84 s
> Error: Python API test subprocess failed.
121.84 s
> stdout:
121.84 s
> ┌────────────────────────────────────────────────────────┐
121.84 s
> │ You are running a restricted Symbolica instance. │
121.84 s
> │ │
121.84 s
> │ This mode is only permitted for non-commercial use and │
121.84 s
> │ is limited to one instance and core per machine. │
121.84 s
> │ │
121.84 s
> │ Hobbyists can easily acquire a free license key │
121.84 s
> │ that unlocks all cores and removes this banner: │
121.84 s
> │ │
121.84 s
> │ from symbolica import * │
121.84 s
> │ request_hobbyist_license('YOUR_NAME', 'YOUR_EMAIL') │
121.84 s
> │ │
121.84 s
> │ All other users can obtain a free 30-day trial key: │
121.84 s
> │ │
121.84 s
> │ from symbolica import * │
121.84 s
> │ request_trial_license('NAME', 'EMAIL', 'EMPLOYER') │
121.84 s
> │ │
121.84 s
> │ See https://symbolica.io/docs/get_started.html#license │
121.84 s
> └────────────────────────────────────────────────────────┘
121.84 s
> ┌───────────────────────────────────────────────────────────────────────────────────────────────────────────┐
121.84 s
> │ Cannot start new unlicensed Symbolica instance since there is already another one running on the machine. │
121.84 s
> └───────────────────────────────────────────────────────────────────────────────────────────────────────────┘
121.84 s
>
121.84 s
> stderr:
121.84 s
>
121.84 s
> ┌───────────────────────────────────────────────────────────┐
121.84 s
> │ Could not resolve the IP of the Symbolica license server. │
121.84 s
> │ │
121.84 s
> │ Please check your DNS configuration. │
121.84 s
> └───────────────────────────────────────────────────────────┘
121.84 s
> Error: failed to lookup address information: Temporary failure in name resolution
121.84 s
> [2026-09-03 15:33:22.333] @gammaloop_api::se... INFO : Running command import model sm-default
121.84 s
> [2026-09-03 15:33:22.333] @import::model INFO : Loading built-in JSON model sm-default
121.84 s
> [2026-09-03 15:33:22.364] @gammalooprs::model INFO : The following 11 external parameters were forced to zero by the restriction card:
121.84 s
> lamWS, AWS, rhoWS, etaWS, ymc, yme, ymm, MC, Me, MM, WTau
121.84 s
> [2026-09-03 15:33:22.364] @gammalooprs::model INFO : The following 34 vertex rules were removed by the restriction card:
121.84 s
> V_82 -> (c~, d, G+) | V_83 -> (t~, d, G+) | V_84 -> (c~, s, G+) | V_85 -> (t~, s, G+) | V_86 -> (u~, b, G+) | V_87 -> (c~, b, G+) | V_90 -> (c~, d, W+) | V_91 -> (t~, d, W+) | V_92 -> (u~, s, W+) | V_94 -> (t~, s, W+) | V_95 -> (u~, b, W+) | V_96 -> (c~, b, W+) | V_101 -> (e+, e-, G0) | V_102 -> (mu+, mu-, G0) | V_104 -> (e+, e-, H) | V_105 -> (mu+, mu-, H) | V_110 -> (ve~, e-, G+) | V_111 -> (vm~, mu-, G+) | V_116 -> (b~, u, G-) | V_117 -> (d~, c, G-) | V_118 -> (s~, c, G-) | V_119 -> (b~, c, G-) | V_120 -> (d~, t, G-) | V_121 -> (s~, t, G-) | V_124 -> (s~, u, W-) | V_125 -> (b~, u, W-) | V_126 -> (d~, c, W-) | V_128 -> (b~, c, W-) | V_129 -> (d~, t, W-) | V_130 -> (s~, t, W-) | V_138 -> (c~, c, G0) | V_140 -> (c~, c, H) | V_145 -> (e+, ve, G-) | V_146 -> (mu+, vm, G-)
121.84 s
> [2026-09-03 15:33:22.364] @gammalooprs::model INFO : The following 36 couplings were removed by the restriction card:
121.84 s
> GC_13, GC_14, GC_16, GC_17, GC_18, GC_19, GC_20, GC_22, GC_23, GC_24, GC_25, GC_26, GC_28, GC_29, GC_42, GC_43, GC_44, GC_46, GC_47, GC_48, GC_84, GC_85, GC_86, GC_87, GC_88, GC_89, GC_90, GC_91, GC_92, GC_93, GC_101, GC_102, GC_103, GC_105, GC_106, GC_107
121.84 s
> [2026-09-03 15:33:22.364] @gammaloop_api::se... INFO : Running command set default-runtime kv kinematics.externals='{"type":"constant","data":{"momenta":[[32.0,0.0,0.0,32.0],[32.0,0.0,0.0,-32.0]],"helicities":[1,1]}}'
121.84 s
> [2026-09-03 15:33:22.365] @gammaloop_api::se... INFO : Running command set default-runtime kv subtraction.disable_threshold_subtraction=true
121.84 s
> [2026-09-03 15:33:22.366] @gammaloop_api::se... INFO : Running command generate xs e+ e- > d d~ g | e- a d g QED^2==4 [{{2}} QCD=0] --numerator-grouping group_identical_graphs_up_to_sign --clear-existing-processes --only-diagrams
121.84 s
> [2026-09-03 15:33:22.368] @feyngen::diagram_... INFO : 0s | Δ=0s | Starting Feynman graph generation with Symbolica...
121.84 s
> [2026-09-03 15:33:22.370] @feyngen::diagram_... INFO : 0s | Δ=0s | Number of graphs resulting from Symbolica generation: 246
121.84 s
> [2026-09-03 15:33:22.370] @feyngen::diagram_... INFO : 0s | Δ=0s | Number of graphs retained after enforcing supergraph particle content: 8
121.84 s
> [2026-09-03 15:33:22.370] @feyngen::diagram_... INFO : 0s | Δ=0s | Number of graphs retained after removal of vetoed topologies: 8
121.84 s
> [2026-09-03 15:33:22.371] @feyngen::diagram_... INFO : 0s | Δ=0s | Number of graphs after vertex info assignment: 8
121.84 s
> [2026-09-03 15:33:22.371] @feyngen::diagram_... INFO : 0s | Δ=0s | Number of graphs after all complete graphs filters are applied: 8
121.84 s
>
121.84 s
>
121.84 s
> Location:
121.84 s
> tests/tests/test_python_api.rs:156:20
121.84 s
>
121.84 s
> FAIL [ 0.219s] (5/5) gammaloop-integration-tests::test_python_api python_settings_wrappers_expose_nested_runtime_and_global_settings
121.84 s
> stdout ---
121.84 s
>
121.84 s
> running 1 test
121.84 s
> test python_settings_wrappers_expose_nested_runtime_and_global_settings ... FAILED
121.84 s
>
121.84 s
> failures:
121.84 s
>
121.84 s
> failures:
121.84 s
> python_settings_wrappers_expose_nested_runtime_and_global_settings
121.84 s
>
121.84 s
> test result: FAILED. 0 passed; 1 failed; 0 ignored; 0 measured; 4 filtered out; finished in 0.22s
121.84 s
>
121.84 s
> stderr ---
121.84 s
> Error: Python API test subprocess failed.
121.84 s
> stdout:
121.84 s
> ┌────────────────────────────────────────────────────────┐
121.84 s
> │ You are running a restricted Symbolica instance. │
121.84 s
> │ │
121.84 s
> │ This mode is only permitted for non-commercial use and │
121.84 s
> │ is limited to one instance and core per machine. │
121.84 s
> │ │
121.84 s
> │ Hobbyists can easily acquire a free license key │
121.84 s
> │ that unlocks all cores and removes this banner: │
121.84 s
> │ │
121.84 s
> │ from symbolica import * │
121.84 s
> │ request_hobbyist_license('YOUR_NAME', 'YOUR_EMAIL') │
121.84 s
> │ │
121.84 s
> │ All other users can obtain a free 30-day trial key: │
121.84 s
> │ │
121.84 s
> │ from symbolica import * │
121.84 s
> │ request_trial_license('NAME', 'EMAIL', 'EMPLOYER') │
121.84 s
> │ │
121.84 s
> │ See https://symbolica.io/docs/get_started.html#license │
121.84 s
> └────────────────────────────────────────────────────────┘
121.84 s
> ┌───────────────────────────────────────────────────────────────────────────────────────────────────────────┐
121.84 s
> │ Cannot start new unlicensed Symbolica instance since there is already another one running on the machine. │
121.84 s
> └───────────────────────────────────────────────────────────────────────────────────────────────────────────┘
121.84 s
>
121.84 s
> stderr:
121.84 s
>
121.84 s
> ┌───────────────────────────────────────────────────────────┐
121.84 s
> │ Could not resolve the IP of the Symbolica license server. │
121.84 s
> │ │
121.84 s
> │ Please check your DNS configuration. │
121.84 s
> └───────────────────────────────────────────────────────────┘
121.84 s
> Error: failed to lookup address information: Temporary failure in name resolution
121.84 s
>
121.84 s
>
121.84 s
> Location:
121.84 s
> tests/tests/test_python_api.rs:156:20
121.84 s
>
121.84 s
> ------------
121.84 s
> Summary [ 0.219s] 5 tests run: 0 passed , 5 failed , 0 skipped
121.84 s
> FAIL [ 0.104s] (1/5) gammaloop-integration-tests::test_python_api python_evaluate_sample_preserves_graph_grouping_and_incoming_pdgs
121.84 s
> stdout ---
121.84 s
>
121.84 s
> running 1 test
121.84 s
> test python_evaluate_sample_preserves_graph_grouping_and_incoming_pdgs ... FAILED
121.84 s
>
121.84 s
> failures:
121.84 s
>
121.84 s
> failures:
121.84 s
> python_evaluate_sample_preserves_graph_grouping_and_incoming_pdgs
121.84 s
>
121.84 s
> test result: FAILED. 0 passed; 1 failed; 0 ignored; 0 measured; 4 filtered out; finished in 0.10s
121.84 s
>
121.84 s
> stderr ---
121.84 s
> Error: Python API test subprocess failed.
121.84 s
> stdout:
121.84 s
> ┌────────────────────────────────────────────────────────┐
121.84 s
> │ You are running a restricted Symbolica instance. │
121.84 s
> │ │
121.84 s
> │ This mode is only permitted for non-commercial use and │
121.84 s
> │ is limited to one instance and core per machine. │
121.84 s
> │ │
121.84 s
> │ Hobbyists can easily acquire a free license key │
121.84 s
> │ that unlocks all cores and removes this banner: │
121.84 s
> │ │
121.84 s
> │ from symbolica import * │
121.84 s
> │ request_hobbyist_license('YOUR_NAME', 'YOUR_EMAIL') │
121.84 s
> │ │
121.84 s
> │ All other users can obtain a free 30-day trial key: │
121.84 s
> │ │
121.84 s
> │ from symbolica import * │
121.84 s
> │ request_trial_license('NAME', 'EMAIL', 'EMPLOYER') │
121.84 s
> │ │
121.84 s
> │ See https://symbolica.io/docs/get_started.html#license │
121.84 s
> └────────────────────────────────────────────────────────┘
121.84 s
> ┌───────────────────────────────────────────────────────────────────────────────────────────────────────────┐
121.84 s
> │ Cannot start new unlicensed Symbolica instance since there is already another one running on the machine. │
121.84 s
> └───────────────────────────────────────────────────────────────────────────────────────────────────────────┘
121.84 s
>
121.84 s
> stderr:
121.84 s
>
121.84 s
> ┌───────────────────────────────────────────────────────────┐
121.84 s
> │ Could not resolve the IP of the Symbolica license server. │
121.84 s
> │ │
121.84 s
> │ Please check your DNS configuration. │
121.84 s
> └───────────────────────────────────────────────────────────┘
121.84 s
> Error: failed to lookup address information: Temporary failure in name resolution
121.84 s
>
121.84 s
>
121.84 s
> Location:
121.84 s
> tests/tests/test_python_api.rs:156:20
121.84 s
>
121.84 s
> FAIL [ 0.109s] (2/5) gammaloop-integration-tests::test_python_api python_session_getters_return_live_toml_and_command_blocks
121.84 s
> stdout ---
121.84 s
>
121.84 s
> running 1 test
121.84 s
> test python_session_getters_return_live_toml_and_command_blocks ... FAILED
121.84 s
>
121.84 s
> failures:
121.84 s
>
121.84 s
> failures:
121.84 s
> python_session_getters_return_live_toml_and_command_blocks
121.84 s
>
121.84 s
> test result: FAILED. 0 passed; 1 failed; 0 ignored; 0 measured; 4 filtered out; finished in 0.10s
121.84 s
>
121.84 s
> stderr ---
121.84 s
> Error: Python API test subprocess failed.
121.84 s
> stdout:
121.84 s
> ┌────────────────────────────────────────────────────────┐
121.84 s
> │ You are running a restricted Symbolica instance. │
121.84 s
> │ │
121.84 s
> │ This mode is only permitted for non-commercial use and │
121.84 s
> │ is limited to one instance and core per machine. │
121.84 s
> │ │
121.84 s
> │ Hobbyists can easily acquire a free license key │
121.84 s
> │ that unlocks all cores and removes this banner: │
121.84 s
> │ │
121.84 s
> │ from symbolica import * │
121.84 s
> │ request_hobbyist_license('YOUR_NAME', 'YOUR_EMAIL') │
121.84 s
> │ │
121.84 s
> │ All other users can obtain a free 30-day trial key: │
121.84 s
> │ │
121.84 s
> │ from symbolica import * │
121.84 s
> │ request_trial_license('NAME', 'EMAIL', 'EMPLOYER') │
121.84 s
> │ │
121.84 s
> │ See https://symbolica.io/docs/get_started.html#license │
121.84 s
> └────────────────────────────────────────────────────────┘
121.84 s
> ┌───────────────────────────────────────────────────────────────────────────────────────────────────────────┐
121.84 s
> │ Cannot start new unlicensed Symbolica instance since there is already another one running on the machine. │
121.84 s
> └───────────────────────────────────────────────────────────────────────────────────────────────────────────┘
121.84 s
>
121.84 s
> stderr:
121.84 s
>
121.84 s
> ┌───────────────────────────────────────────────────────────┐
121.84 s
> │ Could not resolve the IP of the Symbolica license server. │
121.84 s
> │ │
121.84 s
> │ Please check your DNS configuration. │
121.84 s
> └───────────────────────────────────────────────────────────┘
121.84 s
> Error: failed to lookup address information: Temporary failure in name resolution
121.84 s
>
121.84 s
>
121.84 s
> Location:
121.84 s
> tests/tests/test_python_api.rs:156:20
121.84 s
>
121.84 s
> FAIL [ 0.125s] (3/5) gammaloop-integration-tests::test_python_api python_evaluate_samples_batch_and_momentum_space_have_expected_shape
121.84 s
> stdout ---
121.84 s
>
121.84 s
> running 1 test
121.84 s
> test python_evaluate_samples_batch_and_momentum_space_have_expected_shape ... FAILED
121.84 s
>
121.84 s
> failures:
121.84 s
>
121.84 s
> failures:
121.84 s
> python_evaluate_samples_batch_and_momentum_space_have_expected_shape
121.84 s
>
121.84 s
> test result: FAILED. 0 passed; 1 failed; 0 ignored; 0 measured; 4 filtered out; finished in 0.12s
121.84 s
>
121.84 s
> stderr ---
121.84 s
> Error: Python API test subprocess failed.
121.84 s
> stdout:
121.84 s
> ┌────────────────────────────────────────────────────────┐
121.84 s
> │ You are running a restricted Symbolica instance. │
121.84 s
> │ │
121.84 s
> │ This mode is only permitted for non-commercial use and │
121.84 s
> │ is limited to one instance and core per machine. │
121.84 s
> │ │
121.84 s
> │ Hobbyists can easily acquire a free license key │
121.84 s
> │ that unlocks all cores and removes this banner: │
121.84 s
> │ │
121.84 s
> │ from symbolica import * │
121.84 s
> │ request_hobbyist_license('YOUR_NAME', 'YOUR_EMAIL') │
121.84 s
> │ │
121.84 s
> │ All other users can obtain a free 30-day trial key: │
121.84 s
> │ │
121.84 s
> │ from symbolica import * │
121.84 s
> │ request_trial_license('NAME', 'EMAIL', 'EMPLOYER') │
121.84 s
> │ │
121.84 s
> │ See https://symbolica.io/docs/get_started.html#license │
121.84 s
> └────────────────────────────────────────────────────────┘
121.84 s
> ┌───────────────────────────────────────────────────────────────────────────────────────────────────────────┐
121.84 s
> │ Cannot start new unlicensed Symbolica instance since there is already another one running on the machine. │
121.84 s
> └───────────────────────────────────────────────────────────────────────────────────────────────────────────┘
121.84 s
>
121.84 s
> stderr:
121.84 s
>
121.84 s
> ┌───────────────────────────────────────────────────────────┐
121.84 s
> │ Could not resolve the IP of the Symbolica license server. │
121.84 s
> │ │
121.84 s
> │ Please check your DNS configuration. │
121.84 s
> └───────────────────────────────────────────────────────────┘
121.84 s
> Error: failed to lookup address information: Temporary failure in name resolution
121.84 s
>
121.84 s
>
121.84 s
> Location:
121.84 s
> tests/tests/test_python_api.rs:156:20
121.84 s
>
121.84 s
> FAIL [ 0.205s] (4/5) gammaloop-integration-tests::test_python_api python_evaluate_sample_honors_generate_events_and_observable_snapshots
121.84 s
> stdout ---
121.84 s
>
121.84 s
> running 1 test
121.84 s
> test python_evaluate_sample_honors_generate_events_and_observable_snapshots ... FAILED
121.84 s
>
121.84 s
> failures:
121.84 s
>
121.84 s
> failures:
121.84 s
> python_evaluate_sample_honors_generate_events_and_observable_snapshots
121.84 s
>
121.84 s
> test result: FAILED. 0 passed; 1 failed; 0 ignored; 0 measured; 4 filtered out; finished in 0.20s
121.84 s
>
121.84 s
> stderr ---
121.84 s
> Error: Python API test subprocess failed.
121.84 s
> stdout:
121.84 s
> ┌────────────────────────────────────────────────────────┐
121.84 s
> │ You are running a restricted Symbolica instance. │
121.84 s
> │ │
121.84 s
> │ This mode is only permitted for non-commercial use and │
121.84 s
> │ is limited to one instance and core per machine. │
121.84 s
> │ │
121.84 s
> │ Hobbyists can easily acquire a free license key │
121.84 s
> │ that unlocks all cores and removes this banner: │
121.84 s
> │ │
121.84 s
> │ from symbolica import * │
121.84 s
> │ request_hobbyist_license('YOUR_NAME', 'YOUR_EMAIL') │
121.84 s
> │ │
121.84 s
> │ All other users can obtain a free 30-day trial key: │
121.84 s
> │ │
121.84 s
> │ from symbolica import * │
121.84 s
> │ request_trial_license('NAME', 'EMAIL', 'EMPLOYER') │
121.84 s
> │ │
121.84 s
> │ See https://symbolica.io/docs/get_started.html#license │
121.84 s
> └────────────────────────────────────────────────────────┘
121.84 s
> ┌───────────────────────────────────────────────────────────────────────────────────────────────────────────┐
121.84 s
> │ Cannot start new unlicensed Symbolica instance since there is already another one running on the machine. │
121.84 s
> └───────────────────────────────────────────────────────────────────────────────────────────────────────────┘
121.84 s
>
121.84 s
> stderr:
121.84 s
>
121.84 s
> ┌───────────────────────────────────────────────────────────┐
121.84 s
> │ Could not resolve the IP of the Symbolica license server. │
121.84 s
> │ │
121.84 s
> │ Please check your DNS configuration. │
121.84 s
> └───────────────────────────────────────────────────────────┘
121.84 s
> Error: failed to lookup address information: Temporary failure in name resolution
121.84 s
> [2026-09-03 15:33:22.333] @gammaloop_api::se... INFO : Running command import model sm-default
121.84 s
> [2026-09-03 15:33:22.333] @import::model INFO : Loading built-in JSON model sm-default
121.84 s
> [2026-09-03 15:33:22.364] @gammalooprs::model INFO : The following 11 external parameters were forced to zero by the restriction card:
121.84 s
> lamWS, AWS, rhoWS, etaWS, ymc, yme, ymm, MC, Me, MM, WTau
121.84 s
> [2026-09-03 15:33:22.364] @gammalooprs::model INFO : The following 34 vertex rules were removed by the restriction card:
121.84 s
> V_82 -> (c~, d, G+) | V_83 -> (t~, d, G+) | V_84 -> (c~, s, G+) | V_85 -> (t~, s, G+) | V_86 -> (u~, b, G+) | V_87 -> (c~, b, G+) | V_90 -> (c~, d, W+) | V_91 -> (t~, d, W+) | V_92 -> (u~, s, W+) | V_94 -> (t~, s, W+) | V_95 -> (u~, b, W+) | V_96 -> (c~, b, W+) | V_101 -> (e+, e-, G0) | V_102 -> (mu+, mu-, G0) | V_104 -> (e+, e-, H) | V_105 -> (mu+, mu-, H) | V_110 -> (ve~, e-, G+) | V_111 -> (vm~, mu-, G+) | V_116 -> (b~, u, G-) | V_117 -> (d~, c, G-) | V_118 -> (s~, c, G-) | V_119 -> (b~, c, G-) | V_120 -> (d~, t, G-) | V_121 -> (s~, t, G-) | V_124 -> (s~, u, W-) | V_125 -> (b~, u, W-) | V_126 -> (d~, c, W-) | V_128 -> (b~, c, W-) | V_129 -> (d~, t, W-) | V_130 -> (s~, t, W-) | V_138 -> (c~, c, G0) | V_140 -> (c~, c, H) | V_145 -> (e+, ve, G-) | V_146 -> (mu+, vm, G-)
121.84 s
> [2026-09-03 15:33:22.364] @gammalooprs::model INFO : The following 36 couplings were removed by the restriction card:
121.84 s
> GC_13, GC_14, GC_16, GC_17, GC_18, GC_19, GC_20, GC_22, GC_23, GC_24, GC_25, GC_26, GC_28, GC_29, GC_42, GC_43, GC_44, GC_46, GC_47, GC_48, GC_84, GC_85, GC_86, GC_87, GC_88, GC_89, GC_90, GC_91, GC_92, GC_93, GC_101, GC_102, GC_103, GC_105, GC_106, GC_107
121.84 s
> [2026-09-03 15:33:22.364] @gammaloop_api::se... INFO : Running command set default-runtime kv kinematics.externals='{"type":"constant","data":{"momenta":[[32.0,0.0,0.0,32.0],[32.0,0.0,0.0,-32.0]],"helicities":[1,1]}}'
121.84 s
> [2026-09-03 15:33:22.365] @gammaloop_api::se... INFO : Running command set default-runtime kv subtraction.disable_threshold_subtraction=true
121.84 s
> [2026-09-03 15:33:22.366] @gammaloop_api::se... INFO : Running command generate xs e+ e- > d d~ g | e- a d g QED^2==4 [{{2}} QCD=0] --numerator-grouping group_identical_graphs_up_to_sign --clear-existing-processes --only-diagrams
121.84 s
> [2026-09-03 15:33:22.368] @feyngen::diagram_... INFO : 0s | Δ=0s | Starting Feynman graph generation with Symbolica...
121.84 s
> [2026-09-03 15:33:22.370] @feyngen::diagram_... INFO : 0s | Δ=0s | Number of graphs resulting from Symbolica generation: 246
121.84 s
> [2026-09-03 15:33:22.370] @feyngen::diagram_... INFO : 0s | Δ=0s | Number of graphs retained after enforcing supergraph particle content: 8
121.84 s
> [2026-09-03 15:33:22.370] @feyngen::diagram_... INFO : 0s | Δ=0s | Number of graphs retained after removal of vetoed topologies: 8
121.84 s
> [2026-09-03 15:33:22.371] @feyngen::diagram_... INFO : 0s | Δ=0s | Number of graphs after vertex info assignment: 8
121.84 s
> [2026-09-03 15:33:22.371] @feyngen::diagram_... INFO : 0s | Δ=0s | Number of graphs after all complete graphs filters are applied: 8
121.84 s
>
121.84 s
>
121.84 s
> Location:
121.84 s
> tests/tests/test_python_api.rs:156:20
121.84 s
>
121.84 s
> FAIL [ 0.219s] (5/5) gammaloop-integration-tests::test_python_api python_settings_wrappers_expose_nested_runtime_and_global_settings
121.84 s
> stdout ---
121.84 s
>
121.84 s
> running 1 test
121.84 s
> test python_settings_wrappers_expose_nested_runtime_and_global_settings ... FAILED
121.84 s
>
121.84 s
> failures:
121.84 s
>
121.84 s
> failures:
121.84 s
> python_settings_wrappers_expose_nested_runtime_and_global_settings
121.84 s
>
121.84 s
> test result: FAILED. 0 passed; 1 failed; 0 ignored; 0 measured; 4 filtered out; finished in 0.22s
121.84 s
>
121.84 s
> stderr ---
121.84 s
> Error: Python API test subprocess failed.
121.84 s
> stdout:
121.84 s
> ┌────────────────────────────────────────────────────────┐
121.84 s
> │ You are running a restricted Symbolica instance. │
121.84 s
> │ │
121.84 s
> │ This mode is only permitted for non-commercial use and │
121.84 s
> │ is limited to one instance and core per machine. │
121.84 s
> │ │
121.84 s
> │ Hobbyists can easily acquire a free license key │
121.84 s
> │ that unlocks all cores and removes this banner: │
121.84 s
> │ │
121.84 s
> │ from symbolica import * │
121.84 s
> │ request_hobbyist_license('YOUR_NAME', 'YOUR_EMAIL') │
121.84 s
> │ │
121.84 s
> │ All other users can obtain a free 30-day trial key: │
121.84 s
> │ │
121.84 s
> │ from symbolica import * │
121.84 s
> │ request_trial_license('NAME', 'EMAIL', 'EMPLOYER') │
121.84 s
> │ │
121.84 s
> │ See https://symbolica.io/docs/get_started.html#license │
121.84 s
> └────────────────────────────────────────────────────────┘
121.84 s
> ┌───────────────────────────────────────────────────────────────────────────────────────────────────────────┐
121.84 s
> │ Cannot start new unlicensed Symbolica instance since there is already another one running on the machine. │
121.84 s
> └───────────────────────────────────────────────────────────────────────────────────────────────────────────┘
121.84 s
>
121.84 s
> stderr:
121.84 s
>
121.84 s
> ┌───────────────────────────────────────────────────────────┐
121.84 s
> │ Could not resolve the IP of the Symbolica license server. │
121.84 s
> │ │
121.84 s
> │ Please check your DNS configuration. │
121.84 s
> └───────────────────────────────────────────────────────────┘
121.84 s
> Error: failed to lookup address information: Temporary failure in name resolution
121.84 s
>
121.84 s
>
121.84 s
> Location:
121.84 s
> tests/tests/test_python_api.rs:156:20
121.84 s
>
121.84 s
> error : test run failed
121.84 s
>
121.84 s
> ========== nextest test summary ==========
121.84 s
> report: target/nextest/ci_gammaloop/junit.xml
121.84 s
> tests: 5, failures: 5, errors: 0
121.84 s
>
121.84 s
> 1. gammaloop-integration-tests::test_python_api::python_evaluate_sample_preserves_graph_grouping_and_incoming_pdgs
121.84 s
> failure: test failure with exit code 101
121.84 s
> Error: Python API test subprocess failed.
121.84 s
> stdout:
121.84 s
> ┌────────────────────────────────────────────────────────┐
121.84 s
> │ You are running a restricted Symbolica instance. │
121.84 s
> │ │
121.84 s
> │ This mode is only permitted for non-commercial use and │
121.84 s
> │ is limited to one instance and core per machine. │
121.84 s
> │ │
121.84 s
> │ Hobbyists can easily acquire a free license key │
121.84 s
> │ that unlocks all cores and removes this banner: │
121.84 s
> │ │
121.84 s
> │ from symbolica import * │
121.84 s
> │ request_hobbyist_license('YOUR_NAME', 'YOUR_EMAIL') │
121.84 s
> │ │
121.84 s
> │ All other users can obtain a free 30-day trial key: │
121.84 s
> │ │
121.84 s
> │ from symbolica import * │
121.84 s
> │ request_trial_license('NAME', 'EMAIL', 'EMPLOYER') │
121.84 s
> │ │
121.84 s
> │ See https://symbolica.io/docs/get_started.html#license │
121.84 s
> └────────────────────────────────────────────────────────┘
121.84 s
> ┌───────────────────────────────────────────────────────────────────────────────────────────────────────────┐
121.84 s
> │ Cannot start new unlicensed Symbolica instance since there is already another one running on the machine. │
121.84 s
> └───────────────────────────────────────────────────────────────────────────────────────────────────────────┘
121.84 s
>
121.84 s
> stderr:
121.84 s
>
121.84 s
> ┌───────────────────────────────────────────────────────────┐
121.84 s
> │ Could not resolve the IP of the Symbolica license server. │
121.84 s
> │ │
121.84 s
> │ Please check your DNS configuration. │
121.84 s
> └───────────────────────────────────────────────────────────┘
121.84 s
> Error: failed to lookup address information: Temporary failure in name resolution
121.84 s
>
121.84 s
>
121.84 s
> Location:
121.84 s
> tests/tests/test_python_api.rs:156:20
121.84 s
> system-out
121.84 s
> running 1 test
121.84 s
> test python_evaluate_sample_preserves_graph_grouping_and_incoming_pdgs ... FAILED
121.84 s
>
121.84 s
> failures:
121.84 s
>
121.84 s
> failures:
121.84 s
> python_evaluate_sample_preserves_graph_grouping_and_incoming_pdgs
121.84 s
>
121.84 s
> test result: FAILED. 0 passed; 1 failed; 0 ignored; 0 measured; 4 filtered out; finished in 0.10s
121.84 s
> system-err
121.84 s
> Error: Python API test subprocess failed.
121.84 s
> stdout:
121.84 s
> ┌────────────────────────────────────────────────────────┐
121.84 s
> │ You are running a restricted Symbolica instance. │
121.84 s
> │ │
121.84 s
> │ This mode is only permitted for non-commercial use and │
121.84 s
> │ is limited to one instance and core per machine. │
121.84 s
> │ │
121.84 s
> │ Hobbyists can easily acquire a free license key │
121.84 s
> │ that unlocks all cores and removes this banner: │
121.84 s
> │ │
121.84 s
> │ from symbolica import * │
121.84 s
> │ request_hobbyist_license('YOUR_NAME', 'YOUR_EMAIL') │
121.84 s
> │ │
121.84 s
> │ All other users can obtain a free 30-day trial key: │
121.84 s
> │ │
121.84 s
> │ from symbolica import * │
121.84 s
> │ request_trial_license('NAME', 'EMAIL', 'EMPLOYER') │
121.84 s
> │ │
121.84 s
> │ See https://symbolica.io/docs/get_started.html#license │
121.84 s
> └────────────────────────────────────────────────────────┘
121.84 s
> ┌───────────────────────────────────────────────────────────────────────────────────────────────────────────┐
121.84 s
> │ Cannot start new unlicensed Symbolica instance since there is already another one running on the machine. │
121.84 s
> └───────────────────────────────────────────────────────────────────────────────────────────────────────────┘
121.84 s
>
121.84 s
> stderr:
121.84 s
>
121.84 s
> ┌───────────────────────────────────────────────────────────┐
121.84 s
> │ Could not resolve the IP of the Symbolica license server. │
121.84 s
> │ │
121.84 s
> │ Please check your DNS configuration. │
121.84 s
> └───────────────────────────────────────────────────────────┘
121.84 s
> Error: failed to lookup address information: Temporary failure in name resolution
121.84 s
>
121.84 s
>
121.84 s
> Location:
121.84 s
> tests/tests/test_python_api.rs:156:20
121.84 s
>
121.84 s
> 2. gammaloop-integration-tests::test_python_api::python_session_getters_return_live_toml_and_command_blocks
121.84 s
> failure: test failure with exit code 101
121.84 s
> Error: Python API test subprocess failed.
121.84 s
> stdout:
121.84 s
> ┌────────────────────────────────────────────────────────┐
121.84 s
> │ You are running a restricted Symbolica instance. │
121.84 s
> │ │
121.84 s
> │ This mode is only permitted for non-commercial use and │
121.84 s
> │ is limited to one instance and core per machine. │
121.84 s
> │ │
121.84 s
> │ Hobbyists can easily acquire a free license key │
121.84 s
> │ that unlocks all cores and removes this banner: │
121.84 s
> │ │
121.84 s
> │ from symbolica import * │
121.84 s
> │ request_hobbyist_license('YOUR_NAME', 'YOUR_EMAIL') │
121.84 s
> │ │
121.84 s
> │ All other users can obtain a free 30-day trial key: │
121.84 s
> │ │
121.84 s
> │ from symbolica import * │
121.84 s
> │ request_trial_license('NAME', 'EMAIL', 'EMPLOYER') │
121.84 s
> │ │
121.84 s
> │ See https://symbolica.io/docs/get_started.html#license │
121.84 s
> └────────────────────────────────────────────────────────┘
121.84 s
> ┌───────────────────────────────────────────────────────────────────────────────────────────────────────────┐
121.84 s
> │ Cannot start new unlicensed Symbolica instance since there is already another one running on the machine. │
121.84 s
> └───────────────────────────────────────────────────────────────────────────────────────────────────────────┘
121.84 s
>
121.84 s
> stderr:
121.84 s
>
121.84 s
> ┌───────────────────────────────────────────────────────────┐
121.84 s
> │ Could not resolve the IP of the Symbolica license server. │
121.84 s
> │ │
121.84 s
> │ Please check your DNS configuration. │
121.84 s
> └───────────────────────────────────────────────────────────┘
121.84 s
> Error: failed to lookup address information: Temporary failure in name resolution
121.84 s
>
121.84 s
>
121.84 s
> Location:
121.84 s
> tests/tests/test_python_api.rs:156:20
121.84 s
> system-out
121.84 s
> running 1 test
121.84 s
> test python_session_getters_return_live_toml_and_command_blocks ... FAILED
121.84 s
>
121.84 s
> failures:
121.84 s
>
121.84 s
> failures:
121.84 s
> python_session_getters_return_live_toml_and_command_blocks
121.84 s
>
121.84 s
> test result: FAILED. 0 passed; 1 failed; 0 ignored; 0 measured; 4 filtered out; finished in 0.10s
121.84 s
> system-err
121.84 s
> Error: Python API test subprocess failed.
121.84 s
> stdout:
121.84 s
> ┌────────────────────────────────────────────────────────┐
121.84 s
> │ You are running a restricted Symbolica instance. │
121.84 s
> │ │
121.84 s
> │ This mode is only permitted for non-commercial use and │
121.84 s
> │ is limited to one instance and core per machine. │
121.84 s
> │ │
121.84 s
> │ Hobbyists can easily acquire a free license key │
121.84 s
> │ that unlocks all cores and removes this banner: │
121.84 s
> │ │
121.84 s
> │ from symbolica import * │
121.84 s
> │ request_hobbyist_license('YOUR_NAME', 'YOUR_EMAIL') │
121.84 s
> │ │
121.84 s
> │ All other users can obtain a free 30-day trial key: │
121.84 s
> │ │
121.84 s
> │ from symbolica import * │
121.84 s
> │ request_trial_license('NAME', 'EMAIL', 'EMPLOYER') │
121.84 s
> │ │
121.84 s
> │ See https://symbolica.io/docs/get_started.html#license │
121.84 s
> └────────────────────────────────────────────────────────┘
121.84 s
> ┌───────────────────────────────────────────────────────────────────────────────────────────────────────────┐
121.84 s
> │ Cannot start new unlicensed Symbolica instance since there is already another one running on the machine. │
121.84 s
> └───────────────────────────────────────────────────────────────────────────────────────────────────────────┘
121.84 s
>
121.84 s
> stderr:
121.84 s
>
121.84 s
> ┌───────────────────────────────────────────────────────────┐
121.84 s
> │ Could not resolve the IP of the Symbolica license server. │
121.84 s
> │ │
121.84 s
> │ Please check your DNS configuration. │
121.84 s
> └───────────────────────────────────────────────────────────┘
121.84 s
> Error: failed to lookup address information: Temporary failure in name resolution
121.84 s
>
121.84 s
>
121.84 s
> Location:
121.84 s
> tests/tests/test_python_api.rs:156:20
121.84 s
>
121.84 s
> 3. gammaloop-integration-tests::test_python_api::python_evaluate_samples_batch_and_momentum_space_have_expected_shape
121.84 s
> failure: test failure with exit code 101
121.84 s
> Error: Python API test subprocess failed.
121.84 s
> stdout:
121.84 s
> ┌────────────────────────────────────────────────────────┐
121.84 s
> │ You are running a restricted Symbolica instance. │
121.84 s
> │ │
121.84 s
> │ This mode is only permitted for non-commercial use and │
121.84 s
> │ is limited to one instance and core per machine. │
121.84 s
> │ │
121.84 s
> │ Hobbyists can easily acquire a free license key │
121.84 s
> │ that unlocks all cores and removes this banner: │
121.84 s
> │ │
121.84 s
> │ from symbolica import * │
121.84 s
> │ request_hobbyist_license('YOUR_NAME', 'YOUR_EMAIL') │
121.84 s
> │ │
121.84 s
> │ All other users can obtain a free 30-day trial key: │
121.84 s
> │ │
121.84 s
> │ from symbolica import * │
121.84 s
> │ request_trial_license('NAME', 'EMAIL', 'EMPLOYER') │
121.84 s
> │ │
121.84 s
> │ See https://symbolica.io/docs/get_started.html#license │
121.84 s
> └────────────────────────────────────────────────────────┘
121.84 s
> ┌───────────────────────────────────────────────────────────────────────────────────────────────────────────┐
121.84 s
> │ Cannot start new unlicensed Symbolica instance since there is already another one running on the machine. │
121.84 s
> └───────────────────────────────────────────────────────────────────────────────────────────────────────────┘
121.84 s
>
121.84 s
> stderr:
121.84 s
>
121.84 s
> ┌───────────────────────────────────────────────────────────┐
121.84 s
> │ Could not resolve the IP of the Symbolica license server. │
121.84 s
> │ │
121.84 s
> │ Please check your DNS configuration. │
121.84 s
> └───────────────────────────────────────────────────────────┘
121.84 s
> Error: failed to lookup address information: Temporary failure in name resolution
121.84 s
>
121.84 s
>
121.84 s
> Location:
121.84 s
> tests/tests/test_python_api.rs:156:20
121.84 s
> system-out
121.84 s
> running 1 test
121.84 s
> test python_evaluate_samples_batch_and_momentum_space_have_expected_shape ... FAILED
121.84 s
>
121.84 s
> failures:
121.84 s
>
121.84 s
> failures:
121.84 s
> python_evaluate_samples_batch_and_momentum_space_have_expected_shape
121.84 s
>
121.84 s
> test result: FAILED. 0 passed; 1 failed; 0 ignored; 0 measured; 4 filtered out; finished in 0.12s
121.84 s
> system-err
121.84 s
> Error: Python API test subprocess failed.
121.84 s
> stdout:
121.84 s
> ┌────────────────────────────────────────────────────────┐
121.84 s
> │ You are running a restricted Symbolica instance. │
121.84 s
> │ │
121.84 s
> │ This mode is only permitted for non-commercial use and │
121.84 s
> │ is limited to one instance and core per machine. │
121.84 s
> │ │
121.84 s
> │ Hobbyists can easily acquire a free license key │
121.84 s
> │ that unlocks all cores and removes this banner: │
121.84 s
> │ │
121.84 s
> │ from symbolica import * │
121.84 s
> │ request_hobbyist_license('YOUR_NAME', 'YOUR_EMAIL') │
121.84 s
> │ │
121.84 s
> │ All other users can obtain a free 30-day trial key: │
121.84 s
> │ │
121.84 s
> │ from symbolica import * │
121.84 s
> │ request_trial_license('NAME', 'EMAIL', 'EMPLOYER') │
121.84 s
> │ │
121.84 s
> │ See https://symbolica.io/docs/get_started.html#license │
121.84 s
> └────────────────────────────────────────────────────────┘
121.84 s
> ┌───────────────────────────────────────────────────────────────────────────────────────────────────────────┐
121.84 s
> │ Cannot start new unlicensed Symbolica instance since there is already another one running on the machine. │
121.84 s
> └───────────────────────────────────────────────────────────────────────────────────────────────────────────┘
121.84 s
>
121.84 s
> stderr:
121.84 s
>
121.84 s
> ┌───────────────────────────────────────────────────────────┐
121.84 s
> │ Could not resolve the IP of the Symbolica license server. │
121.84 s
> │ │
121.84 s
> │ Please check your DNS configuration. │
121.84 s
> └───────────────────────────────────────────────────────────┘
121.84 s
> Error: failed to lookup address information: Temporary failure in name resolution
121.84 s
>
121.84 s
>
121.84 s
> Location:
121.84 s
> tests/tests/test_python_api.rs:156:20
121.84 s
>
121.84 s
> 4. gammaloop-integration-tests::test_python_api::python_evaluate_sample_honors_generate_events_and_observable_snapshots
121.84 s
> failure: test failure with exit code 101
121.84 s
> Error: Python API test subprocess failed.
121.84 s
> stdout:
121.84 s
> ┌────────────────────────────────────────────────────────┐
121.84 s
> │ You are running a restricted Symbolica instance. │
121.84 s
> │ │
121.84 s
> │ This mode is only permitted for non-commercial use and │
121.84 s
> │ is limited to one instance and core per machine. │
121.84 s
> │ │
121.84 s
> │ Hobbyists can easily acquire a free license key │
121.84 s
> │ that unlocks all cores and removes this banner: │
121.84 s
> │ │
121.84 s
> │ from symbolica import * │
121.84 s
> │ request_hobbyist_license('YOUR_NAME', 'YOUR_EMAIL') │
121.84 s
> │ │
121.84 s
> │ All other users can obtain a free 30-day trial key: │
121.84 s
> │ │
121.84 s
> │ from symbolica import * │
121.84 s
> │ request_trial_license('NAME', 'EMAIL', 'EMPLOYER') │
121.84 s
> │ │
121.84 s
> │ See https://symbolica.io/docs/get_started.html#license │
121.84 s
> └────────────────────────────────────────────────────────┘
121.84 s
> ┌───────────────────────────────────────────────────────────────────────────────────────────────────────────┐
121.84 s
> │ Cannot start new unlicensed Symbolica instance since there is already another one running on the machine. │
121.84 s
> └───────────────────────────────────────────────────────────────────────────────────────────────────────────┘
121.84 s
>
121.84 s
> stderr:
121.84 s
>
121.84 s
> ┌───────────────────────────────────────────────────────────┐
121.84 s
> │ Could not resolve the IP of the Symbolica license server. │
121.84 s
> │ │
121.84 s
> │ Please check your DNS configuration. │
121.84 s
> └───────────────────────────────────────────────────────────┘
121.84 s
> Error: failed to lookup address information: Temporary failure in name resolution
121.84 s
> [2026-09-03 15:33:22.333] @gammaloop_api::se... INFO : Running command import model sm-default
121.84 s
> [2026-09-03 15:33:22.333] @import::model INFO : Loading built-in JSON model sm-default
121.84 s
> [2026-09-03 15:33:22.364] @gammalooprs::model INFO : The following 11 external parameters were forced to zero by the restriction card:
121.84 s
> lamWS, AWS, rhoWS, etaWS, ymc, yme, ymm, MC, Me, MM, WTau
121.84 s
> [2026-09-03 15:33:22.364] @gammalooprs::model INFO : The following 34 vertex rules were removed by the restriction card:
121.84 s
> V_82 -> (c~, d, G+) | V_83 -> (t~, d, G+) | V_84 -> (c~, s, G+) | V_85 -> (t~, s, G+) | V_86 -> (u~, b, G+) | V_87 -> (c~, b, G+) | V_90 -> (c~, d, W+) | V_91 -> (t~, d, W+) | V_92 -> (u~, s, W+) | V_94 -> (t~, s, W+) | V_95 -> (u~, b, W+) | V_96 -> (c~, b, W+) | V_101 -> (e+, e-, G0) | V_102 -> (mu+, mu-, G0) | V_104 -> (e+, e-, H) | V_105 -> (mu+, mu-, H) | V_110 -> (ve~, e-, G+) | V_111 -> (vm~, mu-, G+) | V_116 -> (b~, u, G-) | V_117 -> (d~, c, G-) | V_118 -> (s~, c, G-) | V_119 -> (b~, c, G-) | V_120 -> (d~, t, G-) | V_121 -> (s~, t, G-) | V_124 -> (s~, u, W-) | V_125 -> (b~, u, W-) | V_126 -> (d~, c, W-) | V_128 -> (b~, c, W-) | V_129 -> (d~, t, W-) | V_130 -> (s~, t, W-) | V_138 -> (c~, c, G0) | V_140 -> (c~, c, H) | V_145 -> (e+, ve, G-) | V_146 -> (mu+, vm, G-)
121.84 s
> [2026-09-03 15:33:22.364] @gammalooprs::model INFO : The following 36 couplings were removed by the restriction card:
121.84 s
> GC_13, GC_14, GC_16, GC_17, GC_18, GC_19, GC_20, GC_22, GC_23, GC_24, GC_25, GC_26, GC_28, GC_29, GC_42, GC_43, GC_44, GC_46, GC_47, GC_48, GC_84, GC_85, GC_86, GC_87, GC_88, GC_89, GC_90, GC_91, GC_92, GC_93, GC_101, GC_102, GC_103, GC_105, GC_106, GC_107
121.84 s
> [2026-09-03 15:33:22.364] @gammaloop_api::se... INFO : Running command set default-runtime kv kinematics.externals='{"type":"constant","data":{"momenta":[[32.0,0.0,0.0,32.0],[32.0,0.0,0.0,-32.0]],"helicities":[1,1]}}'
121.84 s
> [2026-09-03 15:33:22.365] @gammaloop_api::se... INFO : Running command set default-runtime kv subtraction.disable_threshold_subtraction=true
121.84 s
> [2026-09-03 15:33:22.366] @gammaloop_api::se... INFO : Running command generate xs e+ e- > d d~ g | e- a d g QED^2==4 [{{2}} QCD=0] --numerator-grouping group_identical_graphs_up_to_sign --clear-existing-processes --only-diagrams
121.84 s
> [2026-09-03 15:33:22.368] @feyngen::diagram_... INFO : 0s | Δ=0s | Starting Feynman graph generation with Symbolica...
121.84 s
> [2026-09-03 15:33:22.370] @feyngen::diagram_... INFO : 0s | Δ=0s | Number of graphs resulting from Symbolica generation: 246
121.84 s
> [2026-09-03 15:33:22.370] @feyngen::diagram_... INFO : 0s | Δ=0s | Number of graphs retained after enforcing supergraph particle content: 8
121.84 s
> [2026-09-03 15:33:22.370] @feyngen::diagram_... INFO : 0s | Δ=0s | Number of graphs retained after removal of vetoed topologies: 8
121.84 s
> [2026-09-03 15:33:22.371] @feyngen::diagram_... INFO : 0s | Δ=0s | Number of graphs after vertex info assignment: 8
121.84 s
> [2026-09-03 15:33:22.371] @feyngen::diagram_... INFO : 0s | Δ=0s | Number of graphs after all complete graphs filters are applied: 8
121.84 s
>
121.84 s
>
121.84 s
> Location:
121.84 s
> tests/tests/test_python_api.rs:156:20
121.84 s
> system-out
121.84 s
> running 1 test
121.84 s
> test python_evaluate_sample_honors_generate_events_and_observable_snapshots ... FAILED
121.84 s
>
121.84 s
> failures:
121.84 s
>
121.84 s
> failures:
121.84 s
> python_evaluate_sample_honors_generate_events_and_observable_snapshots
121.84 s
>
121.84 s
> test result: FAILED. 0 passed; 1 failed; 0 ignored; 0 measured; 4 filtered out; finished in 0.20s
121.84 s
> system-err
121.84 s
> Error: Python API test subprocess failed.
121.84 s
> stdout:
121.84 s
> ┌────────────────────────────────────────────────────────┐
121.84 s
> │ You are running a restricted Symbolica instance. │
121.84 s
> │ │
121.84 s
> │ This mode is only permitted for non-commercial use and │
121.84 s
> │ is limited to one instance and core per machine. │
121.84 s
> │ │
121.84 s
> │ Hobbyists can easily acquire a free license key │
121.84 s
> │ that unlocks all cores and removes this banner: │
121.84 s
> │ │
121.84 s
> │ from symbolica import * │
121.84 s
> │ request_hobbyist_license('YOUR_NAME', 'YOUR_EMAIL') │
121.84 s
> │ │
121.84 s
> │ All other users can obtain a free 30-day trial key: │
121.84 s
> │ │
121.84 s
> │ from symbolica import * │
121.84 s
> │ request_trial_license('NAME', 'EMAIL', 'EMPLOYER') │
121.84 s
> │ │
121.84 s
> │ See https://symbolica.io/docs/get_started.html#license │
121.84 s
> └────────────────────────────────────────────────────────┘
121.84 s
> ┌───────────────────────────────────────────────────────────────────────────────────────────────────────────┐
121.84 s
> │ Cannot start new unlicensed Symbolica instance since there is already another one running on the machine. │
121.84 s
> └───────────────────────────────────────────────────────────────────────────────────────────────────────────┘
121.84 s
>
121.84 s
> stderr:
121.84 s
>
121.84 s
> ┌───────────────────────────────────────────────────────────┐
121.84 s
> │ Could not resolve the IP of the Symbolica license server. │
121.84 s
> │ │
121.84 s
> │ Please check your DNS configuration. │
121.84 s
> └───────────────────────────────────────────────────────────┘
121.84 s
> Error: failed to lookup address information: Temporary failure in name resolution
121.84 s
> [2026-09-03 15:33:22.333] @gammaloop_api::se... INFO : Running command import model sm-default
121.84 s
> [2026-09-03 15:33:22.333] @import::model INFO : Loading built-in JSON model sm-default
121.84 s
> [2026-09-03 15:33:22.364] @gammalooprs::model INFO : The following 11 external parameters were forced to zero by the restriction card:
121.84 s
> lamWS, AWS, rhoWS, etaWS, ymc, yme, ymm, MC, Me, MM, WTau
121.84 s
> [2026-09-03 15:33:22.364] @gammalooprs::model INFO : The following 34 vertex rules were removed by the restriction card:
121.84 s
> V_82 -> (c~, d, G+) | V_83 -> (t~, d, G+) | V_84 -> (c~, s, G+) | V_85 -> (t~, s, G+) | V_86 -> (u~, b, G+) | V_87 -> (c~, b, G+) | V_90 -> (c~, d, W+) | V_91 -> (t~, d, W+) | V_92 -> (u~, s, W+) | V_94 -> (t~, s, W+) | V_95 -> (u~, b, W+) | V_96 -> (c~, b, W+) | V_101 -> (e+, e-, G0) | V_102 -> (mu+, mu-, G0) | V_104 -> (e+, e-, H) | V_105 -> (mu+, mu-, H) | V_110 -> (ve~, e-, G+) | V_111 -> (vm~, mu-, G+) | V_116 -> (b~, u, G-) | V_117 -> (d~, c, G-) | V_118 -> (s~, c, G-) | V_119 -> (b~, c, G-) | V_120 -> (d~, t, G-) | V_121 -> (s~, t, G-) | V_124 -> (s~, u, W-) | V_125 -> (b~, u, W-) | V_126 -> (d~, c, W-) | V_128 -> (b~, c, W-) | V_129 -> (d~, t, W-) | V_130 -> (s~, t, W-) | V_138 -> (c~, c, G0) | V_140 -> (c~, c, H) | V_145 -> (e+, ve, G-) | V_146 -> (mu+, vm, G-)
121.84 s
> [2026-09-03 15:33:22.364] @gammalooprs::model INFO : The following 36 couplings were removed by the restriction card:
121.84 s
> GC_13, GC_14, GC_16, GC_17, GC_18, GC_19, GC_20, GC_22, GC_23, GC_24, GC_25, GC_26, GC_28, GC_29, GC_42, GC_43, GC_44, GC_46, GC_47, GC_48, GC_84, GC_85, GC_86, GC_87, GC_88, GC_89, GC_90, GC_91, GC_92, GC_93, GC_101, GC_102, GC_103, GC_105, GC_106, GC_107
121.84 s
> [2026-09-03 15:33:22.364] @gammaloop_api::se... INFO : Running command set default-runtime kv kinematics.externals='{"type":"constant","data":{"momenta":[[32.0,0.0,0.0,32.0],[32.0,0.0,0.0,-32.0]],"helicities":[1,1]}}'
121.84 s
> [2026-09-03 15:33:22.365] @gammaloop_api::se... INFO : Running command set default-runtime kv subtraction.disable_threshold_subtraction=true
121.84 s
> [2026-09-03 15:33:22.366] @gammaloop_api::se... INFO : Running command generate xs e+ e- > d d~ g | e- a d g QED^2==4 [{{2}} QCD=0] --numerator-grouping group_identical_graphs_up_to_sign --clear-existing-processes --only-diagrams
121.84 s
> [2026-09-03 15:33:22.368] @feyngen::diagram_... INFO : 0s | Δ=0s | Starting Feynman graph generation with Symbolica...
121.84 s
> [2026-09-03 15:33:22.370] @feyngen::diagram_... INFO : 0s | Δ=0s | Number of graphs resulting from Symbolica generation: 246
121.84 s
> [2026-09-03 15:33:22.370] @feyngen::diagram_... INFO : 0s | Δ=0s | Number of graphs retained after enforcing supergraph particle content: 8
121.84 s
> [2026-09-03 15:33:22.370] @feyngen::diagram_... INFO : 0s | Δ=0s | Number of graphs retained after removal of vetoed topologies: 8
121.84 s
> [2026-09-03 15:33:22.371] @feyngen::diagram_... INFO : 0s | Δ=0s | Number of graphs after vertex info assignment: 8
121.84 s
> [2026-09-03 15:33:22.371] @feyngen::diagram_... INFO : 0s | Δ=0s | Number of graphs after all complete graphs filters are applied: 8
121.84 s
>
121.84 s
>
121.84 s
> Location:
121.84 s
> tests/tests/test_python_api.rs:156:20
121.84 s
>
121.84 s
> 5. gammaloop-integration-tests::test_python_api::python_settings_wrappers_expose_nested_runtime_and_global_settings
121.84 s
> failure: test failure with exit code 101
121.84 s
> Error: Python API test subprocess failed.
121.84 s
> stdout:
121.84 s
> ┌────────────────────────────────────────────────────────┐
121.84 s
> │ You are running a restricted Symbolica instance. │
121.84 s
> │ │
121.84 s
> │ This mode is only permitted for non-commercial use and │
121.84 s
> │ is limited to one instance and core per machine. │
121.84 s
> │ │
121.84 s
> │ Hobbyists can easily acquire a free license key │
121.84 s
> │ that unlocks all cores and removes this banner: │
121.84 s
> │ │
121.84 s
> │ from symbolica import * │
121.84 s
> │ request_hobbyist_license('YOUR_NAME', 'YOUR_EMAIL') │
121.84 s
> │ │
121.84 s
> │ All other users can obtain a free 30-day trial key: │
121.84 s
> │ │
121.84 s
> │ from symbolica import * │
121.84 s
> │ request_trial_license('NAME', 'EMAIL', 'EMPLOYER') │
121.84 s
> │ │
121.84 s
> │ See https://symbolica.io/docs/get_started.html#license │
121.84 s
> └────────────────────────────────────────────────────────┘
121.84 s
> ┌───────────────────────────────────────────────────────────────────────────────────────────────────────────┐
121.84 s
> │ Cannot start new unlicensed Symbolica instance since there is already another one running on the machine. │
121.84 s
> └───────────────────────────────────────────────────────────────────────────────────────────────────────────┘
121.84 s
>
121.84 s
> stderr:
121.84 s
>
121.84 s
> ┌───────────────────────────────────────────────────────────┐
121.84 s
> │ Could not resolve the IP of the Symbolica license server. │
121.84 s
> │ │
121.84 s
> │ Please check your DNS configuration. │
121.84 s
> └───────────────────────────────────────────────────────────┘
121.84 s
> Error: failed to lookup address information: Temporary failure in name resolution
121.84 s
>
121.84 s
>
121.84 s
> Location:
121.84 s
> tests/tests/test_python_api.rs:156:20
121.84 s
> system-out
121.84 s
> running 1 test
121.84 s
> test python_settings_wrappers_expose_nested_runtime_and_global_settings ... FAILED
121.84 s
>
121.84 s
> failures:
121.84 s
>
121.84 s
> failures:
121.84 s
> python_settings_wrappers_expose_nested_runtime_and_global_settings
121.84 s
>
121.84 s
> test result: FAILED. 0 passed; 1 failed; 0 ignored; 0 measured; 4 filtered out; finished in 0.22s
121.84 s
> system-err
121.84 s
> Error: Python API test subprocess failed.
121.84 s
> stdout:
121.84 s
> ┌────────────────────────────────────────────────────────┐
121.84 s
> │ You are running a restricted Symbolica instance. │
121.84 s
> │ │
121.84 s
> │ This mode is only permitted for non-commercial use and │
121.84 s
> │ is limited to one instance and core per machine. │
121.84 s
> │ │
121.84 s
> │ Hobbyists can easily acquire a free license key │
121.84 s
> │ that unlocks all cores and removes this banner: │
121.84 s
> │ │
121.84 s
> │ from symbolica import * │
121.84 s
> │ request_hobbyist_license('YOUR_NAME', 'YOUR_EMAIL') │
121.84 s
> │ │
121.84 s
> │ All other users can obtain a free 30-day trial key: │
121.84 s
> │ │
121.84 s
> │ from symbolica import * │
121.84 s
> │ request_trial_license('NAME', 'EMAIL', 'EMPLOYER') │
121.84 s
> │ │
121.84 s
> │ See https://symbolica.io/docs/get_started.html#license │
121.84 s
> └────────────────────────────────────────────────────────┘
121.84 s
> ┌───────────────────────────────────────────────────────────────────────────────────────────────────────────┐
121.84 s
> │ Cannot start new unlicensed Symbolica instance since there is already another one running on the machine. │
121.84 s
> └───────────────────────────────────────────────────────────────────────────────────────────────────────────┘
121.84 s
>
121.84 s
> stderr:
121.84 s
>
121.84 s
> ┌───────────────────────────────────────────────────────────┐
121.84 s
> │ Could not resolve the IP of the Symbolica license server. │
121.84 s
> │ │
121.84 s
> │ Please check your DNS configuration. │
121.84 s
> └───────────────────────────────────────────────────────────┘
121.84 s
> Error: failed to lookup address information: Temporary failure in name resolution
121.84 s
>
121.84 s
>
121.84 s
> Location:
121.84 s
> tests/tests/test_python_api.rs:156:20
121.84 s
> =========================================
121.84 s
For full logs, run:
121.84 s
nix log /nix/store/92rfrz53xqdm3bwmdf3dq8zbdzxy8f7a-gammaloop-nextest-python-api.drv
121.95 s
[0 built (1 failed ), 0.0 Run failed.