1. 0.00 s $ /nix/store/9ypz3flqsrl5xl495mm8h645gadjsxi1-coreutils-9.11/bin/timeout --kill-after=15s 7200s /nix/store/23zk8sgzamrbmj1fday15szf7f2279s8-nix-2.34.7/bin/nix --extra-experimental-features nix-command --extra-experimental-features flakes flake clone git+https://github.com/alphal00p/gammaloop --dest /tmp/nix-ci-worker/stable-pwd/repo/
  2. 0.13 s Cloning into '/tmp/nix-ci-worker/stable-pwd/repo'...
  3. 0.94 s remote: Enumerating objects: 87989, done.
  4. 1.06 s remote: Counting objects: 0% (1/10557) remote: Counting objects: 1% (106/10557) remote: Counting objects: 2% (212/10557) remote: Counting objects: 3% (317/10557) remote: Counting objects: 4% (423/10557) remote: Counting objects: 5% (528/10557) remote: Counting objects: 6% (634/10557) remote: Counting objects: 7% (739/10557) remote: Counting objects: 8% (845/10557) remote: Counting objects: 9% (951/10557) remote: Counting objects: 10% (1056/10557) remote: Counting objects: 11% (1162/10557) remote: Counting objects: 12% (1267/10557) remote: Counting objects: 13% (1373/10557) remote: Counting objects: 14% (1478/10557) remote: Counting objects: 15% (1584/10557) remote: Counting objects: 16% (1690/10557) remote: Counting objects: 17% (1795/10557) remote: Counting objects: 18% (1901/10557) remote: Counting objects: 19% (2006/10557) remote: Counting objects: 20% (2112/10557) remote: Counting objects: 21% (2217/10557) remote: Counting objects: 22% (2323/10557) remote: Counting objects: 23% (2429/10557) remote: Counting objects: 24% (2534/10557) remote: Counting objects: 25% (2640/10557) remote: Counting objects: 26% (2745/10557) remote: Counting objects: 27% (2851/10557) remote: Counting objects: 28% (2956/10557) remote: Counting objects: 29% (3062/10557) remote: Counting objects: 30% (3168/10557) remote: Counting objects: 31% (3273/10557) remote: Counting objects: 32% (3379/10557) remote: Counting objects: 33% (3484/10557) remote: Counting objects: 34% (3590/10557) remote: Counting objects: 35% (3695/10557) remote: Counting objects: 36% (3801/10557) remote: Counting objects: 37% (3907/10557) remote: Counting objects: 38% (4012/10557) remote: Counting objects: 39% (4118/10557) remote: Counting objects: 40% (4223/10557) remote: Counting objects: 41% (4329/10557) remote: Counting objects: 42% (4434/10557) remote: Counting objects: 43% (4540/10557) remote: Counting objects: 44% (4646/10557) remote: Counting objects: 45% (4751/10557) remote: Counting objects: 46% (4857/10557) remote: Counting objects: 47% (4962/10557) remote: Counting objects: 48% (5068/10557) remote: Counting objects: 49% (5173/10557) remote: Counting objects: 50% (5279/10557) remote: Counting objects: 51% (5385/10557) remote: Counting objects: 52% (5490/10557) remote: Counting objects: 53% (5596/10557) remote: Counting objects: 54% (5701/10557) remote: Counting objects: 55% (5807/10557) remote: Counting objects: 56% (5912/10557) remote: Counting objects: 57% (6018/10557) remote: Counting objects: 58% (6124/10557) remote: Counting objects: 59% (6229/10557) remote: Counting objects: 60% (6335/10557) remote: Counting objects: 61% (6440/10557) remote: Counting objects: 62% (6546/10557) remote: Counting objects: 63% (6651/10557) remote: Counting objects: 64% (6757/10557) remote: Counting objects: 65% (6863/10557) remote: Counting objects: 66% (6968/10557) remote: Counting objects: 67% (7074/10557) remote: Counting objects: 68% (7179/10557) remote: Counting objects: 69% (7285/10557) remote: Counting objects: 70% (7390/10557) remote: Counting objects: 71% (7496/10557) remote: Counting objects: 72% (7602/10557) remote: Counting objects: 73% (7707/10557) remote: Counting objects: 74% (7813/10557) remote: Counting objects: 75% (7918/10557) remote: Counting objects: 76% (8024/10557) remote: Counting objects: 77% (8129/10557) remote: Counting objects: 78% (8235/10557) remote: Counting objects: 79% (8341/10557) remote: Counting objects: 80% (8446/10557) remote: Counting objects: 81% (8552/10557) remote: Counting objects: 82% (8657/10557) remote: Counting objects: 83% (8763/10557) remote: Counting objects: 84% (8868/10557) remote: Counting objects: 85% (8974/10557) remote: Counting objects: 86% (9080/10557) remote: Counting objects: 87% (9185/10557) remote: Counting objects: 88% (9291/10557) remote: Counting objects: 89% (9396/10557) remote: Counting objects: 90% (9502/10557) remote: Counting objects: 91% (9607/10557) remote: Counting objects: 92% (9713/10557) remote: Counting objects: 93% (9819/10557) remote: Counting objects: 94% (9924/10557) remote: Counting objects: 95% (10030/10557) remote: Counting objects: 96% (10135/10557) remote: Counting objects: 97% (10241/10557) remote: Counting objects: 98% (10346/10557) remote: Counting objects: 99% (10452/10557) remote: Counting objects: 100% (10557/10557) remote: Counting objects: 100% (10557/10557), done.
  5. 3.92 s remote: Compressing objects: 0% (1/2952) remote: Compressing objects: 1% (30/2952) remote: Compressing objects: 2% (60/2952) remote: Compressing objects: 3% (89/2952) remote: Compressing objects: 4% (119/2952) remote: Compressing objects: 5% (148/2952) remote: Compressing objects: 6% (178/2952) remote: Compressing objects: 7% (207/2952) remote: Compressing objects: 8% (237/2952) remote: Compressing objects: 9% (266/2952) remote: Compressing objects: 10% (296/2952) remote: Compressing objects: 11% (325/2952) remote: Compressing objects: 12% (355/2952) remote: Compressing objects: 13% (384/2952) remote: Compressing objects: 14% (414/2952) remote: Compressing objects: 15% (443/2952) remote: Compressing objects: 15% (449/2952) remote: Compressing objects: 16% (473/2952) remote: Compressing objects: 17% (502/2952) remote: Compressing objects: 18% (532/2952) remote: Compressing objects: 19% (561/2952) remote: Compressing objects: 20% (591/2952) remote: Compressing objects: 21% (620/2952) remote: Compressing objects: 22% (650/2952) remote: Compressing objects: 23% (679/2952) remote: Compressing objects: 24% (709/2952) remote: Compressing objects: 25% (738/2952) remote: Compressing objects: 26% (768/2952) remote: Compressing objects: 26% (782/2952) remote: Compressing objects: 27% (798/2952) remote: Compressing objects: 28% (827/2952) remote: Compressing objects: 29% (857/2952) remote: Compressing objects: 30% (886/2952) remote: Compressing objects: 31% (916/2952) remote: Compressing objects: 32% (945/2952) remote: Compressing objects: 33% (975/2952) remote: Compressing objects: 34% (1004/2952) remote: Compressing objects: 35% (1034/2952) remote: Compressing objects: 36% (1063/2952) remote: Compressing objects: 37% (1093/2952) remote: Compressing objects: 38% (1122/2952) remote: Compressing objects: 39% (1152/2952) remote: Compressing objects: 40% (1181/2952) remote: Compressing objects: 41% (1211/2952) remote: Compressing objects: 42% (1240/2952) remote: Compressing objects: 43% (1270/2952) remote: Compressing objects: 44% (1299/2952) remote: Compressing objects: 45% (1329/2952) remote: Compressing objects: 46% (1358/2952) remote: Compressing objects: 47% (1388/2952) remote: Compressing objects: 48% (1417/2952) remote: Compressing objects: 49% (1447/2952) remote: Compressing objects: 50% (1476/2952) remote: Compressing objects: 51% (1506/2952) remote: Compressing objects: 52% (1536/2952) remote: Compressing objects: 53% (1565/2952) remote: Compressing objects: 54% (1595/2952) remote: Compressing objects: 55% (1624/2952) remote: Compressing objects: 56% (1654/2952) remote: Compressing objects: 57% (1683/2952) remote: Compressing objects: 58% (1713/2952) remote: Compressing objects: 59% (1742/2952) remote: Compressing objects: 60% (1772/2952) remote: Compressing objects: 61% (1801/2952) remote: Compressing objects: 62% (1831/2952) remote: Compressing objects: 63% (1860/2952) remote: Compressing objects: 64% (1890/2952) remote: Compressing objects: 65% (1919/2952) remote: Compressing objects: 66% (1949/2952) remote: Compressing objects: 67% (1978/2952) remote: Compressing objects: 68% (2008/2952) remote: Compressing objects: 69% (2037/2952) remote: Compressing objects: 70% (2067/2952) remote: Compressing objects: 71% (2096/2952) remote: Compressing objects: 72% (2126/2952) remote: Compressing objects: 73% (2155/2952) remote: Compressing objects: 74% (2185/2952) remote: Compressing objects: 75% (2214/2952) remote: Compressing objects: 76% (2244/2952) remote: Compressing objects: 77% (2274/2952) remote: Compressing objects: 78% (2303/2952) remote: Compressing objects: 79% (2333/2952) remote: Compressing objects: 80% (2362/2952) remote: Compressing objects: 81% (2392/2952) remote: Compressing objects: 82% (2421/2952) remote: Compressing objects: 83% (2451/2952) remote: Compressing objects: 84% (2480/2952) remote: Compressing objects: 85% (2510/2952) remote: Compressing objects: 86% (2539/2952) remote: Compressing objects: 87% (2569/2952) remote: Compressing objects: 88% (2598/2952) remote: Compressing objects: 89% (2628/2952) remote: Compressing objects: 90% (2657/2952) remote: Compressing objects: 91% (2687/2952) remote: Compressing objects: 92% (2716/2952) remote: Compressing objects: 93% (2746/2952) remote: Compressing objects: 94% (2775/2952) remote: Compressing objects: 95% (2805/2952) remote: Compressing objects: 96% (2834/2952) remote: Compressing objects: 97% (2864/2952) remote: Compressing objects: 98% (2893/2952) remote: Compressing objects: 99% (2923/2952) remote: Compressing objects: 100% (2952/2952) remote: Compressing objects: 100% (2952/2952), done.
  6. 9.79 s Receiving objects: 0% (1/87989) Receiving objects: 1% (880/87989) Receiving objects: 2% (1760/87989) Receiving objects: 3% (2640/87989) Receiving objects: 4% (3520/87989) Receiving objects: 5% (4400/87989) Receiving objects: 6% (5280/87989) Receiving objects: 7% (6160/87989) Receiving objects: 8% (7040/87989) Receiving objects: 9% (7920/87989), 11.16 MiB | 22.30 MiB/s Receiving objects: 10% (8799/87989), 11.16 MiB | 22.30 MiB/s Receiving objects: 11% (9679/87989), 11.16 MiB | 22.30 MiB/s Receiving objects: 12% (10559/87989), 11.16 MiB | 22.30 MiB/s Receiving objects: 13% (11439/87989), 11.16 MiB | 22.30 MiB/s Receiving objects: 14% (12319/87989), 11.16 MiB | 22.30 MiB/s Receiving objects: 15% (13199/87989), 11.16 MiB | 22.30 MiB/s Receiving objects: 16% (14079/87989), 11.16 MiB | 22.30 MiB/s Receiving objects: 17% (14959/87989), 11.16 MiB | 22.30 MiB/s Receiving objects: 18% (15839/87989), 11.16 MiB | 22.30 MiB/s Receiving objects: 19% (16718/87989), 11.16 MiB | 22.30 MiB/s Receiving objects: 20% (17598/87989), 11.16 MiB | 22.30 MiB/s Receiving objects: 21% (18478/87989), 11.16 MiB | 22.30 MiB/s Receiving objects: 22% (19358/87989), 11.16 MiB | 22.30 MiB/s Receiving objects: 23% (20238/87989), 11.16 MiB | 22.30 MiB/s Receiving objects: 24% (21118/87989), 11.16 MiB | 22.30 MiB/s Receiving objects: 25% (21998/87989), 11.16 MiB | 22.30 MiB/s Receiving objects: 26% (22878/87989), 11.16 MiB | 22.30 MiB/s Receiving objects: 27% (23758/87989), 11.16 MiB | 22.30 MiB/s Receiving objects: 28% (24637/87989), 11.16 MiB | 22.30 MiB/s Receiving objects: 29% (25517/87989), 11.16 MiB | 22.30 MiB/s Receiving objects: 30% (26397/87989), 11.16 MiB | 22.30 MiB/s Receiving objects: 31% (27277/87989), 11.16 MiB | 22.30 MiB/s Receiving objects: 32% (28157/87989), 11.16 MiB | 22.30 MiB/s Receiving objects: 33% (29037/87989), 11.16 MiB | 22.30 MiB/s Receiving objects: 34% (29917/87989), 11.16 MiB | 22.30 MiB/s Receiving objects: 35% (30797/87989), 11.16 MiB | 22.30 MiB/s Receiving objects: 35% (31444/87989), 28.91 MiB | 28.91 MiB/s Receiving objects: 36% (31677/87989), 28.91 MiB | 28.91 MiB/s Receiving objects: 37% (32556/87989), 28.91 MiB | 28.91 MiB/s Receiving objects: 38% (33436/87989), 28.91 MiB | 28.91 MiB/s Receiving objects: 39% (34316/87989), 28.91 MiB | 28.91 MiB/s Receiving objects: 40% (35196/87989), 28.91 MiB | 28.91 MiB/s Receiving objects: 41% (36076/87989), 28.91 MiB | 28.91 MiB/s Receiving objects: 42% (36956/87989), 28.91 MiB | 28.91 MiB/s Receiving objects: 43% (37836/87989), 28.91 MiB | 28.91 MiB/s Receiving objects: 44% (38716/87989), 43.15 MiB | 28.76 MiB/s Receiving objects: 45% (39596/87989), 43.15 MiB | 28.76 MiB/s Receiving objects: 46% (40475/87989), 43.15 MiB | 28.76 MiB/s Receiving objects: 47% (41355/87989), 43.15 MiB | 28.76 MiB/s Receiving objects: 48% (42235/87989), 43.15 MiB | 28.76 MiB/s Receiving objects: 49% (43115/87989), 43.15 MiB | 28.76 MiB/s Receiving objects: 50% (43995/87989), 43.15 MiB | 28.76 MiB/s Receiving objects: 51% (44875/87989), 43.15 MiB | 28.76 MiB/s Receiving objects: 52% (45755/87989), 43.15 MiB | 28.76 MiB/s Receiving objects: 52% (46447/87989), 43.15 MiB | 28.76 MiB/s Receiving objects: 53% (46635/87989), 58.59 MiB | 29.29 MiB/s Receiving objects: 54% (47515/87989), 58.59 MiB | 29.29 MiB/s Receiving objects: 55% (48394/87989), 58.59 MiB | 29.29 MiB/s Receiving objects: 56% (49274/87989), 58.59 MiB | 29.29 MiB/s Receiving objects: 57% (50154/87989), 58.59 MiB | 29.29 MiB/s Receiving objects: 58% (51034/87989), 58.59 MiB | 29.29 MiB/s Receiving objects: 59% (51914/87989), 73.44 MiB | 29.37 MiB/s Receiving objects: 60% (52794/87989), 73.44 MiB | 29.37 MiB/s Receiving objects: 61% (53674/87989), 73.44 MiB | 29.37 MiB/s Receiving objects: 62% (54554/87989), 73.44 MiB | 29.37 MiB/s Receiving objects: 63% (55434/87989), 73.44 MiB | 29.37 MiB/s Receiving objects: 64% (56313/87989), 73.44 MiB | 29.37 MiB/s Receiving objects: 65% (57193/87989), 73.44 MiB | 29.37 MiB/s Receiving objects: 65% (57359/87989), 88.50 MiB | 29.50 MiB/s Receiving objects: 66% (58073/87989), 103.57 MiB | 29.59 MiB/s Receiving objects: 67% (58953/87989), 103.57 MiB | 29.59 MiB/s Receiving objects: 68% (59833/87989), 103.57 MiB | 29.59 MiB/s Receiving objects: 69% (60713/87989), 103.57 MiB | 29.59 MiB/s Receiving objects: 70% (61593/87989), 103.57 MiB | 29.59 MiB/s Receiving objects: 71% (62473/87989), 103.57 MiB | 29.59 MiB/s Receiving objects: 71% (63231/87989), 119.30 MiB | 29.82 MiB/s Receiving objects: 72% (63353/87989), 119.30 MiB | 29.82 MiB/s Receiving objects: 73% (64232/87989), 119.30 MiB | 29.82 MiB/s Receiving objects: 74% (65112/87989), 119.30 MiB | 29.82 MiB/s Receiving objects: 75% (65992/87989), 119.30 MiB | 29.82 MiB/s Receiving objects: 76% (66872/87989), 119.30 MiB | 29.82 MiB/s Receiving objects: 77% (67752/87989), 119.30 MiB | 29.82 MiB/s Receiving objects: 78% (68632/87989), 133.87 MiB | 29.75 MiB/s Receiving objects: 79% (69512/87989), 133.87 MiB | 29.75 MiB/s Receiving objects: 80% (70392/87989), 133.87 MiB | 29.75 MiB/s Receiving objects: 81% (71272/87989), 133.87 MiB | 29.75 MiB/s Receiving objects: 82% (72151/87989), 133.87 MiB | 29.75 MiB/s Receiving objects: 83% (73031/87989), 133.87 MiB | 29.75 MiB/s Receiving objects: 84% (73911/87989), 133.87 MiB | 29.75 MiB/s Receiving objects: 85% (74791/87989), 133.87 MiB | 29.75 MiB/s Receiving objects: 86% (75671/87989), 133.87 MiB | 29.75 MiB/s Receiving objects: 86% (76157/87989), 133.87 MiB | 29.75 MiB/s Receiving objects: 87% (76551/87989), 149.18 MiB | 30.67 MiB/s Receiving objects: 88% (77431/87989), 149.18 MiB | 30.67 MiB/s Receiving objects: 89% (78311/87989), 149.18 MiB | 30.67 MiB/s Receiving objects: 90% (79191/87989), 149.18 MiB | 30.67 MiB/s Receiving objects: 91% (80070/87989), 149.18 MiB | 30.67 MiB/s Receiving objects: 92% (80950/87989), 149.18 MiB | 30.67 MiB/s Receiving objects: 93% (81830/87989), 149.18 MiB | 30.67 MiB/s Receiving objects: 94% (82710/87989), 149.18 MiB | 30.67 MiB/s Receiving objects: 95% (83590/87989), 149.18 MiB | 30.67 MiB/s Receiving objects: 96% (84470/87989), 149.18 MiB | 30.67 MiB/s Receiving objects: 97% (85350/87989), 149.18 MiB | 30.67 MiB/s Receiving objects: 98% (86230/87989), 149.18 MiB | 30.67 MiB/s Receiving objects: 99% (87110/87989), 165.59 MiB | 30.37 MiB/s remote: Total 87989 (delta 8613), reused 8381 (delta 7579), pack-reused 77432 (from 3)
  7. 9.79 s Receiving objects: 100% (87989/87989), 165.59 MiB | 30.37 MiB/s Receiving objects: 100% (87989/87989), 176.53 MiB | 30.04 MiB/s, done.
  8. 11.09 s Resolving deltas: 0% (0/59508) Resolving deltas: 1% (597/59508) Resolving deltas: 2% (1191/59508) Resolving deltas: 3% (1786/59508) Resolving deltas: 4% (2381/59508) Resolving deltas: 5% (2976/59508) Resolving deltas: 6% (3572/59508) Resolving deltas: 7% (4166/59508) Resolving deltas: 8% (4761/59508) Resolving deltas: 9% (5356/59508) Resolving deltas: 10% (5951/59508) Resolving deltas: 11% (6548/59508) Resolving deltas: 12% (7141/59508) Resolving deltas: 13% (7737/59508) Resolving deltas: 14% (8332/59508) Resolving deltas: 15% (8927/59508) Resolving deltas: 16% (9522/59508) Resolving deltas: 17% (10118/59508) Resolving deltas: 18% (10712/59508) Resolving deltas: 19% (11307/59508) Resolving deltas: 20% (11902/59508) Resolving deltas: 21% (12498/59508) Resolving deltas: 22% (13093/59508) Resolving deltas: 23% (13687/59508) Resolving deltas: 24% (14282/59508) Resolving deltas: 25% (14877/59508) Resolving deltas: 26% (15474/59508) Resolving deltas: 27% (16068/59508) Resolving deltas: 28% (16663/59508) Resolving deltas: 29% (17258/59508) Resolving deltas: 30% (17853/59508) Resolving deltas: 31% (18448/59508) Resolving deltas: 32% (19043/59508) Resolving deltas: 33% (19638/59508) Resolving deltas: 34% (20233/59508) Resolving deltas: 35% (20830/59508) Resolving deltas: 36% (21423/59508) Resolving deltas: 37% (22018/59508) Resolving deltas: 38% (22615/59508) Resolving deltas: 39% (23209/59508) Resolving deltas: 40% (23804/59508) Resolving deltas: 41% (24401/59508) Resolving deltas: 42% (24994/59508) Resolving deltas: 43% (25589/59508) Resolving deltas: 44% (26184/59508) Resolving deltas: 45% (26779/59508) Resolving deltas: 46% (27374/59508) Resolving deltas: 47% (27970/59508) Resolving deltas: 48% (28566/59508) Resolving deltas: 49% (29159/59508) Resolving deltas: 50% (29754/59508) Resolving deltas: 51% (30350/59508) Resolving deltas: 52% (30945/59508) Resolving deltas: 53% (31542/59508) Resolving deltas: 54% (32135/59508) Resolving deltas: 55% (32730/59508) Resolving deltas: 56% (33325/59508) Resolving deltas: 57% (33920/59508) Resolving deltas: 58% (34515/59508) Resolving deltas: 59% (35110/59508) Resolving deltas: 60% (35705/59508) Resolving deltas: 61% (36300/59508) Resolving deltas: 62% (36897/59508) Resolving deltas: 63% (37491/59508) Resolving deltas: 64% (38086/59508) Resolving deltas: 65% (38681/59508) Resolving deltas: 66% (39276/59508) Resolving deltas: 67% (39871/59508) Resolving deltas: 68% (40466/59508) Resolving deltas: 69% (41061/59508) Resolving deltas: 70% (41656/59508) Resolving deltas: 71% (42251/59508) Resolving deltas: 72% (42847/59508) Resolving deltas: 73% (43443/59508) Resolving deltas: 74% (44036/59508) Resolving deltas: 75% (44632/59508) Resolving deltas: 76% (45227/59508) Resolving deltas: 77% (45822/59508) Resolving deltas: 77% (46378/59508) Resolving deltas: 78% (46417/59508) Resolving deltas: 79% (47013/59508) Resolving deltas: 80% (47607/59508) Resolving deltas: 81% (48202/59508) Resolving deltas: 82% (48797/59508) Resolving deltas: 83% (49392/59508) Resolving deltas: 84% (49988/59508) Resolving deltas: 85% (50582/59508) Resolving deltas: 86% (51177/59508) Resolving deltas: 87% (51772/59508) Resolving deltas: 88% (52368/59508) Resolving deltas: 89% (52963/59508) Resolving deltas: 90% (53559/59508) Resolving deltas: 91% (54153/59508) Resolving deltas: 92% (54748/59508) Resolving deltas: 93% (55343/59508) Resolving deltas: 94% (55938/59508) Resolving deltas: 95% (56535/59508) Resolving deltas: 96% (57128/59508) Resolving deltas: 97% (57723/59508) Resolving deltas: 98% (58318/59508) Resolving deltas: 99% (58914/59508) Resolving deltas: 100% (59508/59508) Resolving deltas: 100% (59508/59508), done.
  9. 11.59 s Fetching commit 4338252f3f6441dd1159617dee545403b8fb24d4 for docs ...
  10. 11.59 s $ /nix/store/bcnisk3ydfgv26v2gw3zlky24g00yww2-git-2.54.0/bin/git fetch origin 4338252f3f6441dd1159617dee545403b8fb24d4
  11. 12.06 s From https://github.com/alphal00p/gammaloop
  12. 12.06 s * branch 4338252f3f6441dd1159617dee545403b8fb24d4 -> FETCH_HEAD
  13. 12.07 s $ /nix/store/9ypz3flqsrl5xl495mm8h645gadjsxi1-coreutils-9.11/bin/timeout --kill-after=15s 7200s /nix/store/bcnisk3ydfgv26v2gw3zlky24g00yww2-git-2.54.0/bin/git -c advice.detachedHead=false checkout 4338252f3f6441dd1159617dee545403b8fb24d4
  14. 12.36 s HEAD is now at 4338252f3 embed live WASM notebooks in the product guides
  15. 12.36 s $ /nix/store/9ypz3flqsrl5xl495mm8h645gadjsxi1-coreutils-9.11/bin/timeout --kill-after=15s 7200s /nix/store/23zk8sgzamrbmj1fday15szf7f2279s8-nix-2.34.7/bin/nix --extra-experimental-features nix-command --extra-experimental-features flakes --log-format internal-json run .#packages.x86_64-linux.nix-ci-check-gammaloop-nextest-docs --print-build-logs
  16. 12.51 s
  17. 23.75 s evaluating derivation 'g copying '/nix/store/bgss evaluating derivation 'g copying '/nix/store/bgss evaluating derivation 'g copying '/nix/store/bgss evaluating derivation 'g copying '/nix/store/bgss evaluating derivation 'g copying '/nix/store/bgss evaluating derivation 'g copying '/nix/store/bgss evaluating derivation 'g copying '/nix/store/bgss evaluating derivation 'g [0/1 built] [1/0/1 built] building ggammaloop-nextest-docs> Extracting 2 binaries to /build/source
  18. 23.85 s gammaloop-nextest-docs> Extracted 5 files to /build/source in 0.11s
  19. 23.87 s gammaloop-nextest-docs> ------------
  20. 23.87 s gammaloop-nextest-docs> Nextest run ID b5a22949-0314-418c-a581-bbbacd05c642 with nextest profile: ci_gammaloop
  21. 23.87 s gammaloop-nextest-docs> Starting 129 tests across 2 binaries
  22. 70.08 s gammaloop-nextest-docs> FAIL [ 46.205s] (128/129) alphal00p-docs-builder provenance_tests::each_build_captures_one_revision_before_rendering
  23. 70.08 s gammaloop-nextest-docs> stdout ---
  24. 70.08 s gammaloop-nextest-docs>
  25. 70.08 s gammaloop-nextest-docs> running 1 test
  26. 70.08 s gammaloop-nextest-docs>
  27. 70.08 s gammaloop-nextest-docs> running 1 test
  28. 70.08 s gammaloop-nextest-docs> test provenance_tests::each_build_captures_one_revision_before_rendering ... FAILED
  29. 70.08 s gammaloop-nextest-docs>
  30. 70.08 s gammaloop-nextest-docs> failures:
  31. 70.08 s gammaloop-nextest-docs>
  32. 70.08 s gammaloop-nextest-docs> failures:
  33. 70.08 s gammaloop-nextest-docs> provenance_tests::each_build_captures_one_revision_before_rendering
  34. 70.08 s gammaloop-nextest-docs>
  35. 70.08 s gammaloop-nextest-docs> test result: FAILED. 0 passed; 1 failed; 0 ignored; 0 measured; 128 filtered out; finished in 46.11s
  36. 70.08 s gammaloop-nextest-docs>
  37. 70.08 s gammaloop-nextest-docs> test provenance_tests::each_build_captures_one_revision_before_rendering ... FAILED
  38. 70.08 s gammaloop-nextest-docs>
  39. 70.08 s gammaloop-nextest-docs> failures:
  40. 70.08 s gammaloop-nextest-docs>
  41. 70.08 s gammaloop-nextest-docs> failures:
  42. 70.08 s gammaloop-nextest-docs> provenance_tests::each_build_captures_one_revision_before_rendering
  43. 70.08 s gammaloop-nextest-docs>
  44. 70.08 s gammaloop-nextest-docs> test result: FAILED. 0 passed; 1 failed; 0 ignored; 0 measured; 128 filtered out; finished in 46.19s
  45. 70.08 s gammaloop-nextest-docs>
  46. 70.08 s gammaloop-nextest-docs> stderr ---
  47. 70.08 s gammaloop-nextest-docs> warning: bundle export is experimental
  48. 70.08 s gammaloop-nextest-docs> = hint: its behaviour may change at any time
  49. 70.08 s gammaloop-nextest-docs> = hint: do not rely on this feature for production use cases
  50. 70.08 s gammaloop-nextest-docs>
  51. 70.08 s gammaloop-nextest-docs> warning: unknown font family: roboto
  52. 70.08 s gammaloop-nextest-docs> ┌─ crates/linnest/typst/docs/manual.typ:11:28
  53. 70.08 s gammaloop-nextest-docs> │
  54. 70.08 s gammaloop-nextest-docs> 11 │ #set text(size: 10pt, font: "Roboto")
  55. 70.08 s gammaloop-nextest-docs> │ ^^^^^^^^
  56. 70.08 s gammaloop-nextest-docs>
  57. 70.08 s gammaloop-nextest-docs> warning: unknown font family: roboto
  58. 70.08 s gammaloop-nextest-docs> ┌─ crates/linnest/typst/docs/manual.typ:14:29
  59. 70.08 s gammaloop-nextest-docs> │
  60. 70.08 s gammaloop-nextest-docs> 14 │ #set text(size: 3em, font: "Roboto")
  61. 70.08 s gammaloop-nextest-docs> │ ^^^^^^^^
  62. 70.08 s gammaloop-nextest-docs>
  63. 70.08 s gammaloop-nextest-docs> warning: unknown font family: roboto
  64. 70.08 s gammaloop-nextest-docs> ┌─ crates/linnest/typst/docs/manual.typ:16:31
  65. 70.08 s gammaloop-nextest-docs> │
  66. 70.08 s gammaloop-nextest-docs> 16 │ #set text(size: 0.3em, font: "Roboto")
  67. 70.08 s gammaloop-nextest-docs> │ ^^^^^^^^
  68. 70.08 s gammaloop-nextest-docs>
  69. 70.08 s gammaloop-nextest-docs> warning: overline was ignored during MathML export
  70. 70.08 s gammaloop-nextest-docs> ┌─ crates/linnest/typst/docs/manual.typ:949:55
  71. 70.08 s gammaloop-nextest-docs> │
  72. 70.08 s gammaloop-nextest-docs> 949 │ + sum_("dangling" e) c_("dangling-centroid") / (d(e, overline(v)) + epsilon)
  73. 70.08 s gammaloop-nextest-docs> │ ^^^^^^^^^^^
  74. 70.08 s gammaloop-nextest-docs>
  75. 70.08 s gammaloop-nextest-docs> warning: overline was ignored during MathML export
  76. 70.08 s gammaloop-nextest-docs> ┌─ crates/linnest/typst/docs/manual.typ:953:8
  77. 70.08 s gammaloop-nextest-docs> │
  78. 70.08 s gammaloop-nextest-docs> 953 │ Here $overline(v)$ is the mean node position. The centroid term pushes every
  79. 70.08 s gammaloop-nextest-docs> │ ^^^^^^^^^^^
  80. 70.08 s gammaloop-nextest-docs>
  81. 70.08 s gammaloop-nextest-docs>
  82. 70.08 s gammaloop-nextest-docs> thread 'provenance_tests::each_build_captures_one_revision_before_rendering' (248) panicked at crates/alphal00p-docs-builder/src/provenance_tests.rs:297:14:
  83. 70.08 s gammaloop-nextest-docs> called `Result::unwrap()` on an `Err` value: generated site has broken links:
  84. 70.08 s gammaloop-nextest-docs> products/linnet/latest/reference/interfaces/index.html -> https://github.com/alphal00p/gammaloop/blob/1111111111111111111111111111111111111111/crates/linnet-py/examples/physics_render_settings.py (missing repository source file crates/linnet-py/examples/physics_render_settings.py)
  85. 70.08 s gammaloop-nextest-docs> products/linnet/latest/reference/interfaces/index.html -> https://github.com/alphal00p/gammaloop/blob/1111111111111111111111111111111111111111/crates/linnet-py/examples/layout_stream.py (missing repository source file crates/linnet-py/examples/layout_stream.py)
  86. 70.08 s gammaloop-nextest-docs> products/linnet/latest/guides/python-rendering/index.html -> https://github.com/alphal00p/gammaloop/blob/1111111111111111111111111111111111111111/crates/linnet-py/examples/rendering_api.py (missing repository source file crates/linnet-py/examples/rendering_api.py)
  87. 70.08 s gammaloop-nextest-docs> products/linnet/latest/playground/index.html -> https://github.com/alphal00p/gammaloop/blob/1111111111111111111111111111111111111111/crates/linnet-py/examples/layout_stream.py (missing repository source file crates/linnet-py/examples/layout_stream.py)
  88. 70.08 s gammaloop-nextest-docs>
  89. 70.08 s gammaloop-nextest-docs> Location:
  90. 70.08 s gammaloop-nextest-docs> crates/alphal00p-docs-builder/src/lib.rs:4940:9
  91. 70.08 s gammaloop-nextest-docs> stack backtrace:
  92. 70.08 s gammaloop-nextest-docs> 0: __rustc::rust_begin_unwind
  93. 70.08 s gammaloop-nextest-docs> 1: core::panicking::panic_fmt
  94. 70.08 s gammaloop-nextest-docs> 2: core::result::unwrap_failed
  95. 70.08 s gammaloop-nextest-docs> 3: alphal00p_docs_builder::provenance_tests::each_build_captures_one_revision_before_rendering
  96. 70.08 s gammaloop-nextest-docs> 4: <alphal00p_docs_builder::provenance_tests::each_build_captures_one_revision_before_rendering::{closure#0} as core::ops::function::FnOnce<()>>::call_once
  97. 70.08 s gammaloop-nextest-docs> note: Some details are omitted, run with `RUST_BACKTRACE=full` for a verbose backtrace.
  98. 70.08 s gammaloop-nextest-docs>
  99. 70.08 s gammaloop-nextest-docs> thread 'provenance_tests::each_build_captures_one_revision_before_rendering' (187) panicked at crates/alphal00p-docs-builder/src/provenance_tests.rs:274:9:
  100. 70.08 s gammaloop-nextest-docs> assertion failed: command.status().unwrap().success()
  101. 70.08 s gammaloop-nextest-docs> stack backtrace:
  102. 70.08 s gammaloop-nextest-docs> 0: __rustc::rust_begin_unwind
  103. 70.08 s gammaloop-nextest-docs> 1: core::panicking::panic_fmt
  104. 70.08 s gammaloop-nextest-docs> 2: core::panicking::panic
  105. 70.08 s gammaloop-nextest-docs> 3: alphal00p_docs_builder::provenance_tests::each_build_captures_one_revision_before_rendering
  106. 70.08 s gammaloop-nextest-docs> 4: <alphal00p_docs_builder::provenance_tests::each_build_captures_one_revision_before_rendering::{closure#0} as core::ops::function::FnOnce<()>>::call_once
  107. 70.08 s gammaloop-nextest-docs> note: Some details are omitted, run with `RUST_BACKTRACE=full` for a verbose backtrace.
  108. 70.08 s gammaloop-nextest-docs>
  109. 78.25 s gammaloop-nextest-docs> ------------
  110. 78.25 s gammaloop-nextest-docs> Summary [ 54.376s] 129 tests run: 128 passed, 1 failed, 0 skipped
  111. 78.25 s gammaloop-nextest-docs> FAIL [ 46.205s] (128/129) alphal00p-docs-builder provenance_tests::each_build_captures_one_revision_before_rendering
  112. 78.25 s gammaloop-nextest-docs> stdout ---
  113. 78.25 s gammaloop-nextest-docs>
  114. 78.25 s gammaloop-nextest-docs> running 1 test
  115. 78.25 s gammaloop-nextest-docs>
  116. 78.25 s gammaloop-nextest-docs> running 1 test
  117. 78.25 s gammaloop-nextest-docs> test provenance_tests::each_build_captures_one_revision_before_rendering ... FAILED
  118. 78.25 s gammaloop-nextest-docs>
  119. 78.25 s gammaloop-nextest-docs> failures:
  120. 78.25 s gammaloop-nextest-docs>
  121. 78.25 s gammaloop-nextest-docs> failures:
  122. 78.25 s gammaloop-nextest-docs> provenance_tests::each_build_captures_one_revision_before_rendering
  123. 78.25 s gammaloop-nextest-docs>
  124. 78.25 s gammaloop-nextest-docs> test result: FAILED. 0 passed; 1 failed; 0 ignored; 0 measured; 128 filtered out; finished in 46.11s
  125. 78.25 s gammaloop-nextest-docs>
  126. 78.25 s gammaloop-nextest-docs> test provenance_tests::each_build_captures_one_revision_before_rendering ... FAILED
  127. 78.25 s gammaloop-nextest-docs>
  128. 78.25 s gammaloop-nextest-docs> failures:
  129. 78.25 s gammaloop-nextest-docs>
  130. 78.25 s gammaloop-nextest-docs> failures:
  131. 78.25 s gammaloop-nextest-docs> provenance_tests::each_build_captures_one_revision_before_rendering
  132. 78.25 s gammaloop-nextest-docs>
  133. 78.25 s gammaloop-nextest-docs> test result: FAILED. 0 passed; 1 failed; 0 ignored; 0 measured; 128 filtered out; finished in 46.19s
  134. 78.25 s gammaloop-nextest-docs>
  135. 78.25 s gammaloop-nextest-docs> stderr ---
  136. 78.25 s gammaloop-nextest-docs> warning: bundle export is experimental
  137. 78.25 s gammaloop-nextest-docs> = hint: its behaviour may change at any time
  138. 78.25 s gammaloop-nextest-docs> = hint: do not rely on this feature for production use cases
  139. 78.25 s gammaloop-nextest-docs>
  140. 78.25 s gammaloop-nextest-docs> warning: unknown font family: roboto
  141. 78.25 s gammaloop-nextest-docs> ┌─ crates/linnest/typst/docs/manual.typ:11:28
  142. 78.25 s gammaloop-nextest-docs> │
  143. 78.25 s gammaloop-nextest-docs> 11 │ #set text(size: 10pt, font: "Roboto")
  144. 78.25 s gammaloop-nextest-docs> │ ^^^^^^^^
  145. 78.25 s gammaloop-nextest-docs>
  146. 78.25 s gammaloop-nextest-docs> warning: unknown font family: roboto
  147. 78.25 s gammaloop-nextest-docs> ┌─ crates/linnest/typst/docs/manual.typ:14:29
  148. 78.25 s gammaloop-nextest-docs> │
  149. 78.25 s gammaloop-nextest-docs> 14 │ #set text(size: 3em, font: "Roboto")
  150. 78.25 s gammaloop-nextest-docs> │ ^^^^^^^^
  151. 78.25 s gammaloop-nextest-docs>
  152. 78.25 s gammaloop-nextest-docs> warning: unknown font family: roboto
  153. 78.25 s gammaloop-nextest-docs> ┌─ crates/linnest/typst/docs/manual.typ:16:31
  154. 78.25 s gammaloop-nextest-docs> │
  155. 78.25 s gammaloop-nextest-docs> 16 │ #set text(size: 0.3em, font: "Roboto")
  156. 78.25 s gammaloop-nextest-docs> │ ^^^^^^^^
  157. 78.25 s gammaloop-nextest-docs>
  158. 78.25 s gammaloop-nextest-docs> warning: overline was ignored during MathML export
  159. 78.25 s gammaloop-nextest-docs> ┌─ crates/linnest/typst/docs/manual.typ:949:55
  160. 78.25 s gammaloop-nextest-docs> │
  161. 78.25 s gammaloop-nextest-docs> 949 │ + sum_("dangling" e) c_("dangling-centroid") / (d(e, overline(v)) + epsilon)
  162. 78.25 s gammaloop-nextest-docs> │ ^^^^^^^^^^^
  163. 78.25 s gammaloop-nextest-docs>
  164. 78.25 s gammaloop-nextest-docs> warning: overline was ignored during MathML export
  165. 78.25 s gammaloop-nextest-docs> ┌─ crates/linnest/typst/docs/manual.typ:953:8
  166. 78.25 s gammaloop-nextest-docs> │
  167. 78.25 s gammaloop-nextest-docs> 953 │ Here $overline(v)$ is the mean node position. The centroid term pushes every
  168. 78.25 s gammaloop-nextest-docs> │ ^^^^^^^^^^^
  169. 78.25 s gammaloop-nextest-docs>
  170. 78.25 s gammaloop-nextest-docs>
  171. 78.25 s gammaloop-nextest-docs> thread 'provenance_tests::each_build_captures_one_revision_before_rendering' (248) panicked at crates/alphal00p-docs-builder/src/provenance_tests.rs:297:14:
  172. 78.25 s gammaloop-nextest-docs> called `Result::unwrap()` on an `Err` value: generated site has broken links:
  173. 78.25 s gammaloop-nextest-docs> products/linnet/latest/reference/interfaces/index.html -> https://github.com/alphal00p/gammaloop/blob/1111111111111111111111111111111111111111/crates/linnet-py/examples/physics_render_settings.py (missing repository source file crates/linnet-py/examples/physics_render_settings.py)
  174. 78.25 s gammaloop-nextest-docs> products/linnet/latest/reference/interfaces/index.html -> https://github.com/alphal00p/gammaloop/blob/1111111111111111111111111111111111111111/crates/linnet-py/examples/layout_stream.py (missing repository source file crates/linnet-py/examples/layout_stream.py)
  175. 78.25 s gammaloop-nextest-docs> products/linnet/latest/guides/python-rendering/index.html -> https://github.com/alphal00p/gammaloop/blob/1111111111111111111111111111111111111111/crates/linnet-py/examples/rendering_api.py (missing repository source file crates/linnet-py/examples/rendering_api.py)
  176. 78.25 s gammaloop-nextest-docs> products/linnet/latest/playground/index.html -> https://github.com/alphal00p/gammaloop/blob/1111111111111111111111111111111111111111/crates/linnet-py/examples/layout_stream.py (missing repository source file crates/linnet-py/examples/layout_stream.py)
  177. 78.25 s gammaloop-nextest-docs>
  178. 78.25 s gammaloop-nextest-docs> Location:
  179. 78.25 s gammaloop-nextest-docs> crates/alphal00p-docs-builder/src/lib.rs:4940:9
  180. 78.25 s gammaloop-nextest-docs> stack backtrace:
  181. 78.25 s gammaloop-nextest-docs> 0: __rustc::rust_begin_unwind
  182. 78.25 s gammaloop-nextest-docs> 1: core::panicking::panic_fmt
  183. 78.25 s gammaloop-nextest-docs> 2: core::result::unwrap_failed
  184. 78.25 s gammaloop-nextest-docs> 3: alphal00p_docs_builder::provenance_tests::each_build_captures_one_revision_before_rendering
  185. 78.25 s gammaloop-nextest-docs> 4: <alphal00p_docs_builder::provenance_tests::each_build_captures_one_revision_before_rendering::{closure#0} as core::ops::function::FnOnce<()>>::call_once
  186. 78.25 s gammaloop-nextest-docs> note: Some details are omitted, run with `RUST_BACKTRACE=full` for a verbose backtrace.
  187. 78.25 s gammaloop-nextest-docs>
  188. 78.25 s gammaloop-nextest-docs> thread 'provenance_tests::each_build_captures_one_revision_before_rendering' (187) panicked at crates/alphal00p-docs-builder/src/provenance_tests.rs:274:9:
  189. 78.25 s gammaloop-nextest-docs> assertion failed: command.status().unwrap().success()
  190. 78.25 s gammaloop-nextest-docs> stack backtrace:
  191. 78.25 s gammaloop-nextest-docs> 0: __rustc::rust_begin_unwind
  192. 78.25 s gammaloop-nextest-docs> 1: core::panicking::panic_fmt
  193. 78.25 s gammaloop-nextest-docs> 2: core::panicking::panic
  194. 78.25 s gammaloop-nextest-docs> 3: alphal00p_docs_builder::provenance_tests::each_build_captures_one_revision_before_rendering
  195. 78.25 s gammaloop-nextest-docs> 4: <alphal00p_docs_builder::provenance_tests::each_build_captures_one_revision_before_rendering::{closure#0} as core::ops::function::FnOnce<()>>::call_once
  196. 78.25 s gammaloop-nextest-docs> note: Some details are omitted, run with `RUST_BACKTRACE=full` for a verbose backtrace.
  197. 78.25 s gammaloop-nextest-docs>
  198. 78.26 s gammaloop-nextest-docs> error: test run failed
  199. 78.29 s gammaloop-nextest-docs>
  200. 78.29 s gammaloop-nextest-docs> ========== nextest test summary ==========
  201. 78.29 s gammaloop-nextest-docs> report: target/nextest/ci_gammaloop/junit.xml
  202. 78.29 s gammaloop-nextest-docs> tests: 129, failures: 1, errors: 0
  203. 78.29 s gammaloop-nextest-docs>
  204. 78.29 s gammaloop-nextest-docs> 1. alphal00p-docs-builder::provenance_tests::each_build_captures_one_revision_before_rendering
  205. 78.29 s gammaloop-nextest-docs> failure: test failure with exit code 101
  206. 78.29 s gammaloop-nextest-docs> thread 'provenance_tests::each_build_captures_one_revision_before_rendering' (187) panicked at crates/alphal00p-docs-builder/src/provenance_tests.rs:274:9:
  207. 78.29 s gammaloop-nextest-docs> assertion failed: command.status().unwrap().success()
  208. 78.29 s gammaloop-nextest-docs> stack backtrace:
  209. 78.29 s gammaloop-nextest-docs> 0: __rustc::rust_begin_unwind
  210. 78.29 s gammaloop-nextest-docs> 1: core::panicking::panic_fmt
  211. 78.29 s gammaloop-nextest-docs> 2: core::panicking::panic
  212. 78.29 s gammaloop-nextest-docs> 3: alphal00p_docs_builder::provenance_tests::each_build_captures_one_revision_before_rendering
  213. 78.29 s gammaloop-nextest-docs> 4: <alphal00p_docs_builder::provenance_tests::each_build_captures_one_revision_before_rendering::{closure#0} as core::ops::function::FnOnce<()>>::call_once
  214. 78.29 s gammaloop-nextest-docs> note: Some details are omitted, run with `RUST_BACKTRACE=full` for a verbose backtrace.
  215. 78.29 s gammaloop-nextest-docs> system-out
  216. 78.29 s gammaloop-nextest-docs> running 1 test
  217. 78.29 s gammaloop-nextest-docs>
  218. 78.29 s gammaloop-nextest-docs> running 1 test
  219. 78.29 s gammaloop-nextest-docs> test provenance_tests::each_build_captures_one_revision_before_rendering ... FAILED
  220. 78.29 s gammaloop-nextest-docs>
  221. 78.29 s gammaloop-nextest-docs> failures:
  222. 78.29 s gammaloop-nextest-docs>
  223. 78.29 s gammaloop-nextest-docs> failures:
  224. 78.29 s gammaloop-nextest-docs> provenance_tests::each_build_captures_one_revision_before_rendering
  225. 78.29 s gammaloop-nextest-docs>
  226. 78.29 s gammaloop-nextest-docs> test result: FAILED. 0 passed; 1 failed; 0 ignored; 0 measured; 128 filtered out; finished in 46.11s
  227. 78.29 s gammaloop-nextest-docs>
  228. 78.29 s gammaloop-nextest-docs> test provenance_tests::each_build_captures_one_revision_before_rendering ... FAILED
  229. 78.29 s gammaloop-nextest-docs>
  230. 78.29 s gammaloop-nextest-docs> failures:
  231. 78.29 s gammaloop-nextest-docs>
  232. 78.29 s gammaloop-nextest-docs> failures:
  233. 78.29 s gammaloop-nextest-docs> provenance_tests::each_build_captures_one_revision_before_rendering
  234. 78.29 s gammaloop-nextest-docs>
  235. 78.29 s gammaloop-nextest-docs> test result: FAILED. 0 passed; 1 failed; 0 ignored; 0 measured; 128 filtered out; finished in 46.19s
  236. 78.29 s gammaloop-nextest-docs> system-err
  237. 78.29 s gammaloop-nextest-docs> warning: bundle export is experimental
  238. 78.29 s gammaloop-nextest-docs> = hint: its behaviour may change at any time
  239. 78.29 s gammaloop-nextest-docs> = hint: do not rely on this feature for production use cases
  240. 78.29 s gammaloop-nextest-docs>
  241. 78.29 s gammaloop-nextest-docs> warning: unknown font family: roboto
  242. 78.29 s gammaloop-nextest-docs> ┌─ crates/linnest/typst/docs/manual.typ:11:28
  243. 78.29 s gammaloop-nextest-docs> │
  244. 78.29 s gammaloop-nextest-docs> 11 │ #set text(size: 10pt, font: "Roboto")
  245. 78.29 s gammaloop-nextest-docs> │ ^^^^^^^^
  246. 78.29 s gammaloop-nextest-docs>
  247. 78.29 s gammaloop-nextest-docs> warning: unknown font family: roboto
  248. 78.29 s gammaloop-nextest-docs> ┌─ crates/linnest/typst/docs/manual.typ:14:29
  249. 78.29 s gammaloop-nextest-docs> │
  250. 78.29 s gammaloop-nextest-docs> 14 │ #set text(size: 3em, font: "Roboto")
  251. 78.29 s gammaloop-nextest-docs> │ ^^^^^^^^
  252. 78.29 s gammaloop-nextest-docs>
  253. 78.29 s gammaloop-nextest-docs> warning: unknown font family: roboto
  254. 78.29 s gammaloop-nextest-docs> ┌─ crates/linnest/typst/docs/manual.typ:16:31
  255. 78.29 s gammaloop-nextest-docs> │
  256. 78.29 s gammaloop-nextest-docs> 16 │ #set text(size: 0.3em, font: "Roboto")
  257. 78.29 s gammaloop-nextest-docs> │ ^^^^^^^^
  258. 78.29 s gammaloop-nextest-docs>
  259. 78.29 s gammaloop-nextest-docs> warning: overline was ignored during MathML export
  260. 78.29 s gammaloop-nextest-docs> ┌─ crates/linnest/typst/docs/manual.typ:949:55
  261. 78.29 s gammaloop-nextest-docs> │
  262. 78.29 s gammaloop-nextest-docs> 949 │ + sum_("dangling" e) c_("dangling-centroid") / (d(e, overline(v)) + epsilon)
  263. 78.29 s gammaloop-nextest-docs> │ ^^^^^^^^^^^
  264. 78.29 s gammaloop-nextest-docs>
  265. 78.29 s gammaloop-nextest-docs> warning: overline was ignored during MathML export
  266. 78.30 s gammaloop-nextest-docs> ┌─ crates/linnest/typst/docs/manual.typ:953:8
  267. 78.30 s gammaloop-nextest-docs> │
  268. 78.30 s gammaloop-nextest-docs> 953 │ Here $overline(v)$ is the mean node position. The centroid term pushes every
  269. 78.30 s gammaloop-nextest-docs> │ ^^^^^^^^^^^
  270. 78.30 s gammaloop-nextest-docs>
  271. 78.30 s gammaloop-nextest-docs>
  272. 78.30 s gammaloop-nextest-docs> thread 'provenance_tests::each_build_captures_one_revision_before_rendering' (248) panicked at crates/alphal00p-docs-builder/src/provenance_tests.rs:297:14:
  273. 78.30 s gammaloop-nextest-docs> called `Result::unwrap()` on an `Err` value: generated site has broken links:
  274. 78.30 s gammaloop-nextest-docs> products/linnet/latest/reference/interfaces/index.html -> https://github.com/alphal00p/gammaloop/blob/1111111111111111111111111111111111111111/crates/linnet-py/examples/physics_render_settings.py (missing repository source file crates/linnet-py/examples/physics_render_settings.py)
  275. 78.30 s gammaloop-nextest-docs> products/linnet/latest/reference/interfaces/index.html -> https://github.com/alphal00p/gammaloop/blob/1111111111111111111111111111111111111111/crates/linnet-py/examples/layout_stream.py (missing repository source file crates/linnet-py/examples/layout_stream.py)
  276. 78.30 s gammaloop-nextest-docs> products/linnet/latest/guides/python-rendering/index.html -> https://github.com/alphal00p/gammaloop/blob/1111111111111111111111111111111111111111/crates/linnet-py/examples/rendering_api.py (missing repository source file crates/linnet-py/examples/rendering_api.py)
  277. 78.30 s gammaloop-nextest-docs> products/linnet/latest/playground/index.html -> https://github.com/alphal00p/gammaloop/blob/1111111111111111111111111111111111111111/crates/linnet-py/examples/layout_stream.py (missing repository source file crates/linnet-py/examples/layout_stream.py)
  278. 78.30 s gammaloop-nextest-docs>
  279. 78.30 s gammaloop-nextest-docs> Location:
  280. 78.30 s gammaloop-nextest-docs> crates/alphal00p-docs-builder/src/lib.rs:4940:9
  281. 78.30 s gammaloop-nextest-docs> stack backtrace:
  282. 78.30 s gammaloop-nextest-docs> 0: __rustc::rust_begin_unwind
  283. 78.30 s gammaloop-nextest-docs> 1: core::panicking::panic_fmt
  284. 78.30 s gammaloop-nextest-docs> 2: core::result::unwrap_failed
  285. 78.30 s gammaloop-nextest-docs> 3: alphal00p_docs_builder::provenance_tests::each_build_captures_one_revision_before_rendering
  286. 78.30 s gammaloop-nextest-docs> 4: <alphal00p_docs_builder::provenance_tests::each_build_captures_one_revision_before_rendering::{closure#0} as core::ops::function::FnOnce<()>>::call_once
  287. 78.30 s gammaloop-nextest-docs> note: Some details are omitted, run with `RUST_BACKTRACE=full` for a verbose backtrace.
  288. 78.30 s gammaloop-nextest-docs>
  289. 78.30 s gammaloop-nextest-docs> thread 'provenance_tests::each_build_captures_one_revision_before_rendering' (187) panicked at crates/alphal00p-docs-builder/src/provenance_tests.rs:274:9:
  290. 78.30 s gammaloop-nextest-docs> assertion failed: command.status().unwrap().success()
  291. 78.30 s gammaloop-nextest-docs> stack backtrace:
  292. 78.30 s gammaloop-nextest-docs> 0: __rustc::rust_begin_unwind
  293. 78.30 s gammaloop-nextest-docs> 1: core::panicking::panic_fmt
  294. 78.30 s gammaloop-nextest-docs> 2: core::panicking::panic
  295. 78.30 s gammaloop-nextest-docs> 3: alphal00p_docs_builder::provenance_tests::each_build_captures_one_revision_before_rendering
  296. 78.30 s gammaloop-nextest-docs> 4: <alphal00p_docs_builder::provenance_tests::each_build_captures_one_revision_before_rendering::{closure#0} as core::ops::function::FnOnce<()>>::call_once
  297. 78.30 s gammaloop-nextest-docs> note: Some details are omitted, run with `RUST_BACKTRACE=full` for a verbose backtrace.
  298. 78.30 s gammaloop-nextest-docs> =========================================
  299. 78.31 s gammaloop-nextest-docs> Extracting 2 binaries to /build/source
  300. 78.36 s gammaloop-nextest-docs> Extracted 5 files to /build/source in 0.05s
  301. 78.37 s gammaloop-nextest-docs> ------------
  302. 78.37 s gammaloop-nextest-docs> Nextest run ID 5d901acc-d4d5-4a62-85b3-4b580c5b5def with nextest profile: ci_gammaloop
  303. 78.37 s gammaloop-nextest-docs> Starting 22 tests across 2 binaries
  304. 78.39 s gammaloop-nextest-docs> ------------
  305. 78.39 s gammaloop-nextest-docs> Summary [ 0.025s] 22 tests run: 22 passed, 0 skipped
  306. 78.43 s gammaloop-nextest-docs>
  307. 78.43 s gammaloop-nextest-docs> ========== nextest test summary ==========
  308. 78.43 s gammaloop-nextest-docs> report: target/nextest/ci_gammaloop/junit.xml
  309. 78.43 s gammaloop-nextest-docs> tests: 22, failures: 0, errors: 0
  310. 78.43 s gammaloop-nextest-docs> No failing testcases found.
  311. 78.43 s gammaloop-nextest-docs> =========================================
  312. 78.45 s gammaloop-nextest-docs> Extracting 3 binaries (including 2 non-test binaries), 1 build script output directory, and 2 linked paths to /build/source
  313. 78.73 s gammaloop-nextest-docs> Extracted 22 files to /build/source in 0.28s
  314. 78.74 s gammaloop-nextest-docs> ------------
  315. 78.74 s gammaloop-nextest-docs> Nextest run ID b23e7db6-1ff8-4e82-b4fa-6b481dd3d361 with nextest profile: ci_gammaloop
  316. 78.74 s gammaloop-nextest-docs> Starting 89 tests across 1 binary
  317. 78.83 s gammaloop-nextest-docs> ------------
  318. 78.83 s gammaloop-nextest-docs> Summary [ 0.084s] 89 tests run: 89 passed, 0 skipped
  319. 78.87 s gammaloop-nextest-docs>
  320. 78.87 s gammaloop-nextest-docs> ========== nextest test summary ==========
  321. 78.87 s gammaloop-nextest-docs> report: target/nextest/ci_gammaloop/junit.xml
  322. 78.87 s gammaloop-nextest-docs> tests: 89, failures: 0, errors: 0
  323. 78.87 s gammaloop-nextest-docs> No failing testcases found.
  324. 78.87 s gammaloop-nextest-docs> =========================================
  325. 78.88 s gammaloop-nextest-docs> Extracting 2 binaries to /build/source
  326. 78.93 s gammaloop-nextest-docs> Extracted 5 files to /build/source in 0.05s
  327. 78.95 s gammaloop-nextest-docs> ------------
  328. 78.95 s gammaloop-nextest-docs> Nextest run ID f66f585d-35b0-4bf8-bc70-09d6f723a452 with nextest profile: ci_gammaloop
  329. 78.95 s gammaloop-nextest-docs> Starting 10 tests across 2 binaries
  330. 109.75 s gammaloop-nextest-docs> ------------
  331. 109.75 s gammaloop-nextest-docs> Summary [ 30.802s] 10 tests run: 10 passed, 0 skipped
  332. 109.80 s gammaloop-nextest-docs>
  333. 109.80 s gammaloop-nextest-docs> ========== nextest test summary ==========
  334. 109.80 s gammaloop-nextest-docs> report: target/nextest/ci_gammaloop/junit.xml
  335. 109.80 s gammaloop-nextest-docs> tests: 10, failures: 0, errors: 0
  336. 109.80 s gammaloop-nextest-docs> No failing testcases found.
  337. 109.80 s gammaloop-nextest-docs> =========================================
  338. 109.82 s gammaloop-nextest-docs> Extracting 1 binary to /build/source
  339. 109.88 s gammaloop-nextest-docs> Extracted 4 files to /build/source in 0.05s
  340. 109.89 s gammaloop-nextest-docs> ------------
  341. 109.89 s gammaloop-nextest-docs> Nextest run ID 06fe269a-33f5-4b9e-bf3b-3af3fd3f3140 with nextest profile: ci_gammaloop
  342. 109.89 s gammaloop-nextest-docs> Starting 0 tests across 1 binary
  343. 109.89 s gammaloop-nextest-docs> ------------
  344. 109.89 s gammaloop-nextest-docs> Summary [ 0.000s] 0 tests run: 0 passed, 0 skipped
  345. 109.95 s gammaloop-nextest-docs>
  346. 109.95 s gammaloop-nextest-docs> ========== nextest test summary ==========
  347. 109.95 s gammaloop-nextest-docs> report: target/nextest/ci_gammaloop/junit.xml
  348. 109.95 s gammaloop-nextest-docs> tests: 0, failures: 0, errors: 0
  349. 109.95 s gammaloop-nextest-docs> No failing testcases found.
  350. 109.95 s gammaloop-nextest-docs> =========================================
  351. 109.98 s gammaloop-nextest-docs> Extracting 1 binary to /build/source
  352. 110.04 s gammaloop-nextest-docs> Extracted 4 files to /build/source in 0.06s
  353. 110.05 s gammaloop-nextest-docs> ------------
  354. 110.05 s gammaloop-nextest-docs> Nextest run ID bd500b26-7456-487f-9db7-f74e4bb0de9f with nextest profile: ci_gammaloop
  355. 110.05 s gammaloop-nextest-docs> Starting 5 tests across 1 binary
  356. 110.05 s gammaloop-nextest-docs> ------------
  357. 110.05 s gammaloop-nextest-docs> Summary [ 0.007s] 5 tests run: 5 passed, 0 skipped
  358. 110.10 s gammaloop-nextest-docs>
  359. 110.10 s gammaloop-nextest-docs> ========== nextest test summary ==========
  360. 110.10 s gammaloop-nextest-docs> report: target/nextest/ci_gammaloop/junit.xml
  361. 110.10 s gammaloop-nextest-docs> tests: 5, failures: 0, errors: 0
  362. 110.10 s gammaloop-nextest-docs> No failing testcases found.
  363. 110.10 s gammaloop-nextest-docs> =========================================
  364. 110.40 s error: Cannot build '/nix/store/9rs74w2crrwhaq7f0dxdi11wd515i6dj-gammaloop-nextest-docs.drv'.
  365. 110.40 s Reason: builder failed with exit code 100.
  366. 110.40 s Output paths:
  367. 110.40 s /nix/store/1jyipvscqlj4v0h7qjznydlgdlc4bjy7-gammaloop-nextest-docs
  368. 110.40 s Last 347 log lines:
  369. 110.40 s > Extracting 2 binaries to /build/source
  370. 110.40 s > Extracted 5 files to /build/source in 0.11s
  371. 110.40 s > ------------
  372. 110.40 s > Nextest run ID b5a22949-0314-418c-a581-bbbacd05c642 with nextest profile: ci_gammaloop
  373. 110.40 s > Starting 129 tests across 2 binaries
  374. 110.40 s > FAIL [ 46.205s] (128/129) alphal00p-docs-builder provenance_tests::each_build_captures_one_revision_before_rendering
  375. 110.40 s > stdout ---
  376. 110.40 s >
  377. 110.40 s > running 1 test
  378. 110.40 s >
  379. 110.40 s > running 1 test
  380. 110.40 s > test provenance_tests::each_build_captures_one_revision_before_rendering ... FAILED
  381. 110.40 s >
  382. 110.40 s > failures:
  383. 110.40 s >
  384. 110.40 s > failures:
  385. 110.40 s > provenance_tests::each_build_captures_one_revision_before_rendering
  386. 110.40 s >
  387. 110.40 s > test result: FAILED. 0 passed; 1 failed; 0 ignored; 0 measured; 128 filtered out; finished in 46.11s
  388. 110.40 s >
  389. 110.40 s > test provenance_tests::each_build_captures_one_revision_before_rendering ... FAILED
  390. 110.40 s >
  391. 110.40 s > failures:
  392. 110.40 s >
  393. 110.40 s > failures:
  394. 110.40 s > provenance_tests::each_build_captures_one_revision_before_rendering
  395. 110.40 s >
  396. 110.40 s > test result: FAILED. 0 passed; 1 failed; 0 ignored; 0 measured; 128 filtered out; finished in 46.19s
  397. 110.40 s >
  398. 110.40 s > stderr ---
  399. 110.40 s > warning: bundle export is experimental
  400. 110.40 s > = hint: its behaviour may change at any time
  401. 110.40 s > = hint: do not rely on this feature for production use cases
  402. 110.40 s >
  403. 110.40 s > warning: unknown font family: roboto
  404. 110.40 s > ┌─ crates/linnest/typst/docs/manual.typ:11:28
  405. 110.40 s > │
  406. 110.40 s > 11 │ #set text(size: 10pt, font: "Roboto")
  407. 110.40 s > │ ^^^^^^^^
  408. 110.40 s >
  409. 110.40 s > warning: unknown font family: roboto
  410. 110.40 s > ┌─ crates/linnest/typst/docs/manual.typ:14:29
  411. 110.40 s > │
  412. 110.40 s > 14 │ #set text(size: 3em, font: "Roboto")
  413. 110.40 s > │ ^^^^^^^^
  414. 110.40 s >
  415. 110.40 s > warning: unknown font family: roboto
  416. 110.40 s > ┌─ crates/linnest/typst/docs/manual.typ:16:31
  417. 110.40 s > │
  418. 110.40 s > 16 │ #set text(size: 0.3em, font: "Roboto")
  419. 110.40 s > │ ^^^^^^^^
  420. 110.40 s >
  421. 110.40 s > warning: overline was ignored during MathML export
  422. 110.40 s > ┌─ crates/linnest/typst/docs/manual.typ:949:55
  423. 110.40 s > │
  424. 110.40 s > 949 │ + sum_("dangling" e) c_("dangling-centroid") / (d(e, overline(v)) + epsilon)
  425. 110.40 s > │ ^^^^^^^^^^^
  426. 110.40 s >
  427. 110.40 s > warning: overline was ignored during MathML export
  428. 110.40 s > ┌─ crates/linnest/typst/docs/manual.typ:953:8
  429. 110.40 s > │
  430. 110.40 s > 953 │ Here $overline(v)$ is the mean node position. The centroid term pushes every
  431. 110.40 s > │ ^^^^^^^^^^^
  432. 110.40 s >
  433. 110.40 s >
  434. 110.40 s > thread 'provenance_tests::each_build_captures_one_revision_before_rendering' (248) panicked at crates/alphal00p-docs-builder/src/provenance_tests.rs:297:14:
  435. 110.40 s > called `Result::unwrap()` on an `Err` value: generated site has broken links:
  436. 110.40 s > products/linnet/latest/reference/interfaces/index.html -> https://github.com/alphal00p/gammaloop/blob/1111111111111111111111111111111111111111/crates/linnet-py/examples/physics_render_settings.py (missing repository source file crates/linnet-py/examples/physics_render_settings.py)
  437. 110.40 s > products/linnet/latest/reference/interfaces/index.html -> https://github.com/alphal00p/gammaloop/blob/1111111111111111111111111111111111111111/crates/linnet-py/examples/layout_stream.py (missing repository source file crates/linnet-py/examples/layout_stream.py)
  438. 110.40 s > products/linnet/latest/guides/python-rendering/index.html -> https://github.com/alphal00p/gammaloop/blob/1111111111111111111111111111111111111111/crates/linnet-py/examples/rendering_api.py (missing repository source file crates/linnet-py/examples/rendering_api.py)
  439. 110.40 s > products/linnet/latest/playground/index.html -> https://github.com/alphal00p/gammaloop/blob/1111111111111111111111111111111111111111/crates/linnet-py/examples/layout_stream.py (missing repository source file crates/linnet-py/examples/layout_stream.py)
  440. 110.40 s >
  441. 110.40 s > Location:
  442. 110.40 s > crates/alphal00p-docs-builder/src/lib.rs:4940:9
  443. 110.40 s > stack backtrace:
  444. 110.40 s > 0: __rustc::rust_begin_unwind
  445. 110.40 s > 1: core::panicking::panic_fmt
  446. 110.40 s > 2: core::result::unwrap_failed
  447. 110.40 s > 3: alphal00p_docs_builder::provenance_tests::each_build_captures_one_revision_before_rendering
  448. 110.40 s > 4: <alphal00p_docs_builder::provenance_tests::each_build_captures_one_revision_before_rendering::{closure#0} as core::ops::function::FnOnce<()>>::call_once
  449. 110.40 s > note: Some details are omitted, run with `RUST_BACKTRACE=full` for a verbose backtrace.
  450. 110.40 s >
  451. 110.40 s > thread 'provenance_tests::each_build_captures_one_revision_before_rendering' (187) panicked at crates/alphal00p-docs-builder/src/provenance_tests.rs:274:9:
  452. 110.40 s > assertion failed: command.status().unwrap().success()
  453. 110.40 s > stack backtrace:
  454. 110.40 s > 0: __rustc::rust_begin_unwind
  455. 110.40 s > 1: core::panicking::panic_fmt
  456. 110.40 s > 2: core::panicking::panic
  457. 110.40 s > 3: alphal00p_docs_builder::provenance_tests::each_build_captures_one_revision_before_rendering
  458. 110.40 s > 4: <alphal00p_docs_builder::provenance_tests::each_build_captures_one_revision_before_rendering::{closure#0} as core::ops::function::FnOnce<()>>::call_once
  459. 110.40 s > note: Some details are omitted, run with `RUST_BACKTRACE=full` for a verbose backtrace.
  460. 110.40 s >
  461. 110.40 s > ------------
  462. 110.40 s > Summary [ 54.376s] 129 tests run: 128 passed, 1 failed, 0 skipped
  463. 110.40 s > FAIL [ 46.205s] (128/129) alphal00p-docs-builder provenance_tests::each_build_captures_one_revision_before_rendering
  464. 110.40 s > stdout ---
  465. 110.40 s >
  466. 110.40 s > running 1 test
  467. 110.40 s >
  468. 110.40 s > running 1 test
  469. 110.40 s > test provenance_tests::each_build_captures_one_revision_before_rendering ... FAILED
  470. 110.40 s >
  471. 110.40 s > failures:
  472. 110.40 s >
  473. 110.40 s > failures:
  474. 110.40 s > provenance_tests::each_build_captures_one_revision_before_rendering
  475. 110.40 s >
  476. 110.40 s > test result: FAILED. 0 passed; 1 failed; 0 ignored; 0 measured; 128 filtered out; finished in 46.11s
  477. 110.40 s >
  478. 110.40 s > test provenance_tests::each_build_captures_one_revision_before_rendering ... FAILED
  479. 110.40 s >
  480. 110.40 s > failures:
  481. 110.40 s >
  482. 110.40 s > failures:
  483. 110.40 s > provenance_tests::each_build_captures_one_revision_before_rendering
  484. 110.40 s >
  485. 110.40 s > test result: FAILED. 0 passed; 1 failed; 0 ignored; 0 measured; 128 filtered out; finished in 46.19s
  486. 110.40 s >
  487. 110.40 s > stderr ---
  488. 110.40 s > warning: bundle export is experimental
  489. 110.40 s > = hint: its behaviour may change at any time
  490. 110.40 s > = hint: do not rely on this feature for production use cases
  491. 110.40 s >
  492. 110.40 s > warning: unknown font family: roboto
  493. 110.40 s > ┌─ crates/linnest/typst/docs/manual.typ:11:28
  494. 110.40 s > │
  495. 110.40 s > 11 │ #set text(size: 10pt, font: "Roboto")
  496. 110.40 s > │ ^^^^^^^^
  497. 110.40 s >
  498. 110.40 s > warning: unknown font family: roboto
  499. 110.40 s > ┌─ crates/linnest/typst/docs/manual.typ:14:29
  500. 110.40 s > │
  501. 110.40 s > 14 │ #set text(size: 3em, font: "Roboto")
  502. 110.40 s > │ ^^^^^^^^
  503. 110.40 s >
  504. 110.40 s > warning: unknown font family: roboto
  505. 110.40 s > ┌─ crates/linnest/typst/docs/manual.typ:16:31
  506. 110.40 s > │
  507. 110.40 s > 16 │ #set text(size: 0.3em, font: "Roboto")
  508. 110.40 s > │ ^^^^^^^^
  509. 110.40 s >
  510. 110.40 s > warning: overline was ignored during MathML export
  511. 110.40 s > ┌─ crates/linnest/typst/docs/manual.typ:949:55
  512. 110.40 s > │
  513. 110.40 s > 949 │ + sum_("dangling" e) c_("dangling-centroid") / (d(e, overline(v)) + epsilon)
  514. 110.40 s > │ ^^^^^^^^^^^
  515. 110.40 s >
  516. 110.40 s > warning: overline was ignored during MathML export
  517. 110.40 s > ┌─ crates/linnest/typst/docs/manual.typ:953:8
  518. 110.40 s > │
  519. 110.40 s > 953 │ Here $overline(v)$ is the mean node position. The centroid term pushes every
  520. 110.40 s > │ ^^^^^^^^^^^
  521. 110.40 s >
  522. 110.40 s >
  523. 110.40 s > thread 'provenance_tests::each_build_captures_one_revision_before_rendering' (248) panicked at crates/alphal00p-docs-builder/src/provenance_tests.rs:297:14:
  524. 110.40 s > called `Result::unwrap()` on an `Err` value: generated site has broken links:
  525. 110.40 s > products/linnet/latest/reference/interfaces/index.html -> https://github.com/alphal00p/gammaloop/blob/1111111111111111111111111111111111111111/crates/linnet-py/examples/physics_render_settings.py (missing repository source file crates/linnet-py/examples/physics_render_settings.py)
  526. 110.40 s > products/linnet/latest/reference/interfaces/index.html -> https://github.com/alphal00p/gammaloop/blob/1111111111111111111111111111111111111111/crates/linnet-py/examples/layout_stream.py (missing repository source file crates/linnet-py/examples/layout_stream.py)
  527. 110.40 s > products/linnet/latest/guides/python-rendering/index.html -> https://github.com/alphal00p/gammaloop/blob/1111111111111111111111111111111111111111/crates/linnet-py/examples/rendering_api.py (missing repository source file crates/linnet-py/examples/rendering_api.py)
  528. 110.40 s > products/linnet/latest/playground/index.html -> https://github.com/alphal00p/gammaloop/blob/1111111111111111111111111111111111111111/crates/linnet-py/examples/layout_stream.py (missing repository source file crates/linnet-py/examples/layout_stream.py)
  529. 110.40 s >
  530. 110.40 s > Location:
  531. 110.40 s > crates/alphal00p-docs-builder/src/lib.rs:4940:9
  532. 110.40 s > stack backtrace:
  533. 110.40 s > 0: __rustc::rust_begin_unwind
  534. 110.40 s > 1: core::panicking::panic_fmt
  535. 110.40 s > 2: core::result::unwrap_failed
  536. 110.40 s > 3: alphal00p_docs_builder::provenance_tests::each_build_captures_one_revision_before_rendering
  537. 110.40 s > 4: <alphal00p_docs_builder::provenance_tests::each_build_captures_one_revision_before_rendering::{closure#0} as core::ops::function::FnOnce<()>>::call_once
  538. 110.40 s > note: Some details are omitted, run with `RUST_BACKTRACE=full` for a verbose backtrace.
  539. 110.40 s >
  540. 110.40 s > thread 'provenance_tests::each_build_captures_one_revision_before_rendering' (187) panicked at crates/alphal00p-docs-builder/src/provenance_tests.rs:274:9:
  541. 110.40 s > assertion failed: command.status().unwrap().success()
  542. 110.40 s > stack backtrace:
  543. 110.40 s > 0: __rustc::rust_begin_unwind
  544. 110.40 s > 1: core::panicking::panic_fmt
  545. 110.40 s > 2: core::panicking::panic
  546. 110.40 s > 3: alphal00p_docs_builder::provenance_tests::each_build_captures_one_revision_before_rendering
  547. 110.40 s > 4: <alphal00p_docs_builder::provenance_tests::each_build_captures_one_revision_before_rendering::{closure#0} as core::ops::function::FnOnce<()>>::call_once
  548. 110.40 s > note: Some details are omitted, run with `RUST_BACKTRACE=full` for a verbose backtrace.
  549. 110.40 s >
  550. 110.40 s > error: test run failed
  551. 110.40 s >
  552. 110.40 s > ========== nextest test summary ==========
  553. 110.40 s > report: target/nextest/ci_gammaloop/junit.xml
  554. 110.40 s > tests: 129, failures: 1, errors: 0
  555. 110.40 s >
  556. 110.40 s > 1. alphal00p-docs-builder::provenance_tests::each_build_captures_one_revision_before_rendering
  557. 110.40 s > failure: test failure with exit code 101
  558. 110.40 s > thread 'provenance_tests::each_build_captures_one_revision_before_rendering' (187) panicked at crates/alphal00p-docs-builder/src/provenance_tests.rs:274:9:
  559. 110.40 s > assertion failed: command.status().unwrap().success()
  560. 110.40 s > stack backtrace:
  561. 110.40 s > 0: __rustc::rust_begin_unwind
  562. 110.40 s > 1: core::panicking::panic_fmt
  563. 110.40 s > 2: core::panicking::panic
  564. 110.40 s > 3: alphal00p_docs_builder::provenance_tests::each_build_captures_one_revision_before_rendering
  565. 110.41 s > 4: <alphal00p_docs_builder::provenance_tests::each_build_captures_one_revision_before_rendering::{closure#0} as core::ops::function::FnOnce<()>>::call_once
  566. 110.41 s > note: Some details are omitted, run with `RUST_BACKTRACE=full` for a verbose backtrace.
  567. 110.41 s > system-out
  568. 110.41 s > running 1 test
  569. 110.41 s >
  570. 110.41 s > running 1 test
  571. 110.41 s > test provenance_tests::each_build_captures_one_revision_before_rendering ... FAILED
  572. 110.41 s >
  573. 110.41 s > failures:
  574. 110.41 s >
  575. 110.41 s > failures:
  576. 110.41 s > provenance_tests::each_build_captures_one_revision_before_rendering
  577. 110.41 s >
  578. 110.41 s > test result: FAILED. 0 passed; 1 failed; 0 ignored; 0 measured; 128 filtered out; finished in 46.11s
  579. 110.41 s >
  580. 110.41 s > test provenance_tests::each_build_captures_one_revision_before_rendering ... FAILED
  581. 110.41 s >
  582. 110.41 s > failures:
  583. 110.41 s >
  584. 110.41 s > failures:
  585. 110.41 s > provenance_tests::each_build_captures_one_revision_before_rendering
  586. 110.41 s >
  587. 110.41 s > test result: FAILED. 0 passed; 1 failed; 0 ignored; 0 measured; 128 filtered out; finished in 46.19s
  588. 110.41 s > system-err
  589. 110.41 s > warning: bundle export is experimental
  590. 110.41 s > = hint: its behaviour may change at any time
  591. 110.41 s > = hint: do not rely on this feature for production use cases
  592. 110.41 s >
  593. 110.41 s > warning: unknown font family: roboto
  594. 110.41 s > ┌─ crates/linnest/typst/docs/manual.typ:11:28
  595. 110.41 s > │
  596. 110.41 s > 11 │ #set text(size: 10pt, font: "Roboto")
  597. 110.41 s > │ ^^^^^^^^
  598. 110.41 s >
  599. 110.41 s > warning: unknown font family: roboto
  600. 110.41 s > ┌─ crates/linnest/typst/docs/manual.typ:14:29
  601. 110.41 s > │
  602. 110.41 s > 14 │ #set text(size: 3em, font: "Roboto")
  603. 110.41 s > │ ^^^^^^^^
  604. 110.41 s >
  605. 110.41 s > warning: unknown font family: roboto
  606. 110.41 s > ┌─ crates/linnest/typst/docs/manual.typ:16:31
  607. 110.41 s > │
  608. 110.41 s > 16 │ #set text(size: 0.3em, font: "Roboto")
  609. 110.41 s > │ ^^^^^^^^
  610. 110.41 s >
  611. 110.41 s > warning: overline was ignored during MathML export
  612. 110.41 s > ┌─ crates/linnest/typst/docs/manual.typ:949:55
  613. 110.41 s > │
  614. 110.41 s > 949 │ + sum_("dangling" e) c_("dangling-centroid") / (d(e, overline(v)) + epsilon)
  615. 110.41 s > │ ^^^^^^^^^^^
  616. 110.41 s >
  617. 110.41 s > warning: overline was ignored during MathML export
  618. 110.41 s > ┌─ crates/linnest/typst/docs/manual.typ:953:8
  619. 110.41 s > │
  620. 110.41 s > 953 │ Here $overline(v)$ is the mean node position. The centroid term pushes every
  621. 110.41 s > │ ^^^^^^^^^^^
  622. 110.41 s >
  623. 110.41 s >
  624. 110.41 s > thread 'provenance_tests::each_build_captures_one_revision_before_rendering' (248) panicked at crates/alphal00p-docs-builder/src/provenance_tests.rs:297:14:
  625. 110.41 s > called `Result::unwrap()` on an `Err` value: generated site has broken links:
  626. 110.41 s > products/linnet/latest/reference/interfaces/index.html -> https://github.com/alphal00p/gammaloop/blob/1111111111111111111111111111111111111111/crates/linnet-py/examples/physics_render_settings.py (missing repository source file crates/linnet-py/examples/physics_render_settings.py)
  627. 110.41 s > products/linnet/latest/reference/interfaces/index.html -> https://github.com/alphal00p/gammaloop/blob/1111111111111111111111111111111111111111/crates/linnet-py/examples/layout_stream.py (missing repository source file crates/linnet-py/examples/layout_stream.py)
  628. 110.41 s > products/linnet/latest/guides/python-rendering/index.html -> https://github.com/alphal00p/gammaloop/blob/1111111111111111111111111111111111111111/crates/linnet-py/examples/rendering_api.py (missing repository source file crates/linnet-py/examples/rendering_api.py)
  629. 110.41 s > products/linnet/latest/playground/index.html -> https://github.com/alphal00p/gammaloop/blob/1111111111111111111111111111111111111111/crates/linnet-py/examples/layout_stream.py (missing repository source file crates/linnet-py/examples/layout_stream.py)
  630. 110.41 s >
  631. 110.41 s > Location:
  632. 110.41 s > crates/alphal00p-docs-builder/src/lib.rs:4940:9
  633. 110.41 s > stack backtrace:
  634. 110.41 s > 0: __rustc::rust_begin_unwind
  635. 110.41 s > 1: core::panicking::panic_fmt
  636. 110.41 s > 2: core::result::unwrap_failed
  637. 110.41 s > 3: alphal00p_docs_builder::provenance_tests::each_build_captures_one_revision_before_rendering
  638. 110.41 s > 4: <alphal00p_docs_builder::provenance_tests::each_build_captures_one_revision_before_rendering::{closure#0} as core::ops::function::FnOnce<()>>::call_once
  639. 110.41 s > note: Some details are omitted, run with `RUST_BACKTRACE=full` for a verbose backtrace.
  640. 110.41 s >
  641. 110.41 s > thread 'provenance_tests::each_build_captures_one_revision_before_rendering' (187) panicked at crates/alphal00p-docs-builder/src/provenance_tests.rs:274:9:
  642. 110.41 s > assertion failed: command.status().unwrap().success()
  643. 110.41 s > stack backtrace:
  644. 110.41 s > 0: __rustc::rust_begin_unwind
  645. 110.41 s > 1: core::panicking::panic_fmt
  646. 110.41 s > 2: core::panicking::panic
  647. 110.41 s > 3: alphal00p_docs_builder::provenance_tests::each_build_captures_one_revision_before_rendering
  648. 110.41 s > 4: <alphal00p_docs_builder::provenance_tests::each_build_captures_one_revision_before_rendering::{closure#0} as core::ops::function::FnOnce<()>>::call_once
  649. 110.41 s > note: Some details are omitted, run with `RUST_BACKTRACE=full` for a verbose backtrace.
  650. 110.41 s > =========================================
  651. 110.41 s > Extracting 2 binaries to /build/source
  652. 110.41 s > Extracted 5 files to /build/source in 0.05s
  653. 110.41 s > ------------
  654. 110.41 s > Nextest run ID 5d901acc-d4d5-4a62-85b3-4b580c5b5def with nextest profile: ci_gammaloop
  655. 110.41 s > Starting 22 tests across 2 binaries
  656. 110.41 s > ------------
  657. 110.41 s > Summary [ 0.025s] 22 tests run: 22 passed, 0 skipped
  658. 110.41 s >
  659. 110.41 s > ========== nextest test summary ==========
  660. 110.41 s > report: target/nextest/ci_gammaloop/junit.xml
  661. 110.41 s > tests: 22, failures: 0, errors: 0
  662. 110.41 s > No failing testcases found.
  663. 110.41 s > =========================================
  664. 110.41 s > Extracting 3 binaries (including 2 non-test binaries), 1 build script output directory, and 2 linked paths to /build/source
  665. 110.41 s > Extracted 22 files to /build/source in 0.28s
  666. 110.41 s > ------------
  667. 110.41 s > Nextest run ID b23e7db6-1ff8-4e82-b4fa-6b481dd3d361 with nextest profile: ci_gammaloop
  668. 110.41 s > Starting 89 tests across 1 binary
  669. 110.41 s > ------------
  670. 110.41 s > Summary [ 0.084s] 89 tests run: 89 passed, 0 skipped
  671. 110.41 s >
  672. 110.41 s > ========== nextest test summary ==========
  673. 110.41 s > report: target/nextest/ci_gammaloop/junit.xml
  674. 110.41 s > tests: 89, failures: 0, errors: 0
  675. 110.41 s > No failing testcases found.
  676. 110.41 s > =========================================
  677. 110.41 s > Extracting 2 binaries to /build/source
  678. 110.41 s > Extracted 5 files to /build/source in 0.05s
  679. 110.41 s > ------------
  680. 110.41 s > Nextest run ID f66f585d-35b0-4bf8-bc70-09d6f723a452 with nextest profile: ci_gammaloop
  681. 110.41 s > Starting 10 tests across 2 binaries
  682. 110.41 s > ------------
  683. 110.41 s > Summary [ 30.802s] 10 tests run: 10 passed, 0 skipped
  684. 110.41 s >
  685. 110.41 s > ========== nextest test summary ==========
  686. 110.41 s > report: target/nextest/ci_gammaloop/junit.xml
  687. 110.41 s > tests: 10, failures: 0, errors: 0
  688. 110.41 s > No failing testcases found.
  689. 110.41 s > =========================================
  690. 110.41 s > Extracting 1 binary to /build/source
  691. 110.41 s > Extracted 4 files to /build/source in 0.05s
  692. 110.41 s > ------------
  693. 110.41 s > Nextest run ID 06fe269a-33f5-4b9e-bf3b-3af3fd3f3140 with nextest profile: ci_gammaloop
  694. 110.41 s > Starting 0 tests across 1 binary
  695. 110.41 s > ------------
  696. 110.41 s > Summary [ 0.000s] 0 tests run: 0 passed, 0 skipped
  697. 110.41 s >
  698. 110.41 s > ========== nextest test summary ==========
  699. 110.41 s > report: target/nextest/ci_gammaloop/junit.xml
  700. 110.41 s > tests: 0, failures: 0, errors: 0
  701. 110.41 s > No failing testcases found.
  702. 110.41 s > =========================================
  703. 110.41 s > Extracting 1 binary to /build/source
  704. 110.41 s > Extracted 4 files to /build/source in 0.06s
  705. 110.41 s > ------------
  706. 110.41 s > Nextest run ID bd500b26-7456-487f-9db7-f74e4bb0de9f with nextest profile: ci_gammaloop
  707. 110.41 s > Starting 5 tests across 1 binary
  708. 110.41 s > ------------
  709. 110.41 s > Summary [ 0.007s] 5 tests run: 5 passed, 0 skipped
  710. 110.41 s >
  711. 110.41 s > ========== nextest test summary ==========
  712. 110.41 s > report: target/nextest/ci_gammaloop/junit.xml
  713. 110.41 s > tests: 5, failures: 0, errors: 0
  714. 110.41 s > No failing testcases found.
  715. 110.41 s > =========================================
  716. 110.41 s For full logs, run:
  717. 110.41 s nix log /nix/store/9rs74w2crrwhaq7f0dxdi11wd515i6dj-gammaloop-nextest-docs.drv
  718. 110.57 s [0 built (1 failed)]Run failed.