test packages.x86_64-linux.nix-ci-check-gammaloop-nextest-docs
0.00 s
$ /nix/store/9ypz3flqsrl5xl495mm8h645gadjsxi1-coreutils-9.11/bin/timeout --kill-after=15s 7200s /nix/store/23zk8sgzamrbmj1fday15szf7f2279s8-nix-2.34.7/bin/nix --extra-experimental-features nix-command --extra-experimental-features flakes flake clone git+https://github.com/alphal00p/gammaloop --dest /tmp/nix-ci-worker/stable-pwd/repo/
0.13 s
Cloning into '/tmp/nix-ci-worker/stable-pwd/repo'...
0.94 s
remote: Enumerating objects: 87989, done.
1.06 s
remote: Counting objects: 0% (1/10557)
remote: Counting objects: 1% (106/10557)
remote: Counting objects: 2% (212/10557)
remote: Counting objects: 3% (317/10557)
remote: Counting objects: 4% (423/10557)
remote: Counting objects: 5% (528/10557)
remote: Counting objects: 6% (634/10557)
remote: Counting objects: 7% (739/10557)
remote: Counting objects: 8% (845/10557)
remote: Counting objects: 9% (951/10557)
remote: Counting objects: 10% (1056/10557)
remote: Counting objects: 11% (1162/10557)
remote: Counting objects: 12% (1267/10557)
remote: Counting objects: 13% (1373/10557)
remote: Counting objects: 14% (1478/10557)
remote: Counting objects: 15% (1584/10557)
remote: Counting objects: 16% (1690/10557)
remote: Counting objects: 17% (1795/10557)
remote: Counting objects: 18% (1901/10557)
remote: Counting objects: 19% (2006/10557)
remote: Counting objects: 20% (2112/10557)
remote: Counting objects: 21% (2217/10557)
remote: Counting objects: 22% (2323/10557)
remote: Counting objects: 23% (2429/10557)
remote: Counting objects: 24% (2534/10557)
remote: Counting objects: 25% (2640/10557)
remote: Counting objects: 26% (2745/10557)
remote: Counting objects: 27% (2851/10557)
remote: Counting objects: 28% (2956/10557)
remote: Counting objects: 29% (3062/10557)
remote: Counting objects: 30% (3168/10557)
remote: Counting objects: 31% (3273/10557)
remote: Counting objects: 32% (3379/10557)
remote: Counting objects: 33% (3484/10557)
remote: Counting objects: 34% (3590/10557)
remote: Counting objects: 35% (3695/10557)
remote: Counting objects: 36% (3801/10557)
remote: Counting objects: 37% (3907/10557)
remote: Counting objects: 38% (4012/10557)
remote: Counting objects: 39% (4118/10557)
remote: Counting objects: 40% (4223/10557)
remote: Counting objects: 41% (4329/10557)
remote: Counting objects: 42% (4434/10557)
remote: Counting objects: 43% (4540/10557)
remote: Counting objects: 44% (4646/10557)
remote: Counting objects: 45% (4751/10557)
remote: Counting objects: 46% (4857/10557)
remote: Counting objects: 47% (4962/10557)
remote: Counting objects: 48% (5068/10557)
remote: Counting objects: 49% (5173/10557)
remote: Counting objects: 50% (5279/10557)
remote: Counting objects: 51% (5385/10557)
remote: Counting objects: 52% (5490/10557)
remote: Counting objects: 53% (5596/10557)
remote: Counting objects: 54% (5701/10557)
remote: Counting objects: 55% (5807/10557)
remote: Counting objects: 56% (5912/10557)
remote: Counting objects: 57% (6018/10557)
remote: Counting objects: 58% (6124/10557)
remote: Counting objects: 59% (6229/10557)
remote: Counting objects: 60% (6335/10557)
remote: Counting objects: 61% (6440/10557)
remote: Counting objects: 62% (6546/10557)
remote: Counting objects: 63% (6651/10557)
remote: Counting objects: 64% (6757/10557)
remote: Counting objects: 65% (6863/10557)
remote: Counting objects: 66% (6968/10557)
remote: Counting objects: 67% (7074/10557)
remote: Counting objects: 68% (7179/10557)
remote: Counting objects: 69% (7285/10557)
remote: Counting objects: 70% (7390/10557)
remote: Counting objects: 71% (7496/10557)
remote: Counting objects: 72% (7602/10557)
remote: Counting objects: 73% (7707/10557)
remote: Counting objects: 74% (7813/10557)
remote: Counting objects: 75% (7918/10557)
remote: Counting objects: 76% (8024/10557)
remote: Counting objects: 77% (8129/10557)
remote: Counting objects: 78% (8235/10557)
remote: Counting objects: 79% (8341/10557)
remote: Counting objects: 80% (8446/10557)
remote: Counting objects: 81% (8552/10557)
remote: Counting objects: 82% (8657/10557)
remote: Counting objects: 83% (8763/10557)
remote: Counting objects: 84% (8868/10557)
remote: Counting objects: 85% (8974/10557)
remote: Counting objects: 86% (9080/10557)
remote: Counting objects: 87% (9185/10557)
remote: Counting objects: 88% (9291/10557)
remote: Counting objects: 89% (9396/10557)
remote: Counting objects: 90% (9502/10557)
remote: Counting objects: 91% (9607/10557)
remote: Counting objects: 92% (9713/10557)
remote: Counting objects: 93% (9819/10557)
remote: Counting objects: 94% (9924/10557)
remote: Counting objects: 95% (10030/10557)
remote: Counting objects: 96% (10135/10557)
remote: Counting objects: 97% (10241/10557)
remote: Counting objects: 98% (10346/10557)
remote: Counting objects: 99% (10452/10557)
remote: Counting objects: 100% (10557/10557)
remote: Counting objects: 100% (10557/10557), done.
3.92 s
remote: Compressing objects: 0% (1/2952)
remote: Compressing objects: 1% (30/2952)
remote: Compressing objects: 2% (60/2952)
remote: Compressing objects: 3% (89/2952)
remote: Compressing objects: 4% (119/2952)
remote: Compressing objects: 5% (148/2952)
remote: Compressing objects: 6% (178/2952)
remote: Compressing objects: 7% (207/2952)
remote: Compressing objects: 8% (237/2952)
remote: Compressing objects: 9% (266/2952)
remote: Compressing objects: 10% (296/2952)
remote: Compressing objects: 11% (325/2952)
remote: Compressing objects: 12% (355/2952)
remote: Compressing objects: 13% (384/2952)
remote: Compressing objects: 14% (414/2952)
remote: Compressing objects: 15% (443/2952)
remote: Compressing objects: 15% (449/2952)
remote: Compressing objects: 16% (473/2952)
remote: Compressing objects: 17% (502/2952)
remote: Compressing objects: 18% (532/2952)
remote: Compressing objects: 19% (561/2952)
remote: Compressing objects: 20% (591/2952)
remote: Compressing objects: 21% (620/2952)
remote: Compressing objects: 22% (650/2952)
remote: Compressing objects: 23% (679/2952)
remote: Compressing objects: 24% (709/2952)
remote: Compressing objects: 25% (738/2952)
remote: Compressing objects: 26% (768/2952)
remote: Compressing objects: 26% (782/2952)
remote: Compressing objects: 27% (798/2952)
remote: Compressing objects: 28% (827/2952)
remote: Compressing objects: 29% (857/2952)
remote: Compressing objects: 30% (886/2952)
remote: Compressing objects: 31% (916/2952)
remote: Compressing objects: 32% (945/2952)
remote: Compressing objects: 33% (975/2952)
remote: Compressing objects: 34% (1004/2952)
remote: Compressing objects: 35% (1034/2952)
remote: Compressing objects: 36% (1063/2952)
remote: Compressing objects: 37% (1093/2952)
remote: Compressing objects: 38% (1122/2952)
remote: Compressing objects: 39% (1152/2952)
remote: Compressing objects: 40% (1181/2952)
remote: Compressing objects: 41% (1211/2952)
remote: Compressing objects: 42% (1240/2952)
remote: Compressing objects: 43% (1270/2952)
remote: Compressing objects: 44% (1299/2952)
remote: Compressing objects: 45% (1329/2952)
remote: Compressing objects: 46% (1358/2952)
remote: Compressing objects: 47% (1388/2952)
remote: Compressing objects: 48% (1417/2952)
remote: Compressing objects: 49% (1447/2952)
remote: Compressing objects: 50% (1476/2952)
remote: Compressing objects: 51% (1506/2952)
remote: Compressing objects: 52% (1536/2952)
remote: Compressing objects: 53% (1565/2952)
remote: Compressing objects: 54% (1595/2952)
remote: Compressing objects: 55% (1624/2952)
remote: Compressing objects: 56% (1654/2952)
remote: Compressing objects: 57% (1683/2952)
remote: Compressing objects: 58% (1713/2952)
remote: Compressing objects: 59% (1742/2952)
remote: Compressing objects: 60% (1772/2952)
remote: Compressing objects: 61% (1801/2952)
remote: Compressing objects: 62% (1831/2952)
remote: Compressing objects: 63% (1860/2952)
remote: Compressing objects: 64% (1890/2952)
remote: Compressing objects: 65% (1919/2952)
remote: Compressing objects: 66% (1949/2952)
remote: Compressing objects: 67% (1978/2952)
remote: Compressing objects: 68% (2008/2952)
remote: Compressing objects: 69% (2037/2952)
remote: Compressing objects: 70% (2067/2952)
remote: Compressing objects: 71% (2096/2952)
remote: Compressing objects: 72% (2126/2952)
remote: Compressing objects: 73% (2155/2952)
remote: Compressing objects: 74% (2185/2952)
remote: Compressing objects: 75% (2214/2952)
remote: Compressing objects: 76% (2244/2952)
remote: Compressing objects: 77% (2274/2952)
remote: Compressing objects: 78% (2303/2952)
remote: Compressing objects: 79% (2333/2952)
remote: Compressing objects: 80% (2362/2952)
remote: Compressing objects: 81% (2392/2952)
remote: Compressing objects: 82% (2421/2952)
remote: Compressing objects: 83% (2451/2952)
remote: Compressing objects: 84% (2480/2952)
remote: Compressing objects: 85% (2510/2952)
remote: Compressing objects: 86% (2539/2952)
remote: Compressing objects: 87% (2569/2952)
remote: Compressing objects: 88% (2598/2952)
remote: Compressing objects: 89% (2628/2952)
remote: Compressing objects: 90% (2657/2952)
remote: Compressing objects: 91% (2687/2952)
remote: Compressing objects: 92% (2716/2952)
remote: Compressing objects: 93% (2746/2952)
remote: Compressing objects: 94% (2775/2952)
remote: Compressing objects: 95% (2805/2952)
remote: Compressing objects: 96% (2834/2952)
remote: Compressing objects: 97% (2864/2952)
remote: Compressing objects: 98% (2893/2952)
remote: Compressing objects: 99% (2923/2952)
remote: Compressing objects: 100% (2952/2952)
remote: Compressing objects: 100% (2952/2952), done.
9.79 s
Receiving objects: 0% (1/87989)
Receiving objects: 1% (880/87989)
Receiving objects: 2% (1760/87989)
Receiving objects: 3% (2640/87989)
Receiving objects: 4% (3520/87989)
Receiving objects: 5% (4400/87989)
Receiving objects: 6% (5280/87989)
Receiving objects: 7% (6160/87989)
Receiving objects: 8% (7040/87989)
Receiving objects: 9% (7920/87989), 11.16 MiB | 22.30 MiB/s
Receiving objects: 10% (8799/87989), 11.16 MiB | 22.30 MiB/s
Receiving objects: 11% (9679/87989), 11.16 MiB | 22.30 MiB/s
Receiving objects: 12% (10559/87989), 11.16 MiB | 22.30 MiB/s
Receiving objects: 13% (11439/87989), 11.16 MiB | 22.30 MiB/s
Receiving objects: 14% (12319/87989), 11.16 MiB | 22.30 MiB/s
Receiving objects: 15% (13199/87989), 11.16 MiB | 22.30 MiB/s
Receiving objects: 16% (14079/87989), 11.16 MiB | 22.30 MiB/s
Receiving objects: 17% (14959/87989), 11.16 MiB | 22.30 MiB/s
Receiving objects: 18% (15839/87989), 11.16 MiB | 22.30 MiB/s
Receiving objects: 19% (16718/87989), 11.16 MiB | 22.30 MiB/s
Receiving objects: 20% (17598/87989), 11.16 MiB | 22.30 MiB/s
Receiving objects: 21% (18478/87989), 11.16 MiB | 22.30 MiB/s
Receiving objects: 22% (19358/87989), 11.16 MiB | 22.30 MiB/s
Receiving objects: 23% (20238/87989), 11.16 MiB | 22.30 MiB/s
Receiving objects: 24% (21118/87989), 11.16 MiB | 22.30 MiB/s
Receiving objects: 25% (21998/87989), 11.16 MiB | 22.30 MiB/s
Receiving objects: 26% (22878/87989), 11.16 MiB | 22.30 MiB/s
Receiving objects: 27% (23758/87989), 11.16 MiB | 22.30 MiB/s
Receiving objects: 28% (24637/87989), 11.16 MiB | 22.30 MiB/s
Receiving objects: 29% (25517/87989), 11.16 MiB | 22.30 MiB/s
Receiving objects: 30% (26397/87989), 11.16 MiB | 22.30 MiB/s
Receiving objects: 31% (27277/87989), 11.16 MiB | 22.30 MiB/s
Receiving objects: 32% (28157/87989), 11.16 MiB | 22.30 MiB/s
Receiving objects: 33% (29037/87989), 11.16 MiB | 22.30 MiB/s
Receiving objects: 34% (29917/87989), 11.16 MiB | 22.30 MiB/s
Receiving objects: 35% (30797/87989), 11.16 MiB | 22.30 MiB/s
Receiving objects: 35% (31444/87989), 28.91 MiB | 28.91 MiB/s
Receiving objects: 36% (31677/87989), 28.91 MiB | 28.91 MiB/s
Receiving objects: 37% (32556/87989), 28.91 MiB | 28.91 MiB/s
Receiving objects: 38% (33436/87989), 28.91 MiB | 28.91 MiB/s
Receiving objects: 39% (34316/87989), 28.91 MiB | 28.91 MiB/s
Receiving objects: 40% (35196/87989), 28.91 MiB | 28.91 MiB/s
Receiving objects: 41% (36076/87989), 28.91 MiB | 28.91 MiB/s
Receiving objects: 42% (36956/87989), 28.91 MiB | 28.91 MiB/s
Receiving objects: 43% (37836/87989), 28.91 MiB | 28.91 MiB/s
Receiving objects: 44% (38716/87989), 43.15 MiB | 28.76 MiB/s
Receiving objects: 45% (39596/87989), 43.15 MiB | 28.76 MiB/s
Receiving objects: 46% (40475/87989), 43.15 MiB | 28.76 MiB/s
Receiving objects: 47% (41355/87989), 43.15 MiB | 28.76 MiB/s
Receiving objects: 48% (42235/87989), 43.15 MiB | 28.76 MiB/s
Receiving objects: 49% (43115/87989), 43.15 MiB | 28.76 MiB/s
Receiving objects: 50% (43995/87989), 43.15 MiB | 28.76 MiB/s
Receiving objects: 51% (44875/87989), 43.15 MiB | 28.76 MiB/s
Receiving objects: 52% (45755/87989), 43.15 MiB | 28.76 MiB/s
Receiving objects: 52% (46447/87989), 43.15 MiB | 28.76 MiB/s
Receiving objects: 53% (46635/87989), 58.59 MiB | 29.29 MiB/s
Receiving objects: 54% (47515/87989), 58.59 MiB | 29.29 MiB/s
Receiving objects: 55% (48394/87989), 58.59 MiB | 29.29 MiB/s
Receiving objects: 56% (49274/87989), 58.59 MiB | 29.29 MiB/s
Receiving objects: 57% (50154/87989), 58.59 MiB | 29.29 MiB/s
Receiving objects: 58% (51034/87989), 58.59 MiB | 29.29 MiB/s
Receiving objects: 59% (51914/87989), 73.44 MiB | 29.37 MiB/s
Receiving objects: 60% (52794/87989), 73.44 MiB | 29.37 MiB/s
Receiving objects: 61% (53674/87989), 73.44 MiB | 29.37 MiB/s
Receiving objects: 62% (54554/87989), 73.44 MiB | 29.37 MiB/s
Receiving objects: 63% (55434/87989), 73.44 MiB | 29.37 MiB/s
Receiving objects: 64% (56313/87989), 73.44 MiB | 29.37 MiB/s
Receiving objects: 65% (57193/87989), 73.44 MiB | 29.37 MiB/s
Receiving objects: 65% (57359/87989), 88.50 MiB | 29.50 MiB/s
Receiving objects: 66% (58073/87989), 103.57 MiB | 29.59 MiB/s
Receiving objects: 67% (58953/87989), 103.57 MiB | 29.59 MiB/s
Receiving objects: 68% (59833/87989), 103.57 MiB | 29.59 MiB/s
Receiving objects: 69% (60713/87989), 103.57 MiB | 29.59 MiB/s
Receiving objects: 70% (61593/87989), 103.57 MiB | 29.59 MiB/s
Receiving objects: 71% (62473/87989), 103.57 MiB | 29.59 MiB/s
Receiving objects: 71% (63231/87989), 119.30 MiB | 29.82 MiB/s
Receiving objects: 72% (63353/87989), 119.30 MiB | 29.82 MiB/s
Receiving objects: 73% (64232/87989), 119.30 MiB | 29.82 MiB/s
Receiving objects: 74% (65112/87989), 119.30 MiB | 29.82 MiB/s
Receiving objects: 75% (65992/87989), 119.30 MiB | 29.82 MiB/s
Receiving objects: 76% (66872/87989), 119.30 MiB | 29.82 MiB/s
Receiving objects: 77% (67752/87989), 119.30 MiB | 29.82 MiB/s
Receiving objects: 78% (68632/87989), 133.87 MiB | 29.75 MiB/s
Receiving objects: 79% (69512/87989), 133.87 MiB | 29.75 MiB/s
Receiving objects: 80% (70392/87989), 133.87 MiB | 29.75 MiB/s
Receiving objects: 81% (71272/87989), 133.87 MiB | 29.75 MiB/s
Receiving objects: 82% (72151/87989), 133.87 MiB | 29.75 MiB/s
Receiving objects: 83% (73031/87989), 133.87 MiB | 29.75 MiB/s
Receiving objects: 84% (73911/87989), 133.87 MiB | 29.75 MiB/s
Receiving objects: 85% (74791/87989), 133.87 MiB | 29.75 MiB/s
Receiving objects: 86% (75671/87989), 133.87 MiB | 29.75 MiB/s
Receiving objects: 86% (76157/87989), 133.87 MiB | 29.75 MiB/s
Receiving objects: 87% (76551/87989), 149.18 MiB | 30.67 MiB/s
Receiving objects: 88% (77431/87989), 149.18 MiB | 30.67 MiB/s
Receiving objects: 89% (78311/87989), 149.18 MiB | 30.67 MiB/s
Receiving objects: 90% (79191/87989), 149.18 MiB | 30.67 MiB/s
Receiving objects: 91% (80070/87989), 149.18 MiB | 30.67 MiB/s
Receiving objects: 92% (80950/87989), 149.18 MiB | 30.67 MiB/s
Receiving objects: 93% (81830/87989), 149.18 MiB | 30.67 MiB/s
Receiving objects: 94% (82710/87989), 149.18 MiB | 30.67 MiB/s
Receiving objects: 95% (83590/87989), 149.18 MiB | 30.67 MiB/s
Receiving objects: 96% (84470/87989), 149.18 MiB | 30.67 MiB/s
Receiving objects: 97% (85350/87989), 149.18 MiB | 30.67 MiB/s
Receiving objects: 98% (86230/87989), 149.18 MiB | 30.67 MiB/s
Receiving objects: 99% (87110/87989), 165.59 MiB | 30.37 MiB/s
remote: Total 87989 (delta 8613), reused 8381 (delta 7579), pack-reused 77432 (from 3)
9.79 s
Receiving objects: 100% (87989/87989), 165.59 MiB | 30.37 MiB/s
Receiving objects: 100% (87989/87989), 176.53 MiB | 30.04 MiB/s, done.
11.09 s
Resolving deltas: 0% (0/59508)
Resolving deltas: 1% (597/59508)
Resolving deltas: 2% (1191/59508)
Resolving deltas: 3% (1786/59508)
Resolving deltas: 4% (2381/59508)
Resolving deltas: 5% (2976/59508)
Resolving deltas: 6% (3572/59508)
Resolving deltas: 7% (4166/59508)
Resolving deltas: 8% (4761/59508)
Resolving deltas: 9% (5356/59508)
Resolving deltas: 10% (5951/59508)
Resolving deltas: 11% (6548/59508)
Resolving deltas: 12% (7141/59508)
Resolving deltas: 13% (7737/59508)
Resolving deltas: 14% (8332/59508)
Resolving deltas: 15% (8927/59508)
Resolving deltas: 16% (9522/59508)
Resolving deltas: 17% (10118/59508)
Resolving deltas: 18% (10712/59508)
Resolving deltas: 19% (11307/59508)
Resolving deltas: 20% (11902/59508)
Resolving deltas: 21% (12498/59508)
Resolving deltas: 22% (13093/59508)
Resolving deltas: 23% (13687/59508)
Resolving deltas: 24% (14282/59508)
Resolving deltas: 25% (14877/59508)
Resolving deltas: 26% (15474/59508)
Resolving deltas: 27% (16068/59508)
Resolving deltas: 28% (16663/59508)
Resolving deltas: 29% (17258/59508)
Resolving deltas: 30% (17853/59508)
Resolving deltas: 31% (18448/59508)
Resolving deltas: 32% (19043/59508)
Resolving deltas: 33% (19638/59508)
Resolving deltas: 34% (20233/59508)
Resolving deltas: 35% (20830/59508)
Resolving deltas: 36% (21423/59508)
Resolving deltas: 37% (22018/59508)
Resolving deltas: 38% (22615/59508)
Resolving deltas: 39% (23209/59508)
Resolving deltas: 40% (23804/59508)
Resolving deltas: 41% (24401/59508)
Resolving deltas: 42% (24994/59508)
Resolving deltas: 43% (25589/59508)
Resolving deltas: 44% (26184/59508)
Resolving deltas: 45% (26779/59508)
Resolving deltas: 46% (27374/59508)
Resolving deltas: 47% (27970/59508)
Resolving deltas: 48% (28566/59508)
Resolving deltas: 49% (29159/59508)
Resolving deltas: 50% (29754/59508)
Resolving deltas: 51% (30350/59508)
Resolving deltas: 52% (30945/59508)
Resolving deltas: 53% (31542/59508)
Resolving deltas: 54% (32135/59508)
Resolving deltas: 55% (32730/59508)
Resolving deltas: 56% (33325/59508)
Resolving deltas: 57% (33920/59508)
Resolving deltas: 58% (34515/59508)
Resolving deltas: 59% (35110/59508)
Resolving deltas: 60% (35705/59508)
Resolving deltas: 61% (36300/59508)
Resolving deltas: 62% (36897/59508)
Resolving deltas: 63% (37491/59508)
Resolving deltas: 64% (38086/59508)
Resolving deltas: 65% (38681/59508)
Resolving deltas: 66% (39276/59508)
Resolving deltas: 67% (39871/59508)
Resolving deltas: 68% (40466/59508)
Resolving deltas: 69% (41061/59508)
Resolving deltas: 70% (41656/59508)
Resolving deltas: 71% (42251/59508)
Resolving deltas: 72% (42847/59508)
Resolving deltas: 73% (43443/59508)
Resolving deltas: 74% (44036/59508)
Resolving deltas: 75% (44632/59508)
Resolving deltas: 76% (45227/59508)
Resolving deltas: 77% (45822/59508)
Resolving deltas: 77% (46378/59508)
Resolving deltas: 78% (46417/59508)
Resolving deltas: 79% (47013/59508)
Resolving deltas: 80% (47607/59508)
Resolving deltas: 81% (48202/59508)
Resolving deltas: 82% (48797/59508)
Resolving deltas: 83% (49392/59508)
Resolving deltas: 84% (49988/59508)
Resolving deltas: 85% (50582/59508)
Resolving deltas: 86% (51177/59508)
Resolving deltas: 87% (51772/59508)
Resolving deltas: 88% (52368/59508)
Resolving deltas: 89% (52963/59508)
Resolving deltas: 90% (53559/59508)
Resolving deltas: 91% (54153/59508)
Resolving deltas: 92% (54748/59508)
Resolving deltas: 93% (55343/59508)
Resolving deltas: 94% (55938/59508)
Resolving deltas: 95% (56535/59508)
Resolving deltas: 96% (57128/59508)
Resolving deltas: 97% (57723/59508)
Resolving deltas: 98% (58318/59508)
Resolving deltas: 99% (58914/59508)
Resolving deltas: 100% (59508/59508)
Resolving deltas: 100% (59508/59508), done.
11.59 s
Fetching commit 4338252f3f6441dd1159617dee545403b8fb24d4 for docs ...
11.59 s
$ /nix/store/bcnisk3ydfgv26v2gw3zlky24g00yww2-git-2.54.0/bin/git fetch origin 4338252f3f6441dd1159617dee545403b8fb24d4
12.06 s
From https://github.com/alphal00p/gammaloop
12.06 s
* branch 4338252f3f6441dd1159617dee545403b8fb24d4 -> FETCH_HEAD
12.07 s
$ /nix/store/9ypz3flqsrl5xl495mm8h645gadjsxi1-coreutils-9.11/bin/timeout --kill-after=15s 7200s /nix/store/bcnisk3ydfgv26v2gw3zlky24g00yww2-git-2.54.0/bin/git -c advice.detachedHead=false checkout 4338252f3f6441dd1159617dee545403b8fb24d4
12.36 s
HEAD is now at 4338252f3 embed live WASM notebooks in the product guides
12.36 s
$ /nix/store/9ypz3flqsrl5xl495mm8h645gadjsxi1-coreutils-9.11/bin/timeout --kill-after=15s 7200s /nix/store/23zk8sgzamrbmj1fday15szf7f2279s8-nix-2.34.7/bin/nix --extra-experimental-features nix-command --extra-experimental-features flakes --log-format internal-json run .#packages.x86_64-linux.nix-ci-check-gammaloop-nextest-docs --print-build-logs
12.51 s
23.75 s
evaluating derivation 'g
copying '/nix/store/bgss
evaluating derivation 'g
copying '/nix/store/bgss
evaluating derivation 'g
copying '/nix/store/bgss
evaluating derivation 'g
copying '/nix/store/bgss
evaluating derivation 'g
copying '/nix/store/bgss
evaluating derivation 'g
copying '/nix/store/bgss
evaluating derivation 'g
copying '/nix/store/bgss
evaluating derivation 'g
[0 /1 built]
[1 /0 /1 built] building g gammaloop-nextest-docs> Extracting 2 binaries to /build/source
23.85 s
gammaloop-nextest-docs> Extracted 5 files to /build/source in 0.11s
23.87 s
gammaloop-nextest-docs> ------------
23.87 s
gammaloop-nextest-docs> Nextest run ID b5a22949-0314-418c-a581-bbbacd05c642 with nextest profile: ci_gammaloop
23.87 s
gammaloop-nextest-docs> Starting 129 tests across 2 binaries
70.08 s
gammaloop-nextest-docs> FAIL [ 46.205s] (128/129) alphal00p-docs-builder provenance_tests :: each_build_captures_one_revision_before_rendering
70.08 s
gammaloop-nextest-docs> stdout ---
70.08 s
gammaloop-nextest-docs>
70.08 s
gammaloop-nextest-docs> running 1 test
70.08 s
gammaloop-nextest-docs>
70.08 s
gammaloop-nextest-docs> running 1 test
70.08 s
gammaloop-nextest-docs> test provenance_tests::each_build_captures_one_revision_before_rendering ... FAILED
70.08 s
gammaloop-nextest-docs>
70.08 s
gammaloop-nextest-docs> failures:
70.08 s
gammaloop-nextest-docs>
70.08 s
gammaloop-nextest-docs> failures:
70.08 s
gammaloop-nextest-docs> provenance_tests::each_build_captures_one_revision_before_rendering
70.08 s
gammaloop-nextest-docs>
70.08 s
gammaloop-nextest-docs> test result: FAILED. 0 passed; 1 failed; 0 ignored; 0 measured; 128 filtered out; finished in 46.11s
70.08 s
gammaloop-nextest-docs>
70.08 s
gammaloop-nextest-docs> test provenance_tests::each_build_captures_one_revision_before_rendering ... FAILED
70.08 s
gammaloop-nextest-docs>
70.08 s
gammaloop-nextest-docs> failures:
70.08 s
gammaloop-nextest-docs>
70.08 s
gammaloop-nextest-docs> failures:
70.08 s
gammaloop-nextest-docs> provenance_tests::each_build_captures_one_revision_before_rendering
70.08 s
gammaloop-nextest-docs>
70.08 s
gammaloop-nextest-docs> test result: FAILED. 0 passed; 1 failed; 0 ignored; 0 measured; 128 filtered out; finished in 46.19s
70.08 s
gammaloop-nextest-docs>
70.08 s
gammaloop-nextest-docs> stderr ---
70.08 s
gammaloop-nextest-docs> warning: bundle export is experimental
70.08 s
gammaloop-nextest-docs> = hint: its behaviour may change at any time
70.08 s
gammaloop-nextest-docs> = hint: do not rely on this feature for production use cases
70.08 s
gammaloop-nextest-docs>
70.08 s
gammaloop-nextest-docs> warning: unknown font family: roboto
70.08 s
gammaloop-nextest-docs> ┌─ crates/linnest/typst/docs/manual.typ:11:28
70.08 s
gammaloop-nextest-docs> │
70.08 s
gammaloop-nextest-docs> 11 │ #set text(size: 10pt, font: "Roboto")
70.08 s
gammaloop-nextest-docs> │ ^^^^^^^^
70.08 s
gammaloop-nextest-docs>
70.08 s
gammaloop-nextest-docs> warning: unknown font family: roboto
70.08 s
gammaloop-nextest-docs> ┌─ crates/linnest/typst/docs/manual.typ:14:29
70.08 s
gammaloop-nextest-docs> │
70.08 s
gammaloop-nextest-docs> 14 │ #set text(size: 3em, font: "Roboto")
70.08 s
gammaloop-nextest-docs> │ ^^^^^^^^
70.08 s
gammaloop-nextest-docs>
70.08 s
gammaloop-nextest-docs> warning: unknown font family: roboto
70.08 s
gammaloop-nextest-docs> ┌─ crates/linnest/typst/docs/manual.typ:16:31
70.08 s
gammaloop-nextest-docs> │
70.08 s
gammaloop-nextest-docs> 16 │ #set text(size: 0.3em, font: "Roboto")
70.08 s
gammaloop-nextest-docs> │ ^^^^^^^^
70.08 s
gammaloop-nextest-docs>
70.08 s
gammaloop-nextest-docs> warning: overline was ignored during MathML export
70.08 s
gammaloop-nextest-docs> ┌─ crates/linnest/typst/docs/manual.typ:949:55
70.08 s
gammaloop-nextest-docs> │
70.08 s
gammaloop-nextest-docs> 949 │ + sum_("dangling" e) c_("dangling-centroid") / (d(e, overline(v)) + epsilon)
70.08 s
gammaloop-nextest-docs> │ ^^^^^^^^^^^
70.08 s
gammaloop-nextest-docs>
70.08 s
gammaloop-nextest-docs> warning: overline was ignored during MathML export
70.08 s
gammaloop-nextest-docs> ┌─ crates/linnest/typst/docs/manual.typ:953:8
70.08 s
gammaloop-nextest-docs> │
70.08 s
gammaloop-nextest-docs> 953 │ Here $overline(v)$ is the mean node position. The centroid term pushes every
70.08 s
gammaloop-nextest-docs> │ ^^^^^^^^^^^
70.08 s
gammaloop-nextest-docs>
70.08 s
gammaloop-nextest-docs>
70.08 s
gammaloop-nextest-docs> thread 'provenance_tests::each_build_captures_one_revision_before_rendering' (248) panicked at crates/alphal00p-docs-builder/src/provenance_tests.rs:297:14:
70.08 s
gammaloop-nextest-docs> called `Result::unwrap()` on an `Err` value: generated site has broken links:
70.08 s
gammaloop-nextest-docs> products/linnet/latest/reference/interfaces/index.html -> https://github.com/alphal00p/gammaloop/blob/1111111111111111111111111111111111111111/crates/linnet-py/examples/physics_render_settings.py (missing repository source file crates/linnet-py/examples/physics_render_settings.py)
70.08 s
gammaloop-nextest-docs> products/linnet/latest/reference/interfaces/index.html -> https://github.com/alphal00p/gammaloop/blob/1111111111111111111111111111111111111111/crates/linnet-py/examples/layout_stream.py (missing repository source file crates/linnet-py/examples/layout_stream.py)
70.08 s
gammaloop-nextest-docs> products/linnet/latest/guides/python-rendering/index.html -> https://github.com/alphal00p/gammaloop/blob/1111111111111111111111111111111111111111/crates/linnet-py/examples/rendering_api.py (missing repository source file crates/linnet-py/examples/rendering_api.py)
70.08 s
gammaloop-nextest-docs> products/linnet/latest/playground/index.html -> https://github.com/alphal00p/gammaloop/blob/1111111111111111111111111111111111111111/crates/linnet-py/examples/layout_stream.py (missing repository source file crates/linnet-py/examples/layout_stream.py)
70.08 s
gammaloop-nextest-docs>
70.08 s
gammaloop-nextest-docs> Location:
70.08 s
gammaloop-nextest-docs> crates/alphal00p-docs-builder/src/lib.rs:4940:9
70.08 s
gammaloop-nextest-docs> stack backtrace:
70.08 s
gammaloop-nextest-docs> 0: __rustc::rust_begin_unwind
70.08 s
gammaloop-nextest-docs> 1: core::panicking::panic_fmt
70.08 s
gammaloop-nextest-docs> 2: core::result::unwrap_failed
70.08 s
gammaloop-nextest-docs> 3: alphal00p_docs_builder::provenance_tests::each_build_captures_one_revision_before_rendering
70.08 s
gammaloop-nextest-docs> 4: <alphal00p_docs_builder::provenance_tests::each_build_captures_one_revision_before_rendering::{closure#0} as core::ops::function::FnOnce<()>>::call_once
70.08 s
gammaloop-nextest-docs> note: Some details are omitted, run with `RUST_BACKTRACE=full` for a verbose backtrace.
70.08 s
gammaloop-nextest-docs>
70.08 s
gammaloop-nextest-docs> thread 'provenance_tests::each_build_captures_one_revision_before_rendering' (187) panicked at crates/alphal00p-docs-builder/src/provenance_tests.rs:274:9:
70.08 s
gammaloop-nextest-docs> assertion failed: command.status().unwrap().success()
70.08 s
gammaloop-nextest-docs> stack backtrace:
70.08 s
gammaloop-nextest-docs> 0: __rustc::rust_begin_unwind
70.08 s
gammaloop-nextest-docs> 1: core::panicking::panic_fmt
70.08 s
gammaloop-nextest-docs> 2: core::panicking::panic
70.08 s
gammaloop-nextest-docs> 3: alphal00p_docs_builder::provenance_tests::each_build_captures_one_revision_before_rendering
70.08 s
gammaloop-nextest-docs> 4: <alphal00p_docs_builder::provenance_tests::each_build_captures_one_revision_before_rendering::{closure#0} as core::ops::function::FnOnce<()>>::call_once
70.08 s
gammaloop-nextest-docs> note: Some details are omitted, run with `RUST_BACKTRACE=full` for a verbose backtrace.
70.08 s
gammaloop-nextest-docs>
78.25 s
gammaloop-nextest-docs> ------------
78.25 s
gammaloop-nextest-docs> Summary [ 54.376s] 129 tests run: 128 passed , 1 failed , 0 skipped
78.25 s
gammaloop-nextest-docs> FAIL [ 46.205s] (128/129) alphal00p-docs-builder provenance_tests :: each_build_captures_one_revision_before_rendering
78.25 s
gammaloop-nextest-docs> stdout ---
78.25 s
gammaloop-nextest-docs>
78.25 s
gammaloop-nextest-docs> running 1 test
78.25 s
gammaloop-nextest-docs>
78.25 s
gammaloop-nextest-docs> running 1 test
78.25 s
gammaloop-nextest-docs> test provenance_tests::each_build_captures_one_revision_before_rendering ... FAILED
78.25 s
gammaloop-nextest-docs>
78.25 s
gammaloop-nextest-docs> failures:
78.25 s
gammaloop-nextest-docs>
78.25 s
gammaloop-nextest-docs> failures:
78.25 s
gammaloop-nextest-docs> provenance_tests::each_build_captures_one_revision_before_rendering
78.25 s
gammaloop-nextest-docs>
78.25 s
gammaloop-nextest-docs> test result: FAILED. 0 passed; 1 failed; 0 ignored; 0 measured; 128 filtered out; finished in 46.11s
78.25 s
gammaloop-nextest-docs>
78.25 s
gammaloop-nextest-docs> test provenance_tests::each_build_captures_one_revision_before_rendering ... FAILED
78.25 s
gammaloop-nextest-docs>
78.25 s
gammaloop-nextest-docs> failures:
78.25 s
gammaloop-nextest-docs>
78.25 s
gammaloop-nextest-docs> failures:
78.25 s
gammaloop-nextest-docs> provenance_tests::each_build_captures_one_revision_before_rendering
78.25 s
gammaloop-nextest-docs>
78.25 s
gammaloop-nextest-docs> test result: FAILED. 0 passed; 1 failed; 0 ignored; 0 measured; 128 filtered out; finished in 46.19s
78.25 s
gammaloop-nextest-docs>
78.25 s
gammaloop-nextest-docs> stderr ---
78.25 s
gammaloop-nextest-docs> warning: bundle export is experimental
78.25 s
gammaloop-nextest-docs> = hint: its behaviour may change at any time
78.25 s
gammaloop-nextest-docs> = hint: do not rely on this feature for production use cases
78.25 s
gammaloop-nextest-docs>
78.25 s
gammaloop-nextest-docs> warning: unknown font family: roboto
78.25 s
gammaloop-nextest-docs> ┌─ crates/linnest/typst/docs/manual.typ:11:28
78.25 s
gammaloop-nextest-docs> │
78.25 s
gammaloop-nextest-docs> 11 │ #set text(size: 10pt, font: "Roboto")
78.25 s
gammaloop-nextest-docs> │ ^^^^^^^^
78.25 s
gammaloop-nextest-docs>
78.25 s
gammaloop-nextest-docs> warning: unknown font family: roboto
78.25 s
gammaloop-nextest-docs> ┌─ crates/linnest/typst/docs/manual.typ:14:29
78.25 s
gammaloop-nextest-docs> │
78.25 s
gammaloop-nextest-docs> 14 │ #set text(size: 3em, font: "Roboto")
78.25 s
gammaloop-nextest-docs> │ ^^^^^^^^
78.25 s
gammaloop-nextest-docs>
78.25 s
gammaloop-nextest-docs> warning: unknown font family: roboto
78.25 s
gammaloop-nextest-docs> ┌─ crates/linnest/typst/docs/manual.typ:16:31
78.25 s
gammaloop-nextest-docs> │
78.25 s
gammaloop-nextest-docs> 16 │ #set text(size: 0.3em, font: "Roboto")
78.25 s
gammaloop-nextest-docs> │ ^^^^^^^^
78.25 s
gammaloop-nextest-docs>
78.25 s
gammaloop-nextest-docs> warning: overline was ignored during MathML export
78.25 s
gammaloop-nextest-docs> ┌─ crates/linnest/typst/docs/manual.typ:949:55
78.25 s
gammaloop-nextest-docs> │
78.25 s
gammaloop-nextest-docs> 949 │ + sum_("dangling" e) c_("dangling-centroid") / (d(e, overline(v)) + epsilon)
78.25 s
gammaloop-nextest-docs> │ ^^^^^^^^^^^
78.25 s
gammaloop-nextest-docs>
78.25 s
gammaloop-nextest-docs> warning: overline was ignored during MathML export
78.25 s
gammaloop-nextest-docs> ┌─ crates/linnest/typst/docs/manual.typ:953:8
78.25 s
gammaloop-nextest-docs> │
78.25 s
gammaloop-nextest-docs> 953 │ Here $overline(v)$ is the mean node position. The centroid term pushes every
78.25 s
gammaloop-nextest-docs> │ ^^^^^^^^^^^
78.25 s
gammaloop-nextest-docs>
78.25 s
gammaloop-nextest-docs>
78.25 s
gammaloop-nextest-docs> thread 'provenance_tests::each_build_captures_one_revision_before_rendering' (248) panicked at crates/alphal00p-docs-builder/src/provenance_tests.rs:297:14:
78.25 s
gammaloop-nextest-docs> called `Result::unwrap()` on an `Err` value: generated site has broken links:
78.25 s
gammaloop-nextest-docs> products/linnet/latest/reference/interfaces/index.html -> https://github.com/alphal00p/gammaloop/blob/1111111111111111111111111111111111111111/crates/linnet-py/examples/physics_render_settings.py (missing repository source file crates/linnet-py/examples/physics_render_settings.py)
78.25 s
gammaloop-nextest-docs> products/linnet/latest/reference/interfaces/index.html -> https://github.com/alphal00p/gammaloop/blob/1111111111111111111111111111111111111111/crates/linnet-py/examples/layout_stream.py (missing repository source file crates/linnet-py/examples/layout_stream.py)
78.25 s
gammaloop-nextest-docs> products/linnet/latest/guides/python-rendering/index.html -> https://github.com/alphal00p/gammaloop/blob/1111111111111111111111111111111111111111/crates/linnet-py/examples/rendering_api.py (missing repository source file crates/linnet-py/examples/rendering_api.py)
78.25 s
gammaloop-nextest-docs> products/linnet/latest/playground/index.html -> https://github.com/alphal00p/gammaloop/blob/1111111111111111111111111111111111111111/crates/linnet-py/examples/layout_stream.py (missing repository source file crates/linnet-py/examples/layout_stream.py)
78.25 s
gammaloop-nextest-docs>
78.25 s
gammaloop-nextest-docs> Location:
78.25 s
gammaloop-nextest-docs> crates/alphal00p-docs-builder/src/lib.rs:4940:9
78.25 s
gammaloop-nextest-docs> stack backtrace:
78.25 s
gammaloop-nextest-docs> 0: __rustc::rust_begin_unwind
78.25 s
gammaloop-nextest-docs> 1: core::panicking::panic_fmt
78.25 s
gammaloop-nextest-docs> 2: core::result::unwrap_failed
78.25 s
gammaloop-nextest-docs> 3: alphal00p_docs_builder::provenance_tests::each_build_captures_one_revision_before_rendering
78.25 s
gammaloop-nextest-docs> 4: <alphal00p_docs_builder::provenance_tests::each_build_captures_one_revision_before_rendering::{closure#0} as core::ops::function::FnOnce<()>>::call_once
78.25 s
gammaloop-nextest-docs> note: Some details are omitted, run with `RUST_BACKTRACE=full` for a verbose backtrace.
78.25 s
gammaloop-nextest-docs>
78.25 s
gammaloop-nextest-docs> thread 'provenance_tests::each_build_captures_one_revision_before_rendering' (187) panicked at crates/alphal00p-docs-builder/src/provenance_tests.rs:274:9:
78.25 s
gammaloop-nextest-docs> assertion failed: command.status().unwrap().success()
78.25 s
gammaloop-nextest-docs> stack backtrace:
78.25 s
gammaloop-nextest-docs> 0: __rustc::rust_begin_unwind
78.25 s
gammaloop-nextest-docs> 1: core::panicking::panic_fmt
78.25 s
gammaloop-nextest-docs> 2: core::panicking::panic
78.25 s
gammaloop-nextest-docs> 3: alphal00p_docs_builder::provenance_tests::each_build_captures_one_revision_before_rendering
78.25 s
gammaloop-nextest-docs> 4: <alphal00p_docs_builder::provenance_tests::each_build_captures_one_revision_before_rendering::{closure#0} as core::ops::function::FnOnce<()>>::call_once
78.25 s
gammaloop-nextest-docs> note: Some details are omitted, run with `RUST_BACKTRACE=full` for a verbose backtrace.
78.25 s
gammaloop-nextest-docs>
78.26 s
gammaloop-nextest-docs> error : test run failed
78.29 s
gammaloop-nextest-docs>
78.29 s
gammaloop-nextest-docs> ========== nextest test summary ==========
78.29 s
gammaloop-nextest-docs> report: target/nextest/ci_gammaloop/junit.xml
78.29 s
gammaloop-nextest-docs> tests: 129, failures: 1, errors: 0
78.29 s
gammaloop-nextest-docs>
78.29 s
gammaloop-nextest-docs> 1. alphal00p-docs-builder::provenance_tests::each_build_captures_one_revision_before_rendering
78.29 s
gammaloop-nextest-docs> failure: test failure with exit code 101
78.29 s
gammaloop-nextest-docs> thread 'provenance_tests::each_build_captures_one_revision_before_rendering' (187) panicked at crates/alphal00p-docs-builder/src/provenance_tests.rs:274:9:
78.29 s
gammaloop-nextest-docs> assertion failed: command.status().unwrap().success()
78.29 s
gammaloop-nextest-docs> stack backtrace:
78.29 s
gammaloop-nextest-docs> 0: __rustc::rust_begin_unwind
78.29 s
gammaloop-nextest-docs> 1: core::panicking::panic_fmt
78.29 s
gammaloop-nextest-docs> 2: core::panicking::panic
78.29 s
gammaloop-nextest-docs> 3: alphal00p_docs_builder::provenance_tests::each_build_captures_one_revision_before_rendering
78.29 s
gammaloop-nextest-docs> 4: <alphal00p_docs_builder::provenance_tests::each_build_captures_one_revision_before_rendering::{closure#0} as core::ops::function::FnOnce<()>>::call_once
78.29 s
gammaloop-nextest-docs> note: Some details are omitted, run with `RUST_BACKTRACE=full` for a verbose backtrace.
78.29 s
gammaloop-nextest-docs> system-out
78.29 s
gammaloop-nextest-docs> running 1 test
78.29 s
gammaloop-nextest-docs>
78.29 s
gammaloop-nextest-docs> running 1 test
78.29 s
gammaloop-nextest-docs> test provenance_tests::each_build_captures_one_revision_before_rendering ... FAILED
78.29 s
gammaloop-nextest-docs>
78.29 s
gammaloop-nextest-docs> failures:
78.29 s
gammaloop-nextest-docs>
78.29 s
gammaloop-nextest-docs> failures:
78.29 s
gammaloop-nextest-docs> provenance_tests::each_build_captures_one_revision_before_rendering
78.29 s
gammaloop-nextest-docs>
78.29 s
gammaloop-nextest-docs> test result: FAILED. 0 passed; 1 failed; 0 ignored; 0 measured; 128 filtered out; finished in 46.11s
78.29 s
gammaloop-nextest-docs>
78.29 s
gammaloop-nextest-docs> test provenance_tests::each_build_captures_one_revision_before_rendering ... FAILED
78.29 s
gammaloop-nextest-docs>
78.29 s
gammaloop-nextest-docs> failures:
78.29 s
gammaloop-nextest-docs>
78.29 s
gammaloop-nextest-docs> failures:
78.29 s
gammaloop-nextest-docs> provenance_tests::each_build_captures_one_revision_before_rendering
78.29 s
gammaloop-nextest-docs>
78.29 s
gammaloop-nextest-docs> test result: FAILED. 0 passed; 1 failed; 0 ignored; 0 measured; 128 filtered out; finished in 46.19s
78.29 s
gammaloop-nextest-docs> system-err
78.29 s
gammaloop-nextest-docs> warning: bundle export is experimental
78.29 s
gammaloop-nextest-docs> = hint: its behaviour may change at any time
78.29 s
gammaloop-nextest-docs> = hint: do not rely on this feature for production use cases
78.29 s
gammaloop-nextest-docs>
78.29 s
gammaloop-nextest-docs> warning: unknown font family: roboto
78.29 s
gammaloop-nextest-docs> ┌─ crates/linnest/typst/docs/manual.typ:11:28
78.29 s
gammaloop-nextest-docs> │
78.29 s
gammaloop-nextest-docs> 11 │ #set text(size: 10pt, font: "Roboto")
78.29 s
gammaloop-nextest-docs> │ ^^^^^^^^
78.29 s
gammaloop-nextest-docs>
78.29 s
gammaloop-nextest-docs> warning: unknown font family: roboto
78.29 s
gammaloop-nextest-docs> ┌─ crates/linnest/typst/docs/manual.typ:14:29
78.29 s
gammaloop-nextest-docs> │
78.29 s
gammaloop-nextest-docs> 14 │ #set text(size: 3em, font: "Roboto")
78.29 s
gammaloop-nextest-docs> │ ^^^^^^^^
78.29 s
gammaloop-nextest-docs>
78.29 s
gammaloop-nextest-docs> warning: unknown font family: roboto
78.29 s
gammaloop-nextest-docs> ┌─ crates/linnest/typst/docs/manual.typ:16:31
78.29 s
gammaloop-nextest-docs> │
78.29 s
gammaloop-nextest-docs> 16 │ #set text(size: 0.3em, font: "Roboto")
78.29 s
gammaloop-nextest-docs> │ ^^^^^^^^
78.29 s
gammaloop-nextest-docs>
78.29 s
gammaloop-nextest-docs> warning: overline was ignored during MathML export
78.29 s
gammaloop-nextest-docs> ┌─ crates/linnest/typst/docs/manual.typ:949:55
78.29 s
gammaloop-nextest-docs> │
78.29 s
gammaloop-nextest-docs> 949 │ + sum_("dangling" e) c_("dangling-centroid") / (d(e, overline(v)) + epsilon)
78.29 s
gammaloop-nextest-docs> │ ^^^^^^^^^^^
78.29 s
gammaloop-nextest-docs>
78.29 s
gammaloop-nextest-docs> warning: overline was ignored during MathML export
78.30 s
gammaloop-nextest-docs> ┌─ crates/linnest/typst/docs/manual.typ:953:8
78.30 s
gammaloop-nextest-docs> │
78.30 s
gammaloop-nextest-docs> 953 │ Here $overline(v)$ is the mean node position. The centroid term pushes every
78.30 s
gammaloop-nextest-docs> │ ^^^^^^^^^^^
78.30 s
gammaloop-nextest-docs>
78.30 s
gammaloop-nextest-docs>
78.30 s
gammaloop-nextest-docs> thread 'provenance_tests::each_build_captures_one_revision_before_rendering' (248) panicked at crates/alphal00p-docs-builder/src/provenance_tests.rs:297:14:
78.30 s
gammaloop-nextest-docs> called `Result::unwrap()` on an `Err` value: generated site has broken links:
78.30 s
gammaloop-nextest-docs> products/linnet/latest/reference/interfaces/index.html -> https://github.com/alphal00p/gammaloop/blob/1111111111111111111111111111111111111111/crates/linnet-py/examples/physics_render_settings.py (missing repository source file crates/linnet-py/examples/physics_render_settings.py)
78.30 s
gammaloop-nextest-docs> products/linnet/latest/reference/interfaces/index.html -> https://github.com/alphal00p/gammaloop/blob/1111111111111111111111111111111111111111/crates/linnet-py/examples/layout_stream.py (missing repository source file crates/linnet-py/examples/layout_stream.py)
78.30 s
gammaloop-nextest-docs> products/linnet/latest/guides/python-rendering/index.html -> https://github.com/alphal00p/gammaloop/blob/1111111111111111111111111111111111111111/crates/linnet-py/examples/rendering_api.py (missing repository source file crates/linnet-py/examples/rendering_api.py)
78.30 s
gammaloop-nextest-docs> products/linnet/latest/playground/index.html -> https://github.com/alphal00p/gammaloop/blob/1111111111111111111111111111111111111111/crates/linnet-py/examples/layout_stream.py (missing repository source file crates/linnet-py/examples/layout_stream.py)
78.30 s
gammaloop-nextest-docs>
78.30 s
gammaloop-nextest-docs> Location:
78.30 s
gammaloop-nextest-docs> crates/alphal00p-docs-builder/src/lib.rs:4940:9
78.30 s
gammaloop-nextest-docs> stack backtrace:
78.30 s
gammaloop-nextest-docs> 0: __rustc::rust_begin_unwind
78.30 s
gammaloop-nextest-docs> 1: core::panicking::panic_fmt
78.30 s
gammaloop-nextest-docs> 2: core::result::unwrap_failed
78.30 s
gammaloop-nextest-docs> 3: alphal00p_docs_builder::provenance_tests::each_build_captures_one_revision_before_rendering
78.30 s
gammaloop-nextest-docs> 4: <alphal00p_docs_builder::provenance_tests::each_build_captures_one_revision_before_rendering::{closure#0} as core::ops::function::FnOnce<()>>::call_once
78.30 s
gammaloop-nextest-docs> note: Some details are omitted, run with `RUST_BACKTRACE=full` for a verbose backtrace.
78.30 s
gammaloop-nextest-docs>
78.30 s
gammaloop-nextest-docs> thread 'provenance_tests::each_build_captures_one_revision_before_rendering' (187) panicked at crates/alphal00p-docs-builder/src/provenance_tests.rs:274:9:
78.30 s
gammaloop-nextest-docs> assertion failed: command.status().unwrap().success()
78.30 s
gammaloop-nextest-docs> stack backtrace:
78.30 s
gammaloop-nextest-docs> 0: __rustc::rust_begin_unwind
78.30 s
gammaloop-nextest-docs> 1: core::panicking::panic_fmt
78.30 s
gammaloop-nextest-docs> 2: core::panicking::panic
78.30 s
gammaloop-nextest-docs> 3: alphal00p_docs_builder::provenance_tests::each_build_captures_one_revision_before_rendering
78.30 s
gammaloop-nextest-docs> 4: <alphal00p_docs_builder::provenance_tests::each_build_captures_one_revision_before_rendering::{closure#0} as core::ops::function::FnOnce<()>>::call_once
78.30 s
gammaloop-nextest-docs> note: Some details are omitted, run with `RUST_BACKTRACE=full` for a verbose backtrace.
78.30 s
gammaloop-nextest-docs> =========================================
78.31 s
gammaloop-nextest-docs> Extracting 2 binaries to /build/source
78.36 s
gammaloop-nextest-docs> Extracted 5 files to /build/source in 0.05s
78.37 s
gammaloop-nextest-docs> ------------
78.37 s
gammaloop-nextest-docs> Nextest run ID 5d901acc-d4d5-4a62-85b3-4b580c5b5def with nextest profile: ci_gammaloop
78.37 s
gammaloop-nextest-docs> Starting 22 tests across 2 binaries
78.39 s
gammaloop-nextest-docs> ------------
78.39 s
gammaloop-nextest-docs> Summary [ 0.025s] 22 tests run: 22 passed , 0 skipped
78.43 s
gammaloop-nextest-docs>
78.43 s
gammaloop-nextest-docs> ========== nextest test summary ==========
78.43 s
gammaloop-nextest-docs> report: target/nextest/ci_gammaloop/junit.xml
78.43 s
gammaloop-nextest-docs> tests: 22, failures: 0, errors: 0
78.43 s
gammaloop-nextest-docs> No failing testcases found.
78.43 s
gammaloop-nextest-docs> =========================================
78.45 s
gammaloop-nextest-docs> Extracting 3 binaries (including 2 non-test binaries), 1 build script output directory, and 2 linked paths to /build/source
78.73 s
gammaloop-nextest-docs> Extracted 22 files to /build/source in 0.28s
78.74 s
gammaloop-nextest-docs> ------------
78.74 s
gammaloop-nextest-docs> Nextest run ID b23e7db6-1ff8-4e82-b4fa-6b481dd3d361 with nextest profile: ci_gammaloop
78.74 s
gammaloop-nextest-docs> Starting 89 tests across 1 binary
78.83 s
gammaloop-nextest-docs> ------------
78.83 s
gammaloop-nextest-docs> Summary [ 0.084s] 89 tests run: 89 passed , 0 skipped
78.87 s
gammaloop-nextest-docs>
78.87 s
gammaloop-nextest-docs> ========== nextest test summary ==========
78.87 s
gammaloop-nextest-docs> report: target/nextest/ci_gammaloop/junit.xml
78.87 s
gammaloop-nextest-docs> tests: 89, failures: 0, errors: 0
78.87 s
gammaloop-nextest-docs> No failing testcases found.
78.87 s
gammaloop-nextest-docs> =========================================
78.88 s
gammaloop-nextest-docs> Extracting 2 binaries to /build/source
78.93 s
gammaloop-nextest-docs> Extracted 5 files to /build/source in 0.05s
78.95 s
gammaloop-nextest-docs> ------------
78.95 s
gammaloop-nextest-docs> Nextest run ID f66f585d-35b0-4bf8-bc70-09d6f723a452 with nextest profile: ci_gammaloop
78.95 s
gammaloop-nextest-docs> Starting 10 tests across 2 binaries
109.75 s
gammaloop-nextest-docs> ------------
109.75 s
gammaloop-nextest-docs> Summary [ 30.802s] 10 tests run: 10 passed , 0 skipped
109.80 s
gammaloop-nextest-docs>
109.80 s
gammaloop-nextest-docs> ========== nextest test summary ==========
109.80 s
gammaloop-nextest-docs> report: target/nextest/ci_gammaloop/junit.xml
109.80 s
gammaloop-nextest-docs> tests: 10, failures: 0, errors: 0
109.80 s
gammaloop-nextest-docs> No failing testcases found.
109.80 s
gammaloop-nextest-docs> =========================================
109.82 s
gammaloop-nextest-docs> Extracting 1 binary to /build/source
109.88 s
gammaloop-nextest-docs> Extracted 4 files to /build/source in 0.05s
109.89 s
gammaloop-nextest-docs> ------------
109.89 s
gammaloop-nextest-docs> Nextest run ID 06fe269a-33f5-4b9e-bf3b-3af3fd3f3140 with nextest profile: ci_gammaloop
109.89 s
gammaloop-nextest-docs> Starting 0 tests across 1 binary
109.89 s
gammaloop-nextest-docs> ------------
109.89 s
gammaloop-nextest-docs> Summary [ 0.000s] 0 tests run: 0 passed , 0 skipped
109.95 s
gammaloop-nextest-docs>
109.95 s
gammaloop-nextest-docs> ========== nextest test summary ==========
109.95 s
gammaloop-nextest-docs> report: target/nextest/ci_gammaloop/junit.xml
109.95 s
gammaloop-nextest-docs> tests: 0, failures: 0, errors: 0
109.95 s
gammaloop-nextest-docs> No failing testcases found.
109.95 s
gammaloop-nextest-docs> =========================================
109.98 s
gammaloop-nextest-docs> Extracting 1 binary to /build/source
110.04 s
gammaloop-nextest-docs> Extracted 4 files to /build/source in 0.06s
110.05 s
gammaloop-nextest-docs> ------------
110.05 s
gammaloop-nextest-docs> Nextest run ID bd500b26-7456-487f-9db7-f74e4bb0de9f with nextest profile: ci_gammaloop
110.05 s
gammaloop-nextest-docs> Starting 5 tests across 1 binary
110.05 s
gammaloop-nextest-docs> ------------
110.05 s
gammaloop-nextest-docs> Summary [ 0.007s] 5 tests run: 5 passed , 0 skipped
110.10 s
gammaloop-nextest-docs>
110.10 s
gammaloop-nextest-docs> ========== nextest test summary ==========
110.10 s
gammaloop-nextest-docs> report: target/nextest/ci_gammaloop/junit.xml
110.10 s
gammaloop-nextest-docs> tests: 5, failures: 0, errors: 0
110.10 s
gammaloop-nextest-docs> No failing testcases found.
110.10 s
gammaloop-nextest-docs> =========================================
110.40 s
error: Cannot build '/nix/store/9rs74w2crrwhaq7f0dxdi11wd515i6dj-gammaloop-nextest-docs.drv '.
110.40 s
Reason: builder failed with exit code 100 .
110.40 s
Output paths:
110.40 s
/nix/store/1jyipvscqlj4v0h7qjznydlgdlc4bjy7-gammaloop-nextest-docs
110.40 s
Last 347 log lines:
110.40 s
> Extracting 2 binaries to /build/source
110.40 s
> Extracted 5 files to /build/source in 0.11s
110.40 s
> ------------
110.40 s
> Nextest run ID b5a22949-0314-418c-a581-bbbacd05c642 with nextest profile: ci_gammaloop
110.40 s
> Starting 129 tests across 2 binaries
110.40 s
> FAIL [ 46.205s] (128/129) alphal00p-docs-builder provenance_tests :: each_build_captures_one_revision_before_rendering
110.40 s
> stdout ---
110.40 s
>
110.40 s
> running 1 test
110.40 s
>
110.40 s
> running 1 test
110.40 s
> test provenance_tests::each_build_captures_one_revision_before_rendering ... FAILED
110.40 s
>
110.40 s
> failures:
110.40 s
>
110.40 s
> failures:
110.40 s
> provenance_tests::each_build_captures_one_revision_before_rendering
110.40 s
>
110.40 s
> test result: FAILED. 0 passed; 1 failed; 0 ignored; 0 measured; 128 filtered out; finished in 46.11s
110.40 s
>
110.40 s
> test provenance_tests::each_build_captures_one_revision_before_rendering ... FAILED
110.40 s
>
110.40 s
> failures:
110.40 s
>
110.40 s
> failures:
110.40 s
> provenance_tests::each_build_captures_one_revision_before_rendering
110.40 s
>
110.40 s
> test result: FAILED. 0 passed; 1 failed; 0 ignored; 0 measured; 128 filtered out; finished in 46.19s
110.40 s
>
110.40 s
> stderr ---
110.40 s
> warning: bundle export is experimental
110.40 s
> = hint: its behaviour may change at any time
110.40 s
> = hint: do not rely on this feature for production use cases
110.40 s
>
110.40 s
> warning: unknown font family: roboto
110.40 s
> ┌─ crates/linnest/typst/docs/manual.typ:11:28
110.40 s
> │
110.40 s
> 11 │ #set text(size: 10pt, font: "Roboto")
110.40 s
> │ ^^^^^^^^
110.40 s
>
110.40 s
> warning: unknown font family: roboto
110.40 s
> ┌─ crates/linnest/typst/docs/manual.typ:14:29
110.40 s
> │
110.40 s
> 14 │ #set text(size: 3em, font: "Roboto")
110.40 s
> │ ^^^^^^^^
110.40 s
>
110.40 s
> warning: unknown font family: roboto
110.40 s
> ┌─ crates/linnest/typst/docs/manual.typ:16:31
110.40 s
> │
110.40 s
> 16 │ #set text(size: 0.3em, font: "Roboto")
110.40 s
> │ ^^^^^^^^
110.40 s
>
110.40 s
> warning: overline was ignored during MathML export
110.40 s
> ┌─ crates/linnest/typst/docs/manual.typ:949:55
110.40 s
> │
110.40 s
> 949 │ + sum_("dangling" e) c_("dangling-centroid") / (d(e, overline(v)) + epsilon)
110.40 s
> │ ^^^^^^^^^^^
110.40 s
>
110.40 s
> warning: overline was ignored during MathML export
110.40 s
> ┌─ crates/linnest/typst/docs/manual.typ:953:8
110.40 s
> │
110.40 s
> 953 │ Here $overline(v)$ is the mean node position. The centroid term pushes every
110.40 s
> │ ^^^^^^^^^^^
110.40 s
>
110.40 s
>
110.40 s
> thread 'provenance_tests::each_build_captures_one_revision_before_rendering' (248) panicked at crates/alphal00p-docs-builder/src/provenance_tests.rs:297:14:
110.40 s
> called `Result::unwrap()` on an `Err` value: generated site has broken links:
110.40 s
> products/linnet/latest/reference/interfaces/index.html -> https://github.com/alphal00p/gammaloop/blob/1111111111111111111111111111111111111111/crates/linnet-py/examples/physics_render_settings.py (missing repository source file crates/linnet-py/examples/physics_render_settings.py)
110.40 s
> products/linnet/latest/reference/interfaces/index.html -> https://github.com/alphal00p/gammaloop/blob/1111111111111111111111111111111111111111/crates/linnet-py/examples/layout_stream.py (missing repository source file crates/linnet-py/examples/layout_stream.py)
110.40 s
> products/linnet/latest/guides/python-rendering/index.html -> https://github.com/alphal00p/gammaloop/blob/1111111111111111111111111111111111111111/crates/linnet-py/examples/rendering_api.py (missing repository source file crates/linnet-py/examples/rendering_api.py)
110.40 s
> products/linnet/latest/playground/index.html -> https://github.com/alphal00p/gammaloop/blob/1111111111111111111111111111111111111111/crates/linnet-py/examples/layout_stream.py (missing repository source file crates/linnet-py/examples/layout_stream.py)
110.40 s
>
110.40 s
> Location:
110.40 s
> crates/alphal00p-docs-builder/src/lib.rs:4940:9
110.40 s
> stack backtrace:
110.40 s
> 0: __rustc::rust_begin_unwind
110.40 s
> 1: core::panicking::panic_fmt
110.40 s
> 2: core::result::unwrap_failed
110.40 s
> 3: alphal00p_docs_builder::provenance_tests::each_build_captures_one_revision_before_rendering
110.40 s
> 4: <alphal00p_docs_builder::provenance_tests::each_build_captures_one_revision_before_rendering::{closure#0} as core::ops::function::FnOnce<()>>::call_once
110.40 s
> note: Some details are omitted, run with `RUST_BACKTRACE=full` for a verbose backtrace.
110.40 s
>
110.40 s
> thread 'provenance_tests::each_build_captures_one_revision_before_rendering' (187) panicked at crates/alphal00p-docs-builder/src/provenance_tests.rs:274:9:
110.40 s
> assertion failed: command.status().unwrap().success()
110.40 s
> stack backtrace:
110.40 s
> 0: __rustc::rust_begin_unwind
110.40 s
> 1: core::panicking::panic_fmt
110.40 s
> 2: core::panicking::panic
110.40 s
> 3: alphal00p_docs_builder::provenance_tests::each_build_captures_one_revision_before_rendering
110.40 s
> 4: <alphal00p_docs_builder::provenance_tests::each_build_captures_one_revision_before_rendering::{closure#0} as core::ops::function::FnOnce<()>>::call_once
110.40 s
> note: Some details are omitted, run with `RUST_BACKTRACE=full` for a verbose backtrace.
110.40 s
>
110.40 s
> ------------
110.40 s
> Summary [ 54.376s] 129 tests run: 128 passed , 1 failed , 0 skipped
110.40 s
> FAIL [ 46.205s] (128/129) alphal00p-docs-builder provenance_tests :: each_build_captures_one_revision_before_rendering
110.40 s
> stdout ---
110.40 s
>
110.40 s
> running 1 test
110.40 s
>
110.40 s
> running 1 test
110.40 s
> test provenance_tests::each_build_captures_one_revision_before_rendering ... FAILED
110.40 s
>
110.40 s
> failures:
110.40 s
>
110.40 s
> failures:
110.40 s
> provenance_tests::each_build_captures_one_revision_before_rendering
110.40 s
>
110.40 s
> test result: FAILED. 0 passed; 1 failed; 0 ignored; 0 measured; 128 filtered out; finished in 46.11s
110.40 s
>
110.40 s
> test provenance_tests::each_build_captures_one_revision_before_rendering ... FAILED
110.40 s
>
110.40 s
> failures:
110.40 s
>
110.40 s
> failures:
110.40 s
> provenance_tests::each_build_captures_one_revision_before_rendering
110.40 s
>
110.40 s
> test result: FAILED. 0 passed; 1 failed; 0 ignored; 0 measured; 128 filtered out; finished in 46.19s
110.40 s
>
110.40 s
> stderr ---
110.40 s
> warning: bundle export is experimental
110.40 s
> = hint: its behaviour may change at any time
110.40 s
> = hint: do not rely on this feature for production use cases
110.40 s
>
110.40 s
> warning: unknown font family: roboto
110.40 s
> ┌─ crates/linnest/typst/docs/manual.typ:11:28
110.40 s
> │
110.40 s
> 11 │ #set text(size: 10pt, font: "Roboto")
110.40 s
> │ ^^^^^^^^
110.40 s
>
110.40 s
> warning: unknown font family: roboto
110.40 s
> ┌─ crates/linnest/typst/docs/manual.typ:14:29
110.40 s
> │
110.40 s
> 14 │ #set text(size: 3em, font: "Roboto")
110.40 s
> │ ^^^^^^^^
110.40 s
>
110.40 s
> warning: unknown font family: roboto
110.40 s
> ┌─ crates/linnest/typst/docs/manual.typ:16:31
110.40 s
> │
110.40 s
> 16 │ #set text(size: 0.3em, font: "Roboto")
110.40 s
> │ ^^^^^^^^
110.40 s
>
110.40 s
> warning: overline was ignored during MathML export
110.40 s
> ┌─ crates/linnest/typst/docs/manual.typ:949:55
110.40 s
> │
110.40 s
> 949 │ + sum_("dangling" e) c_("dangling-centroid") / (d(e, overline(v)) + epsilon)
110.40 s
> │ ^^^^^^^^^^^
110.40 s
>
110.40 s
> warning: overline was ignored during MathML export
110.40 s
> ┌─ crates/linnest/typst/docs/manual.typ:953:8
110.40 s
> │
110.40 s
> 953 │ Here $overline(v)$ is the mean node position. The centroid term pushes every
110.40 s
> │ ^^^^^^^^^^^
110.40 s
>
110.40 s
>
110.40 s
> thread 'provenance_tests::each_build_captures_one_revision_before_rendering' (248) panicked at crates/alphal00p-docs-builder/src/provenance_tests.rs:297:14:
110.40 s
> called `Result::unwrap()` on an `Err` value: generated site has broken links:
110.40 s
> products/linnet/latest/reference/interfaces/index.html -> https://github.com/alphal00p/gammaloop/blob/1111111111111111111111111111111111111111/crates/linnet-py/examples/physics_render_settings.py (missing repository source file crates/linnet-py/examples/physics_render_settings.py)
110.40 s
> products/linnet/latest/reference/interfaces/index.html -> https://github.com/alphal00p/gammaloop/blob/1111111111111111111111111111111111111111/crates/linnet-py/examples/layout_stream.py (missing repository source file crates/linnet-py/examples/layout_stream.py)
110.40 s
> products/linnet/latest/guides/python-rendering/index.html -> https://github.com/alphal00p/gammaloop/blob/1111111111111111111111111111111111111111/crates/linnet-py/examples/rendering_api.py (missing repository source file crates/linnet-py/examples/rendering_api.py)
110.40 s
> products/linnet/latest/playground/index.html -> https://github.com/alphal00p/gammaloop/blob/1111111111111111111111111111111111111111/crates/linnet-py/examples/layout_stream.py (missing repository source file crates/linnet-py/examples/layout_stream.py)
110.40 s
>
110.40 s
> Location:
110.40 s
> crates/alphal00p-docs-builder/src/lib.rs:4940:9
110.40 s
> stack backtrace:
110.40 s
> 0: __rustc::rust_begin_unwind
110.40 s
> 1: core::panicking::panic_fmt
110.40 s
> 2: core::result::unwrap_failed
110.40 s
> 3: alphal00p_docs_builder::provenance_tests::each_build_captures_one_revision_before_rendering
110.40 s
> 4: <alphal00p_docs_builder::provenance_tests::each_build_captures_one_revision_before_rendering::{closure#0} as core::ops::function::FnOnce<()>>::call_once
110.40 s
> note: Some details are omitted, run with `RUST_BACKTRACE=full` for a verbose backtrace.
110.40 s
>
110.40 s
> thread 'provenance_tests::each_build_captures_one_revision_before_rendering' (187) panicked at crates/alphal00p-docs-builder/src/provenance_tests.rs:274:9:
110.40 s
> assertion failed: command.status().unwrap().success()
110.40 s
> stack backtrace:
110.40 s
> 0: __rustc::rust_begin_unwind
110.40 s
> 1: core::panicking::panic_fmt
110.40 s
> 2: core::panicking::panic
110.40 s
> 3: alphal00p_docs_builder::provenance_tests::each_build_captures_one_revision_before_rendering
110.40 s
> 4: <alphal00p_docs_builder::provenance_tests::each_build_captures_one_revision_before_rendering::{closure#0} as core::ops::function::FnOnce<()>>::call_once
110.40 s
> note: Some details are omitted, run with `RUST_BACKTRACE=full` for a verbose backtrace.
110.40 s
>
110.40 s
> error : test run failed
110.40 s
>
110.40 s
> ========== nextest test summary ==========
110.40 s
> report: target/nextest/ci_gammaloop/junit.xml
110.40 s
> tests: 129, failures: 1, errors: 0
110.40 s
>
110.40 s
> 1. alphal00p-docs-builder::provenance_tests::each_build_captures_one_revision_before_rendering
110.40 s
> failure: test failure with exit code 101
110.40 s
> thread 'provenance_tests::each_build_captures_one_revision_before_rendering' (187) panicked at crates/alphal00p-docs-builder/src/provenance_tests.rs:274:9:
110.40 s
> assertion failed: command.status().unwrap().success()
110.40 s
> stack backtrace:
110.40 s
> 0: __rustc::rust_begin_unwind
110.40 s
> 1: core::panicking::panic_fmt
110.40 s
> 2: core::panicking::panic
110.40 s
> 3: alphal00p_docs_builder::provenance_tests::each_build_captures_one_revision_before_rendering
110.41 s
> 4: <alphal00p_docs_builder::provenance_tests::each_build_captures_one_revision_before_rendering::{closure#0} as core::ops::function::FnOnce<()>>::call_once
110.41 s
> note: Some details are omitted, run with `RUST_BACKTRACE=full` for a verbose backtrace.
110.41 s
> system-out
110.41 s
> running 1 test
110.41 s
>
110.41 s
> running 1 test
110.41 s
> test provenance_tests::each_build_captures_one_revision_before_rendering ... FAILED
110.41 s
>
110.41 s
> failures:
110.41 s
>
110.41 s
> failures:
110.41 s
> provenance_tests::each_build_captures_one_revision_before_rendering
110.41 s
>
110.41 s
> test result: FAILED. 0 passed; 1 failed; 0 ignored; 0 measured; 128 filtered out; finished in 46.11s
110.41 s
>
110.41 s
> test provenance_tests::each_build_captures_one_revision_before_rendering ... FAILED
110.41 s
>
110.41 s
> failures:
110.41 s
>
110.41 s
> failures:
110.41 s
> provenance_tests::each_build_captures_one_revision_before_rendering
110.41 s
>
110.41 s
> test result: FAILED. 0 passed; 1 failed; 0 ignored; 0 measured; 128 filtered out; finished in 46.19s
110.41 s
> system-err
110.41 s
> warning: bundle export is experimental
110.41 s
> = hint: its behaviour may change at any time
110.41 s
> = hint: do not rely on this feature for production use cases
110.41 s
>
110.41 s
> warning: unknown font family: roboto
110.41 s
> ┌─ crates/linnest/typst/docs/manual.typ:11:28
110.41 s
> │
110.41 s
> 11 │ #set text(size: 10pt, font: "Roboto")
110.41 s
> │ ^^^^^^^^
110.41 s
>
110.41 s
> warning: unknown font family: roboto
110.41 s
> ┌─ crates/linnest/typst/docs/manual.typ:14:29
110.41 s
> │
110.41 s
> 14 │ #set text(size: 3em, font: "Roboto")
110.41 s
> │ ^^^^^^^^
110.41 s
>
110.41 s
> warning: unknown font family: roboto
110.41 s
> ┌─ crates/linnest/typst/docs/manual.typ:16:31
110.41 s
> │
110.41 s
> 16 │ #set text(size: 0.3em, font: "Roboto")
110.41 s
> │ ^^^^^^^^
110.41 s
>
110.41 s
> warning: overline was ignored during MathML export
110.41 s
> ┌─ crates/linnest/typst/docs/manual.typ:949:55
110.41 s
> │
110.41 s
> 949 │ + sum_("dangling" e) c_("dangling-centroid") / (d(e, overline(v)) + epsilon)
110.41 s
> │ ^^^^^^^^^^^
110.41 s
>
110.41 s
> warning: overline was ignored during MathML export
110.41 s
> ┌─ crates/linnest/typst/docs/manual.typ:953:8
110.41 s
> │
110.41 s
> 953 │ Here $overline(v)$ is the mean node position. The centroid term pushes every
110.41 s
> │ ^^^^^^^^^^^
110.41 s
>
110.41 s
>
110.41 s
> thread 'provenance_tests::each_build_captures_one_revision_before_rendering' (248) panicked at crates/alphal00p-docs-builder/src/provenance_tests.rs:297:14:
110.41 s
> called `Result::unwrap()` on an `Err` value: generated site has broken links:
110.41 s
> products/linnet/latest/reference/interfaces/index.html -> https://github.com/alphal00p/gammaloop/blob/1111111111111111111111111111111111111111/crates/linnet-py/examples/physics_render_settings.py (missing repository source file crates/linnet-py/examples/physics_render_settings.py)
110.41 s
> products/linnet/latest/reference/interfaces/index.html -> https://github.com/alphal00p/gammaloop/blob/1111111111111111111111111111111111111111/crates/linnet-py/examples/layout_stream.py (missing repository source file crates/linnet-py/examples/layout_stream.py)
110.41 s
> products/linnet/latest/guides/python-rendering/index.html -> https://github.com/alphal00p/gammaloop/blob/1111111111111111111111111111111111111111/crates/linnet-py/examples/rendering_api.py (missing repository source file crates/linnet-py/examples/rendering_api.py)
110.41 s
> products/linnet/latest/playground/index.html -> https://github.com/alphal00p/gammaloop/blob/1111111111111111111111111111111111111111/crates/linnet-py/examples/layout_stream.py (missing repository source file crates/linnet-py/examples/layout_stream.py)
110.41 s
>
110.41 s
> Location:
110.41 s
> crates/alphal00p-docs-builder/src/lib.rs:4940:9
110.41 s
> stack backtrace:
110.41 s
> 0: __rustc::rust_begin_unwind
110.41 s
> 1: core::panicking::panic_fmt
110.41 s
> 2: core::result::unwrap_failed
110.41 s
> 3: alphal00p_docs_builder::provenance_tests::each_build_captures_one_revision_before_rendering
110.41 s
> 4: <alphal00p_docs_builder::provenance_tests::each_build_captures_one_revision_before_rendering::{closure#0} as core::ops::function::FnOnce<()>>::call_once
110.41 s
> note: Some details are omitted, run with `RUST_BACKTRACE=full` for a verbose backtrace.
110.41 s
>
110.41 s
> thread 'provenance_tests::each_build_captures_one_revision_before_rendering' (187) panicked at crates/alphal00p-docs-builder/src/provenance_tests.rs:274:9:
110.41 s
> assertion failed: command.status().unwrap().success()
110.41 s
> stack backtrace:
110.41 s
> 0: __rustc::rust_begin_unwind
110.41 s
> 1: core::panicking::panic_fmt
110.41 s
> 2: core::panicking::panic
110.41 s
> 3: alphal00p_docs_builder::provenance_tests::each_build_captures_one_revision_before_rendering
110.41 s
> 4: <alphal00p_docs_builder::provenance_tests::each_build_captures_one_revision_before_rendering::{closure#0} as core::ops::function::FnOnce<()>>::call_once
110.41 s
> note: Some details are omitted, run with `RUST_BACKTRACE=full` for a verbose backtrace.
110.41 s
> =========================================
110.41 s
> Extracting 2 binaries to /build/source
110.41 s
> Extracted 5 files to /build/source in 0.05s
110.41 s
> ------------
110.41 s
> Nextest run ID 5d901acc-d4d5-4a62-85b3-4b580c5b5def with nextest profile: ci_gammaloop
110.41 s
> Starting 22 tests across 2 binaries
110.41 s
> ------------
110.41 s
> Summary [ 0.025s] 22 tests run: 22 passed , 0 skipped
110.41 s
>
110.41 s
> ========== nextest test summary ==========
110.41 s
> report: target/nextest/ci_gammaloop/junit.xml
110.41 s
> tests: 22, failures: 0, errors: 0
110.41 s
> No failing testcases found.
110.41 s
> =========================================
110.41 s
> Extracting 3 binaries (including 2 non-test binaries), 1 build script output directory, and 2 linked paths to /build/source
110.41 s
> Extracted 22 files to /build/source in 0.28s
110.41 s
> ------------
110.41 s
> Nextest run ID b23e7db6-1ff8-4e82-b4fa-6b481dd3d361 with nextest profile: ci_gammaloop
110.41 s
> Starting 89 tests across 1 binary
110.41 s
> ------------
110.41 s
> Summary [ 0.084s] 89 tests run: 89 passed , 0 skipped
110.41 s
>
110.41 s
> ========== nextest test summary ==========
110.41 s
> report: target/nextest/ci_gammaloop/junit.xml
110.41 s
> tests: 89, failures: 0, errors: 0
110.41 s
> No failing testcases found.
110.41 s
> =========================================
110.41 s
> Extracting 2 binaries to /build/source
110.41 s
> Extracted 5 files to /build/source in 0.05s
110.41 s
> ------------
110.41 s
> Nextest run ID f66f585d-35b0-4bf8-bc70-09d6f723a452 with nextest profile: ci_gammaloop
110.41 s
> Starting 10 tests across 2 binaries
110.41 s
> ------------
110.41 s
> Summary [ 30.802s] 10 tests run: 10 passed , 0 skipped
110.41 s
>
110.41 s
> ========== nextest test summary ==========
110.41 s
> report: target/nextest/ci_gammaloop/junit.xml
110.41 s
> tests: 10, failures: 0, errors: 0
110.41 s
> No failing testcases found.
110.41 s
> =========================================
110.41 s
> Extracting 1 binary to /build/source
110.41 s
> Extracted 4 files to /build/source in 0.05s
110.41 s
> ------------
110.41 s
> Nextest run ID 06fe269a-33f5-4b9e-bf3b-3af3fd3f3140 with nextest profile: ci_gammaloop
110.41 s
> Starting 0 tests across 1 binary
110.41 s
> ------------
110.41 s
> Summary [ 0.000s] 0 tests run: 0 passed , 0 skipped
110.41 s
>
110.41 s
> ========== nextest test summary ==========
110.41 s
> report: target/nextest/ci_gammaloop/junit.xml
110.41 s
> tests: 0, failures: 0, errors: 0
110.41 s
> No failing testcases found.
110.41 s
> =========================================
110.41 s
> Extracting 1 binary to /build/source
110.41 s
> Extracted 4 files to /build/source in 0.06s
110.41 s
> ------------
110.41 s
> Nextest run ID bd500b26-7456-487f-9db7-f74e4bb0de9f with nextest profile: ci_gammaloop
110.41 s
> Starting 5 tests across 1 binary
110.41 s
> ------------
110.41 s
> Summary [ 0.007s] 5 tests run: 5 passed , 0 skipped
110.41 s
>
110.41 s
> ========== nextest test summary ==========
110.41 s
> report: target/nextest/ci_gammaloop/junit.xml
110.41 s
> tests: 5, failures: 0, errors: 0
110.41 s
> No failing testcases found.
110.41 s
> =========================================
110.41 s
For full logs, run:
110.41 s
nix log /nix/store/9rs74w2crrwhaq7f0dxdi11wd515i6dj-gammaloop-nextest-docs.drv
110.57 s
[0 built (1 failed )]Run failed.