test packages.x86_64-linux.nix-ci-check-gammaloop-nextest-docs

Reproduce this run
Retry Run
  1. 0.25 s $ /nix/store/9ypz3flqsrl5xl495mm8h645gadjsxi1-coreutils-9.11/bin/timeout --kill-after=15s 7200s /nix/store/23zk8sgzamrbmj1fday15szf7f2279s8-nix-2.34.7/bin/nix --extra-experimental-features nix-command --extra-experimental-features flakes flake clone git+https://github.com/alphal00p/gammaloop --dest /tmp/nix-ci-worker/stable-pwd/repo/
  2. 0.34 s Cloning into '/tmp/nix-ci-worker/stable-pwd/repo'...
  3. 1.66 s remote: Enumerating objects: 87989, done.
  4. 1.77 s remote: Counting objects: 0% (1/10557) remote: Counting objects: 1% (106/10557) remote: Counting objects: 2% (212/10557) remote: Counting objects: 3% (317/10557) remote: Counting objects: 4% (423/10557) remote: Counting objects: 5% (528/10557) remote: Counting objects: 6% (634/10557) remote: Counting objects: 7% (739/10557) remote: Counting objects: 8% (845/10557) remote: Counting objects: 9% (951/10557) remote: Counting objects: 10% (1056/10557) remote: Counting objects: 11% (1162/10557) remote: Counting objects: 12% (1267/10557) remote: Counting objects: 13% (1373/10557) remote: Counting objects: 14% (1478/10557) remote: Counting objects: 15% (1584/10557) remote: Counting objects: 16% (1690/10557) remote: Counting objects: 17% (1795/10557) remote: Counting objects: 18% (1901/10557) remote: Counting objects: 19% (2006/10557) remote: Counting objects: 20% (2112/10557) remote: Counting objects: 21% (2217/10557) remote: Counting objects: 22% (2323/10557) remote: Counting objects: 23% (2429/10557) remote: Counting objects: 24% (2534/10557) remote: Counting objects: 25% (2640/10557) remote: Counting objects: 26% (2745/10557) remote: Counting objects: 27% (2851/10557) remote: Counting objects: 28% (2956/10557) remote: Counting objects: 29% (3062/10557) remote: Counting objects: 30% (3168/10557) remote: Counting objects: 31% (3273/10557) remote: Counting objects: 32% (3379/10557) remote: Counting objects: 33% (3484/10557) remote: Counting objects: 34% (3590/10557) remote: Counting objects: 35% (3695/10557) remote: Counting objects: 36% (3801/10557) remote: Counting objects: 37% (3907/10557) remote: Counting objects: 38% (4012/10557) remote: Counting objects: 39% (4118/10557) remote: Counting objects: 40% (4223/10557) remote: Counting objects: 41% (4329/10557) remote: Counting objects: 42% (4434/10557) remote: Counting objects: 43% (4540/10557) remote: Counting objects: 44% (4646/10557) remote: Counting objects: 45% (4751/10557) remote: Counting objects: 46% (4857/10557) remote: Counting objects: 47% (4962/10557) remote: Counting objects: 48% (5068/10557) remote: Counting objects: 49% (5173/10557) remote: Counting objects: 50% (5279/10557) remote: Counting objects: 51% (5385/10557) remote: Counting objects: 52% (5490/10557) remote: Counting objects: 53% (5596/10557) remote: Counting objects: 54% (5701/10557) remote: Counting objects: 55% (5807/10557) remote: Counting objects: 56% (5912/10557) remote: Counting objects: 57% (6018/10557) remote: Counting objects: 58% (6124/10557) remote: Counting objects: 59% (6229/10557) remote: Counting objects: 60% (6335/10557) remote: Counting objects: 61% (6440/10557) remote: Counting objects: 62% (6546/10557) remote: Counting objects: 63% (6651/10557) remote: Counting objects: 64% (6757/10557) remote: Counting objects: 65% (6863/10557) remote: Counting objects: 66% (6968/10557) remote: Counting objects: 67% (7074/10557) remote: Counting objects: 68% (7179/10557) remote: Counting objects: 69% (7285/10557) remote: Counting objects: 70% (7390/10557) remote: Counting objects: 71% (7496/10557) remote: Counting objects: 72% (7602/10557) remote: Counting objects: 73% (7707/10557) remote: Counting objects: 74% (7813/10557) remote: Counting objects: 75% (7918/10557) remote: Counting objects: 76% (8024/10557) remote: Counting objects: 77% (8129/10557) remote: Counting objects: 78% (8235/10557) remote: Counting objects: 79% (8341/10557) remote: Counting objects: 80% (8446/10557) remote: Counting objects: 81% (8552/10557) remote: Counting objects: 82% (8657/10557) remote: Counting objects: 83% (8763/10557) remote: Counting objects: 84% (8868/10557) remote: Counting objects: 85% (8974/10557) remote: Counting objects: 86% (9080/10557) remote: Counting objects: 87% (9185/10557) remote: Counting objects: 88% (9291/10557) remote: Counting objects: 89% (9396/10557) remote: Counting objects: 90% (9502/10557) remote: Counting objects: 91% (9607/10557) remote: Counting objects: 92% (9713/10557) remote: Counting objects: 93% (9819/10557) remote: Counting objects: 94% (9924/10557) remote: Counting objects: 95% (10030/10557) remote: Counting objects: 96% (10135/10557) remote: Counting objects: 97% (10241/10557) remote: Counting objects: 98% (10346/10557) remote: Counting objects: 99% (10452/10557) remote: Counting objects: 100% (10557/10557) remote: Counting objects: 100% (10557/10557), done.
  5. 5.23 s remote: Compressing objects: 0% (1/2952) remote: Compressing objects: 1% (30/2952) remote: Compressing objects: 2% (60/2952) remote: Compressing objects: 3% (89/2952) remote: Compressing objects: 4% (119/2952) remote: Compressing objects: 5% (148/2952) remote: Compressing objects: 6% (178/2952) remote: Compressing objects: 7% (207/2952) remote: Compressing objects: 8% (237/2952) remote: Compressing objects: 9% (266/2952) remote: Compressing objects: 10% (296/2952) remote: Compressing objects: 11% (325/2952) remote: Compressing objects: 12% (355/2952) remote: Compressing objects: 13% (384/2952) remote: Compressing objects: 14% (414/2952) remote: Compressing objects: 14% (428/2952) remote: Compressing objects: 15% (443/2952) remote: Compressing objects: 16% (473/2952) remote: Compressing objects: 17% (502/2952) remote: Compressing objects: 18% (532/2952) remote: Compressing objects: 19% (561/2952) remote: Compressing objects: 20% (591/2952) remote: Compressing objects: 21% (620/2952) remote: Compressing objects: 22% (650/2952) remote: Compressing objects: 23% (679/2952) remote: Compressing objects: 24% (709/2952) remote: Compressing objects: 24% (728/2952) remote: Compressing objects: 25% (738/2952) remote: Compressing objects: 26% (768/2952) remote: Compressing objects: 27% (798/2952) remote: Compressing objects: 28% (827/2952) remote: Compressing objects: 29% (857/2952) remote: Compressing objects: 30% (886/2952) remote: Compressing objects: 30% (905/2952) remote: Compressing objects: 31% (916/2952) remote: Compressing objects: 32% (945/2952) remote: Compressing objects: 33% (975/2952) remote: Compressing objects: 34% (1004/2952) remote: Compressing objects: 35% (1034/2952) remote: Compressing objects: 36% (1063/2952) remote: Compressing objects: 37% (1093/2952) remote: Compressing objects: 38% (1122/2952) remote: Compressing objects: 39% (1152/2952) remote: Compressing objects: 40% (1181/2952) remote: Compressing objects: 41% (1211/2952) remote: Compressing objects: 42% (1240/2952) remote: Compressing objects: 43% (1270/2952) remote: Compressing objects: 44% (1299/2952) remote: Compressing objects: 45% (1329/2952) remote: Compressing objects: 46% (1358/2952) remote: Compressing objects: 47% (1388/2952) remote: Compressing objects: 48% (1417/2952) remote: Compressing objects: 49% (1447/2952) remote: Compressing objects: 50% (1476/2952) remote: Compressing objects: 51% (1506/2952) remote: Compressing objects: 52% (1536/2952) remote: Compressing objects: 53% (1565/2952) remote: Compressing objects: 54% (1595/2952) remote: Compressing objects: 55% (1624/2952) remote: Compressing objects: 56% (1654/2952) remote: Compressing objects: 57% (1683/2952) remote: Compressing objects: 58% (1713/2952) remote: Compressing objects: 59% (1742/2952) remote: Compressing objects: 60% (1772/2952) remote: Compressing objects: 61% (1801/2952) remote: Compressing objects: 62% (1831/2952) remote: Compressing objects: 63% (1860/2952) remote: Compressing objects: 64% (1890/2952) remote: Compressing objects: 65% (1919/2952) remote: Compressing objects: 66% (1949/2952) remote: Compressing objects: 67% (1978/2952) remote: Compressing objects: 68% (2008/2952) remote: Compressing objects: 69% (2037/2952) remote: Compressing objects: 70% (2067/2952) remote: Compressing objects: 71% (2096/2952) remote: Compressing objects: 72% (2126/2952) remote: Compressing objects: 73% (2155/2952) remote: Compressing objects: 74% (2185/2952) remote: Compressing objects: 75% (2214/2952) remote: Compressing objects: 76% (2244/2952) remote: Compressing objects: 77% (2274/2952) remote: Compressing objects: 78% (2303/2952) remote: Compressing objects: 79% (2333/2952) remote: Compressing objects: 80% (2362/2952) remote: Compressing objects: 81% (2392/2952) remote: Compressing objects: 82% (2421/2952) remote: Compressing objects: 83% (2451/2952) remote: Compressing objects: 84% (2480/2952) remote: Compressing objects: 85% (2510/2952) remote: Compressing objects: 86% (2539/2952) remote: Compressing objects: 87% (2569/2952) remote: Compressing objects: 88% (2598/2952) remote: Compressing objects: 89% (2628/2952) remote: Compressing objects: 90% (2657/2952) remote: Compressing objects: 91% (2687/2952) remote: Compressing objects: 92% (2716/2952) remote: Compressing objects: 93% (2746/2952) remote: Compressing objects: 94% (2775/2952) remote: Compressing objects: 95% (2805/2952) remote: Compressing objects: 96% (2834/2952) remote: Compressing objects: 97% (2864/2952) remote: Compressing objects: 98% (2893/2952) remote: Compressing objects: 99% (2923/2952) remote: Compressing objects: 100% (2952/2952) remote: Compressing objects: 100% (2952/2952), done.
  6. 11.47 s Receiving objects: 0% (1/87989) Receiving objects: 1% (880/87989) Receiving objects: 2% (1760/87989) Receiving objects: 3% (2640/87989) Receiving objects: 4% (3520/87989) Receiving objects: 5% (4400/87989) Receiving objects: 6% (5280/87989) Receiving objects: 7% (6160/87989) Receiving objects: 8% (7040/87989) Receiving objects: 9% (7920/87989), 13.94 MiB | 27.86 MiB/s Receiving objects: 10% (8799/87989), 13.94 MiB | 27.86 MiB/s Receiving objects: 11% (9679/87989), 13.94 MiB | 27.86 MiB/s Receiving objects: 12% (10559/87989), 13.94 MiB | 27.86 MiB/s Receiving objects: 13% (11439/87989), 13.94 MiB | 27.86 MiB/s Receiving objects: 14% (12319/87989), 13.94 MiB | 27.86 MiB/s Receiving objects: 15% (13199/87989), 13.94 MiB | 27.86 MiB/s Receiving objects: 16% (14079/87989), 13.94 MiB | 27.86 MiB/s Receiving objects: 17% (14959/87989), 13.94 MiB | 27.86 MiB/s Receiving objects: 18% (15839/87989), 13.94 MiB | 27.86 MiB/s Receiving objects: 19% (16718/87989), 13.94 MiB | 27.86 MiB/s Receiving objects: 20% (17598/87989), 13.94 MiB | 27.86 MiB/s Receiving objects: 21% (18478/87989), 13.94 MiB | 27.86 MiB/s Receiving objects: 22% (19358/87989), 13.94 MiB | 27.86 MiB/s Receiving objects: 23% (20238/87989), 13.94 MiB | 27.86 MiB/s Receiving objects: 24% (21118/87989), 13.94 MiB | 27.86 MiB/s Receiving objects: 25% (21998/87989), 13.94 MiB | 27.86 MiB/s Receiving objects: 26% (22878/87989), 13.94 MiB | 27.86 MiB/s Receiving objects: 27% (23758/87989), 13.94 MiB | 27.86 MiB/s Receiving objects: 28% (24637/87989), 13.94 MiB | 27.86 MiB/s Receiving objects: 29% (25517/87989), 13.94 MiB | 27.86 MiB/s Receiving objects: 30% (26397/87989), 13.94 MiB | 27.86 MiB/s Receiving objects: 31% (27277/87989), 13.94 MiB | 27.86 MiB/s Receiving objects: 32% (28157/87989), 13.94 MiB | 27.86 MiB/s Receiving objects: 33% (29037/87989), 13.94 MiB | 27.86 MiB/s Receiving objects: 34% (29917/87989), 13.94 MiB | 27.86 MiB/s Receiving objects: 35% (30797/87989), 13.94 MiB | 27.86 MiB/s Receiving objects: 36% (31677/87989), 13.94 MiB | 27.86 MiB/s Receiving objects: 37% (32556/87989), 13.94 MiB | 27.86 MiB/s Receiving objects: 37% (32648/87989), 30.18 MiB | 30.17 MiB/s Receiving objects: 38% (33436/87989), 30.18 MiB | 30.17 MiB/s Receiving objects: 39% (34316/87989), 30.18 MiB | 30.17 MiB/s Receiving objects: 40% (35196/87989), 30.18 MiB | 30.17 MiB/s Receiving objects: 41% (36076/87989), 30.18 MiB | 30.17 MiB/s Receiving objects: 42% (36956/87989), 30.18 MiB | 30.17 MiB/s Receiving objects: 43% (37836/87989), 42.15 MiB | 28.09 MiB/s Receiving objects: 44% (38716/87989), 42.15 MiB | 28.09 MiB/s Receiving objects: 45% (39596/87989), 42.15 MiB | 28.09 MiB/s Receiving objects: 46% (40475/87989), 42.15 MiB | 28.09 MiB/s Receiving objects: 47% (41355/87989), 42.15 MiB | 28.09 MiB/s Receiving objects: 48% (42235/87989), 42.15 MiB | 28.09 MiB/s Receiving objects: 49% (43115/87989), 42.15 MiB | 28.09 MiB/s Receiving objects: 50% (43995/87989), 42.15 MiB | 28.09 MiB/s Receiving objects: 50% (44396/87989), 53.43 MiB | 26.71 MiB/s Receiving objects: 51% (44875/87989), 53.43 MiB | 26.71 MiB/s Receiving objects: 52% (45755/87989), 53.43 MiB | 26.71 MiB/s Receiving objects: 53% (46635/87989), 53.43 MiB | 26.71 MiB/s Receiving objects: 54% (47515/87989), 53.43 MiB | 26.71 MiB/s Receiving objects: 55% (48394/87989), 53.43 MiB | 26.71 MiB/s Receiving objects: 56% (49274/87989), 64.88 MiB | 25.95 MiB/s Receiving objects: 57% (50154/87989), 64.88 MiB | 25.95 MiB/s Receiving objects: 58% (51034/87989), 64.88 MiB | 25.95 MiB/s Receiving objects: 59% (51914/87989), 64.88 MiB | 25.95 MiB/s Receiving objects: 60% (52794/87989), 64.88 MiB | 25.95 MiB/s Receiving objects: 60% (53414/87989), 64.88 MiB | 25.95 MiB/s Receiving objects: 61% (53674/87989), 76.71 MiB | 25.57 MiB/s Receiving objects: 62% (54554/87989), 76.71 MiB | 25.57 MiB/s Receiving objects: 63% (55434/87989), 76.71 MiB | 25.57 MiB/s Receiving objects: 64% (56313/87989), 76.71 MiB | 25.57 MiB/s Receiving objects: 65% (57193/87989), 76.71 MiB | 25.57 MiB/s Receiving objects: 66% (58073/87989), 89.71 MiB | 25.62 MiB/s Receiving objects: 66% (58080/87989), 105.93 MiB | 26.47 MiB/s Receiving objects: 67% (58953/87989), 105.93 MiB | 26.47 MiB/s Receiving objects: 68% (59833/87989), 105.93 MiB | 26.47 MiB/s Receiving objects: 69% (60713/87989), 105.93 MiB | 26.47 MiB/s Receiving objects: 70% (61593/87989), 105.93 MiB | 26.47 MiB/s Receiving objects: 71% (62473/87989), 105.93 MiB | 26.47 MiB/s Receiving objects: 72% (63353/87989), 105.93 MiB | 26.47 MiB/s Receiving objects: 73% (64232/87989), 123.50 MiB | 27.44 MiB/s Receiving objects: 74% (65112/87989), 123.50 MiB | 27.44 MiB/s Receiving objects: 75% (65992/87989), 123.50 MiB | 27.44 MiB/s Receiving objects: 76% (66872/87989), 123.50 MiB | 27.44 MiB/s Receiving objects: 77% (67752/87989), 123.50 MiB | 27.44 MiB/s Receiving objects: 78% (68632/87989), 123.50 MiB | 27.44 MiB/s Receiving objects: 79% (69512/87989), 123.50 MiB | 27.44 MiB/s Receiving objects: 80% (70392/87989), 123.50 MiB | 27.44 MiB/s Receiving objects: 81% (71272/87989), 123.50 MiB | 27.44 MiB/s Receiving objects: 82% (72151/87989), 123.50 MiB | 27.44 MiB/s Receiving objects: 83% (73031/87989), 123.50 MiB | 27.44 MiB/s Receiving objects: 83% (73303/87989), 123.50 MiB | 27.44 MiB/s Receiving objects: 84% (73911/87989), 139.06 MiB | 27.80 MiB/s Receiving objects: 85% (74791/87989), 139.06 MiB | 27.80 MiB/s Receiving objects: 86% (75671/87989), 139.06 MiB | 27.80 MiB/s Receiving objects: 87% (76551/87989), 139.06 MiB | 27.80 MiB/s Receiving objects: 88% (77431/87989), 139.06 MiB | 27.80 MiB/s Receiving objects: 89% (78311/87989), 139.06 MiB | 27.80 MiB/s Receiving objects: 90% (79191/87989), 139.06 MiB | 27.80 MiB/s Receiving objects: 91% (80070/87989), 139.06 MiB | 27.80 MiB/s Receiving objects: 92% (80950/87989), 139.06 MiB | 27.80 MiB/s Receiving objects: 93% (81830/87989), 139.06 MiB | 27.80 MiB/s Receiving objects: 94% (82710/87989), 139.06 MiB | 27.80 MiB/s Receiving objects: 95% (83590/87989), 139.06 MiB | 27.80 MiB/s Receiving objects: 96% (84470/87989), 139.06 MiB | 27.80 MiB/s Receiving objects: 97% (85350/87989), 153.61 MiB | 27.42 MiB/s Receiving objects: 98% (86230/87989), 153.61 MiB | 27.42 MiB/s Receiving objects: 98% (86706/87989), 153.61 MiB | 27.42 MiB/s Receiving objects: 99% (87110/87989), 168.61 MiB | 28.09 MiB/s remote: Total 87989 (delta 8613), reused 8381 (delta 7579), pack-reused 77432 (from 3)
  7. 11.47 s Receiving objects: 100% (87989/87989), 168.61 MiB | 28.09 MiB/s Receiving objects: 100% (87989/87989), 176.53 MiB | 28.28 MiB/s, done.
  8. 12.52 s Resolving deltas: 0% (0/59508) Resolving deltas: 1% (596/59508) Resolving deltas: 2% (1191/59508) Resolving deltas: 3% (1786/59508) Resolving deltas: 4% (2383/59508) Resolving deltas: 5% (2976/59508) Resolving deltas: 6% (3573/59508) Resolving deltas: 7% (4166/59508) Resolving deltas: 8% (4761/59508) Resolving deltas: 9% (5356/59508) Resolving deltas: 10% (5951/59508) Resolving deltas: 11% (6546/59508) Resolving deltas: 12% (7143/59508) Resolving deltas: 13% (7737/59508) Resolving deltas: 14% (8333/59508) Resolving deltas: 15% (8927/59508) Resolving deltas: 16% (9522/59508) Resolving deltas: 17% (10118/59508) Resolving deltas: 18% (10712/59508) Resolving deltas: 19% (11307/59508) Resolving deltas: 20% (11902/59508) Resolving deltas: 21% (12497/59508) Resolving deltas: 22% (13096/59508) Resolving deltas: 23% (13687/59508) Resolving deltas: 24% (14282/59508) Resolving deltas: 25% (14877/59508) Resolving deltas: 26% (15473/59508) Resolving deltas: 27% (16068/59508) Resolving deltas: 28% (16663/59508) Resolving deltas: 29% (17258/59508) Resolving deltas: 30% (17853/59508) Resolving deltas: 31% (18448/59508) Resolving deltas: 32% (19043/59508) Resolving deltas: 33% (19638/59508) Resolving deltas: 34% (20233/59508) Resolving deltas: 35% (20828/59508) Resolving deltas: 36% (21423/59508) Resolving deltas: 37% (22018/59508) Resolving deltas: 38% (22614/59508) Resolving deltas: 39% (23210/59508) Resolving deltas: 40% (23804/59508) Resolving deltas: 41% (24399/59508) Resolving deltas: 42% (24994/59508) Resolving deltas: 43% (25589/59508) Resolving deltas: 44% (26184/59508) Resolving deltas: 45% (26779/59508) Resolving deltas: 46% (27374/59508) Resolving deltas: 47% (27969/59508) Resolving deltas: 48% (28564/59508) Resolving deltas: 49% (29160/59508) Resolving deltas: 50% (29755/59508) Resolving deltas: 51% (30350/59508) Resolving deltas: 52% (30945/59508) Resolving deltas: 53% (31540/59508) Resolving deltas: 54% (32135/59508) Resolving deltas: 55% (32730/59508) Resolving deltas: 56% (33325/59508) Resolving deltas: 57% (33920/59508) Resolving deltas: 58% (34516/59508) Resolving deltas: 59% (35111/59508) Resolving deltas: 60% (35705/59508) Resolving deltas: 61% (36300/59508) Resolving deltas: 62% (36895/59508) Resolving deltas: 63% (37491/59508) Resolving deltas: 64% (38086/59508) Resolving deltas: 65% (38681/59508) Resolving deltas: 66% (39278/59508) Resolving deltas: 67% (39871/59508) Resolving deltas: 68% (40466/59508) Resolving deltas: 69% (41062/59508) Resolving deltas: 70% (41656/59508) Resolving deltas: 71% (42251/59508) Resolving deltas: 72% (42848/59508) Resolving deltas: 73% (43442/59508) Resolving deltas: 74% (44036/59508) Resolving deltas: 75% (44633/59508) Resolving deltas: 76% (45227/59508) Resolving deltas: 77% (45822/59508) Resolving deltas: 78% (46417/59508) Resolving deltas: 79% (47012/59508) Resolving deltas: 80% (47608/59508) Resolving deltas: 81% (48202/59508) Resolving deltas: 82% (48797/59508) Resolving deltas: 83% (49392/59508) Resolving deltas: 84% (49987/59508) Resolving deltas: 85% (50582/59508) Resolving deltas: 86% (51177/59508) Resolving deltas: 87% (51773/59508) Resolving deltas: 88% (52368/59508) Resolving deltas: 89% (52963/59508) Resolving deltas: 90% (53558/59508) Resolving deltas: 91% (54153/59508) Resolving deltas: 92% (54748/59508) Resolving deltas: 93% (55343/59508) Resolving deltas: 94% (55938/59508) Resolving deltas: 95% (56533/59508) Resolving deltas: 96% (57129/59508) Resolving deltas: 96% (57520/59508) Resolving deltas: 97% (57723/59508) Resolving deltas: 98% (58318/59508) Resolving deltas: 99% (58913/59508) Resolving deltas: 100% (59508/59508) Resolving deltas: 100% (59508/59508), done.
  9. 12.88 s Fetching commit 4338252f3f6441dd1159617dee545403b8fb24d4 for docs ...
  10. 12.88 s $ /nix/store/bcnisk3ydfgv26v2gw3zlky24g00yww2-git-2.54.0/bin/git fetch origin 4338252f3f6441dd1159617dee545403b8fb24d4
  11. 13.31 s From https://github.com/alphal00p/gammaloop
  12. 13.31 s * branch 4338252f3f6441dd1159617dee545403b8fb24d4 -> FETCH_HEAD
  13. 13.32 s $ /nix/store/9ypz3flqsrl5xl495mm8h645gadjsxi1-coreutils-9.11/bin/timeout --kill-after=15s 7200s /nix/store/bcnisk3ydfgv26v2gw3zlky24g00yww2-git-2.54.0/bin/git -c advice.detachedHead=false checkout 4338252f3f6441dd1159617dee545403b8fb24d4
  14. 13.54 s HEAD is now at 4338252f3 embed live WASM notebooks in the product guides
  15. 13.54 s $ /nix/store/9ypz3flqsrl5xl495mm8h645gadjsxi1-coreutils-9.11/bin/timeout --kill-after=15s 7200s /nix/store/23zk8sgzamrbmj1fday15szf7f2279s8-nix-2.34.7/bin/nix --extra-experimental-features nix-command --extra-experimental-features flakes --log-format internal-json run .#packages.x86_64-linux.nix-ci-check-gammaloop-nextest-docs --print-build-logs
  16. 19.17 s
  17. 29.09 s evaluating derivation 'g copying '/nix/store/bgss evaluating derivation 'g copying '/nix/store/bgss evaluating derivation 'g copying '/nix/store/bgss evaluating derivation 'g copying '/nix/store/bgss evaluating derivation 'g copying '/nix/store/bgss evaluating derivation 'g copying '/nix/store/bgss evaluating derivation 'g copying '/nix/store/bgss evaluating derivation 'g querying gammaloop-nexte [16.5/15.7 KiB DL] query [0/11 built, 4/0/48 copi [0/4 built, 11/17/48 cop [0/4 built, 7/26/48 copi [0/4 built, 6/35/48 copi [0/4 built, 4/39/48 copi [0/4 built, 3/41/48 copi [0/4 built, 3/42/48 copi [0/4 built, 3/43/48 copi [0/4 built, 2/46/48 copi [0/3 built, 1/47/48 copi [0/2 built, 48 copied (2python3> structuredAttrs is enabled
  18. 29.17 s [1/0/2 built, 48 copied python3> created 227 symlinks in user environment
  19. 30.09 s python3 (post)> Uploading to the NixCI cache: /nix/store/v67wpyflacy0i2gvzasrxvw2gkz4mr12-python3-3.13.15-env
  20. 30.14 s python3 (post)> warning: 'warn-short-path-literals' is deprecated, use 'lint-short-path-literals = ignore' instead
  21. 30.17 s python3 (post)> copying 0 paths...
  22. 30.22 s python3 (post)> warning: 'warn-short-path-literals' is deprecated, use 'lint-short-path-literals = ignore' instead
  23. 30.33 s python3 (post)> copying 0 paths...
  24. 30.91 s [1/3 built, 48 copied (2 [1/1/2 built, 48 copied gammaloop-nextest-docs> Extracting 2 binaries to /build/source
  25. 30.96 s gammaloop-nextest-docs> Extracted 5 files to /build/source in 0.05s
  26. 30.97 s gammaloop-nextest-docs> ------------
  27. 30.97 s gammaloop-nextest-docs> Nextest run ID 35ae24cf-a09b-4952-bd55-f491fc98ffe1 with nextest profile: ci_gammaloop
  28. 30.97 s gammaloop-nextest-docs> Starting 129 tests across 2 binaries
  29. 61.72 s gammaloop-nextest-docs> FAIL [ 30.747s] (128/129) alphal00p-docs-builder provenance_tests::each_build_captures_one_revision_before_rendering
  30. 61.72 s gammaloop-nextest-docs> stdout ---
  31. 61.72 s gammaloop-nextest-docs>
  32. 61.72 s gammaloop-nextest-docs> running 1 test
  33. 61.72 s gammaloop-nextest-docs>
  34. 61.72 s gammaloop-nextest-docs> running 1 test
  35. 61.72 s gammaloop-nextest-docs> test provenance_tests::each_build_captures_one_revision_before_rendering ... FAILED
  36. 61.72 s gammaloop-nextest-docs>
  37. 61.72 s gammaloop-nextest-docs> failures:
  38. 61.72 s gammaloop-nextest-docs>
  39. 61.72 s gammaloop-nextest-docs> failures:
  40. 61.72 s gammaloop-nextest-docs> provenance_tests::each_build_captures_one_revision_before_rendering
  41. 61.72 s gammaloop-nextest-docs>
  42. 61.72 s gammaloop-nextest-docs> test result: FAILED. 0 passed; 1 failed; 0 ignored; 0 measured; 128 filtered out; finished in 30.70s
  43. 61.72 s gammaloop-nextest-docs>
  44. 61.72 s gammaloop-nextest-docs> test provenance_tests::each_build_captures_one_revision_before_rendering ... FAILED
  45. 61.72 s gammaloop-nextest-docs>
  46. 61.72 s gammaloop-nextest-docs> failures:
  47. 61.72 s gammaloop-nextest-docs>
  48. 61.72 s gammaloop-nextest-docs> failures:
  49. 61.72 s gammaloop-nextest-docs> provenance_tests::each_build_captures_one_revision_before_rendering
  50. 61.72 s gammaloop-nextest-docs>
  51. 61.72 s gammaloop-nextest-docs> test result: FAILED. 0 passed; 1 failed; 0 ignored; 0 measured; 128 filtered out; finished in 30.74s
  52. 61.72 s gammaloop-nextest-docs>
  53. 61.72 s gammaloop-nextest-docs> stderr ---
  54. 61.72 s gammaloop-nextest-docs> warning: bundle export is experimental
  55. 61.72 s gammaloop-nextest-docs> = hint: its behaviour may change at any time
  56. 61.72 s gammaloop-nextest-docs> = hint: do not rely on this feature for production use cases
  57. 61.72 s gammaloop-nextest-docs>
  58. 61.72 s gammaloop-nextest-docs> warning: unknown font family: roboto
  59. 61.72 s gammaloop-nextest-docs> ┌─ crates/linnest/typst/docs/manual.typ:11:28
  60. 61.72 s gammaloop-nextest-docs> │
  61. 61.72 s gammaloop-nextest-docs> 11 │ #set text(size: 10pt, font: "Roboto")
  62. 61.72 s gammaloop-nextest-docs> │ ^^^^^^^^
  63. 61.72 s gammaloop-nextest-docs>
  64. 61.72 s gammaloop-nextest-docs> warning: unknown font family: roboto
  65. 61.72 s gammaloop-nextest-docs> ┌─ crates/linnest/typst/docs/manual.typ:14:29
  66. 61.72 s gammaloop-nextest-docs> │
  67. 61.72 s gammaloop-nextest-docs> 14 │ #set text(size: 3em, font: "Roboto")
  68. 61.72 s gammaloop-nextest-docs> │ ^^^^^^^^
  69. 61.72 s gammaloop-nextest-docs>
  70. 61.72 s gammaloop-nextest-docs> warning: unknown font family: roboto
  71. 61.72 s gammaloop-nextest-docs> ┌─ crates/linnest/typst/docs/manual.typ:16:31
  72. 61.72 s gammaloop-nextest-docs> │
  73. 61.72 s gammaloop-nextest-docs> 16 │ #set text(size: 0.3em, font: "Roboto")
  74. 61.72 s gammaloop-nextest-docs> │ ^^^^^^^^
  75. 61.72 s gammaloop-nextest-docs>
  76. 61.72 s gammaloop-nextest-docs> warning: overline was ignored during MathML export
  77. 61.72 s gammaloop-nextest-docs> ┌─ crates/linnest/typst/docs/manual.typ:949:55
  78. 61.72 s gammaloop-nextest-docs> │
  79. 61.72 s gammaloop-nextest-docs> 949 │ + sum_("dangling" e) c_("dangling-centroid") / (d(e, overline(v)) + epsilon)
  80. 61.72 s gammaloop-nextest-docs> │ ^^^^^^^^^^^
  81. 61.72 s gammaloop-nextest-docs>
  82. 61.72 s gammaloop-nextest-docs> warning: overline was ignored during MathML export
  83. 61.72 s gammaloop-nextest-docs> ┌─ crates/linnest/typst/docs/manual.typ:953:8
  84. 61.72 s gammaloop-nextest-docs> │
  85. 61.72 s gammaloop-nextest-docs> 953 │ Here $overline(v)$ is the mean node position. The centroid term pushes every
  86. 61.72 s gammaloop-nextest-docs> │ ^^^^^^^^^^^
  87. 61.72 s gammaloop-nextest-docs>
  88. 61.72 s gammaloop-nextest-docs>
  89. 61.72 s gammaloop-nextest-docs> thread 'provenance_tests::each_build_captures_one_revision_before_rendering' (254) panicked at crates/alphal00p-docs-builder/src/provenance_tests.rs:297:14:
  90. 61.72 s gammaloop-nextest-docs> called `Result::unwrap()` on an `Err` value: generated site has broken links:
  91. 61.72 s gammaloop-nextest-docs> products/linnet/latest/reference/interfaces/index.html -> https://github.com/alphal00p/gammaloop/blob/1111111111111111111111111111111111111111/crates/linnet-py/examples/physics_render_settings.py (missing repository source file crates/linnet-py/examples/physics_render_settings.py)
  92. 61.72 s gammaloop-nextest-docs> products/linnet/latest/reference/interfaces/index.html -> https://github.com/alphal00p/gammaloop/blob/1111111111111111111111111111111111111111/crates/linnet-py/examples/layout_stream.py (missing repository source file crates/linnet-py/examples/layout_stream.py)
  93. 61.72 s gammaloop-nextest-docs> products/linnet/latest/guides/python-rendering/index.html -> https://github.com/alphal00p/gammaloop/blob/1111111111111111111111111111111111111111/crates/linnet-py/examples/rendering_api.py (missing repository source file crates/linnet-py/examples/rendering_api.py)
  94. 61.72 s gammaloop-nextest-docs> products/linnet/latest/playground/index.html -> https://github.com/alphal00p/gammaloop/blob/1111111111111111111111111111111111111111/crates/linnet-py/examples/layout_stream.py (missing repository source file crates/linnet-py/examples/layout_stream.py)
  95. 61.72 s gammaloop-nextest-docs>
  96. 61.72 s gammaloop-nextest-docs> Location:
  97. 61.72 s gammaloop-nextest-docs> crates/alphal00p-docs-builder/src/lib.rs:4940:9
  98. 61.72 s gammaloop-nextest-docs> stack backtrace:
  99. 61.72 s gammaloop-nextest-docs> 0: __rustc::rust_begin_unwind
  100. 61.72 s gammaloop-nextest-docs> 1: core::panicking::panic_fmt
  101. 61.72 s gammaloop-nextest-docs> 2: core::result::unwrap_failed
  102. 61.72 s gammaloop-nextest-docs> 3: alphal00p_docs_builder::provenance_tests::each_build_captures_one_revision_before_rendering
  103. 61.72 s gammaloop-nextest-docs> 4: <alphal00p_docs_builder::provenance_tests::each_build_captures_one_revision_before_rendering::{closure#0} as core::ops::function::FnOnce<()>>::call_once
  104. 61.72 s gammaloop-nextest-docs> note: Some details are omitted, run with `RUST_BACKTRACE=full` for a verbose backtrace.
  105. 61.72 s gammaloop-nextest-docs>
  106. 61.72 s gammaloop-nextest-docs> thread 'provenance_tests::each_build_captures_one_revision_before_rendering' (226) panicked at crates/alphal00p-docs-builder/src/provenance_tests.rs:274:9:
  107. 61.72 s gammaloop-nextest-docs> assertion failed: command.status().unwrap().success()
  108. 61.72 s gammaloop-nextest-docs> stack backtrace:
  109. 61.72 s gammaloop-nextest-docs> 0: __rustc::rust_begin_unwind
  110. 61.72 s gammaloop-nextest-docs> 1: core::panicking::panic_fmt
  111. 61.72 s gammaloop-nextest-docs> 2: core::panicking::panic
  112. 61.72 s gammaloop-nextest-docs> 3: alphal00p_docs_builder::provenance_tests::each_build_captures_one_revision_before_rendering
  113. 61.72 s gammaloop-nextest-docs> 4: <alphal00p_docs_builder::provenance_tests::each_build_captures_one_revision_before_rendering::{closure#0} as core::ops::function::FnOnce<()>>::call_once
  114. 61.72 s gammaloop-nextest-docs> note: Some details are omitted, run with `RUST_BACKTRACE=full` for a verbose backtrace.
  115. 61.72 s gammaloop-nextest-docs>
  116. 70.35 s gammaloop-nextest-docs> ------------
  117. 70.35 s gammaloop-nextest-docs> Summary [ 39.383s] 129 tests run: 128 passed, 1 failed, 0 skipped
  118. 70.35 s gammaloop-nextest-docs> FAIL [ 30.747s] (128/129) alphal00p-docs-builder provenance_tests::each_build_captures_one_revision_before_rendering
  119. 70.35 s gammaloop-nextest-docs> stdout ---
  120. 70.35 s gammaloop-nextest-docs>
  121. 70.35 s gammaloop-nextest-docs> running 1 test
  122. 70.35 s gammaloop-nextest-docs>
  123. 70.35 s gammaloop-nextest-docs> running 1 test
  124. 70.35 s gammaloop-nextest-docs> test provenance_tests::each_build_captures_one_revision_before_rendering ... FAILED
  125. 70.35 s gammaloop-nextest-docs>
  126. 70.35 s gammaloop-nextest-docs> failures:
  127. 70.35 s gammaloop-nextest-docs>
  128. 70.35 s gammaloop-nextest-docs> failures:
  129. 70.35 s gammaloop-nextest-docs> provenance_tests::each_build_captures_one_revision_before_rendering
  130. 70.35 s gammaloop-nextest-docs>
  131. 70.35 s gammaloop-nextest-docs> test result: FAILED. 0 passed; 1 failed; 0 ignored; 0 measured; 128 filtered out; finished in 30.70s
  132. 70.35 s gammaloop-nextest-docs>
  133. 70.35 s gammaloop-nextest-docs> test provenance_tests::each_build_captures_one_revision_before_rendering ... FAILED
  134. 70.35 s gammaloop-nextest-docs>
  135. 70.35 s gammaloop-nextest-docs> failures:
  136. 70.35 s gammaloop-nextest-docs>
  137. 70.35 s gammaloop-nextest-docs> failures:
  138. 70.35 s gammaloop-nextest-docs> provenance_tests::each_build_captures_one_revision_before_rendering
  139. 70.35 s gammaloop-nextest-docs>
  140. 70.35 s gammaloop-nextest-docs> test result: FAILED. 0 passed; 1 failed; 0 ignored; 0 measured; 128 filtered out; finished in 30.74s
  141. 70.35 s gammaloop-nextest-docs>
  142. 70.35 s gammaloop-nextest-docs> stderr ---
  143. 70.35 s gammaloop-nextest-docs> warning: bundle export is experimental
  144. 70.35 s gammaloop-nextest-docs> = hint: its behaviour may change at any time
  145. 70.35 s gammaloop-nextest-docs> = hint: do not rely on this feature for production use cases
  146. 70.35 s gammaloop-nextest-docs>
  147. 70.35 s gammaloop-nextest-docs> warning: unknown font family: roboto
  148. 70.35 s gammaloop-nextest-docs> ┌─ crates/linnest/typst/docs/manual.typ:11:28
  149. 70.35 s gammaloop-nextest-docs> │
  150. 70.35 s gammaloop-nextest-docs> 11 │ #set text(size: 10pt, font: "Roboto")
  151. 70.35 s gammaloop-nextest-docs> │ ^^^^^^^^
  152. 70.35 s gammaloop-nextest-docs>
  153. 70.35 s gammaloop-nextest-docs> warning: unknown font family: roboto
  154. 70.35 s gammaloop-nextest-docs> ┌─ crates/linnest/typst/docs/manual.typ:14:29
  155. 70.35 s gammaloop-nextest-docs> │
  156. 70.35 s gammaloop-nextest-docs> 14 │ #set text(size: 3em, font: "Roboto")
  157. 70.35 s gammaloop-nextest-docs> │ ^^^^^^^^
  158. 70.35 s gammaloop-nextest-docs>
  159. 70.35 s gammaloop-nextest-docs> warning: unknown font family: roboto
  160. 70.35 s gammaloop-nextest-docs> ┌─ crates/linnest/typst/docs/manual.typ:16:31
  161. 70.35 s gammaloop-nextest-docs> │
  162. 70.35 s gammaloop-nextest-docs> 16 │ #set text(size: 0.3em, font: "Roboto")
  163. 70.35 s gammaloop-nextest-docs> │ ^^^^^^^^
  164. 70.35 s gammaloop-nextest-docs>
  165. 70.35 s gammaloop-nextest-docs> warning: overline was ignored during MathML export
  166. 70.35 s gammaloop-nextest-docs> ┌─ crates/linnest/typst/docs/manual.typ:949:55
  167. 70.35 s gammaloop-nextest-docs> │
  168. 70.35 s gammaloop-nextest-docs> 949 │ + sum_("dangling" e) c_("dangling-centroid") / (d(e, overline(v)) + epsilon)
  169. 70.35 s gammaloop-nextest-docs> │ ^^^^^^^^^^^
  170. 70.35 s gammaloop-nextest-docs>
  171. 70.35 s gammaloop-nextest-docs> warning: overline was ignored during MathML export
  172. 70.35 s gammaloop-nextest-docs> ┌─ crates/linnest/typst/docs/manual.typ:953:8
  173. 70.35 s gammaloop-nextest-docs> │
  174. 70.35 s gammaloop-nextest-docs> 953 │ Here $overline(v)$ is the mean node position. The centroid term pushes every
  175. 70.35 s gammaloop-nextest-docs> │ ^^^^^^^^^^^
  176. 70.35 s gammaloop-nextest-docs>
  177. 70.35 s gammaloop-nextest-docs>
  178. 70.35 s gammaloop-nextest-docs> thread 'provenance_tests::each_build_captures_one_revision_before_rendering' (254) panicked at crates/alphal00p-docs-builder/src/provenance_tests.rs:297:14:
  179. 70.35 s gammaloop-nextest-docs> called `Result::unwrap()` on an `Err` value: generated site has broken links:
  180. 70.35 s gammaloop-nextest-docs> products/linnet/latest/reference/interfaces/index.html -> https://github.com/alphal00p/gammaloop/blob/1111111111111111111111111111111111111111/crates/linnet-py/examples/physics_render_settings.py (missing repository source file crates/linnet-py/examples/physics_render_settings.py)
  181. 70.35 s gammaloop-nextest-docs> products/linnet/latest/reference/interfaces/index.html -> https://github.com/alphal00p/gammaloop/blob/1111111111111111111111111111111111111111/crates/linnet-py/examples/layout_stream.py (missing repository source file crates/linnet-py/examples/layout_stream.py)
  182. 70.35 s gammaloop-nextest-docs> products/linnet/latest/guides/python-rendering/index.html -> https://github.com/alphal00p/gammaloop/blob/1111111111111111111111111111111111111111/crates/linnet-py/examples/rendering_api.py (missing repository source file crates/linnet-py/examples/rendering_api.py)
  183. 70.35 s gammaloop-nextest-docs> products/linnet/latest/playground/index.html -> https://github.com/alphal00p/gammaloop/blob/1111111111111111111111111111111111111111/crates/linnet-py/examples/layout_stream.py (missing repository source file crates/linnet-py/examples/layout_stream.py)
  184. 70.35 s gammaloop-nextest-docs>
  185. 70.35 s gammaloop-nextest-docs> Location:
  186. 70.35 s gammaloop-nextest-docs> crates/alphal00p-docs-builder/src/lib.rs:4940:9
  187. 70.35 s gammaloop-nextest-docs> stack backtrace:
  188. 70.35 s gammaloop-nextest-docs> 0: __rustc::rust_begin_unwind
  189. 70.35 s gammaloop-nextest-docs> 1: core::panicking::panic_fmt
  190. 70.35 s gammaloop-nextest-docs> 2: core::result::unwrap_failed
  191. 70.35 s gammaloop-nextest-docs> 3: alphal00p_docs_builder::provenance_tests::each_build_captures_one_revision_before_rendering
  192. 70.35 s gammaloop-nextest-docs> 4: <alphal00p_docs_builder::provenance_tests::each_build_captures_one_revision_before_rendering::{closure#0} as core::ops::function::FnOnce<()>>::call_once
  193. 70.35 s gammaloop-nextest-docs> note: Some details are omitted, run with `RUST_BACKTRACE=full` for a verbose backtrace.
  194. 70.35 s gammaloop-nextest-docs>
  195. 70.35 s gammaloop-nextest-docs> thread 'provenance_tests::each_build_captures_one_revision_before_rendering' (226) panicked at crates/alphal00p-docs-builder/src/provenance_tests.rs:274:9:
  196. 70.35 s gammaloop-nextest-docs> assertion failed: command.status().unwrap().success()
  197. 70.35 s gammaloop-nextest-docs> stack backtrace:
  198. 70.35 s gammaloop-nextest-docs> 0: __rustc::rust_begin_unwind
  199. 70.35 s gammaloop-nextest-docs> 1: core::panicking::panic_fmt
  200. 70.35 s gammaloop-nextest-docs> 2: core::panicking::panic
  201. 70.35 s gammaloop-nextest-docs> 3: alphal00p_docs_builder::provenance_tests::each_build_captures_one_revision_before_rendering
  202. 70.35 s gammaloop-nextest-docs> 4: <alphal00p_docs_builder::provenance_tests::each_build_captures_one_revision_before_rendering::{closure#0} as core::ops::function::FnOnce<()>>::call_once
  203. 70.35 s gammaloop-nextest-docs> note: Some details are omitted, run with `RUST_BACKTRACE=full` for a verbose backtrace.
  204. 70.35 s gammaloop-nextest-docs>
  205. 70.37 s gammaloop-nextest-docs> error: test run failed
  206. 70.41 s gammaloop-nextest-docs>
  207. 70.41 s gammaloop-nextest-docs> ========== nextest test summary ==========
  208. 70.41 s gammaloop-nextest-docs> report: target/nextest/ci_gammaloop/junit.xml
  209. 70.41 s gammaloop-nextest-docs> tests: 129, failures: 1, errors: 0
  210. 70.41 s gammaloop-nextest-docs>
  211. 70.41 s gammaloop-nextest-docs> 1. alphal00p-docs-builder::provenance_tests::each_build_captures_one_revision_before_rendering
  212. 70.41 s gammaloop-nextest-docs> failure: test failure with exit code 101
  213. 70.41 s gammaloop-nextest-docs> thread 'provenance_tests::each_build_captures_one_revision_before_rendering' (226) panicked at crates/alphal00p-docs-builder/src/provenance_tests.rs:274:9:
  214. 70.41 s gammaloop-nextest-docs> assertion failed: command.status().unwrap().success()
  215. 70.41 s gammaloop-nextest-docs> stack backtrace:
  216. 70.41 s gammaloop-nextest-docs> 0: __rustc::rust_begin_unwind
  217. 70.41 s gammaloop-nextest-docs> 1: core::panicking::panic_fmt
  218. 70.41 s gammaloop-nextest-docs> 2: core::panicking::panic
  219. 70.41 s gammaloop-nextest-docs> 3: alphal00p_docs_builder::provenance_tests::each_build_captures_one_revision_before_rendering
  220. 70.41 s gammaloop-nextest-docs> 4: <alphal00p_docs_builder::provenance_tests::each_build_captures_one_revision_before_rendering::{closure#0} as core::ops::function::FnOnce<()>>::call_once
  221. 70.41 s gammaloop-nextest-docs> note: Some details are omitted, run with `RUST_BACKTRACE=full` for a verbose backtrace.
  222. 70.41 s gammaloop-nextest-docs> system-out
  223. 70.41 s gammaloop-nextest-docs> running 1 test
  224. 70.41 s gammaloop-nextest-docs>
  225. 70.41 s gammaloop-nextest-docs> running 1 test
  226. 70.41 s gammaloop-nextest-docs> test provenance_tests::each_build_captures_one_revision_before_rendering ... FAILED
  227. 70.41 s gammaloop-nextest-docs>
  228. 70.41 s gammaloop-nextest-docs> failures:
  229. 70.41 s gammaloop-nextest-docs>
  230. 70.41 s gammaloop-nextest-docs> failures:
  231. 70.41 s gammaloop-nextest-docs> provenance_tests::each_build_captures_one_revision_before_rendering
  232. 70.41 s gammaloop-nextest-docs>
  233. 70.41 s gammaloop-nextest-docs> test result: FAILED. 0 passed; 1 failed; 0 ignored; 0 measured; 128 filtered out; finished in 30.70s
  234. 70.41 s gammaloop-nextest-docs>
  235. 70.41 s gammaloop-nextest-docs> test provenance_tests::each_build_captures_one_revision_before_rendering ... FAILED
  236. 70.41 s gammaloop-nextest-docs>
  237. 70.41 s gammaloop-nextest-docs> failures:
  238. 70.41 s gammaloop-nextest-docs>
  239. 70.41 s gammaloop-nextest-docs> failures:
  240. 70.41 s gammaloop-nextest-docs> provenance_tests::each_build_captures_one_revision_before_rendering
  241. 70.41 s gammaloop-nextest-docs>
  242. 70.41 s gammaloop-nextest-docs> test result: FAILED. 0 passed; 1 failed; 0 ignored; 0 measured; 128 filtered out; finished in 30.74s
  243. 70.41 s gammaloop-nextest-docs> system-err
  244. 70.41 s gammaloop-nextest-docs> warning: bundle export is experimental
  245. 70.41 s gammaloop-nextest-docs> = hint: its behaviour may change at any time
  246. 70.41 s gammaloop-nextest-docs> = hint: do not rely on this feature for production use cases
  247. 70.41 s gammaloop-nextest-docs>
  248. 70.41 s gammaloop-nextest-docs> warning: unknown font family: roboto
  249. 70.41 s gammaloop-nextest-docs> ┌─ crates/linnest/typst/docs/manual.typ:11:28
  250. 70.41 s gammaloop-nextest-docs> │
  251. 70.41 s gammaloop-nextest-docs> 11 │ #set text(size: 10pt, font: "Roboto")
  252. 70.41 s gammaloop-nextest-docs> │ ^^^^^^^^
  253. 70.41 s gammaloop-nextest-docs>
  254. 70.42 s gammaloop-nextest-docs> warning: unknown font family: roboto
  255. 70.42 s gammaloop-nextest-docs> ┌─ crates/linnest/typst/docs/manual.typ:14:29
  256. 70.42 s gammaloop-nextest-docs> │
  257. 70.42 s gammaloop-nextest-docs> 14 │ #set text(size: 3em, font: "Roboto")
  258. 70.42 s gammaloop-nextest-docs> │ ^^^^^^^^
  259. 70.42 s gammaloop-nextest-docs>
  260. 70.42 s gammaloop-nextest-docs> warning: unknown font family: roboto
  261. 70.42 s gammaloop-nextest-docs> ┌─ crates/linnest/typst/docs/manual.typ:16:31
  262. 70.42 s gammaloop-nextest-docs> │
  263. 70.42 s gammaloop-nextest-docs> 16 │ #set text(size: 0.3em, font: "Roboto")
  264. 70.42 s gammaloop-nextest-docs> │ ^^^^^^^^
  265. 70.42 s gammaloop-nextest-docs>
  266. 70.42 s gammaloop-nextest-docs> warning: overline was ignored during MathML export
  267. 70.42 s gammaloop-nextest-docs> ┌─ crates/linnest/typst/docs/manual.typ:949:55
  268. 70.42 s gammaloop-nextest-docs> │
  269. 70.42 s gammaloop-nextest-docs> 949 │ + sum_("dangling" e) c_("dangling-centroid") / (d(e, overline(v)) + epsilon)
  270. 70.42 s gammaloop-nextest-docs> │ ^^^^^^^^^^^
  271. 70.42 s gammaloop-nextest-docs>
  272. 70.42 s gammaloop-nextest-docs> warning: overline was ignored during MathML export
  273. 70.42 s gammaloop-nextest-docs> ┌─ crates/linnest/typst/docs/manual.typ:953:8
  274. 70.42 s gammaloop-nextest-docs> │
  275. 70.42 s gammaloop-nextest-docs> 953 │ Here $overline(v)$ is the mean node position. The centroid term pushes every
  276. 70.42 s gammaloop-nextest-docs> │ ^^^^^^^^^^^
  277. 70.42 s gammaloop-nextest-docs>
  278. 70.42 s gammaloop-nextest-docs>
  279. 70.42 s gammaloop-nextest-docs> thread 'provenance_tests::each_build_captures_one_revision_before_rendering' (254) panicked at crates/alphal00p-docs-builder/src/provenance_tests.rs:297:14:
  280. 70.42 s gammaloop-nextest-docs> called `Result::unwrap()` on an `Err` value: generated site has broken links:
  281. 70.42 s gammaloop-nextest-docs> products/linnet/latest/reference/interfaces/index.html -> https://github.com/alphal00p/gammaloop/blob/1111111111111111111111111111111111111111/crates/linnet-py/examples/physics_render_settings.py (missing repository source file crates/linnet-py/examples/physics_render_settings.py)
  282. 70.42 s gammaloop-nextest-docs> products/linnet/latest/reference/interfaces/index.html -> https://github.com/alphal00p/gammaloop/blob/1111111111111111111111111111111111111111/crates/linnet-py/examples/layout_stream.py (missing repository source file crates/linnet-py/examples/layout_stream.py)
  283. 70.42 s gammaloop-nextest-docs> products/linnet/latest/guides/python-rendering/index.html -> https://github.com/alphal00p/gammaloop/blob/1111111111111111111111111111111111111111/crates/linnet-py/examples/rendering_api.py (missing repository source file crates/linnet-py/examples/rendering_api.py)
  284. 70.42 s gammaloop-nextest-docs> products/linnet/latest/playground/index.html -> https://github.com/alphal00p/gammaloop/blob/1111111111111111111111111111111111111111/crates/linnet-py/examples/layout_stream.py (missing repository source file crates/linnet-py/examples/layout_stream.py)
  285. 70.42 s gammaloop-nextest-docs>
  286. 70.42 s gammaloop-nextest-docs> Location:
  287. 70.42 s gammaloop-nextest-docs> crates/alphal00p-docs-builder/src/lib.rs:4940:9
  288. 70.42 s gammaloop-nextest-docs> stack backtrace:
  289. 70.42 s gammaloop-nextest-docs> 0: __rustc::rust_begin_unwind
  290. 70.42 s gammaloop-nextest-docs> 1: core::panicking::panic_fmt
  291. 70.42 s gammaloop-nextest-docs> 2: core::result::unwrap_failed
  292. 70.42 s gammaloop-nextest-docs> 3: alphal00p_docs_builder::provenance_tests::each_build_captures_one_revision_before_rendering
  293. 70.42 s gammaloop-nextest-docs> 4: <alphal00p_docs_builder::provenance_tests::each_build_captures_one_revision_before_rendering::{closure#0} as core::ops::function::FnOnce<()>>::call_once
  294. 70.42 s gammaloop-nextest-docs> note: Some details are omitted, run with `RUST_BACKTRACE=full` for a verbose backtrace.
  295. 70.42 s gammaloop-nextest-docs>
  296. 70.42 s gammaloop-nextest-docs> thread 'provenance_tests::each_build_captures_one_revision_before_rendering' (226) panicked at crates/alphal00p-docs-builder/src/provenance_tests.rs:274:9:
  297. 70.42 s gammaloop-nextest-docs> assertion failed: command.status().unwrap().success()
  298. 70.42 s gammaloop-nextest-docs> stack backtrace:
  299. 70.42 s gammaloop-nextest-docs> 0: __rustc::rust_begin_unwind
  300. 70.42 s gammaloop-nextest-docs> 1: core::panicking::panic_fmt
  301. 70.42 s gammaloop-nextest-docs> 2: core::panicking::panic
  302. 70.42 s gammaloop-nextest-docs> 3: alphal00p_docs_builder::provenance_tests::each_build_captures_one_revision_before_rendering
  303. 70.42 s gammaloop-nextest-docs> 4: <alphal00p_docs_builder::provenance_tests::each_build_captures_one_revision_before_rendering::{closure#0} as core::ops::function::FnOnce<()>>::call_once
  304. 70.42 s gammaloop-nextest-docs> note: Some details are omitted, run with `RUST_BACKTRACE=full` for a verbose backtrace.
  305. 70.42 s gammaloop-nextest-docs> =========================================
  306. 70.45 s gammaloop-nextest-docs> Extracting 2 binaries to /build/source
  307. 70.52 s gammaloop-nextest-docs> Extracted 5 files to /build/source in 0.08s
  308. 70.55 s gammaloop-nextest-docs> ------------
  309. 70.55 s gammaloop-nextest-docs> Nextest run ID 9d4fda6c-5120-4cbe-9dbc-d76473c3d1f6 with nextest profile: ci_gammaloop
  310. 70.55 s gammaloop-nextest-docs> Starting 22 tests across 2 binaries
  311. 70.62 s gammaloop-nextest-docs> ------------
  312. 70.62 s gammaloop-nextest-docs> Summary [ 0.072s] 22 tests run: 22 passed, 0 skipped
  313. 70.68 s gammaloop-nextest-docs>
  314. 70.68 s gammaloop-nextest-docs> ========== nextest test summary ==========
  315. 70.68 s gammaloop-nextest-docs> report: target/nextest/ci_gammaloop/junit.xml
  316. 70.68 s gammaloop-nextest-docs> tests: 22, failures: 0, errors: 0
  317. 70.68 s gammaloop-nextest-docs> No failing testcases found.
  318. 70.68 s gammaloop-nextest-docs> =========================================
  319. 70.70 s gammaloop-nextest-docs> Extracting 3 binaries (including 2 non-test binaries), 1 build script output directory, and 2 linked paths to /build/source
  320. 71.13 s gammaloop-nextest-docs> Extracted 22 files to /build/source in 0.43s
  321. 71.16 s gammaloop-nextest-docs> ------------
  322. 71.16 s gammaloop-nextest-docs> Nextest run ID eb1f3580-cf8b-43c9-88ce-9ca20b43e05f with nextest profile: ci_gammaloop
  323. 71.16 s gammaloop-nextest-docs> Starting 89 tests across 1 binary
  324. 71.30 s gammaloop-nextest-docs> ------------
  325. 71.30 s gammaloop-nextest-docs> Summary [ 0.136s] 89 tests run: 89 passed, 0 skipped
  326. 71.35 s gammaloop-nextest-docs>
  327. 71.35 s gammaloop-nextest-docs> ========== nextest test summary ==========
  328. 71.35 s gammaloop-nextest-docs> report: target/nextest/ci_gammaloop/junit.xml
  329. 71.35 s gammaloop-nextest-docs> tests: 89, failures: 0, errors: 0
  330. 71.35 s gammaloop-nextest-docs> No failing testcases found.
  331. 71.35 s gammaloop-nextest-docs> =========================================
  332. 71.37 s gammaloop-nextest-docs> Extracting 2 binaries to /build/source
  333. 71.45 s gammaloop-nextest-docs> Extracted 5 files to /build/source in 0.08s
  334. 71.49 s gammaloop-nextest-docs> ------------
  335. 71.49 s gammaloop-nextest-docs> Nextest run ID 07d24bf3-b628-4b1d-b5b3-e29a6fcaa3a6 with nextest profile: ci_gammaloop
  336. 71.49 s gammaloop-nextest-docs> Starting 10 tests across 2 binaries
  337. 95.04 s gammaloop-nextest-docs> ------------
  338. 95.04 s gammaloop-nextest-docs> Summary [ 23.542s] 10 tests run: 10 passed, 0 skipped
  339. 95.09 s gammaloop-nextest-docs>
  340. 95.09 s gammaloop-nextest-docs> ========== nextest test summary ==========
  341. 95.09 s gammaloop-nextest-docs> report: target/nextest/ci_gammaloop/junit.xml
  342. 95.09 s gammaloop-nextest-docs> tests: 10, failures: 0, errors: 0
  343. 95.09 s gammaloop-nextest-docs> No failing testcases found.
  344. 95.09 s gammaloop-nextest-docs> =========================================
  345. 95.12 s gammaloop-nextest-docs> Extracting 1 binary to /build/source
  346. 95.19 s gammaloop-nextest-docs> Extracted 4 files to /build/source in 0.07s
  347. 95.21 s gammaloop-nextest-docs> ------------
  348. 95.21 s gammaloop-nextest-docs> Nextest run ID 2ee73823-2c9a-48f4-9b5e-231f2677172d with nextest profile: ci_gammaloop
  349. 95.21 s gammaloop-nextest-docs> Starting 0 tests across 1 binary
  350. 95.21 s gammaloop-nextest-docs> ------------
  351. 95.21 s gammaloop-nextest-docs> Summary [ 0.001s] 0 tests run: 0 passed, 0 skipped
  352. 95.28 s gammaloop-nextest-docs>
  353. 95.28 s gammaloop-nextest-docs> ========== nextest test summary ==========
  354. 95.28 s gammaloop-nextest-docs> report: target/nextest/ci_gammaloop/junit.xml
  355. 95.28 s gammaloop-nextest-docs> tests: 0, failures: 0, errors: 0
  356. 95.28 s gammaloop-nextest-docs> No failing testcases found.
  357. 95.28 s gammaloop-nextest-docs> =========================================
  358. 95.31 s gammaloop-nextest-docs> Extracting 1 binary to /build/source
  359. 95.37 s gammaloop-nextest-docs> Extracted 4 files to /build/source in 0.06s
  360. 95.40 s gammaloop-nextest-docs> ------------
  361. 95.40 s gammaloop-nextest-docs> Nextest run ID 5a8cb63a-e982-4604-be46-357e5ad1a7dd with nextest profile: ci_gammaloop
  362. 95.40 s gammaloop-nextest-docs> Starting 5 tests across 1 binary
  363. 95.43 s gammaloop-nextest-docs> ------------
  364. 95.43 s gammaloop-nextest-docs> Summary [ 0.027s] 5 tests run: 5 passed, 0 skipped
  365. 95.49 s gammaloop-nextest-docs>
  366. 95.49 s gammaloop-nextest-docs> ========== nextest test summary ==========
  367. 95.49 s gammaloop-nextest-docs> report: target/nextest/ci_gammaloop/junit.xml
  368. 95.49 s gammaloop-nextest-docs> tests: 5, failures: 0, errors: 0
  369. 95.49 s gammaloop-nextest-docs> No failing testcases found.
  370. 95.49 s gammaloop-nextest-docs> =========================================
  371. 95.78 s error: Cannot build '/nix/store/9rs74w2crrwhaq7f0dxdi11wd515i6dj-gammaloop-nextest-docs.drv'.
  372. 95.78 s Reason: builder failed with exit code 100.
  373. 95.78 s Output paths:
  374. 95.78 s /nix/store/1jyipvscqlj4v0h7qjznydlgdlc4bjy7-gammaloop-nextest-docs
  375. 95.78 s Last 347 log lines:
  376. 95.78 s > Extracting 2 binaries to /build/source
  377. 95.78 s > Extracted 5 files to /build/source in 0.05s
  378. 95.78 s > ------------
  379. 95.78 s > Nextest run ID 35ae24cf-a09b-4952-bd55-f491fc98ffe1 with nextest profile: ci_gammaloop
  380. 95.78 s > Starting 129 tests across 2 binaries
  381. 95.78 s > FAIL [ 30.747s] (128/129) alphal00p-docs-builder provenance_tests::each_build_captures_one_revision_before_rendering
  382. 95.78 s > stdout ---
  383. 95.78 s >
  384. 95.78 s > running 1 test
  385. 95.78 s >
  386. 95.78 s > running 1 test
  387. 95.78 s > test provenance_tests::each_build_captures_one_revision_before_rendering ... FAILED
  388. 95.78 s >
  389. 95.78 s > failures:
  390. 95.78 s >
  391. 95.78 s > failures:
  392. 95.78 s > provenance_tests::each_build_captures_one_revision_before_rendering
  393. 95.78 s >
  394. 95.78 s > test result: FAILED. 0 passed; 1 failed; 0 ignored; 0 measured; 128 filtered out; finished in 30.70s
  395. 95.78 s >
  396. 95.78 s > test provenance_tests::each_build_captures_one_revision_before_rendering ... FAILED
  397. 95.78 s >
  398. 95.78 s > failures:
  399. 95.78 s >
  400. 95.78 s > failures:
  401. 95.78 s > provenance_tests::each_build_captures_one_revision_before_rendering
  402. 95.78 s >
  403. 95.78 s > test result: FAILED. 0 passed; 1 failed; 0 ignored; 0 measured; 128 filtered out; finished in 30.74s
  404. 95.78 s >
  405. 95.78 s > stderr ---
  406. 95.78 s > warning: bundle export is experimental
  407. 95.78 s > = hint: its behaviour may change at any time
  408. 95.78 s > = hint: do not rely on this feature for production use cases
  409. 95.78 s >
  410. 95.78 s > warning: unknown font family: roboto
  411. 95.78 s > ┌─ crates/linnest/typst/docs/manual.typ:11:28
  412. 95.78 s > │
  413. 95.78 s > 11 │ #set text(size: 10pt, font: "Roboto")
  414. 95.78 s > │ ^^^^^^^^
  415. 95.78 s >
  416. 95.78 s > warning: unknown font family: roboto
  417. 95.78 s > ┌─ crates/linnest/typst/docs/manual.typ:14:29
  418. 95.78 s > │
  419. 95.78 s > 14 │ #set text(size: 3em, font: "Roboto")
  420. 95.78 s > │ ^^^^^^^^
  421. 95.78 s >
  422. 95.78 s > warning: unknown font family: roboto
  423. 95.78 s > ┌─ crates/linnest/typst/docs/manual.typ:16:31
  424. 95.78 s > │
  425. 95.78 s > 16 │ #set text(size: 0.3em, font: "Roboto")
  426. 95.78 s > │ ^^^^^^^^
  427. 95.78 s >
  428. 95.78 s > warning: overline was ignored during MathML export
  429. 95.78 s > ┌─ crates/linnest/typst/docs/manual.typ:949:55
  430. 95.78 s > │
  431. 95.78 s > 949 │ + sum_("dangling" e) c_("dangling-centroid") / (d(e, overline(v)) + epsilon)
  432. 95.78 s > │ ^^^^^^^^^^^
  433. 95.78 s >
  434. 95.78 s > warning: overline was ignored during MathML export
  435. 95.78 s > ┌─ crates/linnest/typst/docs/manual.typ:953:8
  436. 95.78 s > │
  437. 95.78 s > 953 │ Here $overline(v)$ is the mean node position. The centroid term pushes every
  438. 95.78 s > │ ^^^^^^^^^^^
  439. 95.78 s >
  440. 95.78 s >
  441. 95.78 s > thread 'provenance_tests::each_build_captures_one_revision_before_rendering' (254) panicked at crates/alphal00p-docs-builder/src/provenance_tests.rs:297:14:
  442. 95.78 s > called `Result::unwrap()` on an `Err` value: generated site has broken links:
  443. 95.78 s > products/linnet/latest/reference/interfaces/index.html -> https://github.com/alphal00p/gammaloop/blob/1111111111111111111111111111111111111111/crates/linnet-py/examples/physics_render_settings.py (missing repository source file crates/linnet-py/examples/physics_render_settings.py)
  444. 95.78 s > products/linnet/latest/reference/interfaces/index.html -> https://github.com/alphal00p/gammaloop/blob/1111111111111111111111111111111111111111/crates/linnet-py/examples/layout_stream.py (missing repository source file crates/linnet-py/examples/layout_stream.py)
  445. 95.78 s > products/linnet/latest/guides/python-rendering/index.html -> https://github.com/alphal00p/gammaloop/blob/1111111111111111111111111111111111111111/crates/linnet-py/examples/rendering_api.py (missing repository source file crates/linnet-py/examples/rendering_api.py)
  446. 95.78 s > products/linnet/latest/playground/index.html -> https://github.com/alphal00p/gammaloop/blob/1111111111111111111111111111111111111111/crates/linnet-py/examples/layout_stream.py (missing repository source file crates/linnet-py/examples/layout_stream.py)
  447. 95.78 s >
  448. 95.78 s > Location:
  449. 95.78 s > crates/alphal00p-docs-builder/src/lib.rs:4940:9
  450. 95.78 s > stack backtrace:
  451. 95.78 s > 0: __rustc::rust_begin_unwind
  452. 95.78 s > 1: core::panicking::panic_fmt
  453. 95.78 s > 2: core::result::unwrap_failed
  454. 95.78 s > 3: alphal00p_docs_builder::provenance_tests::each_build_captures_one_revision_before_rendering
  455. 95.78 s > 4: <alphal00p_docs_builder::provenance_tests::each_build_captures_one_revision_before_rendering::{closure#0} as core::ops::function::FnOnce<()>>::call_once
  456. 95.78 s > note: Some details are omitted, run with `RUST_BACKTRACE=full` for a verbose backtrace.
  457. 95.78 s >
  458. 95.78 s > thread 'provenance_tests::each_build_captures_one_revision_before_rendering' (226) panicked at crates/alphal00p-docs-builder/src/provenance_tests.rs:274:9:
  459. 95.78 s > assertion failed: command.status().unwrap().success()
  460. 95.78 s > stack backtrace:
  461. 95.78 s > 0: __rustc::rust_begin_unwind
  462. 95.78 s > 1: core::panicking::panic_fmt
  463. 95.78 s > 2: core::panicking::panic
  464. 95.78 s > 3: alphal00p_docs_builder::provenance_tests::each_build_captures_one_revision_before_rendering
  465. 95.78 s > 4: <alphal00p_docs_builder::provenance_tests::each_build_captures_one_revision_before_rendering::{closure#0} as core::ops::function::FnOnce<()>>::call_once
  466. 95.78 s > note: Some details are omitted, run with `RUST_BACKTRACE=full` for a verbose backtrace.
  467. 95.78 s >
  468. 95.78 s > ------------
  469. 95.78 s > Summary [ 39.383s] 129 tests run: 128 passed, 1 failed, 0 skipped
  470. 95.78 s > FAIL [ 30.747s] (128/129) alphal00p-docs-builder provenance_tests::each_build_captures_one_revision_before_rendering
  471. 95.78 s > stdout ---
  472. 95.78 s >
  473. 95.78 s > running 1 test
  474. 95.78 s >
  475. 95.78 s > running 1 test
  476. 95.78 s > test provenance_tests::each_build_captures_one_revision_before_rendering ... FAILED
  477. 95.78 s >
  478. 95.78 s > failures:
  479. 95.78 s >
  480. 95.78 s > failures:
  481. 95.78 s > provenance_tests::each_build_captures_one_revision_before_rendering
  482. 95.78 s >
  483. 95.78 s > test result: FAILED. 0 passed; 1 failed; 0 ignored; 0 measured; 128 filtered out; finished in 30.70s
  484. 95.78 s >
  485. 95.78 s > test provenance_tests::each_build_captures_one_revision_before_rendering ... FAILED
  486. 95.78 s >
  487. 95.78 s > failures:
  488. 95.78 s >
  489. 95.78 s > failures:
  490. 95.78 s > provenance_tests::each_build_captures_one_revision_before_rendering
  491. 95.78 s >
  492. 95.78 s > test result: FAILED. 0 passed; 1 failed; 0 ignored; 0 measured; 128 filtered out; finished in 30.74s
  493. 95.78 s >
  494. 95.78 s > stderr ---
  495. 95.78 s > warning: bundle export is experimental
  496. 95.78 s > = hint: its behaviour may change at any time
  497. 95.78 s > = hint: do not rely on this feature for production use cases
  498. 95.78 s >
  499. 95.78 s > warning: unknown font family: roboto
  500. 95.78 s > ┌─ crates/linnest/typst/docs/manual.typ:11:28
  501. 95.78 s > │
  502. 95.78 s > 11 │ #set text(size: 10pt, font: "Roboto")
  503. 95.78 s > │ ^^^^^^^^
  504. 95.78 s >
  505. 95.78 s > warning: unknown font family: roboto
  506. 95.78 s > ┌─ crates/linnest/typst/docs/manual.typ:14:29
  507. 95.78 s > │
  508. 95.78 s > 14 │ #set text(size: 3em, font: "Roboto")
  509. 95.78 s > │ ^^^^^^^^
  510. 95.78 s >
  511. 95.78 s > warning: unknown font family: roboto
  512. 95.78 s > ┌─ crates/linnest/typst/docs/manual.typ:16:31
  513. 95.78 s > │
  514. 95.78 s > 16 │ #set text(size: 0.3em, font: "Roboto")
  515. 95.78 s > │ ^^^^^^^^
  516. 95.78 s >
  517. 95.78 s > warning: overline was ignored during MathML export
  518. 95.78 s > ┌─ crates/linnest/typst/docs/manual.typ:949:55
  519. 95.78 s > │
  520. 95.78 s > 949 │ + sum_("dangling" e) c_("dangling-centroid") / (d(e, overline(v)) + epsilon)
  521. 95.78 s > │ ^^^^^^^^^^^
  522. 95.78 s >
  523. 95.78 s > warning: overline was ignored during MathML export
  524. 95.78 s > ┌─ crates/linnest/typst/docs/manual.typ:953:8
  525. 95.78 s > │
  526. 95.78 s > 953 │ Here $overline(v)$ is the mean node position. The centroid term pushes every
  527. 95.78 s > │ ^^^^^^^^^^^
  528. 95.78 s >
  529. 95.78 s >
  530. 95.78 s > thread 'provenance_tests::each_build_captures_one_revision_before_rendering' (254) panicked at crates/alphal00p-docs-builder/src/provenance_tests.rs:297:14:
  531. 95.78 s > called `Result::unwrap()` on an `Err` value: generated site has broken links:
  532. 95.78 s > products/linnet/latest/reference/interfaces/index.html -> https://github.com/alphal00p/gammaloop/blob/1111111111111111111111111111111111111111/crates/linnet-py/examples/physics_render_settings.py (missing repository source file crates/linnet-py/examples/physics_render_settings.py)
  533. 95.78 s > products/linnet/latest/reference/interfaces/index.html -> https://github.com/alphal00p/gammaloop/blob/1111111111111111111111111111111111111111/crates/linnet-py/examples/layout_stream.py (missing repository source file crates/linnet-py/examples/layout_stream.py)
  534. 95.78 s > products/linnet/latest/guides/python-rendering/index.html -> https://github.com/alphal00p/gammaloop/blob/1111111111111111111111111111111111111111/crates/linnet-py/examples/rendering_api.py (missing repository source file crates/linnet-py/examples/rendering_api.py)
  535. 95.78 s > products/linnet/latest/playground/index.html -> https://github.com/alphal00p/gammaloop/blob/1111111111111111111111111111111111111111/crates/linnet-py/examples/layout_stream.py (missing repository source file crates/linnet-py/examples/layout_stream.py)
  536. 95.78 s >
  537. 95.78 s > Location:
  538. 95.78 s > crates/alphal00p-docs-builder/src/lib.rs:4940:9
  539. 95.78 s > stack backtrace:
  540. 95.78 s > 0: __rustc::rust_begin_unwind
  541. 95.78 s > 1: core::panicking::panic_fmt
  542. 95.78 s > 2: core::result::unwrap_failed
  543. 95.78 s > 3: alphal00p_docs_builder::provenance_tests::each_build_captures_one_revision_before_rendering
  544. 95.78 s > 4: <alphal00p_docs_builder::provenance_tests::each_build_captures_one_revision_before_rendering::{closure#0} as core::ops::function::FnOnce<()>>::call_once
  545. 95.78 s > note: Some details are omitted, run with `RUST_BACKTRACE=full` for a verbose backtrace.
  546. 95.78 s >
  547. 95.78 s > thread 'provenance_tests::each_build_captures_one_revision_before_rendering' (226) panicked at crates/alphal00p-docs-builder/src/provenance_tests.rs:274:9:
  548. 95.78 s > assertion failed: command.status().unwrap().success()
  549. 95.78 s > stack backtrace:
  550. 95.78 s > 0: __rustc::rust_begin_unwind
  551. 95.78 s > 1: core::panicking::panic_fmt
  552. 95.78 s > 2: core::panicking::panic
  553. 95.78 s > 3: alphal00p_docs_builder::provenance_tests::each_build_captures_one_revision_before_rendering
  554. 95.78 s > 4: <alphal00p_docs_builder::provenance_tests::each_build_captures_one_revision_before_rendering::{closure#0} as core::ops::function::FnOnce<()>>::call_once
  555. 95.78 s > note: Some details are omitted, run with `RUST_BACKTRACE=full` for a verbose backtrace.
  556. 95.78 s >
  557. 95.78 s > error: test run failed
  558. 95.78 s >
  559. 95.78 s > ========== nextest test summary ==========
  560. 95.78 s > report: target/nextest/ci_gammaloop/junit.xml
  561. 95.78 s > tests: 129, failures: 1, errors: 0
  562. 95.78 s >
  563. 95.78 s > 1. alphal00p-docs-builder::provenance_tests::each_build_captures_one_revision_before_rendering
  564. 95.78 s > failure: test failure with exit code 101
  565. 95.78 s > thread 'provenance_tests::each_build_captures_one_revision_before_rendering' (226) panicked at crates/alphal00p-docs-builder/src/provenance_tests.rs:274:9:
  566. 95.78 s > assertion failed: command.status().unwrap().success()
  567. 95.78 s > stack backtrace:
  568. 95.78 s > 0: __rustc::rust_begin_unwind
  569. 95.78 s > 1: core::panicking::panic_fmt
  570. 95.78 s > 2: core::panicking::panic
  571. 95.78 s > 3: alphal00p_docs_builder::provenance_tests::each_build_captures_one_revision_before_rendering
  572. 95.78 s > 4: <alphal00p_docs_builder::provenance_tests::each_build_captures_one_revision_before_rendering::{closure#0} as core::ops::function::FnOnce<()>>::call_once
  573. 95.78 s > note: Some details are omitted, run with `RUST_BACKTRACE=full` for a verbose backtrace.
  574. 95.78 s > system-out
  575. 95.78 s > running 1 test
  576. 95.78 s >
  577. 95.78 s > running 1 test
  578. 95.78 s > test provenance_tests::each_build_captures_one_revision_before_rendering ... FAILED
  579. 95.78 s >
  580. 95.78 s > failures:
  581. 95.78 s >
  582. 95.78 s > failures:
  583. 95.78 s > provenance_tests::each_build_captures_one_revision_before_rendering
  584. 95.78 s >
  585. 95.78 s > test result: FAILED. 0 passed; 1 failed; 0 ignored; 0 measured; 128 filtered out; finished in 30.70s
  586. 95.78 s >
  587. 95.78 s > test provenance_tests::each_build_captures_one_revision_before_rendering ... FAILED
  588. 95.78 s >
  589. 95.78 s > failures:
  590. 95.78 s >
  591. 95.78 s > failures:
  592. 95.78 s > provenance_tests::each_build_captures_one_revision_before_rendering
  593. 95.78 s >
  594. 95.78 s > test result: FAILED. 0 passed; 1 failed; 0 ignored; 0 measured; 128 filtered out; finished in 30.74s
  595. 95.78 s > system-err
  596. 95.78 s > warning: bundle export is experimental
  597. 95.78 s > = hint: its behaviour may change at any time
  598. 95.78 s > = hint: do not rely on this feature for production use cases
  599. 95.78 s >
  600. 95.78 s > warning: unknown font family: roboto
  601. 95.78 s > ┌─ crates/linnest/typst/docs/manual.typ:11:28
  602. 95.78 s > │
  603. 95.78 s > 11 │ #set text(size: 10pt, font: "Roboto")
  604. 95.78 s > │ ^^^^^^^^
  605. 95.78 s >
  606. 95.78 s > warning: unknown font family: roboto
  607. 95.78 s > ┌─ crates/linnest/typst/docs/manual.typ:14:29
  608. 95.78 s > │
  609. 95.78 s > 14 │ #set text(size: 3em, font: "Roboto")
  610. 95.78 s > │ ^^^^^^^^
  611. 95.78 s >
  612. 95.78 s > warning: unknown font family: roboto
  613. 95.78 s > ┌─ crates/linnest/typst/docs/manual.typ:16:31
  614. 95.78 s > │
  615. 95.78 s > 16 │ #set text(size: 0.3em, font: "Roboto")
  616. 95.78 s > │ ^^^^^^^^
  617. 95.78 s >
  618. 95.78 s > warning: overline was ignored during MathML export
  619. 95.78 s > ┌─ crates/linnest/typst/docs/manual.typ:949:55
  620. 95.78 s > │
  621. 95.78 s > 949 │ + sum_("dangling" e) c_("dangling-centroid") / (d(e, overline(v)) + epsilon)
  622. 95.78 s > │ ^^^^^^^^^^^
  623. 95.78 s >
  624. 95.78 s > warning: overline was ignored during MathML export
  625. 95.78 s > ┌─ crates/linnest/typst/docs/manual.typ:953:8
  626. 95.78 s > │
  627. 95.78 s > 953 │ Here $overline(v)$ is the mean node position. The centroid term pushes every
  628. 95.78 s > │ ^^^^^^^^^^^
  629. 95.78 s >
  630. 95.78 s >
  631. 95.78 s > thread 'provenance_tests::each_build_captures_one_revision_before_rendering' (254) panicked at crates/alphal00p-docs-builder/src/provenance_tests.rs:297:14:
  632. 95.78 s > called `Result::unwrap()` on an `Err` value: generated site has broken links:
  633. 95.78 s > products/linnet/latest/reference/interfaces/index.html -> https://github.com/alphal00p/gammaloop/blob/1111111111111111111111111111111111111111/crates/linnet-py/examples/physics_render_settings.py (missing repository source file crates/linnet-py/examples/physics_render_settings.py)
  634. 95.78 s > products/linnet/latest/reference/interfaces/index.html -> https://github.com/alphal00p/gammaloop/blob/1111111111111111111111111111111111111111/crates/linnet-py/examples/layout_stream.py (missing repository source file crates/linnet-py/examples/layout_stream.py)
  635. 95.78 s > products/linnet/latest/guides/python-rendering/index.html -> https://github.com/alphal00p/gammaloop/blob/1111111111111111111111111111111111111111/crates/linnet-py/examples/rendering_api.py (missing repository source file crates/linnet-py/examples/rendering_api.py)
  636. 95.78 s > products/linnet/latest/playground/index.html -> https://github.com/alphal00p/gammaloop/blob/1111111111111111111111111111111111111111/crates/linnet-py/examples/layout_stream.py (missing repository source file crates/linnet-py/examples/layout_stream.py)
  637. 95.78 s >
  638. 95.78 s > Location:
  639. 95.78 s > crates/alphal00p-docs-builder/src/lib.rs:4940:9
  640. 95.78 s > stack backtrace:
  641. 95.78 s > 0: __rustc::rust_begin_unwind
  642. 95.78 s > 1: core::panicking::panic_fmt
  643. 95.78 s > 2: core::result::unwrap_failed
  644. 95.78 s > 3: alphal00p_docs_builder::provenance_tests::each_build_captures_one_revision_before_rendering
  645. 95.78 s > 4: <alphal00p_docs_builder::provenance_tests::each_build_captures_one_revision_before_rendering::{closure#0} as core::ops::function::FnOnce<()>>::call_once
  646. 95.78 s > note: Some details are omitted, run with `RUST_BACKTRACE=full` for a verbose backtrace.
  647. 95.78 s >
  648. 95.78 s > thread 'provenance_tests::each_build_captures_one_revision_before_rendering' (226) panicked at crates/alphal00p-docs-builder/src/provenance_tests.rs:274:9:
  649. 95.78 s > assertion failed: command.status().unwrap().success()
  650. 95.78 s > stack backtrace:
  651. 95.78 s > 0: __rustc::rust_begin_unwind
  652. 95.78 s > 1: core::panicking::panic_fmt
  653. 95.78 s > 2: core::panicking::panic
  654. 95.78 s > 3: alphal00p_docs_builder::provenance_tests::each_build_captures_one_revision_before_rendering
  655. 95.78 s > 4: <alphal00p_docs_builder::provenance_tests::each_build_captures_one_revision_before_rendering::{closure#0} as core::ops::function::FnOnce<()>>::call_once
  656. 95.78 s > note: Some details are omitted, run with `RUST_BACKTRACE=full` for a verbose backtrace.
  657. 95.78 s > =========================================
  658. 95.78 s > Extracting 2 binaries to /build/source
  659. 95.78 s > Extracted 5 files to /build/source in 0.08s
  660. 95.78 s > ------------
  661. 95.78 s > Nextest run ID 9d4fda6c-5120-4cbe-9dbc-d76473c3d1f6 with nextest profile: ci_gammaloop
  662. 95.78 s > Starting 22 tests across 2 binaries
  663. 95.78 s > ------------
  664. 95.78 s > Summary [ 0.072s] 22 tests run: 22 passed, 0 skipped
  665. 95.78 s >
  666. 95.78 s > ========== nextest test summary ==========
  667. 95.78 s > report: target/nextest/ci_gammaloop/junit.xml
  668. 95.78 s > tests: 22, failures: 0, errors: 0
  669. 95.78 s > No failing testcases found.
  670. 95.78 s > =========================================
  671. 95.78 s > Extracting 3 binaries (including 2 non-test binaries), 1 build script output directory, and 2 linked paths to /build/source
  672. 95.78 s > Extracted 22 files to /build/source in 0.43s
  673. 95.78 s > ------------
  674. 95.78 s > Nextest run ID eb1f3580-cf8b-43c9-88ce-9ca20b43e05f with nextest profile: ci_gammaloop
  675. 95.78 s > Starting 89 tests across 1 binary
  676. 95.78 s > ------------
  677. 95.78 s > Summary [ 0.136s] 89 tests run: 89 passed, 0 skipped
  678. 95.78 s >
  679. 95.78 s > ========== nextest test summary ==========
  680. 95.78 s > report: target/nextest/ci_gammaloop/junit.xml
  681. 95.78 s > tests: 89, failures: 0, errors: 0
  682. 95.78 s > No failing testcases found.
  683. 95.78 s > =========================================
  684. 95.78 s > Extracting 2 binaries to /build/source
  685. 95.78 s > Extracted 5 files to /build/source in 0.08s
  686. 95.78 s > ------------
  687. 95.78 s > Nextest run ID 07d24bf3-b628-4b1d-b5b3-e29a6fcaa3a6 with nextest profile: ci_gammaloop
  688. 95.78 s > Starting 10 tests across 2 binaries
  689. 95.78 s > ------------
  690. 95.78 s > Summary [ 23.542s] 10 tests run: 10 passed, 0 skipped
  691. 95.78 s >
  692. 95.78 s > ========== nextest test summary ==========
  693. 95.78 s > report: target/nextest/ci_gammaloop/junit.xml
  694. 95.78 s > tests: 10, failures: 0, errors: 0
  695. 95.78 s > No failing testcases found.
  696. 95.78 s > =========================================
  697. 95.78 s > Extracting 1 binary to /build/source
  698. 95.78 s > Extracted 4 files to /build/source in 0.07s
  699. 95.78 s > ------------
  700. 95.78 s > Nextest run ID 2ee73823-2c9a-48f4-9b5e-231f2677172d with nextest profile: ci_gammaloop
  701. 95.78 s > Starting 0 tests across 1 binary
  702. 95.78 s > ------------
  703. 95.78 s > Summary [ 0.001s] 0 tests run: 0 passed, 0 skipped
  704. 95.78 s >
  705. 95.78 s > ========== nextest test summary ==========
  706. 95.78 s > report: target/nextest/ci_gammaloop/junit.xml
  707. 95.78 s > tests: 0, failures: 0, errors: 0
  708. 95.78 s > No failing testcases found.
  709. 95.78 s > =========================================
  710. 95.78 s > Extracting 1 binary to /build/source
  711. 95.78 s > Extracted 4 files to /build/source in 0.06s
  712. 95.78 s > ------------
  713. 95.78 s > Nextest run ID 5a8cb63a-e982-4604-be46-357e5ad1a7dd with nextest profile: ci_gammaloop
  714. 95.78 s > Starting 5 tests across 1 binary
  715. 95.78 s > ------------
  716. 95.78 s > Summary [ 0.027s] 5 tests run: 5 passed, 0 skipped
  717. 95.78 s >
  718. 95.78 s > ========== nextest test summary ==========
  719. 95.78 s > report: target/nextest/ci_gammaloop/junit.xml
  720. 95.78 s > tests: 5, failures: 0, errors: 0
  721. 95.78 s > No failing testcases found.
  722. 95.78 s > =========================================
  723. 95.78 s For full logs, run:
  724. 95.78 s nix log /nix/store/9rs74w2crrwhaq7f0dxdi11wd515i6dj-gammaloop-nextest-docs.drv
  725. 96.02 s [1 built (1 failed), 48 Run failed.