test packages.x86_64-linux.nix-ci-check-gammaloop-nextest-docs

Reproduce this run
Retry Run
  1. 0.00 s $ /nix/store/9ypz3flqsrl5xl495mm8h645gadjsxi1-coreutils-9.11/bin/timeout --kill-after=15s 7200s /nix/store/23zk8sgzamrbmj1fday15szf7f2279s8-nix-2.34.7/bin/nix --extra-experimental-features nix-command --extra-experimental-features flakes flake clone git+https://github.com/alphal00p/gammaloop --dest /tmp/nix-ci-worker/stable-pwd/repo/
  2. 0.08 s Cloning into '/tmp/nix-ci-worker/stable-pwd/repo'...
  3. 1.27 s remote: Enumerating objects: 77128, done.
  4. 1.38 s remote: Counting objects: 0% (1/12971) remote: Counting objects: 1% (130/12971) remote: Counting objects: 2% (260/12971) remote: Counting objects: 3% (390/12971) remote: Counting objects: 4% (519/12971) remote: Counting objects: 5% (649/12971) remote: Counting objects: 6% (779/12971) remote: Counting objects: 7% (908/12971) remote: Counting objects: 8% (1038/12971) remote: Counting objects: 9% (1168/12971) remote: Counting objects: 10% (1298/12971) remote: Counting objects: 11% (1427/12971) remote: Counting objects: 12% (1557/12971) remote: Counting objects: 13% (1687/12971) remote: Counting objects: 14% (1816/12971) remote: Counting objects: 15% (1946/12971) remote: Counting objects: 16% (2076/12971) remote: Counting objects: 17% (2206/12971) remote: Counting objects: 18% (2335/12971) remote: Counting objects: 19% (2465/12971) remote: Counting objects: 20% (2595/12971) remote: Counting objects: 21% (2724/12971) remote: Counting objects: 22% (2854/12971) remote: Counting objects: 23% (2984/12971) remote: Counting objects: 24% (3114/12971) remote: Counting objects: 25% (3243/12971) remote: Counting objects: 26% (3373/12971) remote: Counting objects: 27% (3503/12971) remote: Counting objects: 28% (3632/12971) remote: Counting objects: 29% (3762/12971) remote: Counting objects: 30% (3892/12971) remote: Counting objects: 31% (4022/12971) remote: Counting objects: 32% (4151/12971) remote: Counting objects: 33% (4281/12971) remote: Counting objects: 34% (4411/12971) remote: Counting objects: 35% (4540/12971) remote: Counting objects: 36% (4670/12971) remote: Counting objects: 37% (4800/12971) remote: Counting objects: 38% (4929/12971) remote: Counting objects: 39% (5059/12971) remote: Counting objects: 40% (5189/12971) remote: Counting objects: 41% (5319/12971) remote: Counting objects: 42% (5448/12971) remote: Counting objects: 43% (5578/12971) remote: Counting objects: 44% (5708/12971) remote: Counting objects: 45% (5837/12971) remote: Counting objects: 46% (5967/12971) remote: Counting objects: 47% (6097/12971) remote: Counting objects: 48% (6227/12971) remote: Counting objects: 49% (6356/12971) remote: Counting objects: 50% (6486/12971) remote: Counting objects: 51% (6616/12971) remote: Counting objects: 52% (6745/12971) remote: Counting objects: 53% (6875/12971) remote: Counting objects: 54% (7005/12971) remote: Counting objects: 55% (7135/12971) remote: Counting objects: 56% (7264/12971) remote: Counting objects: 57% (7394/12971) remote: Counting objects: 58% (7524/12971) remote: Counting objects: 59% (7653/12971) remote: Counting objects: 60% (7783/12971) remote: Counting objects: 61% (7913/12971) remote: Counting objects: 62% (8043/12971) remote: Counting objects: 63% (8172/12971) remote: Counting objects: 64% (8302/12971) remote: Counting objects: 65% (8432/12971) remote: Counting objects: 66% (8561/12971) remote: Counting objects: 67% (8691/12971) remote: Counting objects: 68% (8821/12971) remote: Counting objects: 69% (8950/12971) remote: Counting objects: 70% (9080/12971) remote: Counting objects: 71% (9210/12971) remote: Counting objects: 72% (9340/12971) remote: Counting objects: 73% (9469/12971) remote: Counting objects: 74% (9599/12971) remote: Counting objects: 75% (9729/12971) remote: Counting objects: 76% (9858/12971) remote: Counting objects: 77% (9988/12971) remote: Counting objects: 78% (10118/12971) remote: Counting objects: 79% (10248/12971) remote: Counting objects: 80% (10377/12971) remote: Counting objects: 81% (10507/12971) remote: Counting objects: 82% (10637/12971) remote: Counting objects: 83% (10766/12971) remote: Counting objects: 84% (10896/12971) remote: Counting objects: 85% (11026/12971) remote: Counting objects: 86% (11156/12971) remote: Counting objects: 87% (11285/12971) remote: Counting objects: 88% (11415/12971) remote: Counting objects: 89% (11545/12971) remote: Counting objects: 90% (11674/12971) remote: Counting objects: 91% (11804/12971) remote: Counting objects: 92% (11934/12971) remote: Counting objects: 93% (12064/12971) remote: Counting objects: 94% (12193/12971) remote: Counting objects: 95% (12323/12971) remote: Counting objects: 96% (12453/12971) remote: Counting objects: 97% (12582/12971) remote: Counting objects: 98% (12712/12971) remote: Counting objects: 99% (12842/12971) remote: Counting objects: 100% (12971/12971) remote: Counting objects: 100% (12971/12971), done.
  5. 4.07 s remote: Compressing objects: 0% (1/2775) remote: Compressing objects: 1% (28/2775) remote: Compressing objects: 2% (56/2775) remote: Compressing objects: 3% (84/2775) remote: Compressing objects: 4% (111/2775) remote: Compressing objects: 5% (139/2775) remote: Compressing objects: 6% (167/2775) remote: Compressing objects: 7% (195/2775) remote: Compressing objects: 8% (222/2775) remote: Compressing objects: 9% (250/2775) remote: Compressing objects: 10% (278/2775) remote: Compressing objects: 11% (306/2775) remote: Compressing objects: 12% (333/2775) remote: Compressing objects: 13% (361/2775) remote: Compressing objects: 14% (389/2775) remote: Compressing objects: 15% (417/2775) remote: Compressing objects: 16% (444/2775) remote: Compressing objects: 17% (472/2775) remote: Compressing objects: 18% (500/2775) remote: Compressing objects: 19% (528/2775) remote: Compressing objects: 20% (555/2775) remote: Compressing objects: 21% (583/2775) remote: Compressing objects: 22% (611/2775) remote: Compressing objects: 23% (639/2775) remote: Compressing objects: 23% (647/2775) remote: Compressing objects: 24% (666/2775) remote: Compressing objects: 25% (694/2775) remote: Compressing objects: 26% (722/2775) remote: Compressing objects: 27% (750/2775) remote: Compressing objects: 27% (766/2775) remote: Compressing objects: 28% (777/2775) remote: Compressing objects: 29% (805/2775) remote: Compressing objects: 30% (833/2775) remote: Compressing objects: 31% (861/2775) remote: Compressing objects: 32% (888/2775) remote: Compressing objects: 33% (916/2775) remote: Compressing objects: 34% (944/2775) remote: Compressing objects: 35% (972/2775) remote: Compressing objects: 36% (999/2775) remote: Compressing objects: 37% (1027/2775) remote: Compressing objects: 38% (1055/2775) remote: Compressing objects: 39% (1083/2775) remote: Compressing objects: 40% (1110/2775) remote: Compressing objects: 41% (1138/2775) remote: Compressing objects: 42% (1166/2775) remote: Compressing objects: 43% (1194/2775) remote: Compressing objects: 44% (1221/2775) remote: Compressing objects: 45% (1249/2775) remote: Compressing objects: 46% (1277/2775) remote: Compressing objects: 47% (1305/2775) remote: Compressing objects: 48% (1332/2775) remote: Compressing objects: 49% (1360/2775) remote: Compressing objects: 50% (1388/2775) remote: Compressing objects: 51% (1416/2775) remote: Compressing objects: 52% (1443/2775) remote: Compressing objects: 53% (1471/2775) remote: Compressing objects: 54% (1499/2775) remote: Compressing objects: 55% (1527/2775) remote: Compressing objects: 56% (1554/2775) remote: Compressing objects: 57% (1582/2775) remote: Compressing objects: 58% (1610/2775) remote: Compressing objects: 59% (1638/2775) remote: Compressing objects: 60% (1665/2775) remote: Compressing objects: 61% (1693/2775) remote: Compressing objects: 62% (1721/2775) remote: Compressing objects: 63% (1749/2775) remote: Compressing objects: 64% (1776/2775) remote: Compressing objects: 65% (1804/2775) remote: Compressing objects: 66% (1832/2775) remote: Compressing objects: 67% (1860/2775) remote: Compressing objects: 68% (1887/2775) remote: Compressing objects: 69% (1915/2775) remote: Compressing objects: 70% (1943/2775) remote: Compressing objects: 71% (1971/2775) remote: Compressing objects: 72% (1998/2775) remote: Compressing objects: 73% (2026/2775) remote: Compressing objects: 74% (2054/2775) remote: Compressing objects: 75% (2082/2775) remote: Compressing objects: 76% (2109/2775) remote: Compressing objects: 77% (2137/2775) remote: Compressing objects: 78% (2165/2775) remote: Compressing objects: 79% (2193/2775) remote: Compressing objects: 80% (2220/2775) remote: Compressing objects: 81% (2248/2775) remote: Compressing objects: 82% (2276/2775) remote: Compressing objects: 83% (2304/2775) remote: Compressing objects: 84% (2331/2775) remote: Compressing objects: 85% (2359/2775) remote: Compressing objects: 86% (2387/2775) remote: Compressing objects: 87% (2415/2775) remote: Compressing objects: 88% (2442/2775) remote: Compressing objects: 89% (2470/2775) remote: Compressing objects: 90% (2498/2775) remote: Compressing objects: 91% (2526/2775) remote: Compressing objects: 92% (2553/2775) remote: Compressing objects: 93% (2581/2775) remote: Compressing objects: 94% (2609/2775) remote: Compressing objects: 95% (2637/2775) remote: Compressing objects: 96% (2664/2775) remote: Compressing objects: 97% (2692/2775) remote: Compressing objects: 98% (2720/2775) remote: Compressing objects: 99% (2748/2775) remote: Compressing objects: 100% (2775/2775) remote: Compressing objects: 100% (2775/2775), done.
  6. 7.98 s Receiving objects: 0% (1/77128) Receiving objects: 1% (772/77128) Receiving objects: 2% (1543/77128) Receiving objects: 3% (2314/77128) Receiving objects: 4% (3086/77128) Receiving objects: 5% (3857/77128) Receiving objects: 6% (4628/77128) Receiving objects: 7% (5399/77128), 9.21 MiB | 18.40 MiB/s Receiving objects: 8% (6171/77128), 9.21 MiB | 18.40 MiB/s Receiving objects: 9% (6942/77128), 9.21 MiB | 18.40 MiB/s Receiving objects: 10% (7713/77128), 9.21 MiB | 18.40 MiB/s Receiving objects: 11% (8485/77128), 9.21 MiB | 18.40 MiB/s Receiving objects: 12% (9256/77128), 9.21 MiB | 18.40 MiB/s Receiving objects: 13% (10027/77128), 9.21 MiB | 18.40 MiB/s Receiving objects: 14% (10798/77128), 9.21 MiB | 18.40 MiB/s Receiving objects: 15% (11570/77128), 9.21 MiB | 18.40 MiB/s Receiving objects: 16% (12341/77128), 9.21 MiB | 18.40 MiB/s Receiving objects: 17% (13112/77128), 9.21 MiB | 18.40 MiB/s Receiving objects: 18% (13884/77128), 9.21 MiB | 18.40 MiB/s Receiving objects: 19% (14655/77128), 9.21 MiB | 18.40 MiB/s Receiving objects: 20% (15426/77128), 9.21 MiB | 18.40 MiB/s Receiving objects: 21% (16197/77128), 9.21 MiB | 18.40 MiB/s Receiving objects: 22% (16969/77128), 9.21 MiB | 18.40 MiB/s Receiving objects: 23% (17740/77128), 9.21 MiB | 18.40 MiB/s Receiving objects: 24% (18511/77128), 9.21 MiB | 18.40 MiB/s Receiving objects: 25% (19282/77128), 9.21 MiB | 18.40 MiB/s Receiving objects: 26% (20054/77128), 9.21 MiB | 18.40 MiB/s Receiving objects: 27% (20825/77128), 9.21 MiB | 18.40 MiB/s Receiving objects: 28% (21596/77128), 9.21 MiB | 18.40 MiB/s Receiving objects: 29% (22368/77128), 9.21 MiB | 18.40 MiB/s Receiving objects: 30% (23139/77128), 9.21 MiB | 18.40 MiB/s Receiving objects: 31% (23910/77128), 9.21 MiB | 18.40 MiB/s Receiving objects: 32% (24681/77128), 9.21 MiB | 18.40 MiB/s Receiving objects: 33% (25453/77128), 9.21 MiB | 18.40 MiB/s Receiving objects: 34% (26224/77128), 9.21 MiB | 18.40 MiB/s Receiving objects: 35% (26995/77128), 9.21 MiB | 18.40 MiB/s Receiving objects: 35% (27130/77128), 9.21 MiB | 18.40 MiB/s Receiving objects: 36% (27767/77128), 26.84 MiB | 26.83 MiB/s Receiving objects: 37% (28538/77128), 26.84 MiB | 26.83 MiB/s Receiving objects: 38% (29309/77128), 26.84 MiB | 26.83 MiB/s Receiving objects: 39% (30080/77128), 26.84 MiB | 26.83 MiB/s Receiving objects: 40% (30852/77128), 26.84 MiB | 26.83 MiB/s Receiving objects: 41% (31623/77128), 26.84 MiB | 26.83 MiB/s Receiving objects: 42% (32394/77128), 26.84 MiB | 26.83 MiB/s Receiving objects: 43% (33166/77128), 26.84 MiB | 26.83 MiB/s Receiving objects: 44% (33937/77128), 26.84 MiB | 26.83 MiB/s Receiving objects: 45% (34708/77128), 26.84 MiB | 26.83 MiB/s Receiving objects: 46% (35479/77128), 26.84 MiB | 26.83 MiB/s Receiving objects: 47% (36251/77128), 37.52 MiB | 24.72 MiB/s Receiving objects: 48% (37022/77128), 37.52 MiB | 24.72 MiB/s Receiving objects: 49% (37793/77128), 37.52 MiB | 24.72 MiB/s Receiving objects: 50% (38564/77128), 37.52 MiB | 24.72 MiB/s Receiving objects: 51% (39336/77128), 37.52 MiB | 24.72 MiB/s Receiving objects: 52% (40107/77128), 37.52 MiB | 24.72 MiB/s Receiving objects: 53% (40878/77128), 37.52 MiB | 24.72 MiB/s Receiving objects: 54% (41650/77128), 37.52 MiB | 24.72 MiB/s Receiving objects: 55% (42421/77128), 37.52 MiB | 24.72 MiB/s Receiving objects: 56% (43192/77128), 37.52 MiB | 24.72 MiB/s Receiving objects: 57% (43963/77128), 37.52 MiB | 24.72 MiB/s Receiving objects: 57% (44545/77128), 37.52 MiB | 24.72 MiB/s Receiving objects: 58% (44735/77128), 37.52 MiB | 24.72 MiB/s Receiving objects: 59% (45506/77128), 37.52 MiB | 24.72 MiB/s Receiving objects: 60% (46277/77128), 54.96 MiB | 27.24 MiB/s Receiving objects: 61% (47049/77128), 54.96 MiB | 27.24 MiB/s Receiving objects: 62% (47820/77128), 54.96 MiB | 27.24 MiB/s Receiving objects: 63% (48591/77128), 54.96 MiB | 27.24 MiB/s Receiving objects: 64% (49362/77128), 54.96 MiB | 27.24 MiB/s Receiving objects: 65% (50134/77128), 54.96 MiB | 27.24 MiB/s Receiving objects: 66% (50905/77128), 54.96 MiB | 27.24 MiB/s Receiving objects: 67% (51676/77128), 72.71 MiB | 28.65 MiB/s Receiving objects: 68% (52448/77128), 72.71 MiB | 28.65 MiB/s Receiving objects: 69% (53219/77128), 72.71 MiB | 28.65 MiB/s Receiving objects: 70% (53990/77128), 72.71 MiB | 28.65 MiB/s Receiving objects: 71% (54761/77128), 72.71 MiB | 28.65 MiB/s Receiving objects: 72% (55533/77128), 72.71 MiB | 28.65 MiB/s Receiving objects: 73% (56304/77128), 72.71 MiB | 28.65 MiB/s Receiving objects: 74% (57075/77128), 72.71 MiB | 28.65 MiB/s Receiving objects: 75% (57846/77128), 72.71 MiB | 28.65 MiB/s Receiving objects: 76% (58618/77128), 72.71 MiB | 28.65 MiB/s Receiving objects: 77% (59389/77128), 72.71 MiB | 28.65 MiB/s Receiving objects: 78% (60160/77128), 72.71 MiB | 28.65 MiB/s Receiving objects: 78% (60469/77128), 72.71 MiB | 28.65 MiB/s Receiving objects: 79% (60932/77128), 89.72 MiB | 29.38 MiB/s Receiving objects: 80% (61703/77128), 89.72 MiB | 29.38 MiB/s Receiving objects: 81% (62474/77128), 89.72 MiB | 29.38 MiB/s Receiving objects: 82% (63245/77128), 89.72 MiB | 29.38 MiB/s Receiving objects: 83% (64017/77128), 107.83 MiB | 30.30 MiB/s Receiving objects: 84% (64788/77128), 107.83 MiB | 30.30 MiB/s Receiving objects: 85% (65559/77128), 107.83 MiB | 30.30 MiB/s Receiving objects: 86% (66331/77128), 107.83 MiB | 30.30 MiB/s Receiving objects: 87% (67102/77128), 107.83 MiB | 30.30 MiB/s Receiving objects: 88% (67873/77128), 107.83 MiB | 30.30 MiB/s Receiving objects: 89% (68644/77128), 107.83 MiB | 30.30 MiB/s Receiving objects: 90% (69416/77128), 107.83 MiB | 30.30 MiB/s Receiving objects: 91% (70187/77128), 107.83 MiB | 30.30 MiB/s Receiving objects: 92% (70958/77128), 107.83 MiB | 30.30 MiB/s Receiving objects: 93% (71730/77128), 107.83 MiB | 30.30 MiB/s Receiving objects: 94% (72501/77128), 107.83 MiB | 30.30 MiB/s Receiving objects: 95% (73272/77128), 107.83 MiB | 30.30 MiB/s Receiving objects: 96% (74043/77128), 107.83 MiB | 30.30 MiB/s Receiving objects: 97% (74815/77128), 107.83 MiB | 30.30 MiB/s Receiving objects: 98% (75586/77128), 107.83 MiB | 30.30 MiB/s Receiving objects: 99% (76357/77128), 107.83 MiB | 30.30 MiB/s remote: Total 77128 (delta 9347), reused 10916 (delta 8362), pack-reused 64157 (from 2)
  7. 7.98 s Receiving objects: 100% (77128/77128), 107.83 MiB | 30.30 MiB/s Receiving objects: 100% (77128/77128), 119.49 MiB | 30.60 MiB/s, done.
  8. 8.86 s Resolving deltas: 0% (0/52645) Resolving deltas: 1% (527/52645) Resolving deltas: 2% (1053/52645) Resolving deltas: 3% (1580/52645) Resolving deltas: 4% (2107/52645) Resolving deltas: 5% (2634/52645) Resolving deltas: 6% (3160/52645) Resolving deltas: 7% (3686/52645) Resolving deltas: 8% (4212/52645) Resolving deltas: 9% (4739/52645) Resolving deltas: 10% (5266/52645) Resolving deltas: 11% (5791/52645) Resolving deltas: 12% (6318/52645) Resolving deltas: 13% (6844/52645) Resolving deltas: 14% (7375/52645) Resolving deltas: 15% (7897/52645) Resolving deltas: 16% (8424/52645) Resolving deltas: 17% (8950/52645) Resolving deltas: 18% (9477/52645) Resolving deltas: 19% (10003/52645) Resolving deltas: 20% (10529/52645) Resolving deltas: 21% (11056/52645) Resolving deltas: 22% (11582/52645) Resolving deltas: 23% (12110/52645) Resolving deltas: 24% (12635/52645) Resolving deltas: 25% (13162/52645) Resolving deltas: 26% (13688/52645) Resolving deltas: 27% (14215/52645) Resolving deltas: 28% (14741/52645) Resolving deltas: 29% (15268/52645) Resolving deltas: 30% (15794/52645) Resolving deltas: 31% (16320/52645) Resolving deltas: 32% (16847/52645) Resolving deltas: 33% (17373/52645) Resolving deltas: 34% (17900/52645) Resolving deltas: 35% (18426/52645) Resolving deltas: 36% (18953/52645) Resolving deltas: 37% (19479/52645) Resolving deltas: 38% (20006/52645) Resolving deltas: 39% (20532/52645) Resolving deltas: 40% (21058/52645) Resolving deltas: 41% (21586/52645) Resolving deltas: 42% (22111/52645) Resolving deltas: 43% (22638/52645) Resolving deltas: 44% (23164/52645) Resolving deltas: 45% (23691/52645) Resolving deltas: 46% (24217/52645) Resolving deltas: 47% (24744/52645) Resolving deltas: 48% (25270/52645) Resolving deltas: 49% (25797/52645) Resolving deltas: 50% (26323/52645) Resolving deltas: 51% (26850/52645) Resolving deltas: 52% (27376/52645) Resolving deltas: 53% (27903/52645) Resolving deltas: 54% (28430/52645) Resolving deltas: 55% (28956/52645) Resolving deltas: 56% (29482/52645) Resolving deltas: 57% (30008/52645) Resolving deltas: 58% (30535/52645) Resolving deltas: 59% (31061/52645) Resolving deltas: 60% (31587/52645) Resolving deltas: 61% (32114/52645) Resolving deltas: 62% (32641/52645) Resolving deltas: 63% (33167/52645) Resolving deltas: 64% (33694/52645) Resolving deltas: 65% (34220/52645) Resolving deltas: 66% (34746/52645) Resolving deltas: 67% (35273/52645) Resolving deltas: 68% (35799/52645) Resolving deltas: 69% (36326/52645) Resolving deltas: 70% (36852/52645) Resolving deltas: 71% (37379/52645) Resolving deltas: 72% (37905/52645) Resolving deltas: 73% (38431/52645) Resolving deltas: 74% (38959/52645) Resolving deltas: 75% (39484/52645) Resolving deltas: 76% (40011/52645) Resolving deltas: 77% (40537/52645) Resolving deltas: 78% (41064/52645) Resolving deltas: 79% (41590/52645) Resolving deltas: 80% (42116/52645) Resolving deltas: 81% (42643/52645) Resolving deltas: 82% (43169/52645) Resolving deltas: 83% (43696/52645) Resolving deltas: 84% (44222/52645) Resolving deltas: 85% (44750/52645) Resolving deltas: 86% (45275/52645) Resolving deltas: 87% (45802/52645) Resolving deltas: 88% (46328/52645) Resolving deltas: 89% (46855/52645) Resolving deltas: 90% (47381/52645) Resolving deltas: 91% (47907/52645) Resolving deltas: 92% (48434/52645) Resolving deltas: 93% (48960/52645) Resolving deltas: 94% (49487/52645) Resolving deltas: 95% (50013/52645) Resolving deltas: 96% (50540/52645) Resolving deltas: 97% (51067/52645) Resolving deltas: 98% (51593/52645) Resolving deltas: 99% (52119/52645) Resolving deltas: 100% (52645/52645) Resolving deltas: 100% (52645/52645), done.
  9. 9.31 s Fetching commit 509bcc282222aff4015c291e6846ce47e83f1919 for docs ...
  10. 9.31 s $ /nix/store/bcnisk3ydfgv26v2gw3zlky24g00yww2-git-2.54.0/bin/git fetch origin 509bcc282222aff4015c291e6846ce47e83f1919
  11. 9.74 s From https://github.com/alphal00p/gammaloop
  12. 9.74 s * branch 509bcc282222aff4015c291e6846ce47e83f1919 -> FETCH_HEAD
  13. 9.75 s $ /nix/store/9ypz3flqsrl5xl495mm8h645gadjsxi1-coreutils-9.11/bin/timeout --kill-after=15s 7200s /nix/store/bcnisk3ydfgv26v2gw3zlky24g00yww2-git-2.54.0/bin/git -c advice.detachedHead=false checkout 509bcc282222aff4015c291e6846ce47e83f1919
  14. 9.96 s HEAD is now at 509bcc282 fix docs CI and Pages publication
  15. 9.96 s $ /nix/store/9ypz3flqsrl5xl495mm8h645gadjsxi1-coreutils-9.11/bin/timeout --kill-after=15s 7200s /nix/store/23zk8sgzamrbmj1fday15szf7f2279s8-nix-2.34.7/bin/nix --extra-experimental-features nix-command --extra-experimental-features flakes --log-format internal-json run .#packages.x86_64-linux.nix-ci-check-gammaloop-nextest-docs --print-build-logs
  16. 10.20 s stdenv.isDarwin is deprecated, use stdenv.hostPlatform.isDarwin instead
  17. 14.46 s
  18. 14.75 s Downloading cached ShellCheck from https://cache.nix-ci.com
  19. 14.81 s Downloaded cached ShellCheck (7.5 MiB) in 57ms
  20. 14.81 s Progress: 0 of 2 built, 1 of 1 downloaded from cache
  21. 14.89 s Building /nix/store/a6gim03l06gb0a49a6m37yjngwpxbqjx-nix-ci-check-gammaloop-nextest-docs.drv
  22. 14.97 s [nix-ci-check-gammaloop-nextest-docs:post-build] Uploading to the NixCI cache: /nix/store/wx47znq637issdc09v04y9n1yngz3h9c-nix-ci-check-gammaloop-nextest-docs
  23. 15.00 s [nix-ci-check-gammaloop-nextest-docs:post-build] warning: 'warn-short-path-literals' is deprecated, use 'lint-short-path-literals = ignore' instead
  24. 15.02 s [nix-ci-check-gammaloop-nextest-docs:post-build] copying 1 paths...
  25. 15.02 s [nix-ci-check-gammaloop-nextest-docs:post-build] copying path '/nix/store/wx47znq637issdc09v04y9n1yngz3h9c-nix-ci-check-gammaloop-nextest-docs' to 'https://cache.nix-ci.com'...
  26. 15.10 s [nix-ci-check-gammaloop-nextest-docs:post-build] warning: 'warn-short-path-literals' is deprecated, use 'lint-short-path-literals = ignore' instead
  27. 15.60 s [nix-ci-check-gammaloop-nextest-docs:post-build] copying 0 paths...
  28. 15.64 s Uploaded nix-ci-check-gammaloop-nextest-docs in 679ms
  29. 15.64 s Progress: 1 of 2 built, 1 of 1 downloaded from cache
  30. 15.64 s Built nix-ci-check-gammaloop-nextest-docs in 740ms
  31. 15.64 s Progress: 2 of 2 built, 1 of 1 downloaded from cache
  32. 15.93 s evaluating derivation 'gevaluation warning: stdenv.isDarwin is deprecated, use stdenv.hostPlatform.isDarwin instead
  33. 22.91 s copying '/nix/store/j9kx evaluating derivation 'g copying '/nix/store/j9kx evaluating derivation 'g copying '/nix/store/j9kx evaluating derivation 'g copying '/nix/store/j9kx evaluating derivation 'g copying '/nix/store/j9kx evaluating derivation 'g copying '/nix/store/j9kx evaluating derivation 'g copying '/nix/store/j9kx evaluating derivation 'g querying gammaloop-nexte [0.0 KiB DL] querying in [9.7 KiB DL] querying pe [28.2 KiB DL] querying p [0/2 built, 16/3/41 copi [0/2 built, 7/24/41 copi [0/2 built, 3/36/41 copi [0/2 built, 1/40/41 copi [0/1 built, 41 copied (7 [1/0/1 built, 41 copied gammaloop-nextest-docs> Extracting 2 binaries to /build/nextest-archive-vo48A0
  34. 22.95 s gammaloop-nextest-docs> Extracted 5 files to /build/nextest-archive-vo48A0 in 0.05s
  35. 22.96 s gammaloop-nextest-docs> ------------
  36. 22.96 s gammaloop-nextest-docs> Nextest run ID 455ac845-1960-4d7d-b8e4-2b565fac3833 with nextest profile: ci_gammaloop
  37. 22.96 s gammaloop-nextest-docs> Starting 119 tests across 2 binaries
  38. 22.99 s gammaloop-nextest-docs> FAIL [ 0.014s] ( 23/119) alphal00p-docs-builder tests::developer_architecture_is_classified_searchable_and_source_backed
  39. 22.99 s gammaloop-nextest-docs> stdout ---
  40. 22.99 s gammaloop-nextest-docs>
  41. 22.99 s gammaloop-nextest-docs> running 1 test
  42. 22.99 s gammaloop-nextest-docs> test tests::developer_architecture_is_classified_searchable_and_source_backed ... FAILED
  43. 22.99 s gammaloop-nextest-docs>
  44. 22.99 s gammaloop-nextest-docs> failures:
  45. 22.99 s gammaloop-nextest-docs>
  46. 22.99 s gammaloop-nextest-docs> failures:
  47. 22.99 s gammaloop-nextest-docs> tests::developer_architecture_is_classified_searchable_and_source_backed
  48. 22.99 s gammaloop-nextest-docs>
  49. 22.99 s gammaloop-nextest-docs> test result: FAILED. 0 passed; 1 failed; 0 ignored; 0 measured; 118 filtered out; finished in 0.01s
  50. 22.99 s gammaloop-nextest-docs>
  51. 22.99 s gammaloop-nextest-docs> stderr ---
  52. 22.99 s gammaloop-nextest-docs>
  53. 22.99 s gammaloop-nextest-docs> thread 'tests::developer_architecture_is_classified_searchable_and_source_backed' (243) panicked at crates/alphal00p-docs-builder/src/lib.rs:12354:14:
  54. 22.99 s gammaloop-nextest-docs> called `Result::unwrap()` on an `Err` value: cannot determine the documented Git commit; set ALPHAL00P_DOCS_GIT_COMMIT
  55. 22.99 s gammaloop-nextest-docs>
  56. 22.99 s gammaloop-nextest-docs> Location:
  57. 22.99 s gammaloop-nextest-docs> crates/alphal00p-docs-builder/src/lib.rs:4137:9
  58. 22.99 s gammaloop-nextest-docs> stack backtrace:
  59. 22.99 s gammaloop-nextest-docs> 0: __rustc::rust_begin_unwind
  60. 22.99 s gammaloop-nextest-docs> 1: core::panicking::panic_fmt
  61. 22.99 s gammaloop-nextest-docs> 2: core::result::unwrap_failed
  62. 22.99 s gammaloop-nextest-docs> 3: alphal00p_docs_builder::tests::developer_architecture_is_classified_searchable_and_source_backed
  63. 22.99 s gammaloop-nextest-docs> 4: <alphal00p_docs_builder::tests::developer_architecture_is_classified_searchable_and_source_backed::{closure#0} as core::ops::function::FnOnce<()>>::call_once
  64. 22.99 s gammaloop-nextest-docs> note: Some details are omitted, run with `RUST_BACKTRACE=full` for a verbose backtrace.
  65. 22.99 s gammaloop-nextest-docs>
  66. 23.02 s gammaloop-nextest-docs> FAIL [ 0.009s] ( 46/119) alphal00p-docs-builder tests::persistent_rustdoc_target_rejects_symlink_escape
  67. 23.02 s gammaloop-nextest-docs> stdout ---
  68. 23.02 s gammaloop-nextest-docs>
  69. 23.02 s gammaloop-nextest-docs> running 1 test
  70. 23.02 s gammaloop-nextest-docs> test tests::persistent_rustdoc_target_rejects_symlink_escape ... FAILED
  71. 23.02 s gammaloop-nextest-docs>
  72. 23.02 s gammaloop-nextest-docs> failures:
  73. 23.02 s gammaloop-nextest-docs>
  74. 23.02 s gammaloop-nextest-docs> failures:
  75. 23.02 s gammaloop-nextest-docs> tests::persistent_rustdoc_target_rejects_symlink_escape
  76. 23.02 s gammaloop-nextest-docs>
  77. 23.02 s gammaloop-nextest-docs> test result: FAILED. 0 passed; 1 failed; 0 ignored; 0 measured; 118 filtered out; finished in 0.00s
  78. 23.02 s gammaloop-nextest-docs>
  79. 23.02 s gammaloop-nextest-docs> stderr ---
  80. 23.02 s gammaloop-nextest-docs>
  81. 23.02 s gammaloop-nextest-docs> thread 'tests::persistent_rustdoc_target_rejects_symlink_escape' (343) panicked at crates/alphal00p-docs-builder/src/lib.rs:10490:82:
  82. 23.02 s gammaloop-nextest-docs> called `Result::unwrap_err()` on an `Ok` value: "/build/.tmpuJkUdo/escape/cache/cargo-target-v1"
  83. 23.02 s gammaloop-nextest-docs> stack backtrace:
  84. 23.02 s gammaloop-nextest-docs> 0: __rustc::rust_begin_unwind
  85. 23.02 s gammaloop-nextest-docs> 1: core::panicking::panic_fmt
  86. 23.02 s gammaloop-nextest-docs> 2: core::result::unwrap_failed
  87. 23.02 s gammaloop-nextest-docs> 3: alphal00p_docs_builder::tests::persistent_rustdoc_target_rejects_symlink_escape
  88. 23.02 s gammaloop-nextest-docs> 4: <alphal00p_docs_builder::tests::persistent_rustdoc_target_rejects_symlink_escape::{closure#0} as core::ops::function::FnOnce<()>>::call_once
  89. 23.02 s gammaloop-nextest-docs> note: Some details are omitted, run with `RUST_BACKTRACE=full` for a verbose backtrace.
  90. 23.02 s gammaloop-nextest-docs>
  91. 23.02 s gammaloop-nextest-docs> FAIL [ 0.007s] ( 47/119) alphal00p-docs-builder tests::persistent_rustdoc_targets_reject_workspace_and_arbitrary_roots
  92. 23.02 s gammaloop-nextest-docs> stdout ---
  93. 23.02 s gammaloop-nextest-docs>
  94. 23.02 s gammaloop-nextest-docs> running 1 test
  95. 23.02 s gammaloop-nextest-docs> test tests::persistent_rustdoc_targets_reject_workspace_and_arbitrary_roots ... FAILED
  96. 23.02 s gammaloop-nextest-docs>
  97. 23.02 s gammaloop-nextest-docs> failures:
  98. 23.02 s gammaloop-nextest-docs>
  99. 23.02 s gammaloop-nextest-docs> failures:
  100. 23.02 s gammaloop-nextest-docs> tests::persistent_rustdoc_targets_reject_workspace_and_arbitrary_roots
  101. 23.02 s gammaloop-nextest-docs>
  102. 23.02 s gammaloop-nextest-docs> test result: FAILED. 0 passed; 1 failed; 0 ignored; 0 measured; 118 filtered out; finished in 0.00s
  103. 23.02 s gammaloop-nextest-docs>
  104. 23.02 s gammaloop-nextest-docs> stderr ---
  105. 23.02 s gammaloop-nextest-docs>
  106. 23.02 s gammaloop-nextest-docs> thread 'tests::persistent_rustdoc_targets_reject_workspace_and_arbitrary_roots' (348) panicked at crates/alphal00p-docs-builder/src/lib.rs:10467:9:
  107. 23.02 s gammaloop-nextest-docs> assertion failed: prepare_persistent_rustdoc_target(workspace, &arbitrary).is_err()
  108. 23.02 s gammaloop-nextest-docs> stack backtrace:
  109. 23.02 s gammaloop-nextest-docs> 0: __rustc::rust_begin_unwind
  110. 23.02 s gammaloop-nextest-docs> 1: core::panicking::panic_fmt
  111. 23.02 s gammaloop-nextest-docs> 2: core::panicking::panic
  112. 23.02 s gammaloop-nextest-docs> 3: alphal00p_docs_builder::tests::persistent_rustdoc_targets_reject_workspace_and_arbitrary_roots
  113. 23.02 s gammaloop-nextest-docs> 4: <alphal00p_docs_builder::tests::persistent_rustdoc_targets_reject_workspace_and_arbitrary_roots::{closure#0} as core::ops::function::FnOnce<()>>::call_once
  114. 23.02 s gammaloop-nextest-docs> note: Some details are omitted, run with `RUST_BACKTRACE=full` for a verbose backtrace.
  115. 23.02 s gammaloop-nextest-docs>
  116. 23.09 s gammaloop-nextest-docs> FAIL [ 0.076s] ( 66/119) alphal00p-docs-builder tests::portal_and_developer_pages_use_federated_search_and_feedback
  117. 23.09 s gammaloop-nextest-docs> stdout ---
  118. 23.09 s gammaloop-nextest-docs>
  119. 23.09 s gammaloop-nextest-docs> running 1 test
  120. 23.09 s gammaloop-nextest-docs> test tests::portal_and_developer_pages_use_federated_search_and_feedback ... FAILED
  121. 23.09 s gammaloop-nextest-docs>
  122. 23.09 s gammaloop-nextest-docs> failures:
  123. 23.09 s gammaloop-nextest-docs>
  124. 23.09 s gammaloop-nextest-docs> failures:
  125. 23.09 s gammaloop-nextest-docs> tests::portal_and_developer_pages_use_federated_search_and_feedback
  126. 23.09 s gammaloop-nextest-docs>
  127. 23.09 s gammaloop-nextest-docs> test result: FAILED. 0 passed; 1 failed; 0 ignored; 0 measured; 118 filtered out; finished in 0.06s
  128. 23.09 s gammaloop-nextest-docs>
  129. 23.09 s gammaloop-nextest-docs> stderr ---
  130. 23.09 s gammaloop-nextest-docs> warning: bundle export is experimental
  131. 23.09 s gammaloop-nextest-docs> = hint: its behaviour may change at any time
  132. 23.09 s gammaloop-nextest-docs> = hint: do not rely on this feature for production use cases
  133. 23.09 s gammaloop-nextest-docs>
  134. 23.09 s gammaloop-nextest-docs>
  135. 23.09 s gammaloop-nextest-docs> thread 'tests::portal_and_developer_pages_use_federated_search_and_feedback' (366) panicked at crates/alphal00p-docs-builder/src/lib.rs:12758:14:
  136. 23.09 s gammaloop-nextest-docs> called `Result::unwrap()` on an `Err` value: cannot determine the documented Git commit; set ALPHAL00P_DOCS_GIT_COMMIT
  137. 23.09 s gammaloop-nextest-docs>
  138. 23.09 s gammaloop-nextest-docs> Location:
  139. 23.09 s gammaloop-nextest-docs> crates/alphal00p-docs-builder/src/lib.rs:4137:9
  140. 23.09 s gammaloop-nextest-docs> stack backtrace:
  141. 23.09 s gammaloop-nextest-docs> 0: __rustc::rust_begin_unwind
  142. 23.09 s gammaloop-nextest-docs> 1: core::panicking::panic_fmt
  143. 23.09 s gammaloop-nextest-docs> 2: core::result::unwrap_failed
  144. 23.09 s gammaloop-nextest-docs> 3: alphal00p_docs_builder::tests::portal_and_developer_pages_use_federated_search_and_feedback
  145. 23.09 s gammaloop-nextest-docs> 4: <alphal00p_docs_builder::tests::portal_and_developer_pages_use_federated_search_and_feedback::{closure#0} as core::ops::function::FnOnce<()>>::call_once
  146. 23.09 s gammaloop-nextest-docs> note: Some details are omitted, run with `RUST_BACKTRACE=full` for a verbose backtrace.
  147. 23.09 s gammaloop-nextest-docs>
  148. 37.86 s gammaloop-nextest-docs> FAIL [ 14.876s] (118/119) alphal00p-docs-builder tests::every_product_orients_rust_to_native_rustdoc_and_keeps_legacy_redirects
  149. 37.86 s gammaloop-nextest-docs> stdout ---
  150. 37.86 s gammaloop-nextest-docs>
  151. 37.86 s gammaloop-nextest-docs> running 1 test
  152. 37.86 s gammaloop-nextest-docs> test tests::every_product_orients_rust_to_native_rustdoc_and_keeps_legacy_redirects ... FAILED
  153. 37.86 s gammaloop-nextest-docs>
  154. 37.86 s gammaloop-nextest-docs> failures:
  155. 37.86 s gammaloop-nextest-docs>
  156. 37.86 s gammaloop-nextest-docs> failures:
  157. 37.86 s gammaloop-nextest-docs> tests::every_product_orients_rust_to_native_rustdoc_and_keeps_legacy_redirects
  158. 37.86 s gammaloop-nextest-docs>
  159. 37.86 s gammaloop-nextest-docs> test result: FAILED. 0 passed; 1 failed; 0 ignored; 0 measured; 118 filtered out; finished in 14.87s
  160. 37.86 s gammaloop-nextest-docs>
  161. 37.86 s gammaloop-nextest-docs> stderr ---
  162. 37.86 s gammaloop-nextest-docs>
  163. 37.86 s gammaloop-nextest-docs> thread 'tests::every_product_orients_rust_to_native_rustdoc_and_keeps_legacy_redirects' (259) panicked at crates/alphal00p-docs-builder/src/lib.rs:12166:18:
  164. 37.86 s gammaloop-nextest-docs> called `Result::unwrap()` on an `Err` value: cannot determine the documented Git commit; set ALPHAL00P_DOCS_GIT_COMMIT
  165. 37.86 s gammaloop-nextest-docs>
  166. 37.86 s gammaloop-nextest-docs> Location:
  167. 37.86 s gammaloop-nextest-docs> crates/alphal00p-docs-builder/src/lib.rs:2054:9
  168. 37.86 s gammaloop-nextest-docs> stack backtrace:
  169. 37.86 s gammaloop-nextest-docs> 0: __rustc::rust_begin_unwind
  170. 37.86 s gammaloop-nextest-docs> 1: core::panicking::panic_fmt
  171. 37.86 s gammaloop-nextest-docs> 2: core::result::unwrap_failed
  172. 37.86 s gammaloop-nextest-docs> 3: alphal00p_docs_builder::tests::every_product_orients_rust_to_native_rustdoc_and_keeps_legacy_redirects
  173. 37.86 s gammaloop-nextest-docs> 4: <alphal00p_docs_builder::tests::every_product_orients_rust_to_native_rustdoc_and_keeps_legacy_redirects::{closure#0} as core::ops::function::FnOnce<()>>::call_once
  174. 37.86 s gammaloop-nextest-docs> note: Some details are omitted, run with `RUST_BACKTRACE=full` for a verbose backtrace.
  175. 37.86 s gammaloop-nextest-docs>
  176. 41.25 s gammaloop-nextest-docs> ------------
  177. 41.25 s gammaloop-nextest-docs> Summary [ 18.285s] 119 tests run: 114 passed, 5 failed, 0 skipped
  178. 41.25 s gammaloop-nextest-docs> FAIL [ 0.014s] ( 23/119) alphal00p-docs-builder tests::developer_architecture_is_classified_searchable_and_source_backed
  179. 41.25 s gammaloop-nextest-docs> stdout ---
  180. 41.25 s gammaloop-nextest-docs>
  181. 41.25 s gammaloop-nextest-docs> running 1 test
  182. 41.25 s gammaloop-nextest-docs> test tests::developer_architecture_is_classified_searchable_and_source_backed ... FAILED
  183. 41.25 s gammaloop-nextest-docs>
  184. 41.25 s gammaloop-nextest-docs> failures:
  185. 41.25 s gammaloop-nextest-docs>
  186. 41.25 s gammaloop-nextest-docs> failures:
  187. 41.25 s gammaloop-nextest-docs> tests::developer_architecture_is_classified_searchable_and_source_backed
  188. 41.25 s gammaloop-nextest-docs>
  189. 41.25 s gammaloop-nextest-docs> test result: FAILED. 0 passed; 1 failed; 0 ignored; 0 measured; 118 filtered out; finished in 0.01s
  190. 41.25 s gammaloop-nextest-docs>
  191. 41.25 s gammaloop-nextest-docs> stderr ---
  192. 41.25 s gammaloop-nextest-docs>
  193. 41.25 s gammaloop-nextest-docs> thread 'tests::developer_architecture_is_classified_searchable_and_source_backed' (243) panicked at crates/alphal00p-docs-builder/src/lib.rs:12354:14:
  194. 41.25 s gammaloop-nextest-docs> called `Result::unwrap()` on an `Err` value: cannot determine the documented Git commit; set ALPHAL00P_DOCS_GIT_COMMIT
  195. 41.25 s gammaloop-nextest-docs>
  196. 41.25 s gammaloop-nextest-docs> Location:
  197. 41.25 s gammaloop-nextest-docs> crates/alphal00p-docs-builder/src/lib.rs:4137:9
  198. 41.25 s gammaloop-nextest-docs> stack backtrace:
  199. 41.25 s gammaloop-nextest-docs> 0: __rustc::rust_begin_unwind
  200. 41.25 s gammaloop-nextest-docs> 1: core::panicking::panic_fmt
  201. 41.25 s gammaloop-nextest-docs> 2: core::result::unwrap_failed
  202. 41.25 s gammaloop-nextest-docs> 3: alphal00p_docs_builder::tests::developer_architecture_is_classified_searchable_and_source_backed
  203. 41.25 s gammaloop-nextest-docs> 4: <alphal00p_docs_builder::tests::developer_architecture_is_classified_searchable_and_source_backed::{closure#0} as core::ops::function::FnOnce<()>>::call_once
  204. 41.25 s gammaloop-nextest-docs> note: Some details are omitted, run with `RUST_BACKTRACE=full` for a verbose backtrace.
  205. 41.25 s gammaloop-nextest-docs>
  206. 41.25 s gammaloop-nextest-docs> FAIL [ 0.009s] ( 46/119) alphal00p-docs-builder tests::persistent_rustdoc_target_rejects_symlink_escape
  207. 41.25 s gammaloop-nextest-docs> stdout ---
  208. 41.25 s gammaloop-nextest-docs>
  209. 41.25 s gammaloop-nextest-docs> running 1 test
  210. 41.25 s gammaloop-nextest-docs> test tests::persistent_rustdoc_target_rejects_symlink_escape ... FAILED
  211. 41.25 s gammaloop-nextest-docs>
  212. 41.25 s gammaloop-nextest-docs> failures:
  213. 41.25 s gammaloop-nextest-docs>
  214. 41.25 s gammaloop-nextest-docs> failures:
  215. 41.25 s gammaloop-nextest-docs> tests::persistent_rustdoc_target_rejects_symlink_escape
  216. 41.25 s gammaloop-nextest-docs>
  217. 41.25 s gammaloop-nextest-docs> test result: FAILED. 0 passed; 1 failed; 0 ignored; 0 measured; 118 filtered out; finished in 0.00s
  218. 41.25 s gammaloop-nextest-docs>
  219. 41.25 s gammaloop-nextest-docs> stderr ---
  220. 41.25 s gammaloop-nextest-docs>
  221. 41.25 s gammaloop-nextest-docs> thread 'tests::persistent_rustdoc_target_rejects_symlink_escape' (343) panicked at crates/alphal00p-docs-builder/src/lib.rs:10490:82:
  222. 41.25 s gammaloop-nextest-docs> called `Result::unwrap_err()` on an `Ok` value: "/build/.tmpuJkUdo/escape/cache/cargo-target-v1"
  223. 41.25 s gammaloop-nextest-docs> stack backtrace:
  224. 41.25 s gammaloop-nextest-docs> 0: __rustc::rust_begin_unwind
  225. 41.25 s gammaloop-nextest-docs> 1: core::panicking::panic_fmt
  226. 41.25 s gammaloop-nextest-docs> 2: core::result::unwrap_failed
  227. 41.25 s gammaloop-nextest-docs> 3: alphal00p_docs_builder::tests::persistent_rustdoc_target_rejects_symlink_escape
  228. 41.25 s gammaloop-nextest-docs> 4: <alphal00p_docs_builder::tests::persistent_rustdoc_target_rejects_symlink_escape::{closure#0} as core::ops::function::FnOnce<()>>::call_once
  229. 41.25 s gammaloop-nextest-docs> note: Some details are omitted, run with `RUST_BACKTRACE=full` for a verbose backtrace.
  230. 41.25 s gammaloop-nextest-docs>
  231. 41.25 s gammaloop-nextest-docs> FAIL [ 0.007s] ( 47/119) alphal00p-docs-builder tests::persistent_rustdoc_targets_reject_workspace_and_arbitrary_roots
  232. 41.25 s gammaloop-nextest-docs> stdout ---
  233. 41.25 s gammaloop-nextest-docs>
  234. 41.25 s gammaloop-nextest-docs> running 1 test
  235. 41.25 s gammaloop-nextest-docs> test tests::persistent_rustdoc_targets_reject_workspace_and_arbitrary_roots ... FAILED
  236. 41.25 s gammaloop-nextest-docs>
  237. 41.25 s gammaloop-nextest-docs> failures:
  238. 41.25 s gammaloop-nextest-docs>
  239. 41.25 s gammaloop-nextest-docs> failures:
  240. 41.25 s gammaloop-nextest-docs> tests::persistent_rustdoc_targets_reject_workspace_and_arbitrary_roots
  241. 41.25 s gammaloop-nextest-docs>
  242. 41.25 s gammaloop-nextest-docs> test result: FAILED. 0 passed; 1 failed; 0 ignored; 0 measured; 118 filtered out; finished in 0.00s
  243. 41.25 s gammaloop-nextest-docs>
  244. 41.25 s gammaloop-nextest-docs> stderr ---
  245. 41.25 s gammaloop-nextest-docs>
  246. 41.25 s gammaloop-nextest-docs> thread 'tests::persistent_rustdoc_targets_reject_workspace_and_arbitrary_roots' (348) panicked at crates/alphal00p-docs-builder/src/lib.rs:10467:9:
  247. 41.25 s gammaloop-nextest-docs> assertion failed: prepare_persistent_rustdoc_target(workspace, &arbitrary).is_err()
  248. 41.25 s gammaloop-nextest-docs> stack backtrace:
  249. 41.25 s gammaloop-nextest-docs> 0: __rustc::rust_begin_unwind
  250. 41.25 s gammaloop-nextest-docs> 1: core::panicking::panic_fmt
  251. 41.25 s gammaloop-nextest-docs> 2: core::panicking::panic
  252. 41.25 s gammaloop-nextest-docs> 3: alphal00p_docs_builder::tests::persistent_rustdoc_targets_reject_workspace_and_arbitrary_roots
  253. 41.25 s gammaloop-nextest-docs> 4: <alphal00p_docs_builder::tests::persistent_rustdoc_targets_reject_workspace_and_arbitrary_roots::{closure#0} as core::ops::function::FnOnce<()>>::call_once
  254. 41.25 s gammaloop-nextest-docs> note: Some details are omitted, run with `RUST_BACKTRACE=full` for a verbose backtrace.
  255. 41.25 s gammaloop-nextest-docs>
  256. 41.25 s gammaloop-nextest-docs> FAIL [ 0.076s] ( 66/119) alphal00p-docs-builder tests::portal_and_developer_pages_use_federated_search_and_feedback
  257. 41.25 s gammaloop-nextest-docs> stdout ---
  258. 41.25 s gammaloop-nextest-docs>
  259. 41.25 s gammaloop-nextest-docs> running 1 test
  260. 41.25 s gammaloop-nextest-docs> test tests::portal_and_developer_pages_use_federated_search_and_feedback ... FAILED
  261. 41.25 s gammaloop-nextest-docs>
  262. 41.25 s gammaloop-nextest-docs> failures:
  263. 41.25 s gammaloop-nextest-docs>
  264. 41.25 s gammaloop-nextest-docs> failures:
  265. 41.25 s gammaloop-nextest-docs> tests::portal_and_developer_pages_use_federated_search_and_feedback
  266. 41.25 s gammaloop-nextest-docs>
  267. 41.25 s gammaloop-nextest-docs> test result: FAILED. 0 passed; 1 failed; 0 ignored; 0 measured; 118 filtered out; finished in 0.06s
  268. 41.25 s gammaloop-nextest-docs>
  269. 41.25 s gammaloop-nextest-docs> stderr ---
  270. 41.25 s gammaloop-nextest-docs> warning: bundle export is experimental
  271. 41.25 s gammaloop-nextest-docs> = hint: its behaviour may change at any time
  272. 41.25 s gammaloop-nextest-docs> = hint: do not rely on this feature for production use cases
  273. 41.25 s gammaloop-nextest-docs>
  274. 41.25 s gammaloop-nextest-docs>
  275. 41.25 s gammaloop-nextest-docs> thread 'tests::portal_and_developer_pages_use_federated_search_and_feedback' (366) panicked at crates/alphal00p-docs-builder/src/lib.rs:12758:14:
  276. 41.25 s gammaloop-nextest-docs> called `Result::unwrap()` on an `Err` value: cannot determine the documented Git commit; set ALPHAL00P_DOCS_GIT_COMMIT
  277. 41.25 s gammaloop-nextest-docs>
  278. 41.25 s gammaloop-nextest-docs> Location:
  279. 41.25 s gammaloop-nextest-docs> crates/alphal00p-docs-builder/src/lib.rs:4137:9
  280. 41.25 s gammaloop-nextest-docs> stack backtrace:
  281. 41.25 s gammaloop-nextest-docs> 0: __rustc::rust_begin_unwind
  282. 41.25 s gammaloop-nextest-docs> 1: core::panicking::panic_fmt
  283. 41.25 s gammaloop-nextest-docs> 2: core::result::unwrap_failed
  284. 41.25 s gammaloop-nextest-docs> 3: alphal00p_docs_builder::tests::portal_and_developer_pages_use_federated_search_and_feedback
  285. 41.25 s gammaloop-nextest-docs> 4: <alphal00p_docs_builder::tests::portal_and_developer_pages_use_federated_search_and_feedback::{closure#0} as core::ops::function::FnOnce<()>>::call_once
  286. 41.25 s gammaloop-nextest-docs> note: Some details are omitted, run with `RUST_BACKTRACE=full` for a verbose backtrace.
  287. 41.25 s gammaloop-nextest-docs>
  288. 41.25 s gammaloop-nextest-docs> FAIL [ 14.876s] (118/119) alphal00p-docs-builder tests::every_product_orients_rust_to_native_rustdoc_and_keeps_legacy_redirects
  289. 41.25 s gammaloop-nextest-docs> stdout ---
  290. 41.25 s gammaloop-nextest-docs>
  291. 41.25 s gammaloop-nextest-docs> running 1 test
  292. 41.25 s gammaloop-nextest-docs> test tests::every_product_orients_rust_to_native_rustdoc_and_keeps_legacy_redirects ... FAILED
  293. 41.25 s gammaloop-nextest-docs>
  294. 41.25 s gammaloop-nextest-docs> failures:
  295. 41.25 s gammaloop-nextest-docs>
  296. 41.25 s gammaloop-nextest-docs> failures:
  297. 41.25 s gammaloop-nextest-docs> tests::every_product_orients_rust_to_native_rustdoc_and_keeps_legacy_redirects
  298. 41.25 s gammaloop-nextest-docs>
  299. 41.25 s gammaloop-nextest-docs> test result: FAILED. 0 passed; 1 failed; 0 ignored; 0 measured; 118 filtered out; finished in 14.87s
  300. 41.25 s gammaloop-nextest-docs>
  301. 41.25 s gammaloop-nextest-docs> stderr ---
  302. 41.25 s gammaloop-nextest-docs>
  303. 41.25 s gammaloop-nextest-docs> thread 'tests::every_product_orients_rust_to_native_rustdoc_and_keeps_legacy_redirects' (259) panicked at crates/alphal00p-docs-builder/src/lib.rs:12166:18:
  304. 41.25 s gammaloop-nextest-docs> called `Result::unwrap()` on an `Err` value: cannot determine the documented Git commit; set ALPHAL00P_DOCS_GIT_COMMIT
  305. 41.25 s gammaloop-nextest-docs>
  306. 41.25 s gammaloop-nextest-docs> Location:
  307. 41.25 s gammaloop-nextest-docs> crates/alphal00p-docs-builder/src/lib.rs:2054:9
  308. 41.25 s gammaloop-nextest-docs> stack backtrace:
  309. 41.25 s gammaloop-nextest-docs> 0: __rustc::rust_begin_unwind
  310. 41.25 s gammaloop-nextest-docs> 1: core::panicking::panic_fmt
  311. 41.25 s gammaloop-nextest-docs> 2: core::result::unwrap_failed
  312. 41.25 s gammaloop-nextest-docs> 3: alphal00p_docs_builder::tests::every_product_orients_rust_to_native_rustdoc_and_keeps_legacy_redirects
  313. 41.25 s gammaloop-nextest-docs> 4: <alphal00p_docs_builder::tests::every_product_orients_rust_to_native_rustdoc_and_keeps_legacy_redirects::{closure#0} as core::ops::function::FnOnce<()>>::call_once
  314. 41.25 s gammaloop-nextest-docs> note: Some details are omitted, run with `RUST_BACKTRACE=full` for a verbose backtrace.
  315. 41.25 s gammaloop-nextest-docs>
  316. 41.26 s gammaloop-nextest-docs> error: test run failed
  317. 41.29 s gammaloop-nextest-docs>
  318. 41.29 s gammaloop-nextest-docs> ========== nextest test summary ==========
  319. 41.29 s gammaloop-nextest-docs> report: target/nextest/ci_gammaloop/junit.xml
  320. 41.29 s gammaloop-nextest-docs> tests: 119, failures: 5, errors: 0
  321. 41.29 s gammaloop-nextest-docs>
  322. 41.29 s gammaloop-nextest-docs> 1. alphal00p-docs-builder::tests::developer_architecture_is_classified_searchable_and_source_backed
  323. 41.29 s gammaloop-nextest-docs> failure: test failure with exit code 101
  324. 41.29 s gammaloop-nextest-docs> thread 'tests::developer_architecture_is_classified_searchable_and_source_backed' (243) panicked at crates/alphal00p-docs-builder/src/lib.rs:12354:14:
  325. 41.29 s gammaloop-nextest-docs> called `Result::unwrap()` on an `Err` value: cannot determine the documented Git commit; set ALPHAL00P_DOCS_GIT_COMMIT
  326. 41.29 s gammaloop-nextest-docs>
  327. 41.29 s gammaloop-nextest-docs> Location:
  328. 41.29 s gammaloop-nextest-docs> crates/alphal00p-docs-builder/src/lib.rs:4137:9
  329. 41.29 s gammaloop-nextest-docs> stack backtrace:
  330. 41.29 s gammaloop-nextest-docs> 0: __rustc::rust_begin_unwind
  331. 41.29 s gammaloop-nextest-docs> 1: core::panicking::panic_fmt
  332. 41.29 s gammaloop-nextest-docs> 2: core::result::unwrap_failed
  333. 41.29 s gammaloop-nextest-docs> 3: alphal00p_docs_builder::tests::developer_architecture_is_classified_searchable_and_source_backed
  334. 41.29 s gammaloop-nextest-docs> 4: <alphal00p_docs_builder::tests::developer_architecture_is_classified_searchable_and_source_backed::{closure#0} as core::ops::function::FnOnce<()>>::call_once
  335. 41.29 s gammaloop-nextest-docs> note: Some details are omitted, run with `RUST_BACKTRACE=full` for a verbose backtrace.
  336. 41.29 s gammaloop-nextest-docs> system-out
  337. 41.29 s gammaloop-nextest-docs> running 1 test
  338. 41.29 s gammaloop-nextest-docs> test tests::developer_architecture_is_classified_searchable_and_source_backed ... FAILED
  339. 41.29 s gammaloop-nextest-docs>
  340. 41.29 s gammaloop-nextest-docs> failures:
  341. 41.29 s gammaloop-nextest-docs>
  342. 41.29 s gammaloop-nextest-docs> failures:
  343. 41.29 s gammaloop-nextest-docs> tests::developer_architecture_is_classified_searchable_and_source_backed
  344. 41.29 s gammaloop-nextest-docs>
  345. 41.29 s gammaloop-nextest-docs> test result: FAILED. 0 passed; 1 failed; 0 ignored; 0 measured; 118 filtered out; finished in 0.01s
  346. 41.29 s gammaloop-nextest-docs> system-err
  347. 41.29 s gammaloop-nextest-docs> thread 'tests::developer_architecture_is_classified_searchable_and_source_backed' (243) panicked at crates/alphal00p-docs-builder/src/lib.rs:12354:14:
  348. 41.29 s gammaloop-nextest-docs> called `Result::unwrap()` on an `Err` value: cannot determine the documented Git commit; set ALPHAL00P_DOCS_GIT_COMMIT
  349. 41.29 s gammaloop-nextest-docs>
  350. 41.29 s gammaloop-nextest-docs> Location:
  351. 41.29 s gammaloop-nextest-docs> crates/alphal00p-docs-builder/src/lib.rs:4137:9
  352. 41.29 s gammaloop-nextest-docs> stack backtrace:
  353. 41.29 s gammaloop-nextest-docs> 0: __rustc::rust_begin_unwind
  354. 41.29 s gammaloop-nextest-docs> 1: core::panicking::panic_fmt
  355. 41.29 s gammaloop-nextest-docs> 2: core::result::unwrap_failed
  356. 41.29 s gammaloop-nextest-docs> 3: alphal00p_docs_builder::tests::developer_architecture_is_classified_searchable_and_source_backed
  357. 41.29 s gammaloop-nextest-docs> 4: <alphal00p_docs_builder::tests::developer_architecture_is_classified_searchable_and_source_backed::{closure#0} as core::ops::function::FnOnce<()>>::call_once
  358. 41.29 s gammaloop-nextest-docs> note: Some details are omitted, run with `RUST_BACKTRACE=full` for a verbose backtrace.
  359. 41.29 s gammaloop-nextest-docs>
  360. 41.29 s gammaloop-nextest-docs> 2. alphal00p-docs-builder::tests::persistent_rustdoc_target_rejects_symlink_escape
  361. 41.29 s gammaloop-nextest-docs> failure: test failure with exit code 101
  362. 41.29 s gammaloop-nextest-docs> thread 'tests::persistent_rustdoc_target_rejects_symlink_escape' (343) panicked at crates/alphal00p-docs-builder/src/lib.rs:10490:82:
  363. 41.29 s gammaloop-nextest-docs> called `Result::unwrap_err()` on an `Ok` value: "/build/.tmpuJkUdo/escape/cache/cargo-target-v1"
  364. 41.29 s gammaloop-nextest-docs> stack backtrace:
  365. 41.29 s gammaloop-nextest-docs> 0: __rustc::rust_begin_unwind
  366. 41.29 s gammaloop-nextest-docs> 1: core::panicking::panic_fmt
  367. 41.29 s gammaloop-nextest-docs> 2: core::result::unwrap_failed
  368. 41.29 s gammaloop-nextest-docs> 3: alphal00p_docs_builder::tests::persistent_rustdoc_target_rejects_symlink_escape
  369. 41.29 s gammaloop-nextest-docs> 4: <alphal00p_docs_builder::tests::persistent_rustdoc_target_rejects_symlink_escape::{closure#0} as core::ops::function::FnOnce<()>>::call_once
  370. 41.29 s gammaloop-nextest-docs> note: Some details are omitted, run with `RUST_BACKTRACE=full` for a verbose backtrace.
  371. 41.29 s gammaloop-nextest-docs> system-out
  372. 41.29 s gammaloop-nextest-docs> running 1 test
  373. 41.29 s gammaloop-nextest-docs> test tests::persistent_rustdoc_target_rejects_symlink_escape ... FAILED
  374. 41.29 s gammaloop-nextest-docs>
  375. 41.29 s gammaloop-nextest-docs> failures:
  376. 41.29 s gammaloop-nextest-docs>
  377. 41.29 s gammaloop-nextest-docs> failures:
  378. 41.29 s gammaloop-nextest-docs> tests::persistent_rustdoc_target_rejects_symlink_escape
  379. 41.29 s gammaloop-nextest-docs>
  380. 41.29 s gammaloop-nextest-docs> test result: FAILED. 0 passed; 1 failed; 0 ignored; 0 measured; 118 filtered out; finished in 0.00s
  381. 41.29 s gammaloop-nextest-docs> system-err
  382. 41.29 s gammaloop-nextest-docs> thread 'tests::persistent_rustdoc_target_rejects_symlink_escape' (343) panicked at crates/alphal00p-docs-builder/src/lib.rs:10490:82:
  383. 41.29 s gammaloop-nextest-docs> called `Result::unwrap_err()` on an `Ok` value: "/build/.tmpuJkUdo/escape/cache/cargo-target-v1"
  384. 41.29 s gammaloop-nextest-docs> stack backtrace:
  385. 41.29 s gammaloop-nextest-docs> 0: __rustc::rust_begin_unwind
  386. 41.29 s gammaloop-nextest-docs> 1: core::panicking::panic_fmt
  387. 41.29 s gammaloop-nextest-docs> 2: core::result::unwrap_failed
  388. 41.29 s gammaloop-nextest-docs> 3: alphal00p_docs_builder::tests::persistent_rustdoc_target_rejects_symlink_escape
  389. 41.29 s gammaloop-nextest-docs> 4: <alphal00p_docs_builder::tests::persistent_rustdoc_target_rejects_symlink_escape::{closure#0} as core::ops::function::FnOnce<()>>::call_once
  390. 41.29 s gammaloop-nextest-docs> note: Some details are omitted, run with `RUST_BACKTRACE=full` for a verbose backtrace.
  391. 41.29 s gammaloop-nextest-docs>
  392. 41.29 s gammaloop-nextest-docs> 3. alphal00p-docs-builder::tests::persistent_rustdoc_targets_reject_workspace_and_arbitrary_roots
  393. 41.29 s gammaloop-nextest-docs> failure: test failure with exit code 101
  394. 41.29 s gammaloop-nextest-docs> thread 'tests::persistent_rustdoc_targets_reject_workspace_and_arbitrary_roots' (348) panicked at crates/alphal00p-docs-builder/src/lib.rs:10467:9:
  395. 41.29 s gammaloop-nextest-docs> assertion failed: prepare_persistent_rustdoc_target(workspace, &arbitrary).is_err()
  396. 41.29 s gammaloop-nextest-docs> stack backtrace:
  397. 41.29 s gammaloop-nextest-docs> 0: __rustc::rust_begin_unwind
  398. 41.29 s gammaloop-nextest-docs> 1: core::panicking::panic_fmt
  399. 41.29 s gammaloop-nextest-docs> 2: core::panicking::panic
  400. 41.29 s gammaloop-nextest-docs> 3: alphal00p_docs_builder::tests::persistent_rustdoc_targets_reject_workspace_and_arbitrary_roots
  401. 41.29 s gammaloop-nextest-docs> 4: <alphal00p_docs_builder::tests::persistent_rustdoc_targets_reject_workspace_and_arbitrary_roots::{closure#0} as core::ops::function::FnOnce<()>>::call_once
  402. 41.29 s gammaloop-nextest-docs> note: Some details are omitted, run with `RUST_BACKTRACE=full` for a verbose backtrace.
  403. 41.29 s gammaloop-nextest-docs> system-out
  404. 41.29 s gammaloop-nextest-docs> running 1 test
  405. 41.29 s gammaloop-nextest-docs> test tests::persistent_rustdoc_targets_reject_workspace_and_arbitrary_roots ... FAILED
  406. 41.29 s gammaloop-nextest-docs>
  407. 41.29 s gammaloop-nextest-docs> failures:
  408. 41.29 s gammaloop-nextest-docs>
  409. 41.29 s gammaloop-nextest-docs> failures:
  410. 41.29 s gammaloop-nextest-docs> tests::persistent_rustdoc_targets_reject_workspace_and_arbitrary_roots
  411. 41.29 s gammaloop-nextest-docs>
  412. 41.29 s gammaloop-nextest-docs> test result: FAILED. 0 passed; 1 failed; 0 ignored; 0 measured; 118 filtered out; finished in 0.00s
  413. 41.29 s gammaloop-nextest-docs> system-err
  414. 41.29 s gammaloop-nextest-docs> thread 'tests::persistent_rustdoc_targets_reject_workspace_and_arbitrary_roots' (348) panicked at crates/alphal00p-docs-builder/src/lib.rs:10467:9:
  415. 41.29 s gammaloop-nextest-docs> assertion failed: prepare_persistent_rustdoc_target(workspace, &arbitrary).is_err()
  416. 41.29 s gammaloop-nextest-docs> stack backtrace:
  417. 41.29 s gammaloop-nextest-docs> 0: __rustc::rust_begin_unwind
  418. 41.29 s gammaloop-nextest-docs> 1: core::panicking::panic_fmt
  419. 41.29 s gammaloop-nextest-docs> 2: core::panicking::panic
  420. 41.29 s gammaloop-nextest-docs> 3: alphal00p_docs_builder::tests::persistent_rustdoc_targets_reject_workspace_and_arbitrary_roots
  421. 41.29 s gammaloop-nextest-docs> 4: <alphal00p_docs_builder::tests::persistent_rustdoc_targets_reject_workspace_and_arbitrary_roots::{closure#0} as core::ops::function::FnOnce<()>>::call_once
  422. 41.29 s gammaloop-nextest-docs> note: Some details are omitted, run with `RUST_BACKTRACE=full` for a verbose backtrace.
  423. 41.29 s gammaloop-nextest-docs>
  424. 41.29 s gammaloop-nextest-docs> 4. alphal00p-docs-builder::tests::portal_and_developer_pages_use_federated_search_and_feedback
  425. 41.29 s gammaloop-nextest-docs> failure: test failure with exit code 101
  426. 41.29 s gammaloop-nextest-docs> thread 'tests::portal_and_developer_pages_use_federated_search_and_feedback' (366) panicked at crates/alphal00p-docs-builder/src/lib.rs:12758:14:
  427. 41.29 s gammaloop-nextest-docs> called `Result::unwrap()` on an `Err` value: cannot determine the documented Git commit; set ALPHAL00P_DOCS_GIT_COMMIT
  428. 41.29 s gammaloop-nextest-docs>
  429. 41.29 s gammaloop-nextest-docs> Location:
  430. 41.29 s gammaloop-nextest-docs> crates/alphal00p-docs-builder/src/lib.rs:4137:9
  431. 41.29 s gammaloop-nextest-docs> stack backtrace:
  432. 41.29 s gammaloop-nextest-docs> 0: __rustc::rust_begin_unwind
  433. 41.29 s gammaloop-nextest-docs> 1: core::panicking::panic_fmt
  434. 41.29 s gammaloop-nextest-docs> 2: core::result::unwrap_failed
  435. 41.29 s gammaloop-nextest-docs> 3: alphal00p_docs_builder::tests::portal_and_developer_pages_use_federated_search_and_feedback
  436. 41.29 s gammaloop-nextest-docs> 4: <alphal00p_docs_builder::tests::portal_and_developer_pages_use_federated_search_and_feedback::{closure#0} as core::ops::function::FnOnce<()>>::call_once
  437. 41.29 s gammaloop-nextest-docs> note: Some details are omitted, run with `RUST_BACKTRACE=full` for a verbose backtrace.
  438. 41.29 s gammaloop-nextest-docs> system-out
  439. 41.29 s gammaloop-nextest-docs> running 1 test
  440. 41.29 s gammaloop-nextest-docs> test tests::portal_and_developer_pages_use_federated_search_and_feedback ... FAILED
  441. 41.29 s gammaloop-nextest-docs>
  442. 41.29 s gammaloop-nextest-docs> failures:
  443. 41.29 s gammaloop-nextest-docs>
  444. 41.29 s gammaloop-nextest-docs> failures:
  445. 41.29 s gammaloop-nextest-docs> tests::portal_and_developer_pages_use_federated_search_and_feedback
  446. 41.29 s gammaloop-nextest-docs>
  447. 41.29 s gammaloop-nextest-docs> test result: FAILED. 0 passed; 1 failed; 0 ignored; 0 measured; 118 filtered out; finished in 0.06s
  448. 41.29 s gammaloop-nextest-docs> system-err
  449. 41.29 s gammaloop-nextest-docs> warning: bundle export is experimental
  450. 41.29 s gammaloop-nextest-docs> = hint: its behaviour may change at any time
  451. 41.29 s gammaloop-nextest-docs> = hint: do not rely on this feature for production use cases
  452. 41.29 s gammaloop-nextest-docs>
  453. 41.29 s gammaloop-nextest-docs>
  454. 41.29 s gammaloop-nextest-docs> thread 'tests::portal_and_developer_pages_use_federated_search_and_feedback' (366) panicked at crates/alphal00p-docs-builder/src/lib.rs:12758:14:
  455. 41.29 s gammaloop-nextest-docs> called `Result::unwrap()` on an `Err` value: cannot determine the documented Git commit; set ALPHAL00P_DOCS_GIT_COMMIT
  456. 41.29 s gammaloop-nextest-docs>
  457. 41.29 s gammaloop-nextest-docs> Location:
  458. 41.29 s gammaloop-nextest-docs> crates/alphal00p-docs-builder/src/lib.rs:4137:9
  459. 41.29 s gammaloop-nextest-docs> stack backtrace:
  460. 41.29 s gammaloop-nextest-docs> 0: __rustc::rust_begin_unwind
  461. 41.29 s gammaloop-nextest-docs> 1: core::panicking::panic_fmt
  462. 41.29 s gammaloop-nextest-docs> 2: core::result::unwrap_failed
  463. 41.29 s gammaloop-nextest-docs> 3: alphal00p_docs_builder::tests::portal_and_developer_pages_use_federated_search_and_feedback
  464. 41.29 s gammaloop-nextest-docs> 4: <alphal00p_docs_builder::tests::portal_and_developer_pages_use_federated_search_and_feedback::{closure#0} as core::ops::function::FnOnce<()>>::call_once
  465. 41.29 s gammaloop-nextest-docs> note: Some details are omitted, run with `RUST_BACKTRACE=full` for a verbose backtrace.
  466. 41.29 s gammaloop-nextest-docs>
  467. 41.29 s gammaloop-nextest-docs> 5. alphal00p-docs-builder::tests::every_product_orients_rust_to_native_rustdoc_and_keeps_legacy_redirects
  468. 41.29 s gammaloop-nextest-docs> failure: test failure with exit code 101
  469. 41.29 s gammaloop-nextest-docs> thread 'tests::every_product_orients_rust_to_native_rustdoc_and_keeps_legacy_redirects' (259) panicked at crates/alphal00p-docs-builder/src/lib.rs:12166:18:
  470. 41.29 s gammaloop-nextest-docs> called `Result::unwrap()` on an `Err` value: cannot determine the documented Git commit; set ALPHAL00P_DOCS_GIT_COMMIT
  471. 41.29 s gammaloop-nextest-docs>
  472. 41.29 s gammaloop-nextest-docs> Location:
  473. 41.29 s gammaloop-nextest-docs> crates/alphal00p-docs-builder/src/lib.rs:2054:9
  474. 41.29 s gammaloop-nextest-docs> stack backtrace:
  475. 41.29 s gammaloop-nextest-docs> 0: __rustc::rust_begin_unwind
  476. 41.29 s gammaloop-nextest-docs> 1: core::panicking::panic_fmt
  477. 41.29 s gammaloop-nextest-docs> 2: core::result::unwrap_failed
  478. 41.29 s gammaloop-nextest-docs> 3: alphal00p_docs_builder::tests::every_product_orients_rust_to_native_rustdoc_and_keeps_legacy_redirects
  479. 41.29 s gammaloop-nextest-docs> 4: <alphal00p_docs_builder::tests::every_product_orients_rust_to_native_rustdoc_and_keeps_legacy_redirects::{closure#0} as core::ops::function::FnOnce<()>>::call_once
  480. 41.29 s gammaloop-nextest-docs> note: Some details are omitted, run with `RUST_BACKTRACE=full` for a verbose backtrace.
  481. 41.29 s gammaloop-nextest-docs> system-out
  482. 41.29 s gammaloop-nextest-docs> running 1 test
  483. 41.29 s gammaloop-nextest-docs> test tests::every_product_orients_rust_to_native_rustdoc_and_keeps_legacy_redirects ... FAILED
  484. 41.29 s gammaloop-nextest-docs>
  485. 41.29 s gammaloop-nextest-docs> failures:
  486. 41.29 s gammaloop-nextest-docs>
  487. 41.29 s gammaloop-nextest-docs> failures:
  488. 41.29 s gammaloop-nextest-docs> tests::every_product_orients_rust_to_native_rustdoc_and_keeps_legacy_redirects
  489. 41.29 s gammaloop-nextest-docs>
  490. 41.29 s gammaloop-nextest-docs> test result: FAILED. 0 passed; 1 failed; 0 ignored; 0 measured; 118 filtered out; finished in 14.87s
  491. 41.29 s gammaloop-nextest-docs> system-err
  492. 41.29 s gammaloop-nextest-docs> thread 'tests::every_product_orients_rust_to_native_rustdoc_and_keeps_legacy_redirects' (259) panicked at crates/alphal00p-docs-builder/src/lib.rs:12166:18:
  493. 41.29 s gammaloop-nextest-docs> called `Result::unwrap()` on an `Err` value: cannot determine the documented Git commit; set ALPHAL00P_DOCS_GIT_COMMIT
  494. 41.29 s gammaloop-nextest-docs>
  495. 41.30 s gammaloop-nextest-docs> Location:
  496. 41.30 s gammaloop-nextest-docs> crates/alphal00p-docs-builder/src/lib.rs:2054:9
  497. 41.30 s gammaloop-nextest-docs> stack backtrace:
  498. 41.30 s gammaloop-nextest-docs> 0: __rustc::rust_begin_unwind
  499. 41.30 s gammaloop-nextest-docs> 1: core::panicking::panic_fmt
  500. 41.30 s gammaloop-nextest-docs> 2: core::result::unwrap_failed
  501. 41.30 s gammaloop-nextest-docs> 3: alphal00p_docs_builder::tests::every_product_orients_rust_to_native_rustdoc_and_keeps_legacy_redirects
  502. 41.30 s gammaloop-nextest-docs> 4: <alphal00p_docs_builder::tests::every_product_orients_rust_to_native_rustdoc_and_keeps_legacy_redirects::{closure#0} as core::ops::function::FnOnce<()>>::call_once
  503. 41.30 s gammaloop-nextest-docs> note: Some details are omitted, run with `RUST_BACKTRACE=full` for a verbose backtrace.
  504. 41.30 s gammaloop-nextest-docs> =========================================
  505. 41.31 s gammaloop-nextest-docs> Extracting 2 binaries to /build/nextest-archive-MpCNs6
  506. 41.36 s gammaloop-nextest-docs> Extracted 5 files to /build/nextest-archive-MpCNs6 in 0.05s
  507. 41.37 s gammaloop-nextest-docs> ------------
  508. 41.37 s gammaloop-nextest-docs> Nextest run ID 85fa3184-e2c4-462c-9e83-d3b2d811af9e with nextest profile: ci_gammaloop
  509. 41.37 s gammaloop-nextest-docs> Starting 21 tests across 2 binaries
  510. 41.40 s gammaloop-nextest-docs> ------------
  511. 41.40 s gammaloop-nextest-docs> Summary [ 0.030s] 21 tests run: 21 passed, 0 skipped
  512. 41.45 s gammaloop-nextest-docs>
  513. 41.45 s gammaloop-nextest-docs> ========== nextest test summary ==========
  514. 41.45 s gammaloop-nextest-docs> report: target/nextest/ci_gammaloop/junit.xml
  515. 41.45 s gammaloop-nextest-docs> tests: 21, failures: 0, errors: 0
  516. 41.45 s gammaloop-nextest-docs> No failing testcases found.
  517. 41.45 s gammaloop-nextest-docs> =========================================
  518. 41.47 s gammaloop-nextest-docs> Extracting 3 binaries (including 2 non-test binaries), 1 build script output directory, and 2 linked paths to /build/nextest-archive-YssPb5
  519. 41.74 s gammaloop-nextest-docs> Extracted 22 files to /build/nextest-archive-YssPb5 in 0.27s
  520. 41.75 s gammaloop-nextest-docs> ------------
  521. 41.75 s gammaloop-nextest-docs> Nextest run ID 9438eb82-3fc6-48f7-85d5-b53b7dc1b5b0 with nextest profile: ci_gammaloop
  522. 41.75 s gammaloop-nextest-docs> Starting 89 tests across 1 binary
  523. 41.83 s gammaloop-nextest-docs> ------------
  524. 41.83 s gammaloop-nextest-docs> Summary [ 0.081s] 89 tests run: 89 passed, 0 skipped
  525. 41.91 s gammaloop-nextest-docs>
  526. 41.91 s gammaloop-nextest-docs> ========== nextest test summary ==========
  527. 41.91 s gammaloop-nextest-docs> report: target/nextest/ci_gammaloop/junit.xml
  528. 41.91 s gammaloop-nextest-docs> tests: 89, failures: 0, errors: 0
  529. 41.91 s gammaloop-nextest-docs> No failing testcases found.
  530. 41.91 s gammaloop-nextest-docs> =========================================
  531. 41.92 s gammaloop-nextest-docs> Extracting 2 binaries to /build/nextest-archive-Cl6Jru
  532. 41.97 s gammaloop-nextest-docs> Extracted 5 files to /build/nextest-archive-Cl6Jru in 0.05s
  533. 41.98 s gammaloop-nextest-docs> ------------
  534. 41.98 s gammaloop-nextest-docs> Nextest run ID c9673d64-bfc5-4041-be7d-7cb3b3d1bbfc with nextest profile: ci_gammaloop
  535. 41.98 s gammaloop-nextest-docs> Starting 10 tests across 2 binaries
  536. 59.53 s gammaloop-nextest-docs> ------------
  537. 59.53 s gammaloop-nextest-docs> Summary [ 17.549s] 10 tests run: 10 passed, 0 skipped
  538. 59.57 s gammaloop-nextest-docs>
  539. 59.57 s gammaloop-nextest-docs> ========== nextest test summary ==========
  540. 59.57 s gammaloop-nextest-docs> report: target/nextest/ci_gammaloop/junit.xml
  541. 59.57 s gammaloop-nextest-docs> tests: 10, failures: 0, errors: 0
  542. 59.57 s gammaloop-nextest-docs> No failing testcases found.
  543. 59.57 s gammaloop-nextest-docs> =========================================
  544. 59.60 s gammaloop-nextest-docs> Extracting 1 binary to /build/nextest-archive-x2Ig9A
  545. 59.64 s gammaloop-nextest-docs> Extracted 4 files to /build/nextest-archive-x2Ig9A in 0.04s
  546. 59.65 s gammaloop-nextest-docs> ------------
  547. 59.65 s gammaloop-nextest-docs> Nextest run ID 4ee0d097-7e56-47c0-812a-685e7b7a77b6 with nextest profile: ci_gammaloop
  548. 59.65 s gammaloop-nextest-docs> Starting 0 tests across 1 binary
  549. 59.65 s gammaloop-nextest-docs> ------------
  550. 59.65 s gammaloop-nextest-docs> Summary [ 0.002s] 0 tests run: 0 passed, 0 skipped
  551. 59.70 s gammaloop-nextest-docs>
  552. 59.70 s gammaloop-nextest-docs> ========== nextest test summary ==========
  553. 59.70 s gammaloop-nextest-docs> report: target/nextest/ci_gammaloop/junit.xml
  554. 59.70 s gammaloop-nextest-docs> tests: 0, failures: 0, errors: 0
  555. 59.70 s gammaloop-nextest-docs> No failing testcases found.
  556. 59.70 s gammaloop-nextest-docs> =========================================
  557. 59.72 s gammaloop-nextest-docs> Extracting 1 binary to /build/nextest-archive-Dtr94Y
  558. 59.77 s gammaloop-nextest-docs> Extracted 4 files to /build/nextest-archive-Dtr94Y in 0.04s
  559. 59.79 s gammaloop-nextest-docs> ------------
  560. 59.79 s gammaloop-nextest-docs> Nextest run ID dc2e57cc-9c7f-4585-b867-f2305b4d5112 with nextest profile: ci_gammaloop
  561. 59.79 s gammaloop-nextest-docs> Starting 4 tests across 1 binary
  562. 59.81 s gammaloop-nextest-docs> ------------
  563. 59.81 s gammaloop-nextest-docs> Summary [ 0.022s] 4 tests run: 4 passed, 0 skipped
  564. 59.87 s gammaloop-nextest-docs>
  565. 59.87 s gammaloop-nextest-docs> ========== nextest test summary ==========
  566. 59.87 s gammaloop-nextest-docs> report: target/nextest/ci_gammaloop/junit.xml
  567. 59.87 s gammaloop-nextest-docs> tests: 4, failures: 0, errors: 0
  568. 59.87 s gammaloop-nextest-docs> No failing testcases found.
  569. 59.87 s gammaloop-nextest-docs> =========================================
  570. 60.13 s [0 built (1 failed), 41 error: Cannot build '/nix/store/97637lakc6i3dvs2xjwvp87fmqr4wngc-gammaloop-nextest-docs.drv'.
  571. 60.13 s Reason: builder failed with exit code 100.
  572. 60.13 s Output paths:
  573. 60.13 s /nix/store/z1xh981kw745hgllv03mrbf9cyaf6c35-gammaloop-nextest-docs
  574. 60.13 s Last 537 log lines:
  575. 60.13 s > Extracting 2 binaries to /build/nextest-archive-vo48A0
  576. 60.13 s > Extracted 5 files to /build/nextest-archive-vo48A0 in 0.05s
  577. 60.13 s > ------------
  578. 60.13 s > Nextest run ID 455ac845-1960-4d7d-b8e4-2b565fac3833 with nextest profile: ci_gammaloop
  579. 60.13 s > Starting 119 tests across 2 binaries
  580. 60.13 s > FAIL [ 0.014s] ( 23/119) alphal00p-docs-builder tests::developer_architecture_is_classified_searchable_and_source_backed
  581. 60.13 s > stdout ---
  582. 60.13 s >
  583. 60.13 s > running 1 test
  584. 60.13 s > test tests::developer_architecture_is_classified_searchable_and_source_backed ... FAILED
  585. 60.13 s >
  586. 60.13 s > failures:
  587. 60.13 s >
  588. 60.13 s > failures:
  589. 60.13 s > tests::developer_architecture_is_classified_searchable_and_source_backed
  590. 60.13 s >
  591. 60.13 s > test result: FAILED. 0 passed; 1 failed; 0 ignored; 0 measured; 118 filtered out; finished in 0.01s
  592. 60.13 s >
  593. 60.13 s > stderr ---
  594. 60.13 s >
  595. 60.13 s > thread 'tests::developer_architecture_is_classified_searchable_and_source_backed' (243) panicked at crates/alphal00p-docs-builder/src/lib.rs:12354:14:
  596. 60.13 s > called `Result::unwrap()` on an `Err` value: cannot determine the documented Git commit; set ALPHAL00P_DOCS_GIT_COMMIT
  597. 60.13 s >
  598. 60.13 s > Location:
  599. 60.13 s > crates/alphal00p-docs-builder/src/lib.rs:4137:9
  600. 60.13 s > stack backtrace:
  601. 60.13 s > 0: __rustc::rust_begin_unwind
  602. 60.13 s > 1: core::panicking::panic_fmt
  603. 60.13 s > 2: core::result::unwrap_failed
  604. 60.13 s > 3: alphal00p_docs_builder::tests::developer_architecture_is_classified_searchable_and_source_backed
  605. 60.13 s > 4: <alphal00p_docs_builder::tests::developer_architecture_is_classified_searchable_and_source_backed::{closure#0} as core::ops::function::FnOnce<()>>::call_once
  606. 60.13 s > note: Some details are omitted, run with `RUST_BACKTRACE=full` for a verbose backtrace.
  607. 60.13 s >
  608. 60.13 s > FAIL [ 0.009s] ( 46/119) alphal00p-docs-builder tests::persistent_rustdoc_target_rejects_symlink_escape
  609. 60.13 s > stdout ---
  610. 60.13 s >
  611. 60.13 s > running 1 test
  612. 60.13 s > test tests::persistent_rustdoc_target_rejects_symlink_escape ... FAILED
  613. 60.13 s >
  614. 60.13 s > failures:
  615. 60.13 s >
  616. 60.13 s > failures:
  617. 60.13 s > tests::persistent_rustdoc_target_rejects_symlink_escape
  618. 60.13 s >
  619. 60.13 s > test result: FAILED. 0 passed; 1 failed; 0 ignored; 0 measured; 118 filtered out; finished in 0.00s
  620. 60.13 s >
  621. 60.13 s > stderr ---
  622. 60.13 s >
  623. 60.13 s > thread 'tests::persistent_rustdoc_target_rejects_symlink_escape' (343) panicked at crates/alphal00p-docs-builder/src/lib.rs:10490:82:
  624. 60.13 s > called `Result::unwrap_err()` on an `Ok` value: "/build/.tmpuJkUdo/escape/cache/cargo-target-v1"
  625. 60.13 s > stack backtrace:
  626. 60.13 s > 0: __rustc::rust_begin_unwind
  627. 60.13 s > 1: core::panicking::panic_fmt
  628. 60.13 s > 2: core::result::unwrap_failed
  629. 60.13 s > 3: alphal00p_docs_builder::tests::persistent_rustdoc_target_rejects_symlink_escape
  630. 60.13 s > 4: <alphal00p_docs_builder::tests::persistent_rustdoc_target_rejects_symlink_escape::{closure#0} as core::ops::function::FnOnce<()>>::call_once
  631. 60.13 s > note: Some details are omitted, run with `RUST_BACKTRACE=full` for a verbose backtrace.
  632. 60.13 s >
  633. 60.14 s > FAIL [ 0.007s] ( 47/119) alphal00p-docs-builder tests::persistent_rustdoc_targets_reject_workspace_and_arbitrary_roots
  634. 60.14 s > stdout ---
  635. 60.14 s >
  636. 60.14 s > running 1 test
  637. 60.14 s > test tests::persistent_rustdoc_targets_reject_workspace_and_arbitrary_roots ... FAILED
  638. 60.14 s >
  639. 60.14 s > failures:
  640. 60.14 s >
  641. 60.14 s > failures:
  642. 60.14 s > tests::persistent_rustdoc_targets_reject_workspace_and_arbitrary_roots
  643. 60.14 s >
  644. 60.14 s > test result: FAILED. 0 passed; 1 failed; 0 ignored; 0 measured; 118 filtered out; finished in 0.00s
  645. 60.14 s >
  646. 60.14 s > stderr ---
  647. 60.14 s >
  648. 60.14 s > thread 'tests::persistent_rustdoc_targets_reject_workspace_and_arbitrary_roots' (348) panicked at crates/alphal00p-docs-builder/src/lib.rs:10467:9:
  649. 60.14 s > assertion failed: prepare_persistent_rustdoc_target(workspace, &arbitrary).is_err()
  650. 60.14 s > stack backtrace:
  651. 60.14 s > 0: __rustc::rust_begin_unwind
  652. 60.14 s > 1: core::panicking::panic_fmt
  653. 60.14 s > 2: core::panicking::panic
  654. 60.14 s > 3: alphal00p_docs_builder::tests::persistent_rustdoc_targets_reject_workspace_and_arbitrary_roots
  655. 60.14 s > 4: <alphal00p_docs_builder::tests::persistent_rustdoc_targets_reject_workspace_and_arbitrary_roots::{closure#0} as core::ops::function::FnOnce<()>>::call_once
  656. 60.14 s > note: Some details are omitted, run with `RUST_BACKTRACE=full` for a verbose backtrace.
  657. 60.14 s >
  658. 60.14 s > FAIL [ 0.076s] ( 66/119) alphal00p-docs-builder tests::portal_and_developer_pages_use_federated_search_and_feedback
  659. 60.14 s > stdout ---
  660. 60.14 s >
  661. 60.14 s > running 1 test
  662. 60.14 s > test tests::portal_and_developer_pages_use_federated_search_and_feedback ... FAILED
  663. 60.14 s >
  664. 60.14 s > failures:
  665. 60.14 s >
  666. 60.14 s > failures:
  667. 60.14 s > tests::portal_and_developer_pages_use_federated_search_and_feedback
  668. 60.14 s >
  669. 60.14 s > test result: FAILED. 0 passed; 1 failed; 0 ignored; 0 measured; 118 filtered out; finished in 0.06s
  670. 60.14 s >
  671. 60.14 s > stderr ---
  672. 60.14 s > warning: bundle export is experimental
  673. 60.14 s > = hint: its behaviour may change at any time
  674. 60.14 s > = hint: do not rely on this feature for production use cases
  675. 60.14 s >
  676. 60.14 s >
  677. 60.14 s > thread 'tests::portal_and_developer_pages_use_federated_search_and_feedback' (366) panicked at crates/alphal00p-docs-builder/src/lib.rs:12758:14:
  678. 60.14 s > called `Result::unwrap()` on an `Err` value: cannot determine the documented Git commit; set ALPHAL00P_DOCS_GIT_COMMIT
  679. 60.14 s >
  680. 60.14 s > Location:
  681. 60.14 s > crates/alphal00p-docs-builder/src/lib.rs:4137:9
  682. 60.14 s > stack backtrace:
  683. 60.14 s > 0: __rustc::rust_begin_unwind
  684. 60.14 s > 1: core::panicking::panic_fmt
  685. 60.14 s > 2: core::result::unwrap_failed
  686. 60.14 s > 3: alphal00p_docs_builder::tests::portal_and_developer_pages_use_federated_search_and_feedback
  687. 60.14 s > 4: <alphal00p_docs_builder::tests::portal_and_developer_pages_use_federated_search_and_feedback::{closure#0} as core::ops::function::FnOnce<()>>::call_once
  688. 60.14 s > note: Some details are omitted, run with `RUST_BACKTRACE=full` for a verbose backtrace.
  689. 60.14 s >
  690. 60.14 s > FAIL [ 14.876s] (118/119) alphal00p-docs-builder tests::every_product_orients_rust_to_native_rustdoc_and_keeps_legacy_redirects
  691. 60.14 s > stdout ---
  692. 60.14 s >
  693. 60.14 s > running 1 test
  694. 60.14 s > test tests::every_product_orients_rust_to_native_rustdoc_and_keeps_legacy_redirects ... FAILED
  695. 60.14 s >
  696. 60.14 s > failures:
  697. 60.14 s >
  698. 60.14 s > failures:
  699. 60.14 s > tests::every_product_orients_rust_to_native_rustdoc_and_keeps_legacy_redirects
  700. 60.14 s >
  701. 60.14 s > test result: FAILED. 0 passed; 1 failed; 0 ignored; 0 measured; 118 filtered out; finished in 14.87s
  702. 60.14 s >
  703. 60.14 s > stderr ---
  704. 60.14 s >
  705. 60.14 s > thread 'tests::every_product_orients_rust_to_native_rustdoc_and_keeps_legacy_redirects' (259) panicked at crates/alphal00p-docs-builder/src/lib.rs:12166:18:
  706. 60.14 s > called `Result::unwrap()` on an `Err` value: cannot determine the documented Git commit; set ALPHAL00P_DOCS_GIT_COMMIT
  707. 60.14 s >
  708. 60.14 s > Location:
  709. 60.14 s > crates/alphal00p-docs-builder/src/lib.rs:2054:9
  710. 60.14 s > stack backtrace:
  711. 60.14 s > 0: __rustc::rust_begin_unwind
  712. 60.14 s > 1: core::panicking::panic_fmt
  713. 60.14 s > 2: core::result::unwrap_failed
  714. 60.14 s > 3: alphal00p_docs_builder::tests::every_product_orients_rust_to_native_rustdoc_and_keeps_legacy_redirects
  715. 60.14 s > 4: <alphal00p_docs_builder::tests::every_product_orients_rust_to_native_rustdoc_and_keeps_legacy_redirects::{closure#0} as core::ops::function::FnOnce<()>>::call_once
  716. 60.14 s > note: Some details are omitted, run with `RUST_BACKTRACE=full` for a verbose backtrace.
  717. 60.14 s >
  718. 60.14 s > ------------
  719. 60.14 s > Summary [ 18.285s] 119 tests run: 114 passed, 5 failed, 0 skipped
  720. 60.14 s > FAIL [ 0.014s] ( 23/119) alphal00p-docs-builder tests::developer_architecture_is_classified_searchable_and_source_backed
  721. 60.14 s > stdout ---
  722. 60.14 s >
  723. 60.14 s > running 1 test
  724. 60.14 s > test tests::developer_architecture_is_classified_searchable_and_source_backed ... FAILED
  725. 60.14 s >
  726. 60.14 s > failures:
  727. 60.14 s >
  728. 60.14 s > failures:
  729. 60.14 s > tests::developer_architecture_is_classified_searchable_and_source_backed
  730. 60.14 s >
  731. 60.14 s > test result: FAILED. 0 passed; 1 failed; 0 ignored; 0 measured; 118 filtered out; finished in 0.01s
  732. 60.14 s >
  733. 60.14 s > stderr ---
  734. 60.14 s >
  735. 60.14 s > thread 'tests::developer_architecture_is_classified_searchable_and_source_backed' (243) panicked at crates/alphal00p-docs-builder/src/lib.rs:12354:14:
  736. 60.14 s > called `Result::unwrap()` on an `Err` value: cannot determine the documented Git commit; set ALPHAL00P_DOCS_GIT_COMMIT
  737. 60.14 s >
  738. 60.14 s > Location:
  739. 60.14 s > crates/alphal00p-docs-builder/src/lib.rs:4137:9
  740. 60.14 s > stack backtrace:
  741. 60.14 s > 0: __rustc::rust_begin_unwind
  742. 60.14 s > 1: core::panicking::panic_fmt
  743. 60.14 s > 2: core::result::unwrap_failed
  744. 60.14 s > 3: alphal00p_docs_builder::tests::developer_architecture_is_classified_searchable_and_source_backed
  745. 60.14 s > 4: <alphal00p_docs_builder::tests::developer_architecture_is_classified_searchable_and_source_backed::{closure#0} as core::ops::function::FnOnce<()>>::call_once
  746. 60.14 s > note: Some details are omitted, run with `RUST_BACKTRACE=full` for a verbose backtrace.
  747. 60.14 s >
  748. 60.14 s > FAIL [ 0.009s] ( 46/119) alphal00p-docs-builder tests::persistent_rustdoc_target_rejects_symlink_escape
  749. 60.14 s > stdout ---
  750. 60.14 s >
  751. 60.14 s > running 1 test
  752. 60.14 s > test tests::persistent_rustdoc_target_rejects_symlink_escape ... FAILED
  753. 60.14 s >
  754. 60.14 s > failures:
  755. 60.14 s >
  756. 60.14 s > failures:
  757. 60.14 s > tests::persistent_rustdoc_target_rejects_symlink_escape
  758. 60.14 s >
  759. 60.14 s > test result: FAILED. 0 passed; 1 failed; 0 ignored; 0 measured; 118 filtered out; finished in 0.00s
  760. 60.14 s >
  761. 60.14 s > stderr ---
  762. 60.14 s >
  763. 60.14 s > thread 'tests::persistent_rustdoc_target_rejects_symlink_escape' (343) panicked at crates/alphal00p-docs-builder/src/lib.rs:10490:82:
  764. 60.14 s > called `Result::unwrap_err()` on an `Ok` value: "/build/.tmpuJkUdo/escape/cache/cargo-target-v1"
  765. 60.14 s > stack backtrace:
  766. 60.14 s > 0: __rustc::rust_begin_unwind
  767. 60.14 s > 1: core::panicking::panic_fmt
  768. 60.14 s > 2: core::result::unwrap_failed
  769. 60.14 s > 3: alphal00p_docs_builder::tests::persistent_rustdoc_target_rejects_symlink_escape
  770. 60.14 s > 4: <alphal00p_docs_builder::tests::persistent_rustdoc_target_rejects_symlink_escape::{closure#0} as core::ops::function::FnOnce<()>>::call_once
  771. 60.14 s > note: Some details are omitted, run with `RUST_BACKTRACE=full` for a verbose backtrace.
  772. 60.14 s >
  773. 60.14 s > FAIL [ 0.007s] ( 47/119) alphal00p-docs-builder tests::persistent_rustdoc_targets_reject_workspace_and_arbitrary_roots
  774. 60.14 s > stdout ---
  775. 60.14 s >
  776. 60.14 s > running 1 test
  777. 60.14 s > test tests::persistent_rustdoc_targets_reject_workspace_and_arbitrary_roots ... FAILED
  778. 60.14 s >
  779. 60.14 s > failures:
  780. 60.14 s >
  781. 60.14 s > failures:
  782. 60.14 s > tests::persistent_rustdoc_targets_reject_workspace_and_arbitrary_roots
  783. 60.14 s >
  784. 60.14 s > test result: FAILED. 0 passed; 1 failed; 0 ignored; 0 measured; 118 filtered out; finished in 0.00s
  785. 60.14 s >
  786. 60.14 s > stderr ---
  787. 60.14 s >
  788. 60.14 s > thread 'tests::persistent_rustdoc_targets_reject_workspace_and_arbitrary_roots' (348) panicked at crates/alphal00p-docs-builder/src/lib.rs:10467:9:
  789. 60.14 s > assertion failed: prepare_persistent_rustdoc_target(workspace, &arbitrary).is_err()
  790. 60.14 s > stack backtrace:
  791. 60.14 s > 0: __rustc::rust_begin_unwind
  792. 60.14 s > 1: core::panicking::panic_fmt
  793. 60.14 s > 2: core::panicking::panic
  794. 60.14 s > 3: alphal00p_docs_builder::tests::persistent_rustdoc_targets_reject_workspace_and_arbitrary_roots
  795. 60.14 s > 4: <alphal00p_docs_builder::tests::persistent_rustdoc_targets_reject_workspace_and_arbitrary_roots::{closure#0} as core::ops::function::FnOnce<()>>::call_once
  796. 60.14 s > note: Some details are omitted, run with `RUST_BACKTRACE=full` for a verbose backtrace.
  797. 60.14 s >
  798. 60.14 s > FAIL [ 0.076s] ( 66/119) alphal00p-docs-builder tests::portal_and_developer_pages_use_federated_search_and_feedback
  799. 60.14 s > stdout ---
  800. 60.14 s >
  801. 60.14 s > running 1 test
  802. 60.14 s > test tests::portal_and_developer_pages_use_federated_search_and_feedback ... FAILED
  803. 60.14 s >
  804. 60.14 s > failures:
  805. 60.14 s >
  806. 60.14 s > failures:
  807. 60.14 s > tests::portal_and_developer_pages_use_federated_search_and_feedback
  808. 60.14 s >
  809. 60.14 s > test result: FAILED. 0 passed; 1 failed; 0 ignored; 0 measured; 118 filtered out; finished in 0.06s
  810. 60.14 s >
  811. 60.14 s > stderr ---
  812. 60.14 s > warning: bundle export is experimental
  813. 60.14 s > = hint: its behaviour may change at any time
  814. 60.14 s > = hint: do not rely on this feature for production use cases
  815. 60.14 s >
  816. 60.14 s >
  817. 60.14 s > thread 'tests::portal_and_developer_pages_use_federated_search_and_feedback' (366) panicked at crates/alphal00p-docs-builder/src/lib.rs:12758:14:
  818. 60.14 s > called `Result::unwrap()` on an `Err` value: cannot determine the documented Git commit; set ALPHAL00P_DOCS_GIT_COMMIT
  819. 60.14 s >
  820. 60.14 s > Location:
  821. 60.14 s > crates/alphal00p-docs-builder/src/lib.rs:4137:9
  822. 60.14 s > stack backtrace:
  823. 60.14 s > 0: __rustc::rust_begin_unwind
  824. 60.14 s > 1: core::panicking::panic_fmt
  825. 60.14 s > 2: core::result::unwrap_failed
  826. 60.14 s > 3: alphal00p_docs_builder::tests::portal_and_developer_pages_use_federated_search_and_feedback
  827. 60.14 s > 4: <alphal00p_docs_builder::tests::portal_and_developer_pages_use_federated_search_and_feedback::{closure#0} as core::ops::function::FnOnce<()>>::call_once
  828. 60.14 s > note: Some details are omitted, run with `RUST_BACKTRACE=full` for a verbose backtrace.
  829. 60.14 s >
  830. 60.14 s > FAIL [ 14.876s] (118/119) alphal00p-docs-builder tests::every_product_orients_rust_to_native_rustdoc_and_keeps_legacy_redirects
  831. 60.14 s > stdout ---
  832. 60.14 s >
  833. 60.14 s > running 1 test
  834. 60.14 s > test tests::every_product_orients_rust_to_native_rustdoc_and_keeps_legacy_redirects ... FAILED
  835. 60.14 s >
  836. 60.14 s > failures:
  837. 60.14 s >
  838. 60.14 s > failures:
  839. 60.14 s > tests::every_product_orients_rust_to_native_rustdoc_and_keeps_legacy_redirects
  840. 60.14 s >
  841. 60.14 s > test result: FAILED. 0 passed; 1 failed; 0 ignored; 0 measured; 118 filtered out; finished in 14.87s
  842. 60.14 s >
  843. 60.14 s > stderr ---
  844. 60.14 s >
  845. 60.14 s > thread 'tests::every_product_orients_rust_to_native_rustdoc_and_keeps_legacy_redirects' (259) panicked at crates/alphal00p-docs-builder/src/lib.rs:12166:18:
  846. 60.14 s > called `Result::unwrap()` on an `Err` value: cannot determine the documented Git commit; set ALPHAL00P_DOCS_GIT_COMMIT
  847. 60.14 s >
  848. 60.14 s > Location:
  849. 60.14 s > crates/alphal00p-docs-builder/src/lib.rs:2054:9
  850. 60.14 s > stack backtrace:
  851. 60.14 s > 0: __rustc::rust_begin_unwind
  852. 60.14 s > 1: core::panicking::panic_fmt
  853. 60.14 s > 2: core::result::unwrap_failed
  854. 60.14 s > 3: alphal00p_docs_builder::tests::every_product_orients_rust_to_native_rustdoc_and_keeps_legacy_redirects
  855. 60.14 s > 4: <alphal00p_docs_builder::tests::every_product_orients_rust_to_native_rustdoc_and_keeps_legacy_redirects::{closure#0} as core::ops::function::FnOnce<()>>::call_once
  856. 60.14 s > note: Some details are omitted, run with `RUST_BACKTRACE=full` for a verbose backtrace.
  857. 60.14 s >
  858. 60.14 s > error: test run failed
  859. 60.14 s >
  860. 60.14 s > ========== nextest test summary ==========
  861. 60.14 s > report: target/nextest/ci_gammaloop/junit.xml
  862. 60.14 s > tests: 119, failures: 5, errors: 0
  863. 60.14 s >
  864. 60.14 s > 1. alphal00p-docs-builder::tests::developer_architecture_is_classified_searchable_and_source_backed
  865. 60.14 s > failure: test failure with exit code 101
  866. 60.14 s > thread 'tests::developer_architecture_is_classified_searchable_and_source_backed' (243) panicked at crates/alphal00p-docs-builder/src/lib.rs:12354:14:
  867. 60.14 s > called `Result::unwrap()` on an `Err` value: cannot determine the documented Git commit; set ALPHAL00P_DOCS_GIT_COMMIT
  868. 60.14 s >
  869. 60.14 s > Location:
  870. 60.14 s > crates/alphal00p-docs-builder/src/lib.rs:4137:9
  871. 60.14 s > stack backtrace:
  872. 60.14 s > 0: __rustc::rust_begin_unwind
  873. 60.14 s > 1: core::panicking::panic_fmt
  874. 60.14 s > 2: core::result::unwrap_failed
  875. 60.14 s > 3: alphal00p_docs_builder::tests::developer_architecture_is_classified_searchable_and_source_backed
  876. 60.14 s > 4: <alphal00p_docs_builder::tests::developer_architecture_is_classified_searchable_and_source_backed::{closure#0} as core::ops::function::FnOnce<()>>::call_once
  877. 60.14 s > note: Some details are omitted, run with `RUST_BACKTRACE=full` for a verbose backtrace.
  878. 60.14 s > system-out
  879. 60.14 s > running 1 test
  880. 60.14 s > test tests::developer_architecture_is_classified_searchable_and_source_backed ... FAILED
  881. 60.14 s >
  882. 60.14 s > failures:
  883. 60.14 s >
  884. 60.14 s > failures:
  885. 60.14 s > tests::developer_architecture_is_classified_searchable_and_source_backed
  886. 60.14 s >
  887. 60.14 s > test result: FAILED. 0 passed; 1 failed; 0 ignored; 0 measured; 118 filtered out; finished in 0.01s
  888. 60.14 s > system-err
  889. 60.14 s > thread 'tests::developer_architecture_is_classified_searchable_and_source_backed' (243) panicked at crates/alphal00p-docs-builder/src/lib.rs:12354:14:
  890. 60.14 s > called `Result::unwrap()` on an `Err` value: cannot determine the documented Git commit; set ALPHAL00P_DOCS_GIT_COMMIT
  891. 60.14 s >
  892. 60.14 s > Location:
  893. 60.14 s > crates/alphal00p-docs-builder/src/lib.rs:4137:9
  894. 60.14 s > stack backtrace:
  895. 60.14 s > 0: __rustc::rust_begin_unwind
  896. 60.14 s > 1: core::panicking::panic_fmt
  897. 60.14 s > 2: core::result::unwrap_failed
  898. 60.14 s > 3: alphal00p_docs_builder::tests::developer_architecture_is_classified_searchable_and_source_backed
  899. 60.14 s > 4: <alphal00p_docs_builder::tests::developer_architecture_is_classified_searchable_and_source_backed::{closure#0} as core::ops::function::FnOnce<()>>::call_once
  900. 60.14 s > note: Some details are omitted, run with `RUST_BACKTRACE=full` for a verbose backtrace.
  901. 60.14 s >
  902. 60.14 s > 2. alphal00p-docs-builder::tests::persistent_rustdoc_target_rejects_symlink_escape
  903. 60.14 s > failure: test failure with exit code 101
  904. 60.14 s > thread 'tests::persistent_rustdoc_target_rejects_symlink_escape' (343) panicked at crates/alphal00p-docs-builder/src/lib.rs:10490:82:
  905. 60.14 s > called `Result::unwrap_err()` on an `Ok` value: "/build/.tmpuJkUdo/escape/cache/cargo-target-v1"
  906. 60.14 s > stack backtrace:
  907. 60.14 s > 0: __rustc::rust_begin_unwind
  908. 60.14 s > 1: core::panicking::panic_fmt
  909. 60.14 s > 2: core::result::unwrap_failed
  910. 60.14 s > 3: alphal00p_docs_builder::tests::persistent_rustdoc_target_rejects_symlink_escape
  911. 60.14 s > 4: <alphal00p_docs_builder::tests::persistent_rustdoc_target_rejects_symlink_escape::{closure#0} as core::ops::function::FnOnce<()>>::call_once
  912. 60.14 s > note: Some details are omitted, run with `RUST_BACKTRACE=full` for a verbose backtrace.
  913. 60.14 s > system-out
  914. 60.14 s > running 1 test
  915. 60.14 s > test tests::persistent_rustdoc_target_rejects_symlink_escape ... FAILED
  916. 60.14 s >
  917. 60.14 s > failures:
  918. 60.14 s >
  919. 60.14 s > failures:
  920. 60.14 s > tests::persistent_rustdoc_target_rejects_symlink_escape
  921. 60.14 s >
  922. 60.14 s > test result: FAILED. 0 passed; 1 failed; 0 ignored; 0 measured; 118 filtered out; finished in 0.00s
  923. 60.14 s > system-err
  924. 60.14 s > thread 'tests::persistent_rustdoc_target_rejects_symlink_escape' (343) panicked at crates/alphal00p-docs-builder/src/lib.rs:10490:82:
  925. 60.14 s > called `Result::unwrap_err()` on an `Ok` value: "/build/.tmpuJkUdo/escape/cache/cargo-target-v1"
  926. 60.14 s > stack backtrace:
  927. 60.14 s > 0: __rustc::rust_begin_unwind
  928. 60.14 s > 1: core::panicking::panic_fmt
  929. 60.14 s > 2: core::result::unwrap_failed
  930. 60.14 s > 3: alphal00p_docs_builder::tests::persistent_rustdoc_target_rejects_symlink_escape
  931. 60.14 s > 4: <alphal00p_docs_builder::tests::persistent_rustdoc_target_rejects_symlink_escape::{closure#0} as core::ops::function::FnOnce<()>>::call_once
  932. 60.14 s > note: Some details are omitted, run with `RUST_BACKTRACE=full` for a verbose backtrace.
  933. 60.14 s >
  934. 60.14 s > 3. alphal00p-docs-builder::tests::persistent_rustdoc_targets_reject_workspace_and_arbitrary_roots
  935. 60.14 s > failure: test failure with exit code 101
  936. 60.14 s > thread 'tests::persistent_rustdoc_targets_reject_workspace_and_arbitrary_roots' (348) panicked at crates/alphal00p-docs-builder/src/lib.rs:10467:9:
  937. 60.14 s > assertion failed: prepare_persistent_rustdoc_target(workspace, &arbitrary).is_err()
  938. 60.14 s > stack backtrace:
  939. 60.14 s > 0: __rustc::rust_begin_unwind
  940. 60.14 s > 1: core::panicking::panic_fmt
  941. 60.14 s > 2: core::panicking::panic
  942. 60.14 s > 3: alphal00p_docs_builder::tests::persistent_rustdoc_targets_reject_workspace_and_arbitrary_roots
  943. 60.14 s > 4: <alphal00p_docs_builder::tests::persistent_rustdoc_targets_reject_workspace_and_arbitrary_roots::{closure#0} as core::ops::function::FnOnce<()>>::call_once
  944. 60.14 s > note: Some details are omitted, run with `RUST_BACKTRACE=full` for a verbose backtrace.
  945. 60.14 s > system-out
  946. 60.14 s > running 1 test
  947. 60.14 s > test tests::persistent_rustdoc_targets_reject_workspace_and_arbitrary_roots ... FAILED
  948. 60.14 s >
  949. 60.14 s > failures:
  950. 60.14 s >
  951. 60.14 s > failures:
  952. 60.14 s > tests::persistent_rustdoc_targets_reject_workspace_and_arbitrary_roots
  953. 60.14 s >
  954. 60.14 s > test result: FAILED. 0 passed; 1 failed; 0 ignored; 0 measured; 118 filtered out; finished in 0.00s
  955. 60.14 s > system-err
  956. 60.14 s > thread 'tests::persistent_rustdoc_targets_reject_workspace_and_arbitrary_roots' (348) panicked at crates/alphal00p-docs-builder/src/lib.rs:10467:9:
  957. 60.14 s > assertion failed: prepare_persistent_rustdoc_target(workspace, &arbitrary).is_err()
  958. 60.14 s > stack backtrace:
  959. 60.14 s > 0: __rustc::rust_begin_unwind
  960. 60.14 s > 1: core::panicking::panic_fmt
  961. 60.14 s > 2: core::panicking::panic
  962. 60.14 s > 3: alphal00p_docs_builder::tests::persistent_rustdoc_targets_reject_workspace_and_arbitrary_roots
  963. 60.14 s > 4: <alphal00p_docs_builder::tests::persistent_rustdoc_targets_reject_workspace_and_arbitrary_roots::{closure#0} as core::ops::function::FnOnce<()>>::call_once
  964. 60.14 s > note: Some details are omitted, run with `RUST_BACKTRACE=full` for a verbose backtrace.
  965. 60.14 s >
  966. 60.14 s > 4. alphal00p-docs-builder::tests::portal_and_developer_pages_use_federated_search_and_feedback
  967. 60.14 s > failure: test failure with exit code 101
  968. 60.14 s > thread 'tests::portal_and_developer_pages_use_federated_search_and_feedback' (366) panicked at crates/alphal00p-docs-builder/src/lib.rs:12758:14:
  969. 60.14 s > called `Result::unwrap()` on an `Err` value: cannot determine the documented Git commit; set ALPHAL00P_DOCS_GIT_COMMIT
  970. 60.14 s >
  971. 60.14 s > Location:
  972. 60.14 s > crates/alphal00p-docs-builder/src/lib.rs:4137:9
  973. 60.14 s > stack backtrace:
  974. 60.14 s > 0: __rustc::rust_begin_unwind
  975. 60.14 s > 1: core::panicking::panic_fmt
  976. 60.14 s > 2: core::result::unwrap_failed
  977. 60.14 s > 3: alphal00p_docs_builder::tests::portal_and_developer_pages_use_federated_search_and_feedback
  978. 60.14 s > 4: <alphal00p_docs_builder::tests::portal_and_developer_pages_use_federated_search_and_feedback::{closure#0} as core::ops::function::FnOnce<()>>::call_once
  979. 60.14 s > note: Some details are omitted, run with `RUST_BACKTRACE=full` for a verbose backtrace.
  980. 60.14 s > system-out
  981. 60.14 s > running 1 test
  982. 60.14 s > test tests::portal_and_developer_pages_use_federated_search_and_feedback ... FAILED
  983. 60.14 s >
  984. 60.14 s > failures:
  985. 60.14 s >
  986. 60.14 s > failures:
  987. 60.14 s > tests::portal_and_developer_pages_use_federated_search_and_feedback
  988. 60.14 s >
  989. 60.14 s > test result: FAILED. 0 passed; 1 failed; 0 ignored; 0 measured; 118 filtered out; finished in 0.06s
  990. 60.14 s > system-err
  991. 60.14 s > warning: bundle export is experimental
  992. 60.14 s > = hint: its behaviour may change at any time
  993. 60.14 s > = hint: do not rely on this feature for production use cases
  994. 60.14 s >
  995. 60.14 s >
  996. 60.14 s > thread 'tests::portal_and_developer_pages_use_federated_search_and_feedback' (366) panicked at crates/alphal00p-docs-builder/src/lib.rs:12758:14:
  997. 60.14 s > called `Result::unwrap()` on an `Err` value: cannot determine the documented Git commit; set ALPHAL00P_DOCS_GIT_COMMIT
  998. 60.14 s >
  999. 60.14 s > Location:
  1000. 60.14 s > crates/alphal00p-docs-builder/src/lib.rs:4137:9
  1001. 60.14 s > stack backtrace:
  1002. 60.14 s > 0: __rustc::rust_begin_unwind
  1003. 60.14 s > 1: core::panicking::panic_fmt
  1004. 60.14 s > 2: core::result::unwrap_failed
  1005. 60.14 s > 3: alphal00p_docs_builder::tests::portal_and_developer_pages_use_federated_search_and_feedback
  1006. 60.14 s > 4: <alphal00p_docs_builder::tests::portal_and_developer_pages_use_federated_search_and_feedback::{closure#0} as core::ops::function::FnOnce<()>>::call_once
  1007. 60.14 s > note: Some details are omitted, run with `RUST_BACKTRACE=full` for a verbose backtrace.
  1008. 60.14 s >
  1009. 60.14 s > 5. alphal00p-docs-builder::tests::every_product_orients_rust_to_native_rustdoc_and_keeps_legacy_redirects
  1010. 60.14 s > failure: test failure with exit code 101
  1011. 60.14 s > thread 'tests::every_product_orients_rust_to_native_rustdoc_and_keeps_legacy_redirects' (259) panicked at crates/alphal00p-docs-builder/src/lib.rs:12166:18:
  1012. 60.14 s > called `Result::unwrap()` on an `Err` value: cannot determine the documented Git commit; set ALPHAL00P_DOCS_GIT_COMMIT
  1013. 60.14 s >
  1014. 60.14 s > Location:
  1015. 60.14 s > crates/alphal00p-docs-builder/src/lib.rs:2054:9
  1016. 60.14 s > stack backtrace:
  1017. 60.14 s > 0: __rustc::rust_begin_unwind
  1018. 60.14 s > 1: core::panicking::panic_fmt
  1019. 60.14 s > 2: core::result::unwrap_failed
  1020. 60.14 s > 3: alphal00p_docs_builder::tests::every_product_orients_rust_to_native_rustdoc_and_keeps_legacy_redirects
  1021. 60.14 s > 4: <alphal00p_docs_builder::tests::every_product_orients_rust_to_native_rustdoc_and_keeps_legacy_redirects::{closure#0} as core::ops::function::FnOnce<()>>::call_once
  1022. 60.14 s > note: Some details are omitted, run with `RUST_BACKTRACE=full` for a verbose backtrace.
  1023. 60.14 s > system-out
  1024. 60.14 s > running 1 test
  1025. 60.14 s > test tests::every_product_orients_rust_to_native_rustdoc_and_keeps_legacy_redirects ... FAILED
  1026. 60.14 s >
  1027. 60.14 s > failures:
  1028. 60.14 s >
  1029. 60.14 s > failures:
  1030. 60.14 s > tests::every_product_orients_rust_to_native_rustdoc_and_keeps_legacy_redirects
  1031. 60.14 s >
  1032. 60.14 s > test result: FAILED. 0 passed; 1 failed; 0 ignored; 0 measured; 118 filtered out; finished in 14.87s
  1033. 60.14 s > system-err
  1034. 60.14 s > thread 'tests::every_product_orients_rust_to_native_rustdoc_and_keeps_legacy_redirects' (259) panicked at crates/alphal00p-docs-builder/src/lib.rs:12166:18:
  1035. 60.14 s > called `Result::unwrap()` on an `Err` value: cannot determine the documented Git commit; set ALPHAL00P_DOCS_GIT_COMMIT
  1036. 60.14 s >
  1037. 60.14 s > Location:
  1038. 60.14 s > crates/alphal00p-docs-builder/src/lib.rs:2054:9
  1039. 60.14 s > stack backtrace:
  1040. 60.14 s > 0: __rustc::rust_begin_unwind
  1041. 60.14 s > 1: core::panicking::panic_fmt
  1042. 60.14 s > 2: core::result::unwrap_failed
  1043. 60.14 s > 3: alphal00p_docs_builder::tests::every_product_orients_rust_to_native_rustdoc_and_keeps_legacy_redirects
  1044. 60.14 s > 4: <alphal00p_docs_builder::tests::every_product_orients_rust_to_native_rustdoc_and_keeps_legacy_redirects::{closure#0} as core::ops::function::FnOnce<()>>::call_once
  1045. 60.14 s > note: Some details are omitted, run with `RUST_BACKTRACE=full` for a verbose backtrace.
  1046. 60.14 s > =========================================
  1047. 60.14 s > Extracting 2 binaries to /build/nextest-archive-MpCNs6
  1048. 60.14 s > Extracted 5 files to /build/nextest-archive-MpCNs6 in 0.05s
  1049. 60.14 s > ------------
  1050. 60.14 s > Nextest run ID 85fa3184-e2c4-462c-9e83-d3b2d811af9e with nextest profile: ci_gammaloop
  1051. 60.14 s > Starting 21 tests across 2 binaries
  1052. 60.14 s > ------------
  1053. 60.14 s > Summary [ 0.030s] 21 tests run: 21 passed, 0 skipped
  1054. 60.14 s >
  1055. 60.14 s > ========== nextest test summary ==========
  1056. 60.14 s > report: target/nextest/ci_gammaloop/junit.xml
  1057. 60.14 s > tests: 21, failures: 0, errors: 0
  1058. 60.14 s > No failing testcases found.
  1059. 60.14 s > =========================================
  1060. 60.14 s > Extracting 3 binaries (including 2 non-test binaries), 1 build script output directory, and 2 linked paths to /build/nextest-archive-YssPb5
  1061. 60.14 s > Extracted 22 files to /build/nextest-archive-YssPb5 in 0.27s
  1062. 60.14 s > ------------
  1063. 60.14 s > Nextest run ID 9438eb82-3fc6-48f7-85d5-b53b7dc1b5b0 with nextest profile: ci_gammaloop
  1064. 60.14 s > Starting 89 tests across 1 binary
  1065. 60.14 s > ------------
  1066. 60.14 s > Summary [ 0.081s] 89 tests run: 89 passed, 0 skipped
  1067. 60.14 s >
  1068. 60.14 s > ========== nextest test summary ==========
  1069. 60.14 s > report: target/nextest/ci_gammaloop/junit.xml
  1070. 60.14 s > tests: 89, failures: 0, errors: 0
  1071. 60.14 s > No failing testcases found.
  1072. 60.14 s > =========================================
  1073. 60.14 s > Extracting 2 binaries to /build/nextest-archive-Cl6Jru
  1074. 60.14 s > Extracted 5 files to /build/nextest-archive-Cl6Jru in 0.05s
  1075. 60.14 s > ------------
  1076. 60.14 s > Nextest run ID c9673d64-bfc5-4041-be7d-7cb3b3d1bbfc with nextest profile: ci_gammaloop
  1077. 60.14 s > Starting 10 tests across 2 binaries
  1078. 60.14 s > ------------
  1079. 60.14 s > Summary [ 17.549s] 10 tests run: 10 passed, 0 skipped
  1080. 60.14 s >
  1081. 60.14 s > ========== nextest test summary ==========
  1082. 60.14 s > report: target/nextest/ci_gammaloop/junit.xml
  1083. 60.14 s > tests: 10, failures: 0, errors: 0
  1084. 60.14 s > No failing testcases found.
  1085. 60.14 s > =========================================
  1086. 60.14 s > Extracting 1 binary to /build/nextest-archive-x2Ig9A
  1087. 60.14 s > Extracted 4 files to /build/nextest-archive-x2Ig9A in 0.04s
  1088. 60.14 s > ------------
  1089. 60.14 s > Nextest run ID 4ee0d097-7e56-47c0-812a-685e7b7a77b6 with nextest profile: ci_gammaloop
  1090. 60.14 s > Starting 0 tests across 1 binary
  1091. 60.14 s > ------------
  1092. 60.14 s > Summary [ 0.002s] 0 tests run: 0 passed, 0 skipped
  1093. 60.14 s >
  1094. 60.14 s > ========== nextest test summary ==========
  1095. 60.14 s > report: target/nextest/ci_gammaloop/junit.xml
  1096. 60.14 s > tests: 0, failures: 0, errors: 0
  1097. 60.14 s > No failing testcases found.
  1098. 60.14 s > =========================================
  1099. 60.14 s > Extracting 1 binary to /build/nextest-archive-Dtr94Y
  1100. 60.14 s > Extracted 4 files to /build/nextest-archive-Dtr94Y in 0.04s
  1101. 60.14 s > ------------
  1102. 60.14 s > Nextest run ID dc2e57cc-9c7f-4585-b867-f2305b4d5112 with nextest profile: ci_gammaloop
  1103. 60.14 s > Starting 4 tests across 1 binary
  1104. 60.14 s > ------------
  1105. 60.14 s > Summary [ 0.022s] 4 tests run: 4 passed, 0 skipped
  1106. 60.14 s >
  1107. 60.14 s > ========== nextest test summary ==========
  1108. 60.14 s > report: target/nextest/ci_gammaloop/junit.xml
  1109. 60.14 s > tests: 4, failures: 0, errors: 0
  1110. 60.14 s > No failing testcases found.
  1111. 60.14 s > =========================================
  1112. 60.14 s For full logs, run:
  1113. 60.14 s nix log /nix/store/97637lakc6i3dvs2xjwvp87fmqr4wngc-gammaloop-nextest-docs.drv
  1114. 60.31 s Run failed.