0.00 s
$ /nix/store/9ypz3flqsrl5xl495mm8h645gadjsxi1-coreutils-9.11/bin/timeout --kill-after=15s 7200s /nix/store/23zk8sgzamrbmj1fday15szf7f2279s8-nix-2.34.7/bin/nix --extra-experimental-features nix-command --extra-experimental-features flakes flake clone git+https://github.com/alphal00p/gammaloop --dest /tmp/nix-ci-worker/stable-pwd/repo/
0.08 s
Cloning into '/tmp/nix-ci-worker/stable-pwd/repo'...
1.27 s
remote: Enumerating objects: 77128, done.
1.38 s
remote: Counting objects: 0% (1/12971)
remote: Counting objects: 1% (130/12971)
remote: Counting objects: 2% (260/12971)
remote: Counting objects: 3% (390/12971)
remote: Counting objects: 4% (519/12971)
remote: Counting objects: 5% (649/12971)
remote: Counting objects: 6% (779/12971)
remote: Counting objects: 7% (908/12971)
remote: Counting objects: 8% (1038/12971)
remote: Counting objects: 9% (1168/12971)
remote: Counting objects: 10% (1298/12971)
remote: Counting objects: 11% (1427/12971)
remote: Counting objects: 12% (1557/12971)
remote: Counting objects: 13% (1687/12971)
remote: Counting objects: 14% (1816/12971)
remote: Counting objects: 15% (1946/12971)
remote: Counting objects: 16% (2076/12971)
remote: Counting objects: 17% (2206/12971)
remote: Counting objects: 18% (2335/12971)
remote: Counting objects: 19% (2465/12971)
remote: Counting objects: 20% (2595/12971)
remote: Counting objects: 21% (2724/12971)
remote: Counting objects: 22% (2854/12971)
remote: Counting objects: 23% (2984/12971)
remote: Counting objects: 24% (3114/12971)
remote: Counting objects: 25% (3243/12971)
remote: Counting objects: 26% (3373/12971)
remote: Counting objects: 27% (3503/12971)
remote: Counting objects: 28% (3632/12971)
remote: Counting objects: 29% (3762/12971)
remote: Counting objects: 30% (3892/12971)
remote: Counting objects: 31% (4022/12971)
remote: Counting objects: 32% (4151/12971)
remote: Counting objects: 33% (4281/12971)
remote: Counting objects: 34% (4411/12971)
remote: Counting objects: 35% (4540/12971)
remote: Counting objects: 36% (4670/12971)
remote: Counting objects: 37% (4800/12971)
remote: Counting objects: 38% (4929/12971)
remote: Counting objects: 39% (5059/12971)
remote: Counting objects: 40% (5189/12971)
remote: Counting objects: 41% (5319/12971)
remote: Counting objects: 42% (5448/12971)
remote: Counting objects: 43% (5578/12971)
remote: Counting objects: 44% (5708/12971)
remote: Counting objects: 45% (5837/12971)
remote: Counting objects: 46% (5967/12971)
remote: Counting objects: 47% (6097/12971)
remote: Counting objects: 48% (6227/12971)
remote: Counting objects: 49% (6356/12971)
remote: Counting objects: 50% (6486/12971)
remote: Counting objects: 51% (6616/12971)
remote: Counting objects: 52% (6745/12971)
remote: Counting objects: 53% (6875/12971)
remote: Counting objects: 54% (7005/12971)
remote: Counting objects: 55% (7135/12971)
remote: Counting objects: 56% (7264/12971)
remote: Counting objects: 57% (7394/12971)
remote: Counting objects: 58% (7524/12971)
remote: Counting objects: 59% (7653/12971)
remote: Counting objects: 60% (7783/12971)
remote: Counting objects: 61% (7913/12971)
remote: Counting objects: 62% (8043/12971)
remote: Counting objects: 63% (8172/12971)
remote: Counting objects: 64% (8302/12971)
remote: Counting objects: 65% (8432/12971)
remote: Counting objects: 66% (8561/12971)
remote: Counting objects: 67% (8691/12971)
remote: Counting objects: 68% (8821/12971)
remote: Counting objects: 69% (8950/12971)
remote: Counting objects: 70% (9080/12971)
remote: Counting objects: 71% (9210/12971)
remote: Counting objects: 72% (9340/12971)
remote: Counting objects: 73% (9469/12971)
remote: Counting objects: 74% (9599/12971)
remote: Counting objects: 75% (9729/12971)
remote: Counting objects: 76% (9858/12971)
remote: Counting objects: 77% (9988/12971)
remote: Counting objects: 78% (10118/12971)
remote: Counting objects: 79% (10248/12971)
remote: Counting objects: 80% (10377/12971)
remote: Counting objects: 81% (10507/12971)
remote: Counting objects: 82% (10637/12971)
remote: Counting objects: 83% (10766/12971)
remote: Counting objects: 84% (10896/12971)
remote: Counting objects: 85% (11026/12971)
remote: Counting objects: 86% (11156/12971)
remote: Counting objects: 87% (11285/12971)
remote: Counting objects: 88% (11415/12971)
remote: Counting objects: 89% (11545/12971)
remote: Counting objects: 90% (11674/12971)
remote: Counting objects: 91% (11804/12971)
remote: Counting objects: 92% (11934/12971)
remote: Counting objects: 93% (12064/12971)
remote: Counting objects: 94% (12193/12971)
remote: Counting objects: 95% (12323/12971)
remote: Counting objects: 96% (12453/12971)
remote: Counting objects: 97% (12582/12971)
remote: Counting objects: 98% (12712/12971)
remote: Counting objects: 99% (12842/12971)
remote: Counting objects: 100% (12971/12971)
remote: Counting objects: 100% (12971/12971), done.
4.07 s
remote: Compressing objects: 0% (1/2775)
remote: Compressing objects: 1% (28/2775)
remote: Compressing objects: 2% (56/2775)
remote: Compressing objects: 3% (84/2775)
remote: Compressing objects: 4% (111/2775)
remote: Compressing objects: 5% (139/2775)
remote: Compressing objects: 6% (167/2775)
remote: Compressing objects: 7% (195/2775)
remote: Compressing objects: 8% (222/2775)
remote: Compressing objects: 9% (250/2775)
remote: Compressing objects: 10% (278/2775)
remote: Compressing objects: 11% (306/2775)
remote: Compressing objects: 12% (333/2775)
remote: Compressing objects: 13% (361/2775)
remote: Compressing objects: 14% (389/2775)
remote: Compressing objects: 15% (417/2775)
remote: Compressing objects: 16% (444/2775)
remote: Compressing objects: 17% (472/2775)
remote: Compressing objects: 18% (500/2775)
remote: Compressing objects: 19% (528/2775)
remote: Compressing objects: 20% (555/2775)
remote: Compressing objects: 21% (583/2775)
remote: Compressing objects: 22% (611/2775)
remote: Compressing objects: 23% (639/2775)
remote: Compressing objects: 23% (647/2775)
remote: Compressing objects: 24% (666/2775)
remote: Compressing objects: 25% (694/2775)
remote: Compressing objects: 26% (722/2775)
remote: Compressing objects: 27% (750/2775)
remote: Compressing objects: 27% (766/2775)
remote: Compressing objects: 28% (777/2775)
remote: Compressing objects: 29% (805/2775)
remote: Compressing objects: 30% (833/2775)
remote: Compressing objects: 31% (861/2775)
remote: Compressing objects: 32% (888/2775)
remote: Compressing objects: 33% (916/2775)
remote: Compressing objects: 34% (944/2775)
remote: Compressing objects: 35% (972/2775)
remote: Compressing objects: 36% (999/2775)
remote: Compressing objects: 37% (1027/2775)
remote: Compressing objects: 38% (1055/2775)
remote: Compressing objects: 39% (1083/2775)
remote: Compressing objects: 40% (1110/2775)
remote: Compressing objects: 41% (1138/2775)
remote: Compressing objects: 42% (1166/2775)
remote: Compressing objects: 43% (1194/2775)
remote: Compressing objects: 44% (1221/2775)
remote: Compressing objects: 45% (1249/2775)
remote: Compressing objects: 46% (1277/2775)
remote: Compressing objects: 47% (1305/2775)
remote: Compressing objects: 48% (1332/2775)
remote: Compressing objects: 49% (1360/2775)
remote: Compressing objects: 50% (1388/2775)
remote: Compressing objects: 51% (1416/2775)
remote: Compressing objects: 52% (1443/2775)
remote: Compressing objects: 53% (1471/2775)
remote: Compressing objects: 54% (1499/2775)
remote: Compressing objects: 55% (1527/2775)
remote: Compressing objects: 56% (1554/2775)
remote: Compressing objects: 57% (1582/2775)
remote: Compressing objects: 58% (1610/2775)
remote: Compressing objects: 59% (1638/2775)
remote: Compressing objects: 60% (1665/2775)
remote: Compressing objects: 61% (1693/2775)
remote: Compressing objects: 62% (1721/2775)
remote: Compressing objects: 63% (1749/2775)
remote: Compressing objects: 64% (1776/2775)
remote: Compressing objects: 65% (1804/2775)
remote: Compressing objects: 66% (1832/2775)
remote: Compressing objects: 67% (1860/2775)
remote: Compressing objects: 68% (1887/2775)
remote: Compressing objects: 69% (1915/2775)
remote: Compressing objects: 70% (1943/2775)
remote: Compressing objects: 71% (1971/2775)
remote: Compressing objects: 72% (1998/2775)
remote: Compressing objects: 73% (2026/2775)
remote: Compressing objects: 74% (2054/2775)
remote: Compressing objects: 75% (2082/2775)
remote: Compressing objects: 76% (2109/2775)
remote: Compressing objects: 77% (2137/2775)
remote: Compressing objects: 78% (2165/2775)
remote: Compressing objects: 79% (2193/2775)
remote: Compressing objects: 80% (2220/2775)
remote: Compressing objects: 81% (2248/2775)
remote: Compressing objects: 82% (2276/2775)
remote: Compressing objects: 83% (2304/2775)
remote: Compressing objects: 84% (2331/2775)
remote: Compressing objects: 85% (2359/2775)
remote: Compressing objects: 86% (2387/2775)
remote: Compressing objects: 87% (2415/2775)
remote: Compressing objects: 88% (2442/2775)
remote: Compressing objects: 89% (2470/2775)
remote: Compressing objects: 90% (2498/2775)
remote: Compressing objects: 91% (2526/2775)
remote: Compressing objects: 92% (2553/2775)
remote: Compressing objects: 93% (2581/2775)
remote: Compressing objects: 94% (2609/2775)
remote: Compressing objects: 95% (2637/2775)
remote: Compressing objects: 96% (2664/2775)
remote: Compressing objects: 97% (2692/2775)
remote: Compressing objects: 98% (2720/2775)
remote: Compressing objects: 99% (2748/2775)
remote: Compressing objects: 100% (2775/2775)
remote: Compressing objects: 100% (2775/2775), done.
7.98 s
Receiving objects: 0% (1/77128)
Receiving objects: 1% (772/77128)
Receiving objects: 2% (1543/77128)
Receiving objects: 3% (2314/77128)
Receiving objects: 4% (3086/77128)
Receiving objects: 5% (3857/77128)
Receiving objects: 6% (4628/77128)
Receiving objects: 7% (5399/77128), 9.21 MiB | 18.40 MiB/s
Receiving objects: 8% (6171/77128), 9.21 MiB | 18.40 MiB/s
Receiving objects: 9% (6942/77128), 9.21 MiB | 18.40 MiB/s
Receiving objects: 10% (7713/77128), 9.21 MiB | 18.40 MiB/s
Receiving objects: 11% (8485/77128), 9.21 MiB | 18.40 MiB/s
Receiving objects: 12% (9256/77128), 9.21 MiB | 18.40 MiB/s
Receiving objects: 13% (10027/77128), 9.21 MiB | 18.40 MiB/s
Receiving objects: 14% (10798/77128), 9.21 MiB | 18.40 MiB/s
Receiving objects: 15% (11570/77128), 9.21 MiB | 18.40 MiB/s
Receiving objects: 16% (12341/77128), 9.21 MiB | 18.40 MiB/s
Receiving objects: 17% (13112/77128), 9.21 MiB | 18.40 MiB/s
Receiving objects: 18% (13884/77128), 9.21 MiB | 18.40 MiB/s
Receiving objects: 19% (14655/77128), 9.21 MiB | 18.40 MiB/s
Receiving objects: 20% (15426/77128), 9.21 MiB | 18.40 MiB/s
Receiving objects: 21% (16197/77128), 9.21 MiB | 18.40 MiB/s
Receiving objects: 22% (16969/77128), 9.21 MiB | 18.40 MiB/s
Receiving objects: 23% (17740/77128), 9.21 MiB | 18.40 MiB/s
Receiving objects: 24% (18511/77128), 9.21 MiB | 18.40 MiB/s
Receiving objects: 25% (19282/77128), 9.21 MiB | 18.40 MiB/s
Receiving objects: 26% (20054/77128), 9.21 MiB | 18.40 MiB/s
Receiving objects: 27% (20825/77128), 9.21 MiB | 18.40 MiB/s
Receiving objects: 28% (21596/77128), 9.21 MiB | 18.40 MiB/s
Receiving objects: 29% (22368/77128), 9.21 MiB | 18.40 MiB/s
Receiving objects: 30% (23139/77128), 9.21 MiB | 18.40 MiB/s
Receiving objects: 31% (23910/77128), 9.21 MiB | 18.40 MiB/s
Receiving objects: 32% (24681/77128), 9.21 MiB | 18.40 MiB/s
Receiving objects: 33% (25453/77128), 9.21 MiB | 18.40 MiB/s
Receiving objects: 34% (26224/77128), 9.21 MiB | 18.40 MiB/s
Receiving objects: 35% (26995/77128), 9.21 MiB | 18.40 MiB/s
Receiving objects: 35% (27130/77128), 9.21 MiB | 18.40 MiB/s
Receiving objects: 36% (27767/77128), 26.84 MiB | 26.83 MiB/s
Receiving objects: 37% (28538/77128), 26.84 MiB | 26.83 MiB/s
Receiving objects: 38% (29309/77128), 26.84 MiB | 26.83 MiB/s
Receiving objects: 39% (30080/77128), 26.84 MiB | 26.83 MiB/s
Receiving objects: 40% (30852/77128), 26.84 MiB | 26.83 MiB/s
Receiving objects: 41% (31623/77128), 26.84 MiB | 26.83 MiB/s
Receiving objects: 42% (32394/77128), 26.84 MiB | 26.83 MiB/s
Receiving objects: 43% (33166/77128), 26.84 MiB | 26.83 MiB/s
Receiving objects: 44% (33937/77128), 26.84 MiB | 26.83 MiB/s
Receiving objects: 45% (34708/77128), 26.84 MiB | 26.83 MiB/s
Receiving objects: 46% (35479/77128), 26.84 MiB | 26.83 MiB/s
Receiving objects: 47% (36251/77128), 37.52 MiB | 24.72 MiB/s
Receiving objects: 48% (37022/77128), 37.52 MiB | 24.72 MiB/s
Receiving objects: 49% (37793/77128), 37.52 MiB | 24.72 MiB/s
Receiving objects: 50% (38564/77128), 37.52 MiB | 24.72 MiB/s
Receiving objects: 51% (39336/77128), 37.52 MiB | 24.72 MiB/s
Receiving objects: 52% (40107/77128), 37.52 MiB | 24.72 MiB/s
Receiving objects: 53% (40878/77128), 37.52 MiB | 24.72 MiB/s
Receiving objects: 54% (41650/77128), 37.52 MiB | 24.72 MiB/s
Receiving objects: 55% (42421/77128), 37.52 MiB | 24.72 MiB/s
Receiving objects: 56% (43192/77128), 37.52 MiB | 24.72 MiB/s
Receiving objects: 57% (43963/77128), 37.52 MiB | 24.72 MiB/s
Receiving objects: 57% (44545/77128), 37.52 MiB | 24.72 MiB/s
Receiving objects: 58% (44735/77128), 37.52 MiB | 24.72 MiB/s
Receiving objects: 59% (45506/77128), 37.52 MiB | 24.72 MiB/s
Receiving objects: 60% (46277/77128), 54.96 MiB | 27.24 MiB/s
Receiving objects: 61% (47049/77128), 54.96 MiB | 27.24 MiB/s
Receiving objects: 62% (47820/77128), 54.96 MiB | 27.24 MiB/s
Receiving objects: 63% (48591/77128), 54.96 MiB | 27.24 MiB/s
Receiving objects: 64% (49362/77128), 54.96 MiB | 27.24 MiB/s
Receiving objects: 65% (50134/77128), 54.96 MiB | 27.24 MiB/s
Receiving objects: 66% (50905/77128), 54.96 MiB | 27.24 MiB/s
Receiving objects: 67% (51676/77128), 72.71 MiB | 28.65 MiB/s
Receiving objects: 68% (52448/77128), 72.71 MiB | 28.65 MiB/s
Receiving objects: 69% (53219/77128), 72.71 MiB | 28.65 MiB/s
Receiving objects: 70% (53990/77128), 72.71 MiB | 28.65 MiB/s
Receiving objects: 71% (54761/77128), 72.71 MiB | 28.65 MiB/s
Receiving objects: 72% (55533/77128), 72.71 MiB | 28.65 MiB/s
Receiving objects: 73% (56304/77128), 72.71 MiB | 28.65 MiB/s
Receiving objects: 74% (57075/77128), 72.71 MiB | 28.65 MiB/s
Receiving objects: 75% (57846/77128), 72.71 MiB | 28.65 MiB/s
Receiving objects: 76% (58618/77128), 72.71 MiB | 28.65 MiB/s
Receiving objects: 77% (59389/77128), 72.71 MiB | 28.65 MiB/s
Receiving objects: 78% (60160/77128), 72.71 MiB | 28.65 MiB/s
Receiving objects: 78% (60469/77128), 72.71 MiB | 28.65 MiB/s
Receiving objects: 79% (60932/77128), 89.72 MiB | 29.38 MiB/s
Receiving objects: 80% (61703/77128), 89.72 MiB | 29.38 MiB/s
Receiving objects: 81% (62474/77128), 89.72 MiB | 29.38 MiB/s
Receiving objects: 82% (63245/77128), 89.72 MiB | 29.38 MiB/s
Receiving objects: 83% (64017/77128), 107.83 MiB | 30.30 MiB/s
Receiving objects: 84% (64788/77128), 107.83 MiB | 30.30 MiB/s
Receiving objects: 85% (65559/77128), 107.83 MiB | 30.30 MiB/s
Receiving objects: 86% (66331/77128), 107.83 MiB | 30.30 MiB/s
Receiving objects: 87% (67102/77128), 107.83 MiB | 30.30 MiB/s
Receiving objects: 88% (67873/77128), 107.83 MiB | 30.30 MiB/s
Receiving objects: 89% (68644/77128), 107.83 MiB | 30.30 MiB/s
Receiving objects: 90% (69416/77128), 107.83 MiB | 30.30 MiB/s
Receiving objects: 91% (70187/77128), 107.83 MiB | 30.30 MiB/s
Receiving objects: 92% (70958/77128), 107.83 MiB | 30.30 MiB/s
Receiving objects: 93% (71730/77128), 107.83 MiB | 30.30 MiB/s
Receiving objects: 94% (72501/77128), 107.83 MiB | 30.30 MiB/s
Receiving objects: 95% (73272/77128), 107.83 MiB | 30.30 MiB/s
Receiving objects: 96% (74043/77128), 107.83 MiB | 30.30 MiB/s
Receiving objects: 97% (74815/77128), 107.83 MiB | 30.30 MiB/s
Receiving objects: 98% (75586/77128), 107.83 MiB | 30.30 MiB/s
Receiving objects: 99% (76357/77128), 107.83 MiB | 30.30 MiB/s
remote: Total 77128 (delta 9347), reused 10916 (delta 8362), pack-reused 64157 (from 2)
7.98 s
Receiving objects: 100% (77128/77128), 107.83 MiB | 30.30 MiB/s
Receiving objects: 100% (77128/77128), 119.49 MiB | 30.60 MiB/s, done.
8.86 s
Resolving deltas: 0% (0/52645)
Resolving deltas: 1% (527/52645)
Resolving deltas: 2% (1053/52645)
Resolving deltas: 3% (1580/52645)
Resolving deltas: 4% (2107/52645)
Resolving deltas: 5% (2634/52645)
Resolving deltas: 6% (3160/52645)
Resolving deltas: 7% (3686/52645)
Resolving deltas: 8% (4212/52645)
Resolving deltas: 9% (4739/52645)
Resolving deltas: 10% (5266/52645)
Resolving deltas: 11% (5791/52645)
Resolving deltas: 12% (6318/52645)
Resolving deltas: 13% (6844/52645)
Resolving deltas: 14% (7375/52645)
Resolving deltas: 15% (7897/52645)
Resolving deltas: 16% (8424/52645)
Resolving deltas: 17% (8950/52645)
Resolving deltas: 18% (9477/52645)
Resolving deltas: 19% (10003/52645)
Resolving deltas: 20% (10529/52645)
Resolving deltas: 21% (11056/52645)
Resolving deltas: 22% (11582/52645)
Resolving deltas: 23% (12110/52645)
Resolving deltas: 24% (12635/52645)
Resolving deltas: 25% (13162/52645)
Resolving deltas: 26% (13688/52645)
Resolving deltas: 27% (14215/52645)
Resolving deltas: 28% (14741/52645)
Resolving deltas: 29% (15268/52645)
Resolving deltas: 30% (15794/52645)
Resolving deltas: 31% (16320/52645)
Resolving deltas: 32% (16847/52645)
Resolving deltas: 33% (17373/52645)
Resolving deltas: 34% (17900/52645)
Resolving deltas: 35% (18426/52645)
Resolving deltas: 36% (18953/52645)
Resolving deltas: 37% (19479/52645)
Resolving deltas: 38% (20006/52645)
Resolving deltas: 39% (20532/52645)
Resolving deltas: 40% (21058/52645)
Resolving deltas: 41% (21586/52645)
Resolving deltas: 42% (22111/52645)
Resolving deltas: 43% (22638/52645)
Resolving deltas: 44% (23164/52645)
Resolving deltas: 45% (23691/52645)
Resolving deltas: 46% (24217/52645)
Resolving deltas: 47% (24744/52645)
Resolving deltas: 48% (25270/52645)
Resolving deltas: 49% (25797/52645)
Resolving deltas: 50% (26323/52645)
Resolving deltas: 51% (26850/52645)
Resolving deltas: 52% (27376/52645)
Resolving deltas: 53% (27903/52645)
Resolving deltas: 54% (28430/52645)
Resolving deltas: 55% (28956/52645)
Resolving deltas: 56% (29482/52645)
Resolving deltas: 57% (30008/52645)
Resolving deltas: 58% (30535/52645)
Resolving deltas: 59% (31061/52645)
Resolving deltas: 60% (31587/52645)
Resolving deltas: 61% (32114/52645)
Resolving deltas: 62% (32641/52645)
Resolving deltas: 63% (33167/52645)
Resolving deltas: 64% (33694/52645)
Resolving deltas: 65% (34220/52645)
Resolving deltas: 66% (34746/52645)
Resolving deltas: 67% (35273/52645)
Resolving deltas: 68% (35799/52645)
Resolving deltas: 69% (36326/52645)
Resolving deltas: 70% (36852/52645)
Resolving deltas: 71% (37379/52645)
Resolving deltas: 72% (37905/52645)
Resolving deltas: 73% (38431/52645)
Resolving deltas: 74% (38959/52645)
Resolving deltas: 75% (39484/52645)
Resolving deltas: 76% (40011/52645)
Resolving deltas: 77% (40537/52645)
Resolving deltas: 78% (41064/52645)
Resolving deltas: 79% (41590/52645)
Resolving deltas: 80% (42116/52645)
Resolving deltas: 81% (42643/52645)
Resolving deltas: 82% (43169/52645)
Resolving deltas: 83% (43696/52645)
Resolving deltas: 84% (44222/52645)
Resolving deltas: 85% (44750/52645)
Resolving deltas: 86% (45275/52645)
Resolving deltas: 87% (45802/52645)
Resolving deltas: 88% (46328/52645)
Resolving deltas: 89% (46855/52645)
Resolving deltas: 90% (47381/52645)
Resolving deltas: 91% (47907/52645)
Resolving deltas: 92% (48434/52645)
Resolving deltas: 93% (48960/52645)
Resolving deltas: 94% (49487/52645)
Resolving deltas: 95% (50013/52645)
Resolving deltas: 96% (50540/52645)
Resolving deltas: 97% (51067/52645)
Resolving deltas: 98% (51593/52645)
Resolving deltas: 99% (52119/52645)
Resolving deltas: 100% (52645/52645)
Resolving deltas: 100% (52645/52645), done.
9.31 s
Fetching commit 509bcc282222aff4015c291e6846ce47e83f1919 for docs ...
9.31 s
$ /nix/store/bcnisk3ydfgv26v2gw3zlky24g00yww2-git-2.54.0/bin/git fetch origin 509bcc282222aff4015c291e6846ce47e83f1919
9.74 s
From https://github.com/alphal00p/gammaloop
9.74 s
* branch 509bcc282222aff4015c291e6846ce47e83f1919 -> FETCH_HEAD
9.75 s
$ /nix/store/9ypz3flqsrl5xl495mm8h645gadjsxi1-coreutils-9.11/bin/timeout --kill-after=15s 7200s /nix/store/bcnisk3ydfgv26v2gw3zlky24g00yww2-git-2.54.0/bin/git -c advice.detachedHead=false checkout 509bcc282222aff4015c291e6846ce47e83f1919
9.96 s
HEAD is now at 509bcc282 fix docs CI and Pages publication
9.96 s
$ /nix/store/9ypz3flqsrl5xl495mm8h645gadjsxi1-coreutils-9.11/bin/timeout --kill-after=15s 7200s /nix/store/23zk8sgzamrbmj1fday15szf7f2279s8-nix-2.34.7/bin/nix --extra-experimental-features nix-command --extra-experimental-features flakes --log-format internal-json run .#packages.x86_64-linux.nix-ci-check-gammaloop-nextest-docs --print-build-logs
10.20 s
stdenv.isDarwin is deprecated, use stdenv.hostPlatform.isDarwin instead
14.46 s
14.75 s
Downloading cached ShellCheck from https://cache.nix-ci.com
14.81 s
Downloaded cached ShellCheck (7.5 MiB) in 57ms
14.81 s
Progress: 0 of 2 built, 1 of 1 downloaded from cache
14.89 s
Building /nix/store/a6gim03l06gb0a49a6m37yjngwpxbqjx-nix-ci-check-gammaloop-nextest-docs.drv
14.97 s
[nix-ci-check-gammaloop-nextest-docs:post-build] Uploading to the NixCI cache: /nix/store/wx47znq637issdc09v04y9n1yngz3h9c-nix-ci-check-gammaloop-nextest-docs
15.00 s
[nix-ci-check-gammaloop-nextest-docs:post-build] warning: 'warn-short-path-literals' is deprecated, use 'lint-short-path-literals = ignore' instead
15.02 s
[nix-ci-check-gammaloop-nextest-docs:post-build] copying 1 paths...
15.02 s
[nix-ci-check-gammaloop-nextest-docs:post-build] copying path '/nix/store/wx47znq637issdc09v04y9n1yngz3h9c-nix-ci-check-gammaloop-nextest-docs' to 'https://cache.nix-ci.com'...
15.10 s
[nix-ci-check-gammaloop-nextest-docs:post-build] warning: 'warn-short-path-literals' is deprecated, use 'lint-short-path-literals = ignore' instead
15.60 s
[nix-ci-check-gammaloop-nextest-docs:post-build] copying 0 paths...
15.64 s
Uploaded nix-ci-check-gammaloop-nextest-docs in 679ms
15.64 s
Progress: 1 of 2 built, 1 of 1 downloaded from cache
15.64 s
Built nix-ci-check-gammaloop-nextest-docs in 740ms
15.64 s
Progress: 2 of 2 built, 1 of 1 downloaded from cache
15.93 s
evaluating derivation 'gevaluation warning: stdenv.isDarwin is deprecated, use stdenv.hostPlatform.isDarwin instead
22.91 s
copying '/nix/store/j9kx
evaluating derivation 'g
copying '/nix/store/j9kx
evaluating derivation 'g
copying '/nix/store/j9kx
evaluating derivation 'g
copying '/nix/store/j9kx
evaluating derivation 'g
copying '/nix/store/j9kx
evaluating derivation 'g
copying '/nix/store/j9kx
evaluating derivation 'g
copying '/nix/store/j9kx
evaluating derivation 'g
querying gammaloop-nexte
[0.0 KiB DL] querying in
[9.7 KiB DL] querying pe
[28.2 KiB DL] querying p
[0 /2 built, 16 /3 /41 copi
[0 /2 built, 7 /24 /41 copi
[0 /2 built, 3 /36 /41 copi
[0 /2 built, 1 /40 /41 copi
[0 /1 built, 41 copied (7
[1 /0 /1 built, 41 copied gammaloop-nextest-docs> Extracting 2 binaries to /build/nextest-archive-vo48A0
22.95 s
gammaloop-nextest-docs> Extracted 5 files to /build/nextest-archive-vo48A0 in 0.05s
22.96 s
gammaloop-nextest-docs> ------------
22.96 s
gammaloop-nextest-docs> Nextest run ID 455ac845-1960-4d7d-b8e4-2b565fac3833 with nextest profile: ci_gammaloop
22.96 s
gammaloop-nextest-docs> Starting 119 tests across 2 binaries
22.99 s
gammaloop-nextest-docs> FAIL [ 0.014s] ( 23/119) alphal00p-docs-builder tests :: developer_architecture_is_classified_searchable_and_source_backed
22.99 s
gammaloop-nextest-docs> stdout ---
22.99 s
gammaloop-nextest-docs>
22.99 s
gammaloop-nextest-docs> running 1 test
22.99 s
gammaloop-nextest-docs> test tests::developer_architecture_is_classified_searchable_and_source_backed ... FAILED
22.99 s
gammaloop-nextest-docs>
22.99 s
gammaloop-nextest-docs> failures:
22.99 s
gammaloop-nextest-docs>
22.99 s
gammaloop-nextest-docs> failures:
22.99 s
gammaloop-nextest-docs> tests::developer_architecture_is_classified_searchable_and_source_backed
22.99 s
gammaloop-nextest-docs>
22.99 s
gammaloop-nextest-docs> test result: FAILED. 0 passed; 1 failed; 0 ignored; 0 measured; 118 filtered out; finished in 0.01s
22.99 s
gammaloop-nextest-docs>
22.99 s
gammaloop-nextest-docs> stderr ---
22.99 s
gammaloop-nextest-docs>
22.99 s
gammaloop-nextest-docs> thread 'tests::developer_architecture_is_classified_searchable_and_source_backed' (243) panicked at crates/alphal00p-docs-builder/src/lib.rs:12354:14:
22.99 s
gammaloop-nextest-docs> called `Result::unwrap()` on an `Err` value: cannot determine the documented Git commit; set ALPHAL00P_DOCS_GIT_COMMIT
22.99 s
gammaloop-nextest-docs>
22.99 s
gammaloop-nextest-docs> Location:
22.99 s
gammaloop-nextest-docs> crates/alphal00p-docs-builder/src/lib.rs:4137:9
22.99 s
gammaloop-nextest-docs> stack backtrace:
22.99 s
gammaloop-nextest-docs> 0: __rustc::rust_begin_unwind
22.99 s
gammaloop-nextest-docs> 1: core::panicking::panic_fmt
22.99 s
gammaloop-nextest-docs> 2: core::result::unwrap_failed
22.99 s
gammaloop-nextest-docs> 3: alphal00p_docs_builder::tests::developer_architecture_is_classified_searchable_and_source_backed
22.99 s
gammaloop-nextest-docs> 4: <alphal00p_docs_builder::tests::developer_architecture_is_classified_searchable_and_source_backed::{closure#0} as core::ops::function::FnOnce<()>>::call_once
22.99 s
gammaloop-nextest-docs> note: Some details are omitted, run with `RUST_BACKTRACE=full` for a verbose backtrace.
22.99 s
gammaloop-nextest-docs>
23.02 s
gammaloop-nextest-docs> FAIL [ 0.009s] ( 46/119) alphal00p-docs-builder tests :: persistent_rustdoc_target_rejects_symlink_escape
23.02 s
gammaloop-nextest-docs> stdout ---
23.02 s
gammaloop-nextest-docs>
23.02 s
gammaloop-nextest-docs> running 1 test
23.02 s
gammaloop-nextest-docs> test tests::persistent_rustdoc_target_rejects_symlink_escape ... FAILED
23.02 s
gammaloop-nextest-docs>
23.02 s
gammaloop-nextest-docs> failures:
23.02 s
gammaloop-nextest-docs>
23.02 s
gammaloop-nextest-docs> failures:
23.02 s
gammaloop-nextest-docs> tests::persistent_rustdoc_target_rejects_symlink_escape
23.02 s
gammaloop-nextest-docs>
23.02 s
gammaloop-nextest-docs> test result: FAILED. 0 passed; 1 failed; 0 ignored; 0 measured; 118 filtered out; finished in 0.00s
23.02 s
gammaloop-nextest-docs>
23.02 s
gammaloop-nextest-docs> stderr ---
23.02 s
gammaloop-nextest-docs>
23.02 s
gammaloop-nextest-docs> thread 'tests::persistent_rustdoc_target_rejects_symlink_escape' (343) panicked at crates/alphal00p-docs-builder/src/lib.rs:10490:82:
23.02 s
gammaloop-nextest-docs> called `Result::unwrap_err()` on an `Ok` value: "/build/.tmpuJkUdo/escape/cache/cargo-target-v1"
23.02 s
gammaloop-nextest-docs> stack backtrace:
23.02 s
gammaloop-nextest-docs> 0: __rustc::rust_begin_unwind
23.02 s
gammaloop-nextest-docs> 1: core::panicking::panic_fmt
23.02 s
gammaloop-nextest-docs> 2: core::result::unwrap_failed
23.02 s
gammaloop-nextest-docs> 3: alphal00p_docs_builder::tests::persistent_rustdoc_target_rejects_symlink_escape
23.02 s
gammaloop-nextest-docs> 4: <alphal00p_docs_builder::tests::persistent_rustdoc_target_rejects_symlink_escape::{closure#0} as core::ops::function::FnOnce<()>>::call_once
23.02 s
gammaloop-nextest-docs> note: Some details are omitted, run with `RUST_BACKTRACE=full` for a verbose backtrace.
23.02 s
gammaloop-nextest-docs>
23.02 s
gammaloop-nextest-docs> FAIL [ 0.007s] ( 47/119) alphal00p-docs-builder tests :: persistent_rustdoc_targets_reject_workspace_and_arbitrary_roots
23.02 s
gammaloop-nextest-docs> stdout ---
23.02 s
gammaloop-nextest-docs>
23.02 s
gammaloop-nextest-docs> running 1 test
23.02 s
gammaloop-nextest-docs> test tests::persistent_rustdoc_targets_reject_workspace_and_arbitrary_roots ... FAILED
23.02 s
gammaloop-nextest-docs>
23.02 s
gammaloop-nextest-docs> failures:
23.02 s
gammaloop-nextest-docs>
23.02 s
gammaloop-nextest-docs> failures:
23.02 s
gammaloop-nextest-docs> tests::persistent_rustdoc_targets_reject_workspace_and_arbitrary_roots
23.02 s
gammaloop-nextest-docs>
23.02 s
gammaloop-nextest-docs> test result: FAILED. 0 passed; 1 failed; 0 ignored; 0 measured; 118 filtered out; finished in 0.00s
23.02 s
gammaloop-nextest-docs>
23.02 s
gammaloop-nextest-docs> stderr ---
23.02 s
gammaloop-nextest-docs>
23.02 s
gammaloop-nextest-docs> thread 'tests::persistent_rustdoc_targets_reject_workspace_and_arbitrary_roots' (348) panicked at crates/alphal00p-docs-builder/src/lib.rs:10467:9:
23.02 s
gammaloop-nextest-docs> assertion failed: prepare_persistent_rustdoc_target(workspace, &arbitrary).is_err()
23.02 s
gammaloop-nextest-docs> stack backtrace:
23.02 s
gammaloop-nextest-docs> 0: __rustc::rust_begin_unwind
23.02 s
gammaloop-nextest-docs> 1: core::panicking::panic_fmt
23.02 s
gammaloop-nextest-docs> 2: core::panicking::panic
23.02 s
gammaloop-nextest-docs> 3: alphal00p_docs_builder::tests::persistent_rustdoc_targets_reject_workspace_and_arbitrary_roots
23.02 s
gammaloop-nextest-docs> 4: <alphal00p_docs_builder::tests::persistent_rustdoc_targets_reject_workspace_and_arbitrary_roots::{closure#0} as core::ops::function::FnOnce<()>>::call_once
23.02 s
gammaloop-nextest-docs> note: Some details are omitted, run with `RUST_BACKTRACE=full` for a verbose backtrace.
23.02 s
gammaloop-nextest-docs>
23.09 s
gammaloop-nextest-docs> FAIL [ 0.076s] ( 66/119) alphal00p-docs-builder tests :: portal_and_developer_pages_use_federated_search_and_feedback
23.09 s
gammaloop-nextest-docs> stdout ---
23.09 s
gammaloop-nextest-docs>
23.09 s
gammaloop-nextest-docs> running 1 test
23.09 s
gammaloop-nextest-docs> test tests::portal_and_developer_pages_use_federated_search_and_feedback ... FAILED
23.09 s
gammaloop-nextest-docs>
23.09 s
gammaloop-nextest-docs> failures:
23.09 s
gammaloop-nextest-docs>
23.09 s
gammaloop-nextest-docs> failures:
23.09 s
gammaloop-nextest-docs> tests::portal_and_developer_pages_use_federated_search_and_feedback
23.09 s
gammaloop-nextest-docs>
23.09 s
gammaloop-nextest-docs> test result: FAILED. 0 passed; 1 failed; 0 ignored; 0 measured; 118 filtered out; finished in 0.06s
23.09 s
gammaloop-nextest-docs>
23.09 s
gammaloop-nextest-docs> stderr ---
23.09 s
gammaloop-nextest-docs> warning: bundle export is experimental
23.09 s
gammaloop-nextest-docs> = hint: its behaviour may change at any time
23.09 s
gammaloop-nextest-docs> = hint: do not rely on this feature for production use cases
23.09 s
gammaloop-nextest-docs>
23.09 s
gammaloop-nextest-docs>
23.09 s
gammaloop-nextest-docs> thread 'tests::portal_and_developer_pages_use_federated_search_and_feedback' (366) panicked at crates/alphal00p-docs-builder/src/lib.rs:12758:14:
23.09 s
gammaloop-nextest-docs> called `Result::unwrap()` on an `Err` value: cannot determine the documented Git commit; set ALPHAL00P_DOCS_GIT_COMMIT
23.09 s
gammaloop-nextest-docs>
23.09 s
gammaloop-nextest-docs> Location:
23.09 s
gammaloop-nextest-docs> crates/alphal00p-docs-builder/src/lib.rs:4137:9
23.09 s
gammaloop-nextest-docs> stack backtrace:
23.09 s
gammaloop-nextest-docs> 0: __rustc::rust_begin_unwind
23.09 s
gammaloop-nextest-docs> 1: core::panicking::panic_fmt
23.09 s
gammaloop-nextest-docs> 2: core::result::unwrap_failed
23.09 s
gammaloop-nextest-docs> 3: alphal00p_docs_builder::tests::portal_and_developer_pages_use_federated_search_and_feedback
23.09 s
gammaloop-nextest-docs> 4: <alphal00p_docs_builder::tests::portal_and_developer_pages_use_federated_search_and_feedback::{closure#0} as core::ops::function::FnOnce<()>>::call_once
23.09 s
gammaloop-nextest-docs> note: Some details are omitted, run with `RUST_BACKTRACE=full` for a verbose backtrace.
23.09 s
gammaloop-nextest-docs>
37.86 s
gammaloop-nextest-docs> FAIL [ 14.876s] (118/119) alphal00p-docs-builder tests :: every_product_orients_rust_to_native_rustdoc_and_keeps_legacy_redirects
37.86 s
gammaloop-nextest-docs> stdout ---
37.86 s
gammaloop-nextest-docs>
37.86 s
gammaloop-nextest-docs> running 1 test
37.86 s
gammaloop-nextest-docs> test tests::every_product_orients_rust_to_native_rustdoc_and_keeps_legacy_redirects ... FAILED
37.86 s
gammaloop-nextest-docs>
37.86 s
gammaloop-nextest-docs> failures:
37.86 s
gammaloop-nextest-docs>
37.86 s
gammaloop-nextest-docs> failures:
37.86 s
gammaloop-nextest-docs> tests::every_product_orients_rust_to_native_rustdoc_and_keeps_legacy_redirects
37.86 s
gammaloop-nextest-docs>
37.86 s
gammaloop-nextest-docs> test result: FAILED. 0 passed; 1 failed; 0 ignored; 0 measured; 118 filtered out; finished in 14.87s
37.86 s
gammaloop-nextest-docs>
37.86 s
gammaloop-nextest-docs> stderr ---
37.86 s
gammaloop-nextest-docs>
37.86 s
gammaloop-nextest-docs> thread 'tests::every_product_orients_rust_to_native_rustdoc_and_keeps_legacy_redirects' (259) panicked at crates/alphal00p-docs-builder/src/lib.rs:12166:18:
37.86 s
gammaloop-nextest-docs> called `Result::unwrap()` on an `Err` value: cannot determine the documented Git commit; set ALPHAL00P_DOCS_GIT_COMMIT
37.86 s
gammaloop-nextest-docs>
37.86 s
gammaloop-nextest-docs> Location:
37.86 s
gammaloop-nextest-docs> crates/alphal00p-docs-builder/src/lib.rs:2054:9
37.86 s
gammaloop-nextest-docs> stack backtrace:
37.86 s
gammaloop-nextest-docs> 0: __rustc::rust_begin_unwind
37.86 s
gammaloop-nextest-docs> 1: core::panicking::panic_fmt
37.86 s
gammaloop-nextest-docs> 2: core::result::unwrap_failed
37.86 s
gammaloop-nextest-docs> 3: alphal00p_docs_builder::tests::every_product_orients_rust_to_native_rustdoc_and_keeps_legacy_redirects
37.86 s
gammaloop-nextest-docs> 4: <alphal00p_docs_builder::tests::every_product_orients_rust_to_native_rustdoc_and_keeps_legacy_redirects::{closure#0} as core::ops::function::FnOnce<()>>::call_once
37.86 s
gammaloop-nextest-docs> note: Some details are omitted, run with `RUST_BACKTRACE=full` for a verbose backtrace.
37.86 s
gammaloop-nextest-docs>
41.25 s
gammaloop-nextest-docs> ------------
41.25 s
gammaloop-nextest-docs> Summary [ 18.285s] 119 tests run: 114 passed , 5 failed , 0 skipped
41.25 s
gammaloop-nextest-docs> FAIL [ 0.014s] ( 23/119) alphal00p-docs-builder tests :: developer_architecture_is_classified_searchable_and_source_backed
41.25 s
gammaloop-nextest-docs> stdout ---
41.25 s
gammaloop-nextest-docs>
41.25 s
gammaloop-nextest-docs> running 1 test
41.25 s
gammaloop-nextest-docs> test tests::developer_architecture_is_classified_searchable_and_source_backed ... FAILED
41.25 s
gammaloop-nextest-docs>
41.25 s
gammaloop-nextest-docs> failures:
41.25 s
gammaloop-nextest-docs>
41.25 s
gammaloop-nextest-docs> failures:
41.25 s
gammaloop-nextest-docs> tests::developer_architecture_is_classified_searchable_and_source_backed
41.25 s
gammaloop-nextest-docs>
41.25 s
gammaloop-nextest-docs> test result: FAILED. 0 passed; 1 failed; 0 ignored; 0 measured; 118 filtered out; finished in 0.01s
41.25 s
gammaloop-nextest-docs>
41.25 s
gammaloop-nextest-docs> stderr ---
41.25 s
gammaloop-nextest-docs>
41.25 s
gammaloop-nextest-docs> thread 'tests::developer_architecture_is_classified_searchable_and_source_backed' (243) panicked at crates/alphal00p-docs-builder/src/lib.rs:12354:14:
41.25 s
gammaloop-nextest-docs> called `Result::unwrap()` on an `Err` value: cannot determine the documented Git commit; set ALPHAL00P_DOCS_GIT_COMMIT
41.25 s
gammaloop-nextest-docs>
41.25 s
gammaloop-nextest-docs> Location:
41.25 s
gammaloop-nextest-docs> crates/alphal00p-docs-builder/src/lib.rs:4137:9
41.25 s
gammaloop-nextest-docs> stack backtrace:
41.25 s
gammaloop-nextest-docs> 0: __rustc::rust_begin_unwind
41.25 s
gammaloop-nextest-docs> 1: core::panicking::panic_fmt
41.25 s
gammaloop-nextest-docs> 2: core::result::unwrap_failed
41.25 s
gammaloop-nextest-docs> 3: alphal00p_docs_builder::tests::developer_architecture_is_classified_searchable_and_source_backed
41.25 s
gammaloop-nextest-docs> 4: <alphal00p_docs_builder::tests::developer_architecture_is_classified_searchable_and_source_backed::{closure#0} as core::ops::function::FnOnce<()>>::call_once
41.25 s
gammaloop-nextest-docs> note: Some details are omitted, run with `RUST_BACKTRACE=full` for a verbose backtrace.
41.25 s
gammaloop-nextest-docs>
41.25 s
gammaloop-nextest-docs> FAIL [ 0.009s] ( 46/119) alphal00p-docs-builder tests :: persistent_rustdoc_target_rejects_symlink_escape
41.25 s
gammaloop-nextest-docs> stdout ---
41.25 s
gammaloop-nextest-docs>
41.25 s
gammaloop-nextest-docs> running 1 test
41.25 s
gammaloop-nextest-docs> test tests::persistent_rustdoc_target_rejects_symlink_escape ... FAILED
41.25 s
gammaloop-nextest-docs>
41.25 s
gammaloop-nextest-docs> failures:
41.25 s
gammaloop-nextest-docs>
41.25 s
gammaloop-nextest-docs> failures:
41.25 s
gammaloop-nextest-docs> tests::persistent_rustdoc_target_rejects_symlink_escape
41.25 s
gammaloop-nextest-docs>
41.25 s
gammaloop-nextest-docs> test result: FAILED. 0 passed; 1 failed; 0 ignored; 0 measured; 118 filtered out; finished in 0.00s
41.25 s
gammaloop-nextest-docs>
41.25 s
gammaloop-nextest-docs> stderr ---
41.25 s
gammaloop-nextest-docs>
41.25 s
gammaloop-nextest-docs> thread 'tests::persistent_rustdoc_target_rejects_symlink_escape' (343) panicked at crates/alphal00p-docs-builder/src/lib.rs:10490:82:
41.25 s
gammaloop-nextest-docs> called `Result::unwrap_err()` on an `Ok` value: "/build/.tmpuJkUdo/escape/cache/cargo-target-v1"
41.25 s
gammaloop-nextest-docs> stack backtrace:
41.25 s
gammaloop-nextest-docs> 0: __rustc::rust_begin_unwind
41.25 s
gammaloop-nextest-docs> 1: core::panicking::panic_fmt
41.25 s
gammaloop-nextest-docs> 2: core::result::unwrap_failed
41.25 s
gammaloop-nextest-docs> 3: alphal00p_docs_builder::tests::persistent_rustdoc_target_rejects_symlink_escape
41.25 s
gammaloop-nextest-docs> 4: <alphal00p_docs_builder::tests::persistent_rustdoc_target_rejects_symlink_escape::{closure#0} as core::ops::function::FnOnce<()>>::call_once
41.25 s
gammaloop-nextest-docs> note: Some details are omitted, run with `RUST_BACKTRACE=full` for a verbose backtrace.
41.25 s
gammaloop-nextest-docs>
41.25 s
gammaloop-nextest-docs> FAIL [ 0.007s] ( 47/119) alphal00p-docs-builder tests :: persistent_rustdoc_targets_reject_workspace_and_arbitrary_roots
41.25 s
gammaloop-nextest-docs> stdout ---
41.25 s
gammaloop-nextest-docs>
41.25 s
gammaloop-nextest-docs> running 1 test
41.25 s
gammaloop-nextest-docs> test tests::persistent_rustdoc_targets_reject_workspace_and_arbitrary_roots ... FAILED
41.25 s
gammaloop-nextest-docs>
41.25 s
gammaloop-nextest-docs> failures:
41.25 s
gammaloop-nextest-docs>
41.25 s
gammaloop-nextest-docs> failures:
41.25 s
gammaloop-nextest-docs> tests::persistent_rustdoc_targets_reject_workspace_and_arbitrary_roots
41.25 s
gammaloop-nextest-docs>
41.25 s
gammaloop-nextest-docs> test result: FAILED. 0 passed; 1 failed; 0 ignored; 0 measured; 118 filtered out; finished in 0.00s
41.25 s
gammaloop-nextest-docs>
41.25 s
gammaloop-nextest-docs> stderr ---
41.25 s
gammaloop-nextest-docs>
41.25 s
gammaloop-nextest-docs> thread 'tests::persistent_rustdoc_targets_reject_workspace_and_arbitrary_roots' (348) panicked at crates/alphal00p-docs-builder/src/lib.rs:10467:9:
41.25 s
gammaloop-nextest-docs> assertion failed: prepare_persistent_rustdoc_target(workspace, &arbitrary).is_err()
41.25 s
gammaloop-nextest-docs> stack backtrace:
41.25 s
gammaloop-nextest-docs> 0: __rustc::rust_begin_unwind
41.25 s
gammaloop-nextest-docs> 1: core::panicking::panic_fmt
41.25 s
gammaloop-nextest-docs> 2: core::panicking::panic
41.25 s
gammaloop-nextest-docs> 3: alphal00p_docs_builder::tests::persistent_rustdoc_targets_reject_workspace_and_arbitrary_roots
41.25 s
gammaloop-nextest-docs> 4: <alphal00p_docs_builder::tests::persistent_rustdoc_targets_reject_workspace_and_arbitrary_roots::{closure#0} as core::ops::function::FnOnce<()>>::call_once
41.25 s
gammaloop-nextest-docs> note: Some details are omitted, run with `RUST_BACKTRACE=full` for a verbose backtrace.
41.25 s
gammaloop-nextest-docs>
41.25 s
gammaloop-nextest-docs> FAIL [ 0.076s] ( 66/119) alphal00p-docs-builder tests :: portal_and_developer_pages_use_federated_search_and_feedback
41.25 s
gammaloop-nextest-docs> stdout ---
41.25 s
gammaloop-nextest-docs>
41.25 s
gammaloop-nextest-docs> running 1 test
41.25 s
gammaloop-nextest-docs> test tests::portal_and_developer_pages_use_federated_search_and_feedback ... FAILED
41.25 s
gammaloop-nextest-docs>
41.25 s
gammaloop-nextest-docs> failures:
41.25 s
gammaloop-nextest-docs>
41.25 s
gammaloop-nextest-docs> failures:
41.25 s
gammaloop-nextest-docs> tests::portal_and_developer_pages_use_federated_search_and_feedback
41.25 s
gammaloop-nextest-docs>
41.25 s
gammaloop-nextest-docs> test result: FAILED. 0 passed; 1 failed; 0 ignored; 0 measured; 118 filtered out; finished in 0.06s
41.25 s
gammaloop-nextest-docs>
41.25 s
gammaloop-nextest-docs> stderr ---
41.25 s
gammaloop-nextest-docs> warning: bundle export is experimental
41.25 s
gammaloop-nextest-docs> = hint: its behaviour may change at any time
41.25 s
gammaloop-nextest-docs> = hint: do not rely on this feature for production use cases
41.25 s
gammaloop-nextest-docs>
41.25 s
gammaloop-nextest-docs>
41.25 s
gammaloop-nextest-docs> thread 'tests::portal_and_developer_pages_use_federated_search_and_feedback' (366) panicked at crates/alphal00p-docs-builder/src/lib.rs:12758:14:
41.25 s
gammaloop-nextest-docs> called `Result::unwrap()` on an `Err` value: cannot determine the documented Git commit; set ALPHAL00P_DOCS_GIT_COMMIT
41.25 s
gammaloop-nextest-docs>
41.25 s
gammaloop-nextest-docs> Location:
41.25 s
gammaloop-nextest-docs> crates/alphal00p-docs-builder/src/lib.rs:4137:9
41.25 s
gammaloop-nextest-docs> stack backtrace:
41.25 s
gammaloop-nextest-docs> 0: __rustc::rust_begin_unwind
41.25 s
gammaloop-nextest-docs> 1: core::panicking::panic_fmt
41.25 s
gammaloop-nextest-docs> 2: core::result::unwrap_failed
41.25 s
gammaloop-nextest-docs> 3: alphal00p_docs_builder::tests::portal_and_developer_pages_use_federated_search_and_feedback
41.25 s
gammaloop-nextest-docs> 4: <alphal00p_docs_builder::tests::portal_and_developer_pages_use_federated_search_and_feedback::{closure#0} as core::ops::function::FnOnce<()>>::call_once
41.25 s
gammaloop-nextest-docs> note: Some details are omitted, run with `RUST_BACKTRACE=full` for a verbose backtrace.
41.25 s
gammaloop-nextest-docs>
41.25 s
gammaloop-nextest-docs> FAIL [ 14.876s] (118/119) alphal00p-docs-builder tests :: every_product_orients_rust_to_native_rustdoc_and_keeps_legacy_redirects
41.25 s
gammaloop-nextest-docs> stdout ---
41.25 s
gammaloop-nextest-docs>
41.25 s
gammaloop-nextest-docs> running 1 test
41.25 s
gammaloop-nextest-docs> test tests::every_product_orients_rust_to_native_rustdoc_and_keeps_legacy_redirects ... FAILED
41.25 s
gammaloop-nextest-docs>
41.25 s
gammaloop-nextest-docs> failures:
41.25 s
gammaloop-nextest-docs>
41.25 s
gammaloop-nextest-docs> failures:
41.25 s
gammaloop-nextest-docs> tests::every_product_orients_rust_to_native_rustdoc_and_keeps_legacy_redirects
41.25 s
gammaloop-nextest-docs>
41.25 s
gammaloop-nextest-docs> test result: FAILED. 0 passed; 1 failed; 0 ignored; 0 measured; 118 filtered out; finished in 14.87s
41.25 s
gammaloop-nextest-docs>
41.25 s
gammaloop-nextest-docs> stderr ---
41.25 s
gammaloop-nextest-docs>
41.25 s
gammaloop-nextest-docs> thread 'tests::every_product_orients_rust_to_native_rustdoc_and_keeps_legacy_redirects' (259) panicked at crates/alphal00p-docs-builder/src/lib.rs:12166:18:
41.25 s
gammaloop-nextest-docs> called `Result::unwrap()` on an `Err` value: cannot determine the documented Git commit; set ALPHAL00P_DOCS_GIT_COMMIT
41.25 s
gammaloop-nextest-docs>
41.25 s
gammaloop-nextest-docs> Location:
41.25 s
gammaloop-nextest-docs> crates/alphal00p-docs-builder/src/lib.rs:2054:9
41.25 s
gammaloop-nextest-docs> stack backtrace:
41.25 s
gammaloop-nextest-docs> 0: __rustc::rust_begin_unwind
41.25 s
gammaloop-nextest-docs> 1: core::panicking::panic_fmt
41.25 s
gammaloop-nextest-docs> 2: core::result::unwrap_failed
41.25 s
gammaloop-nextest-docs> 3: alphal00p_docs_builder::tests::every_product_orients_rust_to_native_rustdoc_and_keeps_legacy_redirects
41.25 s
gammaloop-nextest-docs> 4: <alphal00p_docs_builder::tests::every_product_orients_rust_to_native_rustdoc_and_keeps_legacy_redirects::{closure#0} as core::ops::function::FnOnce<()>>::call_once
41.25 s
gammaloop-nextest-docs> note: Some details are omitted, run with `RUST_BACKTRACE=full` for a verbose backtrace.
41.25 s
gammaloop-nextest-docs>
41.26 s
gammaloop-nextest-docs> error : test run failed
41.29 s
gammaloop-nextest-docs>
41.29 s
gammaloop-nextest-docs> ========== nextest test summary ==========
41.29 s
gammaloop-nextest-docs> report: target/nextest/ci_gammaloop/junit.xml
41.29 s
gammaloop-nextest-docs> tests: 119, failures: 5, errors: 0
41.29 s
gammaloop-nextest-docs>
41.29 s
gammaloop-nextest-docs> 1. alphal00p-docs-builder::tests::developer_architecture_is_classified_searchable_and_source_backed
41.29 s
gammaloop-nextest-docs> failure: test failure with exit code 101
41.29 s
gammaloop-nextest-docs> thread 'tests::developer_architecture_is_classified_searchable_and_source_backed' (243) panicked at crates/alphal00p-docs-builder/src/lib.rs:12354:14:
41.29 s
gammaloop-nextest-docs> called `Result::unwrap()` on an `Err` value: cannot determine the documented Git commit; set ALPHAL00P_DOCS_GIT_COMMIT
41.29 s
gammaloop-nextest-docs>
41.29 s
gammaloop-nextest-docs> Location:
41.29 s
gammaloop-nextest-docs> crates/alphal00p-docs-builder/src/lib.rs:4137:9
41.29 s
gammaloop-nextest-docs> stack backtrace:
41.29 s
gammaloop-nextest-docs> 0: __rustc::rust_begin_unwind
41.29 s
gammaloop-nextest-docs> 1: core::panicking::panic_fmt
41.29 s
gammaloop-nextest-docs> 2: core::result::unwrap_failed
41.29 s
gammaloop-nextest-docs> 3: alphal00p_docs_builder::tests::developer_architecture_is_classified_searchable_and_source_backed
41.29 s
gammaloop-nextest-docs> 4: <alphal00p_docs_builder::tests::developer_architecture_is_classified_searchable_and_source_backed::{closure#0} as core::ops::function::FnOnce<()>>::call_once
41.29 s
gammaloop-nextest-docs> note: Some details are omitted, run with `RUST_BACKTRACE=full` for a verbose backtrace.
41.29 s
gammaloop-nextest-docs> system-out
41.29 s
gammaloop-nextest-docs> running 1 test
41.29 s
gammaloop-nextest-docs> test tests::developer_architecture_is_classified_searchable_and_source_backed ... FAILED
41.29 s
gammaloop-nextest-docs>
41.29 s
gammaloop-nextest-docs> failures:
41.29 s
gammaloop-nextest-docs>
41.29 s
gammaloop-nextest-docs> failures:
41.29 s
gammaloop-nextest-docs> tests::developer_architecture_is_classified_searchable_and_source_backed
41.29 s
gammaloop-nextest-docs>
41.29 s
gammaloop-nextest-docs> test result: FAILED. 0 passed; 1 failed; 0 ignored; 0 measured; 118 filtered out; finished in 0.01s
41.29 s
gammaloop-nextest-docs> system-err
41.29 s
gammaloop-nextest-docs> thread 'tests::developer_architecture_is_classified_searchable_and_source_backed' (243) panicked at crates/alphal00p-docs-builder/src/lib.rs:12354:14:
41.29 s
gammaloop-nextest-docs> called `Result::unwrap()` on an `Err` value: cannot determine the documented Git commit; set ALPHAL00P_DOCS_GIT_COMMIT
41.29 s
gammaloop-nextest-docs>
41.29 s
gammaloop-nextest-docs> Location:
41.29 s
gammaloop-nextest-docs> crates/alphal00p-docs-builder/src/lib.rs:4137:9
41.29 s
gammaloop-nextest-docs> stack backtrace:
41.29 s
gammaloop-nextest-docs> 0: __rustc::rust_begin_unwind
41.29 s
gammaloop-nextest-docs> 1: core::panicking::panic_fmt
41.29 s
gammaloop-nextest-docs> 2: core::result::unwrap_failed
41.29 s
gammaloop-nextest-docs> 3: alphal00p_docs_builder::tests::developer_architecture_is_classified_searchable_and_source_backed
41.29 s
gammaloop-nextest-docs> 4: <alphal00p_docs_builder::tests::developer_architecture_is_classified_searchable_and_source_backed::{closure#0} as core::ops::function::FnOnce<()>>::call_once
41.29 s
gammaloop-nextest-docs> note: Some details are omitted, run with `RUST_BACKTRACE=full` for a verbose backtrace.
41.29 s
gammaloop-nextest-docs>
41.29 s
gammaloop-nextest-docs> 2. alphal00p-docs-builder::tests::persistent_rustdoc_target_rejects_symlink_escape
41.29 s
gammaloop-nextest-docs> failure: test failure with exit code 101
41.29 s
gammaloop-nextest-docs> thread 'tests::persistent_rustdoc_target_rejects_symlink_escape' (343) panicked at crates/alphal00p-docs-builder/src/lib.rs:10490:82:
41.29 s
gammaloop-nextest-docs> called `Result::unwrap_err()` on an `Ok` value: "/build/.tmpuJkUdo/escape/cache/cargo-target-v1"
41.29 s
gammaloop-nextest-docs> stack backtrace:
41.29 s
gammaloop-nextest-docs> 0: __rustc::rust_begin_unwind
41.29 s
gammaloop-nextest-docs> 1: core::panicking::panic_fmt
41.29 s
gammaloop-nextest-docs> 2: core::result::unwrap_failed
41.29 s
gammaloop-nextest-docs> 3: alphal00p_docs_builder::tests::persistent_rustdoc_target_rejects_symlink_escape
41.29 s
gammaloop-nextest-docs> 4: <alphal00p_docs_builder::tests::persistent_rustdoc_target_rejects_symlink_escape::{closure#0} as core::ops::function::FnOnce<()>>::call_once
41.29 s
gammaloop-nextest-docs> note: Some details are omitted, run with `RUST_BACKTRACE=full` for a verbose backtrace.
41.29 s
gammaloop-nextest-docs> system-out
41.29 s
gammaloop-nextest-docs> running 1 test
41.29 s
gammaloop-nextest-docs> test tests::persistent_rustdoc_target_rejects_symlink_escape ... FAILED
41.29 s
gammaloop-nextest-docs>
41.29 s
gammaloop-nextest-docs> failures:
41.29 s
gammaloop-nextest-docs>
41.29 s
gammaloop-nextest-docs> failures:
41.29 s
gammaloop-nextest-docs> tests::persistent_rustdoc_target_rejects_symlink_escape
41.29 s
gammaloop-nextest-docs>
41.29 s
gammaloop-nextest-docs> test result: FAILED. 0 passed; 1 failed; 0 ignored; 0 measured; 118 filtered out; finished in 0.00s
41.29 s
gammaloop-nextest-docs> system-err
41.29 s
gammaloop-nextest-docs> thread 'tests::persistent_rustdoc_target_rejects_symlink_escape' (343) panicked at crates/alphal00p-docs-builder/src/lib.rs:10490:82:
41.29 s
gammaloop-nextest-docs> called `Result::unwrap_err()` on an `Ok` value: "/build/.tmpuJkUdo/escape/cache/cargo-target-v1"
41.29 s
gammaloop-nextest-docs> stack backtrace:
41.29 s
gammaloop-nextest-docs> 0: __rustc::rust_begin_unwind
41.29 s
gammaloop-nextest-docs> 1: core::panicking::panic_fmt
41.29 s
gammaloop-nextest-docs> 2: core::result::unwrap_failed
41.29 s
gammaloop-nextest-docs> 3: alphal00p_docs_builder::tests::persistent_rustdoc_target_rejects_symlink_escape
41.29 s
gammaloop-nextest-docs> 4: <alphal00p_docs_builder::tests::persistent_rustdoc_target_rejects_symlink_escape::{closure#0} as core::ops::function::FnOnce<()>>::call_once
41.29 s
gammaloop-nextest-docs> note: Some details are omitted, run with `RUST_BACKTRACE=full` for a verbose backtrace.
41.29 s
gammaloop-nextest-docs>
41.29 s
gammaloop-nextest-docs> 3. alphal00p-docs-builder::tests::persistent_rustdoc_targets_reject_workspace_and_arbitrary_roots
41.29 s
gammaloop-nextest-docs> failure: test failure with exit code 101
41.29 s
gammaloop-nextest-docs> thread 'tests::persistent_rustdoc_targets_reject_workspace_and_arbitrary_roots' (348) panicked at crates/alphal00p-docs-builder/src/lib.rs:10467:9:
41.29 s
gammaloop-nextest-docs> assertion failed: prepare_persistent_rustdoc_target(workspace, &arbitrary).is_err()
41.29 s
gammaloop-nextest-docs> stack backtrace:
41.29 s
gammaloop-nextest-docs> 0: __rustc::rust_begin_unwind
41.29 s
gammaloop-nextest-docs> 1: core::panicking::panic_fmt
41.29 s
gammaloop-nextest-docs> 2: core::panicking::panic
41.29 s
gammaloop-nextest-docs> 3: alphal00p_docs_builder::tests::persistent_rustdoc_targets_reject_workspace_and_arbitrary_roots
41.29 s
gammaloop-nextest-docs> 4: <alphal00p_docs_builder::tests::persistent_rustdoc_targets_reject_workspace_and_arbitrary_roots::{closure#0} as core::ops::function::FnOnce<()>>::call_once
41.29 s
gammaloop-nextest-docs> note: Some details are omitted, run with `RUST_BACKTRACE=full` for a verbose backtrace.
41.29 s
gammaloop-nextest-docs> system-out
41.29 s
gammaloop-nextest-docs> running 1 test
41.29 s
gammaloop-nextest-docs> test tests::persistent_rustdoc_targets_reject_workspace_and_arbitrary_roots ... FAILED
41.29 s
gammaloop-nextest-docs>
41.29 s
gammaloop-nextest-docs> failures:
41.29 s
gammaloop-nextest-docs>
41.29 s
gammaloop-nextest-docs> failures:
41.29 s
gammaloop-nextest-docs> tests::persistent_rustdoc_targets_reject_workspace_and_arbitrary_roots
41.29 s
gammaloop-nextest-docs>
41.29 s
gammaloop-nextest-docs> test result: FAILED. 0 passed; 1 failed; 0 ignored; 0 measured; 118 filtered out; finished in 0.00s
41.29 s
gammaloop-nextest-docs> system-err
41.29 s
gammaloop-nextest-docs> thread 'tests::persistent_rustdoc_targets_reject_workspace_and_arbitrary_roots' (348) panicked at crates/alphal00p-docs-builder/src/lib.rs:10467:9:
41.29 s
gammaloop-nextest-docs> assertion failed: prepare_persistent_rustdoc_target(workspace, &arbitrary).is_err()
41.29 s
gammaloop-nextest-docs> stack backtrace:
41.29 s
gammaloop-nextest-docs> 0: __rustc::rust_begin_unwind
41.29 s
gammaloop-nextest-docs> 1: core::panicking::panic_fmt
41.29 s
gammaloop-nextest-docs> 2: core::panicking::panic
41.29 s
gammaloop-nextest-docs> 3: alphal00p_docs_builder::tests::persistent_rustdoc_targets_reject_workspace_and_arbitrary_roots
41.29 s
gammaloop-nextest-docs> 4: <alphal00p_docs_builder::tests::persistent_rustdoc_targets_reject_workspace_and_arbitrary_roots::{closure#0} as core::ops::function::FnOnce<()>>::call_once
41.29 s
gammaloop-nextest-docs> note: Some details are omitted, run with `RUST_BACKTRACE=full` for a verbose backtrace.
41.29 s
gammaloop-nextest-docs>
41.29 s
gammaloop-nextest-docs> 4. alphal00p-docs-builder::tests::portal_and_developer_pages_use_federated_search_and_feedback
41.29 s
gammaloop-nextest-docs> failure: test failure with exit code 101
41.29 s
gammaloop-nextest-docs> thread 'tests::portal_and_developer_pages_use_federated_search_and_feedback' (366) panicked at crates/alphal00p-docs-builder/src/lib.rs:12758:14:
41.29 s
gammaloop-nextest-docs> called `Result::unwrap()` on an `Err` value: cannot determine the documented Git commit; set ALPHAL00P_DOCS_GIT_COMMIT
41.29 s
gammaloop-nextest-docs>
41.29 s
gammaloop-nextest-docs> Location:
41.29 s
gammaloop-nextest-docs> crates/alphal00p-docs-builder/src/lib.rs:4137:9
41.29 s
gammaloop-nextest-docs> stack backtrace:
41.29 s
gammaloop-nextest-docs> 0: __rustc::rust_begin_unwind
41.29 s
gammaloop-nextest-docs> 1: core::panicking::panic_fmt
41.29 s
gammaloop-nextest-docs> 2: core::result::unwrap_failed
41.29 s
gammaloop-nextest-docs> 3: alphal00p_docs_builder::tests::portal_and_developer_pages_use_federated_search_and_feedback
41.29 s
gammaloop-nextest-docs> 4: <alphal00p_docs_builder::tests::portal_and_developer_pages_use_federated_search_and_feedback::{closure#0} as core::ops::function::FnOnce<()>>::call_once
41.29 s
gammaloop-nextest-docs> note: Some details are omitted, run with `RUST_BACKTRACE=full` for a verbose backtrace.
41.29 s
gammaloop-nextest-docs> system-out
41.29 s
gammaloop-nextest-docs> running 1 test
41.29 s
gammaloop-nextest-docs> test tests::portal_and_developer_pages_use_federated_search_and_feedback ... FAILED
41.29 s
gammaloop-nextest-docs>
41.29 s
gammaloop-nextest-docs> failures:
41.29 s
gammaloop-nextest-docs>
41.29 s
gammaloop-nextest-docs> failures:
41.29 s
gammaloop-nextest-docs> tests::portal_and_developer_pages_use_federated_search_and_feedback
41.29 s
gammaloop-nextest-docs>
41.29 s
gammaloop-nextest-docs> test result: FAILED. 0 passed; 1 failed; 0 ignored; 0 measured; 118 filtered out; finished in 0.06s
41.29 s
gammaloop-nextest-docs> system-err
41.29 s
gammaloop-nextest-docs> warning: bundle export is experimental
41.29 s
gammaloop-nextest-docs> = hint: its behaviour may change at any time
41.29 s
gammaloop-nextest-docs> = hint: do not rely on this feature for production use cases
41.29 s
gammaloop-nextest-docs>
41.29 s
gammaloop-nextest-docs>
41.29 s
gammaloop-nextest-docs> thread 'tests::portal_and_developer_pages_use_federated_search_and_feedback' (366) panicked at crates/alphal00p-docs-builder/src/lib.rs:12758:14:
41.29 s
gammaloop-nextest-docs> called `Result::unwrap()` on an `Err` value: cannot determine the documented Git commit; set ALPHAL00P_DOCS_GIT_COMMIT
41.29 s
gammaloop-nextest-docs>
41.29 s
gammaloop-nextest-docs> Location:
41.29 s
gammaloop-nextest-docs> crates/alphal00p-docs-builder/src/lib.rs:4137:9
41.29 s
gammaloop-nextest-docs> stack backtrace:
41.29 s
gammaloop-nextest-docs> 0: __rustc::rust_begin_unwind
41.29 s
gammaloop-nextest-docs> 1: core::panicking::panic_fmt
41.29 s
gammaloop-nextest-docs> 2: core::result::unwrap_failed
41.29 s
gammaloop-nextest-docs> 3: alphal00p_docs_builder::tests::portal_and_developer_pages_use_federated_search_and_feedback
41.29 s
gammaloop-nextest-docs> 4: <alphal00p_docs_builder::tests::portal_and_developer_pages_use_federated_search_and_feedback::{closure#0} as core::ops::function::FnOnce<()>>::call_once
41.29 s
gammaloop-nextest-docs> note: Some details are omitted, run with `RUST_BACKTRACE=full` for a verbose backtrace.
41.29 s
gammaloop-nextest-docs>
41.29 s
gammaloop-nextest-docs> 5. alphal00p-docs-builder::tests::every_product_orients_rust_to_native_rustdoc_and_keeps_legacy_redirects
41.29 s
gammaloop-nextest-docs> failure: test failure with exit code 101
41.29 s
gammaloop-nextest-docs> thread 'tests::every_product_orients_rust_to_native_rustdoc_and_keeps_legacy_redirects' (259) panicked at crates/alphal00p-docs-builder/src/lib.rs:12166:18:
41.29 s
gammaloop-nextest-docs> called `Result::unwrap()` on an `Err` value: cannot determine the documented Git commit; set ALPHAL00P_DOCS_GIT_COMMIT
41.29 s
gammaloop-nextest-docs>
41.29 s
gammaloop-nextest-docs> Location:
41.29 s
gammaloop-nextest-docs> crates/alphal00p-docs-builder/src/lib.rs:2054:9
41.29 s
gammaloop-nextest-docs> stack backtrace:
41.29 s
gammaloop-nextest-docs> 0: __rustc::rust_begin_unwind
41.29 s
gammaloop-nextest-docs> 1: core::panicking::panic_fmt
41.29 s
gammaloop-nextest-docs> 2: core::result::unwrap_failed
41.29 s
gammaloop-nextest-docs> 3: alphal00p_docs_builder::tests::every_product_orients_rust_to_native_rustdoc_and_keeps_legacy_redirects
41.29 s
gammaloop-nextest-docs> 4: <alphal00p_docs_builder::tests::every_product_orients_rust_to_native_rustdoc_and_keeps_legacy_redirects::{closure#0} as core::ops::function::FnOnce<()>>::call_once
41.29 s
gammaloop-nextest-docs> note: Some details are omitted, run with `RUST_BACKTRACE=full` for a verbose backtrace.
41.29 s
gammaloop-nextest-docs> system-out
41.29 s
gammaloop-nextest-docs> running 1 test
41.29 s
gammaloop-nextest-docs> test tests::every_product_orients_rust_to_native_rustdoc_and_keeps_legacy_redirects ... FAILED
41.29 s
gammaloop-nextest-docs>
41.29 s
gammaloop-nextest-docs> failures:
41.29 s
gammaloop-nextest-docs>
41.29 s
gammaloop-nextest-docs> failures:
41.29 s
gammaloop-nextest-docs> tests::every_product_orients_rust_to_native_rustdoc_and_keeps_legacy_redirects
41.29 s
gammaloop-nextest-docs>
41.29 s
gammaloop-nextest-docs> test result: FAILED. 0 passed; 1 failed; 0 ignored; 0 measured; 118 filtered out; finished in 14.87s
41.29 s
gammaloop-nextest-docs> system-err
41.29 s
gammaloop-nextest-docs> thread 'tests::every_product_orients_rust_to_native_rustdoc_and_keeps_legacy_redirects' (259) panicked at crates/alphal00p-docs-builder/src/lib.rs:12166:18:
41.29 s
gammaloop-nextest-docs> called `Result::unwrap()` on an `Err` value: cannot determine the documented Git commit; set ALPHAL00P_DOCS_GIT_COMMIT
41.29 s
gammaloop-nextest-docs>
41.30 s
gammaloop-nextest-docs> Location:
41.30 s
gammaloop-nextest-docs> crates/alphal00p-docs-builder/src/lib.rs:2054:9
41.30 s
gammaloop-nextest-docs> stack backtrace:
41.30 s
gammaloop-nextest-docs> 0: __rustc::rust_begin_unwind
41.30 s
gammaloop-nextest-docs> 1: core::panicking::panic_fmt
41.30 s
gammaloop-nextest-docs> 2: core::result::unwrap_failed
41.30 s
gammaloop-nextest-docs> 3: alphal00p_docs_builder::tests::every_product_orients_rust_to_native_rustdoc_and_keeps_legacy_redirects
41.30 s
gammaloop-nextest-docs> 4: <alphal00p_docs_builder::tests::every_product_orients_rust_to_native_rustdoc_and_keeps_legacy_redirects::{closure#0} as core::ops::function::FnOnce<()>>::call_once
41.30 s
gammaloop-nextest-docs> note: Some details are omitted, run with `RUST_BACKTRACE=full` for a verbose backtrace.
41.30 s
gammaloop-nextest-docs> =========================================
41.31 s
gammaloop-nextest-docs> Extracting 2 binaries to /build/nextest-archive-MpCNs6
41.36 s
gammaloop-nextest-docs> Extracted 5 files to /build/nextest-archive-MpCNs6 in 0.05s
41.37 s
gammaloop-nextest-docs> ------------
41.37 s
gammaloop-nextest-docs> Nextest run ID 85fa3184-e2c4-462c-9e83-d3b2d811af9e with nextest profile: ci_gammaloop
41.37 s
gammaloop-nextest-docs> Starting 21 tests across 2 binaries
41.40 s
gammaloop-nextest-docs> ------------
41.40 s
gammaloop-nextest-docs> Summary [ 0.030s] 21 tests run: 21 passed , 0 skipped
41.45 s
gammaloop-nextest-docs>
41.45 s
gammaloop-nextest-docs> ========== nextest test summary ==========
41.45 s
gammaloop-nextest-docs> report: target/nextest/ci_gammaloop/junit.xml
41.45 s
gammaloop-nextest-docs> tests: 21, failures: 0, errors: 0
41.45 s
gammaloop-nextest-docs> No failing testcases found.
41.45 s
gammaloop-nextest-docs> =========================================
41.47 s
gammaloop-nextest-docs> Extracting 3 binaries (including 2 non-test binaries), 1 build script output directory, and 2 linked paths to /build/nextest-archive-YssPb5
41.74 s
gammaloop-nextest-docs> Extracted 22 files to /build/nextest-archive-YssPb5 in 0.27s
41.75 s
gammaloop-nextest-docs> ------------
41.75 s
gammaloop-nextest-docs> Nextest run ID 9438eb82-3fc6-48f7-85d5-b53b7dc1b5b0 with nextest profile: ci_gammaloop
41.75 s
gammaloop-nextest-docs> Starting 89 tests across 1 binary
41.83 s
gammaloop-nextest-docs> ------------
41.83 s
gammaloop-nextest-docs> Summary [ 0.081s] 89 tests run: 89 passed , 0 skipped
41.91 s
gammaloop-nextest-docs>
41.91 s
gammaloop-nextest-docs> ========== nextest test summary ==========
41.91 s
gammaloop-nextest-docs> report: target/nextest/ci_gammaloop/junit.xml
41.91 s
gammaloop-nextest-docs> tests: 89, failures: 0, errors: 0
41.91 s
gammaloop-nextest-docs> No failing testcases found.
41.91 s
gammaloop-nextest-docs> =========================================
41.92 s
gammaloop-nextest-docs> Extracting 2 binaries to /build/nextest-archive-Cl6Jru
41.97 s
gammaloop-nextest-docs> Extracted 5 files to /build/nextest-archive-Cl6Jru in 0.05s
41.98 s
gammaloop-nextest-docs> ------------
41.98 s
gammaloop-nextest-docs> Nextest run ID c9673d64-bfc5-4041-be7d-7cb3b3d1bbfc with nextest profile: ci_gammaloop
41.98 s
gammaloop-nextest-docs> Starting 10 tests across 2 binaries
59.53 s
gammaloop-nextest-docs> ------------
59.53 s
gammaloop-nextest-docs> Summary [ 17.549s] 10 tests run: 10 passed , 0 skipped
59.57 s
gammaloop-nextest-docs>
59.57 s
gammaloop-nextest-docs> ========== nextest test summary ==========
59.57 s
gammaloop-nextest-docs> report: target/nextest/ci_gammaloop/junit.xml
59.57 s
gammaloop-nextest-docs> tests: 10, failures: 0, errors: 0
59.57 s
gammaloop-nextest-docs> No failing testcases found.
59.57 s
gammaloop-nextest-docs> =========================================
59.60 s
gammaloop-nextest-docs> Extracting 1 binary to /build/nextest-archive-x2Ig9A
59.64 s
gammaloop-nextest-docs> Extracted 4 files to /build/nextest-archive-x2Ig9A in 0.04s
59.65 s
gammaloop-nextest-docs> ------------
59.65 s
gammaloop-nextest-docs> Nextest run ID 4ee0d097-7e56-47c0-812a-685e7b7a77b6 with nextest profile: ci_gammaloop
59.65 s
gammaloop-nextest-docs> Starting 0 tests across 1 binary
59.65 s
gammaloop-nextest-docs> ------------
59.65 s
gammaloop-nextest-docs> Summary [ 0.002s] 0 tests run: 0 passed , 0 skipped
59.70 s
gammaloop-nextest-docs>
59.70 s
gammaloop-nextest-docs> ========== nextest test summary ==========
59.70 s
gammaloop-nextest-docs> report: target/nextest/ci_gammaloop/junit.xml
59.70 s
gammaloop-nextest-docs> tests: 0, failures: 0, errors: 0
59.70 s
gammaloop-nextest-docs> No failing testcases found.
59.70 s
gammaloop-nextest-docs> =========================================
59.72 s
gammaloop-nextest-docs> Extracting 1 binary to /build/nextest-archive-Dtr94Y
59.77 s
gammaloop-nextest-docs> Extracted 4 files to /build/nextest-archive-Dtr94Y in 0.04s
59.79 s
gammaloop-nextest-docs> ------------
59.79 s
gammaloop-nextest-docs> Nextest run ID dc2e57cc-9c7f-4585-b867-f2305b4d5112 with nextest profile: ci_gammaloop
59.79 s
gammaloop-nextest-docs> Starting 4 tests across 1 binary
59.81 s
gammaloop-nextest-docs> ------------
59.81 s
gammaloop-nextest-docs> Summary [ 0.022s] 4 tests run: 4 passed , 0 skipped
59.87 s
gammaloop-nextest-docs>
59.87 s
gammaloop-nextest-docs> ========== nextest test summary ==========
59.87 s
gammaloop-nextest-docs> report: target/nextest/ci_gammaloop/junit.xml
59.87 s
gammaloop-nextest-docs> tests: 4, failures: 0, errors: 0
59.87 s
gammaloop-nextest-docs> No failing testcases found.
59.87 s
gammaloop-nextest-docs> =========================================
60.13 s
[0 built (1 failed ), 41 error: Cannot build '/nix/store/97637lakc6i3dvs2xjwvp87fmqr4wngc-gammaloop-nextest-docs.drv '.
60.13 s
Reason: builder failed with exit code 100 .
60.13 s
Output paths:
60.13 s
/nix/store/z1xh981kw745hgllv03mrbf9cyaf6c35-gammaloop-nextest-docs
60.13 s
Last 537 log lines:
60.13 s
> Extracting 2 binaries to /build/nextest-archive-vo48A0
60.13 s
> Extracted 5 files to /build/nextest-archive-vo48A0 in 0.05s
60.13 s
> ------------
60.13 s
> Nextest run ID 455ac845-1960-4d7d-b8e4-2b565fac3833 with nextest profile: ci_gammaloop
60.13 s
> Starting 119 tests across 2 binaries
60.13 s
> FAIL [ 0.014s] ( 23/119) alphal00p-docs-builder tests :: developer_architecture_is_classified_searchable_and_source_backed
60.13 s
> stdout ---
60.13 s
>
60.13 s
> running 1 test
60.13 s
> test tests::developer_architecture_is_classified_searchable_and_source_backed ... FAILED
60.13 s
>
60.13 s
> failures:
60.13 s
>
60.13 s
> failures:
60.13 s
> tests::developer_architecture_is_classified_searchable_and_source_backed
60.13 s
>
60.13 s
> test result: FAILED. 0 passed; 1 failed; 0 ignored; 0 measured; 118 filtered out; finished in 0.01s
60.13 s
>
60.13 s
> stderr ---
60.13 s
>
60.13 s
> thread 'tests::developer_architecture_is_classified_searchable_and_source_backed' (243) panicked at crates/alphal00p-docs-builder/src/lib.rs:12354:14:
60.13 s
> called `Result::unwrap()` on an `Err` value: cannot determine the documented Git commit; set ALPHAL00P_DOCS_GIT_COMMIT
60.13 s
>
60.13 s
> Location:
60.13 s
> crates/alphal00p-docs-builder/src/lib.rs:4137:9
60.13 s
> stack backtrace:
60.13 s
> 0: __rustc::rust_begin_unwind
60.13 s
> 1: core::panicking::panic_fmt
60.13 s
> 2: core::result::unwrap_failed
60.13 s
> 3: alphal00p_docs_builder::tests::developer_architecture_is_classified_searchable_and_source_backed
60.13 s
> 4: <alphal00p_docs_builder::tests::developer_architecture_is_classified_searchable_and_source_backed::{closure#0} as core::ops::function::FnOnce<()>>::call_once
60.13 s
> note: Some details are omitted, run with `RUST_BACKTRACE=full` for a verbose backtrace.
60.13 s
>
60.13 s
> FAIL [ 0.009s] ( 46/119) alphal00p-docs-builder tests :: persistent_rustdoc_target_rejects_symlink_escape
60.13 s
> stdout ---
60.13 s
>
60.13 s
> running 1 test
60.13 s
> test tests::persistent_rustdoc_target_rejects_symlink_escape ... FAILED
60.13 s
>
60.13 s
> failures:
60.13 s
>
60.13 s
> failures:
60.13 s
> tests::persistent_rustdoc_target_rejects_symlink_escape
60.13 s
>
60.13 s
> test result: FAILED. 0 passed; 1 failed; 0 ignored; 0 measured; 118 filtered out; finished in 0.00s
60.13 s
>
60.13 s
> stderr ---
60.13 s
>
60.13 s
> thread 'tests::persistent_rustdoc_target_rejects_symlink_escape' (343) panicked at crates/alphal00p-docs-builder/src/lib.rs:10490:82:
60.13 s
> called `Result::unwrap_err()` on an `Ok` value: "/build/.tmpuJkUdo/escape/cache/cargo-target-v1"
60.13 s
> stack backtrace:
60.13 s
> 0: __rustc::rust_begin_unwind
60.13 s
> 1: core::panicking::panic_fmt
60.13 s
> 2: core::result::unwrap_failed
60.13 s
> 3: alphal00p_docs_builder::tests::persistent_rustdoc_target_rejects_symlink_escape
60.13 s
> 4: <alphal00p_docs_builder::tests::persistent_rustdoc_target_rejects_symlink_escape::{closure#0} as core::ops::function::FnOnce<()>>::call_once
60.13 s
> note: Some details are omitted, run with `RUST_BACKTRACE=full` for a verbose backtrace.
60.13 s
>
60.14 s
> FAIL [ 0.007s] ( 47/119) alphal00p-docs-builder tests :: persistent_rustdoc_targets_reject_workspace_and_arbitrary_roots
60.14 s
> stdout ---
60.14 s
>
60.14 s
> running 1 test
60.14 s
> test tests::persistent_rustdoc_targets_reject_workspace_and_arbitrary_roots ... FAILED
60.14 s
>
60.14 s
> failures:
60.14 s
>
60.14 s
> failures:
60.14 s
> tests::persistent_rustdoc_targets_reject_workspace_and_arbitrary_roots
60.14 s
>
60.14 s
> test result: FAILED. 0 passed; 1 failed; 0 ignored; 0 measured; 118 filtered out; finished in 0.00s
60.14 s
>
60.14 s
> stderr ---
60.14 s
>
60.14 s
> thread 'tests::persistent_rustdoc_targets_reject_workspace_and_arbitrary_roots' (348) panicked at crates/alphal00p-docs-builder/src/lib.rs:10467:9:
60.14 s
> assertion failed: prepare_persistent_rustdoc_target(workspace, &arbitrary).is_err()
60.14 s
> stack backtrace:
60.14 s
> 0: __rustc::rust_begin_unwind
60.14 s
> 1: core::panicking::panic_fmt
60.14 s
> 2: core::panicking::panic
60.14 s
> 3: alphal00p_docs_builder::tests::persistent_rustdoc_targets_reject_workspace_and_arbitrary_roots
60.14 s
> 4: <alphal00p_docs_builder::tests::persistent_rustdoc_targets_reject_workspace_and_arbitrary_roots::{closure#0} as core::ops::function::FnOnce<()>>::call_once
60.14 s
> note: Some details are omitted, run with `RUST_BACKTRACE=full` for a verbose backtrace.
60.14 s
>
60.14 s
> FAIL [ 0.076s] ( 66/119) alphal00p-docs-builder tests :: portal_and_developer_pages_use_federated_search_and_feedback
60.14 s
> stdout ---
60.14 s
>
60.14 s
> running 1 test
60.14 s
> test tests::portal_and_developer_pages_use_federated_search_and_feedback ... FAILED
60.14 s
>
60.14 s
> failures:
60.14 s
>
60.14 s
> failures:
60.14 s
> tests::portal_and_developer_pages_use_federated_search_and_feedback
60.14 s
>
60.14 s
> test result: FAILED. 0 passed; 1 failed; 0 ignored; 0 measured; 118 filtered out; finished in 0.06s
60.14 s
>
60.14 s
> stderr ---
60.14 s
> warning: bundle export is experimental
60.14 s
> = hint: its behaviour may change at any time
60.14 s
> = hint: do not rely on this feature for production use cases
60.14 s
>
60.14 s
>
60.14 s
> thread 'tests::portal_and_developer_pages_use_federated_search_and_feedback' (366) panicked at crates/alphal00p-docs-builder/src/lib.rs:12758:14:
60.14 s
> called `Result::unwrap()` on an `Err` value: cannot determine the documented Git commit; set ALPHAL00P_DOCS_GIT_COMMIT
60.14 s
>
60.14 s
> Location:
60.14 s
> crates/alphal00p-docs-builder/src/lib.rs:4137:9
60.14 s
> stack backtrace:
60.14 s
> 0: __rustc::rust_begin_unwind
60.14 s
> 1: core::panicking::panic_fmt
60.14 s
> 2: core::result::unwrap_failed
60.14 s
> 3: alphal00p_docs_builder::tests::portal_and_developer_pages_use_federated_search_and_feedback
60.14 s
> 4: <alphal00p_docs_builder::tests::portal_and_developer_pages_use_federated_search_and_feedback::{closure#0} as core::ops::function::FnOnce<()>>::call_once
60.14 s
> note: Some details are omitted, run with `RUST_BACKTRACE=full` for a verbose backtrace.
60.14 s
>
60.14 s
> FAIL [ 14.876s] (118/119) alphal00p-docs-builder tests :: every_product_orients_rust_to_native_rustdoc_and_keeps_legacy_redirects
60.14 s
> stdout ---
60.14 s
>
60.14 s
> running 1 test
60.14 s
> test tests::every_product_orients_rust_to_native_rustdoc_and_keeps_legacy_redirects ... FAILED
60.14 s
>
60.14 s
> failures:
60.14 s
>
60.14 s
> failures:
60.14 s
> tests::every_product_orients_rust_to_native_rustdoc_and_keeps_legacy_redirects
60.14 s
>
60.14 s
> test result: FAILED. 0 passed; 1 failed; 0 ignored; 0 measured; 118 filtered out; finished in 14.87s
60.14 s
>
60.14 s
> stderr ---
60.14 s
>
60.14 s
> thread 'tests::every_product_orients_rust_to_native_rustdoc_and_keeps_legacy_redirects' (259) panicked at crates/alphal00p-docs-builder/src/lib.rs:12166:18:
60.14 s
> called `Result::unwrap()` on an `Err` value: cannot determine the documented Git commit; set ALPHAL00P_DOCS_GIT_COMMIT
60.14 s
>
60.14 s
> Location:
60.14 s
> crates/alphal00p-docs-builder/src/lib.rs:2054:9
60.14 s
> stack backtrace:
60.14 s
> 0: __rustc::rust_begin_unwind
60.14 s
> 1: core::panicking::panic_fmt
60.14 s
> 2: core::result::unwrap_failed
60.14 s
> 3: alphal00p_docs_builder::tests::every_product_orients_rust_to_native_rustdoc_and_keeps_legacy_redirects
60.14 s
> 4: <alphal00p_docs_builder::tests::every_product_orients_rust_to_native_rustdoc_and_keeps_legacy_redirects::{closure#0} as core::ops::function::FnOnce<()>>::call_once
60.14 s
> note: Some details are omitted, run with `RUST_BACKTRACE=full` for a verbose backtrace.
60.14 s
>
60.14 s
> ------------
60.14 s
> Summary [ 18.285s] 119 tests run: 114 passed , 5 failed , 0 skipped
60.14 s
> FAIL [ 0.014s] ( 23/119) alphal00p-docs-builder tests :: developer_architecture_is_classified_searchable_and_source_backed
60.14 s
> stdout ---
60.14 s
>
60.14 s
> running 1 test
60.14 s
> test tests::developer_architecture_is_classified_searchable_and_source_backed ... FAILED
60.14 s
>
60.14 s
> failures:
60.14 s
>
60.14 s
> failures:
60.14 s
> tests::developer_architecture_is_classified_searchable_and_source_backed
60.14 s
>
60.14 s
> test result: FAILED. 0 passed; 1 failed; 0 ignored; 0 measured; 118 filtered out; finished in 0.01s
60.14 s
>
60.14 s
> stderr ---
60.14 s
>
60.14 s
> thread 'tests::developer_architecture_is_classified_searchable_and_source_backed' (243) panicked at crates/alphal00p-docs-builder/src/lib.rs:12354:14:
60.14 s
> called `Result::unwrap()` on an `Err` value: cannot determine the documented Git commit; set ALPHAL00P_DOCS_GIT_COMMIT
60.14 s
>
60.14 s
> Location:
60.14 s
> crates/alphal00p-docs-builder/src/lib.rs:4137:9
60.14 s
> stack backtrace:
60.14 s
> 0: __rustc::rust_begin_unwind
60.14 s
> 1: core::panicking::panic_fmt
60.14 s
> 2: core::result::unwrap_failed
60.14 s
> 3: alphal00p_docs_builder::tests::developer_architecture_is_classified_searchable_and_source_backed
60.14 s
> 4: <alphal00p_docs_builder::tests::developer_architecture_is_classified_searchable_and_source_backed::{closure#0} as core::ops::function::FnOnce<()>>::call_once
60.14 s
> note: Some details are omitted, run with `RUST_BACKTRACE=full` for a verbose backtrace.
60.14 s
>
60.14 s
> FAIL [ 0.009s] ( 46/119) alphal00p-docs-builder tests :: persistent_rustdoc_target_rejects_symlink_escape
60.14 s
> stdout ---
60.14 s
>
60.14 s
> running 1 test
60.14 s
> test tests::persistent_rustdoc_target_rejects_symlink_escape ... FAILED
60.14 s
>
60.14 s
> failures:
60.14 s
>
60.14 s
> failures:
60.14 s
> tests::persistent_rustdoc_target_rejects_symlink_escape
60.14 s
>
60.14 s
> test result: FAILED. 0 passed; 1 failed; 0 ignored; 0 measured; 118 filtered out; finished in 0.00s
60.14 s
>
60.14 s
> stderr ---
60.14 s
>
60.14 s
> thread 'tests::persistent_rustdoc_target_rejects_symlink_escape' (343) panicked at crates/alphal00p-docs-builder/src/lib.rs:10490:82:
60.14 s
> called `Result::unwrap_err()` on an `Ok` value: "/build/.tmpuJkUdo/escape/cache/cargo-target-v1"
60.14 s
> stack backtrace:
60.14 s
> 0: __rustc::rust_begin_unwind
60.14 s
> 1: core::panicking::panic_fmt
60.14 s
> 2: core::result::unwrap_failed
60.14 s
> 3: alphal00p_docs_builder::tests::persistent_rustdoc_target_rejects_symlink_escape
60.14 s
> 4: <alphal00p_docs_builder::tests::persistent_rustdoc_target_rejects_symlink_escape::{closure#0} as core::ops::function::FnOnce<()>>::call_once
60.14 s
> note: Some details are omitted, run with `RUST_BACKTRACE=full` for a verbose backtrace.
60.14 s
>
60.14 s
> FAIL [ 0.007s] ( 47/119) alphal00p-docs-builder tests :: persistent_rustdoc_targets_reject_workspace_and_arbitrary_roots
60.14 s
> stdout ---
60.14 s
>
60.14 s
> running 1 test
60.14 s
> test tests::persistent_rustdoc_targets_reject_workspace_and_arbitrary_roots ... FAILED
60.14 s
>
60.14 s
> failures:
60.14 s
>
60.14 s
> failures:
60.14 s
> tests::persistent_rustdoc_targets_reject_workspace_and_arbitrary_roots
60.14 s
>
60.14 s
> test result: FAILED. 0 passed; 1 failed; 0 ignored; 0 measured; 118 filtered out; finished in 0.00s
60.14 s
>
60.14 s
> stderr ---
60.14 s
>
60.14 s
> thread 'tests::persistent_rustdoc_targets_reject_workspace_and_arbitrary_roots' (348) panicked at crates/alphal00p-docs-builder/src/lib.rs:10467:9:
60.14 s
> assertion failed: prepare_persistent_rustdoc_target(workspace, &arbitrary).is_err()
60.14 s
> stack backtrace:
60.14 s
> 0: __rustc::rust_begin_unwind
60.14 s
> 1: core::panicking::panic_fmt
60.14 s
> 2: core::panicking::panic
60.14 s
> 3: alphal00p_docs_builder::tests::persistent_rustdoc_targets_reject_workspace_and_arbitrary_roots
60.14 s
> 4: <alphal00p_docs_builder::tests::persistent_rustdoc_targets_reject_workspace_and_arbitrary_roots::{closure#0} as core::ops::function::FnOnce<()>>::call_once
60.14 s
> note: Some details are omitted, run with `RUST_BACKTRACE=full` for a verbose backtrace.
60.14 s
>
60.14 s
> FAIL [ 0.076s] ( 66/119) alphal00p-docs-builder tests :: portal_and_developer_pages_use_federated_search_and_feedback
60.14 s
> stdout ---
60.14 s
>
60.14 s
> running 1 test
60.14 s
> test tests::portal_and_developer_pages_use_federated_search_and_feedback ... FAILED
60.14 s
>
60.14 s
> failures:
60.14 s
>
60.14 s
> failures:
60.14 s
> tests::portal_and_developer_pages_use_federated_search_and_feedback
60.14 s
>
60.14 s
> test result: FAILED. 0 passed; 1 failed; 0 ignored; 0 measured; 118 filtered out; finished in 0.06s
60.14 s
>
60.14 s
> stderr ---
60.14 s
> warning: bundle export is experimental
60.14 s
> = hint: its behaviour may change at any time
60.14 s
> = hint: do not rely on this feature for production use cases
60.14 s
>
60.14 s
>
60.14 s
> thread 'tests::portal_and_developer_pages_use_federated_search_and_feedback' (366) panicked at crates/alphal00p-docs-builder/src/lib.rs:12758:14:
60.14 s
> called `Result::unwrap()` on an `Err` value: cannot determine the documented Git commit; set ALPHAL00P_DOCS_GIT_COMMIT
60.14 s
>
60.14 s
> Location:
60.14 s
> crates/alphal00p-docs-builder/src/lib.rs:4137:9
60.14 s
> stack backtrace:
60.14 s
> 0: __rustc::rust_begin_unwind
60.14 s
> 1: core::panicking::panic_fmt
60.14 s
> 2: core::result::unwrap_failed
60.14 s
> 3: alphal00p_docs_builder::tests::portal_and_developer_pages_use_federated_search_and_feedback
60.14 s
> 4: <alphal00p_docs_builder::tests::portal_and_developer_pages_use_federated_search_and_feedback::{closure#0} as core::ops::function::FnOnce<()>>::call_once
60.14 s
> note: Some details are omitted, run with `RUST_BACKTRACE=full` for a verbose backtrace.
60.14 s
>
60.14 s
> FAIL [ 14.876s] (118/119) alphal00p-docs-builder tests :: every_product_orients_rust_to_native_rustdoc_and_keeps_legacy_redirects
60.14 s
> stdout ---
60.14 s
>
60.14 s
> running 1 test
60.14 s
> test tests::every_product_orients_rust_to_native_rustdoc_and_keeps_legacy_redirects ... FAILED
60.14 s
>
60.14 s
> failures:
60.14 s
>
60.14 s
> failures:
60.14 s
> tests::every_product_orients_rust_to_native_rustdoc_and_keeps_legacy_redirects
60.14 s
>
60.14 s
> test result: FAILED. 0 passed; 1 failed; 0 ignored; 0 measured; 118 filtered out; finished in 14.87s
60.14 s
>
60.14 s
> stderr ---
60.14 s
>
60.14 s
> thread 'tests::every_product_orients_rust_to_native_rustdoc_and_keeps_legacy_redirects' (259) panicked at crates/alphal00p-docs-builder/src/lib.rs:12166:18:
60.14 s
> called `Result::unwrap()` on an `Err` value: cannot determine the documented Git commit; set ALPHAL00P_DOCS_GIT_COMMIT
60.14 s
>
60.14 s
> Location:
60.14 s
> crates/alphal00p-docs-builder/src/lib.rs:2054:9
60.14 s
> stack backtrace:
60.14 s
> 0: __rustc::rust_begin_unwind
60.14 s
> 1: core::panicking::panic_fmt
60.14 s
> 2: core::result::unwrap_failed
60.14 s
> 3: alphal00p_docs_builder::tests::every_product_orients_rust_to_native_rustdoc_and_keeps_legacy_redirects
60.14 s
> 4: <alphal00p_docs_builder::tests::every_product_orients_rust_to_native_rustdoc_and_keeps_legacy_redirects::{closure#0} as core::ops::function::FnOnce<()>>::call_once
60.14 s
> note: Some details are omitted, run with `RUST_BACKTRACE=full` for a verbose backtrace.
60.14 s
>
60.14 s
> error : test run failed
60.14 s
>
60.14 s
> ========== nextest test summary ==========
60.14 s
> report: target/nextest/ci_gammaloop/junit.xml
60.14 s
> tests: 119, failures: 5, errors: 0
60.14 s
>
60.14 s
> 1. alphal00p-docs-builder::tests::developer_architecture_is_classified_searchable_and_source_backed
60.14 s
> failure: test failure with exit code 101
60.14 s
> thread 'tests::developer_architecture_is_classified_searchable_and_source_backed' (243) panicked at crates/alphal00p-docs-builder/src/lib.rs:12354:14:
60.14 s
> called `Result::unwrap()` on an `Err` value: cannot determine the documented Git commit; set ALPHAL00P_DOCS_GIT_COMMIT
60.14 s
>
60.14 s
> Location:
60.14 s
> crates/alphal00p-docs-builder/src/lib.rs:4137:9
60.14 s
> stack backtrace:
60.14 s
> 0: __rustc::rust_begin_unwind
60.14 s
> 1: core::panicking::panic_fmt
60.14 s
> 2: core::result::unwrap_failed
60.14 s
> 3: alphal00p_docs_builder::tests::developer_architecture_is_classified_searchable_and_source_backed
60.14 s
> 4: <alphal00p_docs_builder::tests::developer_architecture_is_classified_searchable_and_source_backed::{closure#0} as core::ops::function::FnOnce<()>>::call_once
60.14 s
> note: Some details are omitted, run with `RUST_BACKTRACE=full` for a verbose backtrace.
60.14 s
> system-out
60.14 s
> running 1 test
60.14 s
> test tests::developer_architecture_is_classified_searchable_and_source_backed ... FAILED
60.14 s
>
60.14 s
> failures:
60.14 s
>
60.14 s
> failures:
60.14 s
> tests::developer_architecture_is_classified_searchable_and_source_backed
60.14 s
>
60.14 s
> test result: FAILED. 0 passed; 1 failed; 0 ignored; 0 measured; 118 filtered out; finished in 0.01s
60.14 s
> system-err
60.14 s
> thread 'tests::developer_architecture_is_classified_searchable_and_source_backed' (243) panicked at crates/alphal00p-docs-builder/src/lib.rs:12354:14:
60.14 s
> called `Result::unwrap()` on an `Err` value: cannot determine the documented Git commit; set ALPHAL00P_DOCS_GIT_COMMIT
60.14 s
>
60.14 s
> Location:
60.14 s
> crates/alphal00p-docs-builder/src/lib.rs:4137:9
60.14 s
> stack backtrace:
60.14 s
> 0: __rustc::rust_begin_unwind
60.14 s
> 1: core::panicking::panic_fmt
60.14 s
> 2: core::result::unwrap_failed
60.14 s
> 3: alphal00p_docs_builder::tests::developer_architecture_is_classified_searchable_and_source_backed
60.14 s
> 4: <alphal00p_docs_builder::tests::developer_architecture_is_classified_searchable_and_source_backed::{closure#0} as core::ops::function::FnOnce<()>>::call_once
60.14 s
> note: Some details are omitted, run with `RUST_BACKTRACE=full` for a verbose backtrace.
60.14 s
>
60.14 s
> 2. alphal00p-docs-builder::tests::persistent_rustdoc_target_rejects_symlink_escape
60.14 s
> failure: test failure with exit code 101
60.14 s
> thread 'tests::persistent_rustdoc_target_rejects_symlink_escape' (343) panicked at crates/alphal00p-docs-builder/src/lib.rs:10490:82:
60.14 s
> called `Result::unwrap_err()` on an `Ok` value: "/build/.tmpuJkUdo/escape/cache/cargo-target-v1"
60.14 s
> stack backtrace:
60.14 s
> 0: __rustc::rust_begin_unwind
60.14 s
> 1: core::panicking::panic_fmt
60.14 s
> 2: core::result::unwrap_failed
60.14 s
> 3: alphal00p_docs_builder::tests::persistent_rustdoc_target_rejects_symlink_escape
60.14 s
> 4: <alphal00p_docs_builder::tests::persistent_rustdoc_target_rejects_symlink_escape::{closure#0} as core::ops::function::FnOnce<()>>::call_once
60.14 s
> note: Some details are omitted, run with `RUST_BACKTRACE=full` for a verbose backtrace.
60.14 s
> system-out
60.14 s
> running 1 test
60.14 s
> test tests::persistent_rustdoc_target_rejects_symlink_escape ... FAILED
60.14 s
>
60.14 s
> failures:
60.14 s
>
60.14 s
> failures:
60.14 s
> tests::persistent_rustdoc_target_rejects_symlink_escape
60.14 s
>
60.14 s
> test result: FAILED. 0 passed; 1 failed; 0 ignored; 0 measured; 118 filtered out; finished in 0.00s
60.14 s
> system-err
60.14 s
> thread 'tests::persistent_rustdoc_target_rejects_symlink_escape' (343) panicked at crates/alphal00p-docs-builder/src/lib.rs:10490:82:
60.14 s
> called `Result::unwrap_err()` on an `Ok` value: "/build/.tmpuJkUdo/escape/cache/cargo-target-v1"
60.14 s
> stack backtrace:
60.14 s
> 0: __rustc::rust_begin_unwind
60.14 s
> 1: core::panicking::panic_fmt
60.14 s
> 2: core::result::unwrap_failed
60.14 s
> 3: alphal00p_docs_builder::tests::persistent_rustdoc_target_rejects_symlink_escape
60.14 s
> 4: <alphal00p_docs_builder::tests::persistent_rustdoc_target_rejects_symlink_escape::{closure#0} as core::ops::function::FnOnce<()>>::call_once
60.14 s
> note: Some details are omitted, run with `RUST_BACKTRACE=full` for a verbose backtrace.
60.14 s
>
60.14 s
> 3. alphal00p-docs-builder::tests::persistent_rustdoc_targets_reject_workspace_and_arbitrary_roots
60.14 s
> failure: test failure with exit code 101
60.14 s
> thread 'tests::persistent_rustdoc_targets_reject_workspace_and_arbitrary_roots' (348) panicked at crates/alphal00p-docs-builder/src/lib.rs:10467:9:
60.14 s
> assertion failed: prepare_persistent_rustdoc_target(workspace, &arbitrary).is_err()
60.14 s
> stack backtrace:
60.14 s
> 0: __rustc::rust_begin_unwind
60.14 s
> 1: core::panicking::panic_fmt
60.14 s
> 2: core::panicking::panic
60.14 s
> 3: alphal00p_docs_builder::tests::persistent_rustdoc_targets_reject_workspace_and_arbitrary_roots
60.14 s
> 4: <alphal00p_docs_builder::tests::persistent_rustdoc_targets_reject_workspace_and_arbitrary_roots::{closure#0} as core::ops::function::FnOnce<()>>::call_once
60.14 s
> note: Some details are omitted, run with `RUST_BACKTRACE=full` for a verbose backtrace.
60.14 s
> system-out
60.14 s
> running 1 test
60.14 s
> test tests::persistent_rustdoc_targets_reject_workspace_and_arbitrary_roots ... FAILED
60.14 s
>
60.14 s
> failures:
60.14 s
>
60.14 s
> failures:
60.14 s
> tests::persistent_rustdoc_targets_reject_workspace_and_arbitrary_roots
60.14 s
>
60.14 s
> test result: FAILED. 0 passed; 1 failed; 0 ignored; 0 measured; 118 filtered out; finished in 0.00s
60.14 s
> system-err
60.14 s
> thread 'tests::persistent_rustdoc_targets_reject_workspace_and_arbitrary_roots' (348) panicked at crates/alphal00p-docs-builder/src/lib.rs:10467:9:
60.14 s
> assertion failed: prepare_persistent_rustdoc_target(workspace, &arbitrary).is_err()
60.14 s
> stack backtrace:
60.14 s
> 0: __rustc::rust_begin_unwind
60.14 s
> 1: core::panicking::panic_fmt
60.14 s
> 2: core::panicking::panic
60.14 s
> 3: alphal00p_docs_builder::tests::persistent_rustdoc_targets_reject_workspace_and_arbitrary_roots
60.14 s
> 4: <alphal00p_docs_builder::tests::persistent_rustdoc_targets_reject_workspace_and_arbitrary_roots::{closure#0} as core::ops::function::FnOnce<()>>::call_once
60.14 s
> note: Some details are omitted, run with `RUST_BACKTRACE=full` for a verbose backtrace.
60.14 s
>
60.14 s
> 4. alphal00p-docs-builder::tests::portal_and_developer_pages_use_federated_search_and_feedback
60.14 s
> failure: test failure with exit code 101
60.14 s
> thread 'tests::portal_and_developer_pages_use_federated_search_and_feedback' (366) panicked at crates/alphal00p-docs-builder/src/lib.rs:12758:14:
60.14 s
> called `Result::unwrap()` on an `Err` value: cannot determine the documented Git commit; set ALPHAL00P_DOCS_GIT_COMMIT
60.14 s
>
60.14 s
> Location:
60.14 s
> crates/alphal00p-docs-builder/src/lib.rs:4137:9
60.14 s
> stack backtrace:
60.14 s
> 0: __rustc::rust_begin_unwind
60.14 s
> 1: core::panicking::panic_fmt
60.14 s
> 2: core::result::unwrap_failed
60.14 s
> 3: alphal00p_docs_builder::tests::portal_and_developer_pages_use_federated_search_and_feedback
60.14 s
> 4: <alphal00p_docs_builder::tests::portal_and_developer_pages_use_federated_search_and_feedback::{closure#0} as core::ops::function::FnOnce<()>>::call_once
60.14 s
> note: Some details are omitted, run with `RUST_BACKTRACE=full` for a verbose backtrace.
60.14 s
> system-out
60.14 s
> running 1 test
60.14 s
> test tests::portal_and_developer_pages_use_federated_search_and_feedback ... FAILED
60.14 s
>
60.14 s
> failures:
60.14 s
>
60.14 s
> failures:
60.14 s
> tests::portal_and_developer_pages_use_federated_search_and_feedback
60.14 s
>
60.14 s
> test result: FAILED. 0 passed; 1 failed; 0 ignored; 0 measured; 118 filtered out; finished in 0.06s
60.14 s
> system-err
60.14 s
> warning: bundle export is experimental
60.14 s
> = hint: its behaviour may change at any time
60.14 s
> = hint: do not rely on this feature for production use cases
60.14 s
>
60.14 s
>
60.14 s
> thread 'tests::portal_and_developer_pages_use_federated_search_and_feedback' (366) panicked at crates/alphal00p-docs-builder/src/lib.rs:12758:14:
60.14 s
> called `Result::unwrap()` on an `Err` value: cannot determine the documented Git commit; set ALPHAL00P_DOCS_GIT_COMMIT
60.14 s
>
60.14 s
> Location:
60.14 s
> crates/alphal00p-docs-builder/src/lib.rs:4137:9
60.14 s
> stack backtrace:
60.14 s
> 0: __rustc::rust_begin_unwind
60.14 s
> 1: core::panicking::panic_fmt
60.14 s
> 2: core::result::unwrap_failed
60.14 s
> 3: alphal00p_docs_builder::tests::portal_and_developer_pages_use_federated_search_and_feedback
60.14 s
> 4: <alphal00p_docs_builder::tests::portal_and_developer_pages_use_federated_search_and_feedback::{closure#0} as core::ops::function::FnOnce<()>>::call_once
60.14 s
> note: Some details are omitted, run with `RUST_BACKTRACE=full` for a verbose backtrace.
60.14 s
>
60.14 s
> 5. alphal00p-docs-builder::tests::every_product_orients_rust_to_native_rustdoc_and_keeps_legacy_redirects
60.14 s
> failure: test failure with exit code 101
60.14 s
> thread 'tests::every_product_orients_rust_to_native_rustdoc_and_keeps_legacy_redirects' (259) panicked at crates/alphal00p-docs-builder/src/lib.rs:12166:18:
60.14 s
> called `Result::unwrap()` on an `Err` value: cannot determine the documented Git commit; set ALPHAL00P_DOCS_GIT_COMMIT
60.14 s
>
60.14 s
> Location:
60.14 s
> crates/alphal00p-docs-builder/src/lib.rs:2054:9
60.14 s
> stack backtrace:
60.14 s
> 0: __rustc::rust_begin_unwind
60.14 s
> 1: core::panicking::panic_fmt
60.14 s
> 2: core::result::unwrap_failed
60.14 s
> 3: alphal00p_docs_builder::tests::every_product_orients_rust_to_native_rustdoc_and_keeps_legacy_redirects
60.14 s
> 4: <alphal00p_docs_builder::tests::every_product_orients_rust_to_native_rustdoc_and_keeps_legacy_redirects::{closure#0} as core::ops::function::FnOnce<()>>::call_once
60.14 s
> note: Some details are omitted, run with `RUST_BACKTRACE=full` for a verbose backtrace.
60.14 s
> system-out
60.14 s
> running 1 test
60.14 s
> test tests::every_product_orients_rust_to_native_rustdoc_and_keeps_legacy_redirects ... FAILED
60.14 s
>
60.14 s
> failures:
60.14 s
>
60.14 s
> failures:
60.14 s
> tests::every_product_orients_rust_to_native_rustdoc_and_keeps_legacy_redirects
60.14 s
>
60.14 s
> test result: FAILED. 0 passed; 1 failed; 0 ignored; 0 measured; 118 filtered out; finished in 14.87s
60.14 s
> system-err
60.14 s
> thread 'tests::every_product_orients_rust_to_native_rustdoc_and_keeps_legacy_redirects' (259) panicked at crates/alphal00p-docs-builder/src/lib.rs:12166:18:
60.14 s
> called `Result::unwrap()` on an `Err` value: cannot determine the documented Git commit; set ALPHAL00P_DOCS_GIT_COMMIT
60.14 s
>
60.14 s
> Location:
60.14 s
> crates/alphal00p-docs-builder/src/lib.rs:2054:9
60.14 s
> stack backtrace:
60.14 s
> 0: __rustc::rust_begin_unwind
60.14 s
> 1: core::panicking::panic_fmt
60.14 s
> 2: core::result::unwrap_failed
60.14 s
> 3: alphal00p_docs_builder::tests::every_product_orients_rust_to_native_rustdoc_and_keeps_legacy_redirects
60.14 s
> 4: <alphal00p_docs_builder::tests::every_product_orients_rust_to_native_rustdoc_and_keeps_legacy_redirects::{closure#0} as core::ops::function::FnOnce<()>>::call_once
60.14 s
> note: Some details are omitted, run with `RUST_BACKTRACE=full` for a verbose backtrace.
60.14 s
> =========================================
60.14 s
> Extracting 2 binaries to /build/nextest-archive-MpCNs6
60.14 s
> Extracted 5 files to /build/nextest-archive-MpCNs6 in 0.05s
60.14 s
> ------------
60.14 s
> Nextest run ID 85fa3184-e2c4-462c-9e83-d3b2d811af9e with nextest profile: ci_gammaloop
60.14 s
> Starting 21 tests across 2 binaries
60.14 s
> ------------
60.14 s
> Summary [ 0.030s] 21 tests run: 21 passed , 0 skipped
60.14 s
>
60.14 s
> ========== nextest test summary ==========
60.14 s
> report: target/nextest/ci_gammaloop/junit.xml
60.14 s
> tests: 21, failures: 0, errors: 0
60.14 s
> No failing testcases found.
60.14 s
> =========================================
60.14 s
> Extracting 3 binaries (including 2 non-test binaries), 1 build script output directory, and 2 linked paths to /build/nextest-archive-YssPb5
60.14 s
> Extracted 22 files to /build/nextest-archive-YssPb5 in 0.27s
60.14 s
> ------------
60.14 s
> Nextest run ID 9438eb82-3fc6-48f7-85d5-b53b7dc1b5b0 with nextest profile: ci_gammaloop
60.14 s
> Starting 89 tests across 1 binary
60.14 s
> ------------
60.14 s
> Summary [ 0.081s] 89 tests run: 89 passed , 0 skipped
60.14 s
>
60.14 s
> ========== nextest test summary ==========
60.14 s
> report: target/nextest/ci_gammaloop/junit.xml
60.14 s
> tests: 89, failures: 0, errors: 0
60.14 s
> No failing testcases found.
60.14 s
> =========================================
60.14 s
> Extracting 2 binaries to /build/nextest-archive-Cl6Jru
60.14 s
> Extracted 5 files to /build/nextest-archive-Cl6Jru in 0.05s
60.14 s
> ------------
60.14 s
> Nextest run ID c9673d64-bfc5-4041-be7d-7cb3b3d1bbfc with nextest profile: ci_gammaloop
60.14 s
> Starting 10 tests across 2 binaries
60.14 s
> ------------
60.14 s
> Summary [ 17.549s] 10 tests run: 10 passed , 0 skipped
60.14 s
>
60.14 s
> ========== nextest test summary ==========
60.14 s
> report: target/nextest/ci_gammaloop/junit.xml
60.14 s
> tests: 10, failures: 0, errors: 0
60.14 s
> No failing testcases found.
60.14 s
> =========================================
60.14 s
> Extracting 1 binary to /build/nextest-archive-x2Ig9A
60.14 s
> Extracted 4 files to /build/nextest-archive-x2Ig9A in 0.04s
60.14 s
> ------------
60.14 s
> Nextest run ID 4ee0d097-7e56-47c0-812a-685e7b7a77b6 with nextest profile: ci_gammaloop
60.14 s
> Starting 0 tests across 1 binary
60.14 s
> ------------
60.14 s
> Summary [ 0.002s] 0 tests run: 0 passed , 0 skipped
60.14 s
>
60.14 s
> ========== nextest test summary ==========
60.14 s
> report: target/nextest/ci_gammaloop/junit.xml
60.14 s
> tests: 0, failures: 0, errors: 0
60.14 s
> No failing testcases found.
60.14 s
> =========================================
60.14 s
> Extracting 1 binary to /build/nextest-archive-Dtr94Y
60.14 s
> Extracted 4 files to /build/nextest-archive-Dtr94Y in 0.04s
60.14 s
> ------------
60.14 s
> Nextest run ID dc2e57cc-9c7f-4585-b867-f2305b4d5112 with nextest profile: ci_gammaloop
60.14 s
> Starting 4 tests across 1 binary
60.14 s
> ------------
60.14 s
> Summary [ 0.022s] 4 tests run: 4 passed , 0 skipped
60.14 s
>
60.14 s
> ========== nextest test summary ==========
60.14 s
> report: target/nextest/ci_gammaloop/junit.xml
60.14 s
> tests: 4, failures: 0, errors: 0
60.14 s
> No failing testcases found.
60.14 s
> =========================================
60.14 s
For full logs, run:
60.14 s
nix log /nix/store/97637lakc6i3dvs2xjwvp87fmqr4wngc-gammaloop-nextest-docs.drv
60.31 s
Run failed.