test packages.x86_64-linux.nix-ci-check-gammaloop-nextest-docs
0.00 s
$ /nix/store/9ypz3flqsrl5xl495mm8h645gadjsxi1-coreutils-9.11/bin/timeout --kill-after=15s 7200s /nix/store/23zk8sgzamrbmj1fday15szf7f2279s8-nix-2.34.7/bin/nix --extra-experimental-features nix-command --extra-experimental-features flakes flake clone git+https://github.com/alphal00p/gammaloop --dest /tmp/nix-ci-worker/stable-pwd/repo/
0.10 s
Cloning into '/tmp/nix-ci-worker/stable-pwd/repo'...
1.53 s
remote: Enumerating objects: 81893, done.
1.64 s
remote: Counting objects: 0% (1/11488)
remote: Counting objects: 1% (115/11488)
remote: Counting objects: 2% (230/11488)
remote: Counting objects: 3% (345/11488)
remote: Counting objects: 4% (460/11488)
remote: Counting objects: 5% (575/11488)
remote: Counting objects: 6% (690/11488)
remote: Counting objects: 7% (805/11488)
remote: Counting objects: 8% (920/11488)
remote: Counting objects: 9% (1034/11488)
remote: Counting objects: 10% (1149/11488)
remote: Counting objects: 11% (1264/11488)
remote: Counting objects: 12% (1379/11488)
remote: Counting objects: 13% (1494/11488)
remote: Counting objects: 14% (1609/11488)
remote: Counting objects: 15% (1724/11488)
remote: Counting objects: 16% (1839/11488)
remote: Counting objects: 17% (1953/11488)
remote: Counting objects: 18% (2068/11488)
remote: Counting objects: 19% (2183/11488)
remote: Counting objects: 20% (2298/11488)
remote: Counting objects: 21% (2413/11488)
remote: Counting objects: 22% (2528/11488)
remote: Counting objects: 23% (2643/11488)
remote: Counting objects: 24% (2758/11488)
remote: Counting objects: 25% (2872/11488)
remote: Counting objects: 26% (2987/11488)
remote: Counting objects: 27% (3102/11488)
remote: Counting objects: 28% (3217/11488)
remote: Counting objects: 29% (3332/11488)
remote: Counting objects: 30% (3447/11488)
remote: Counting objects: 31% (3562/11488)
remote: Counting objects: 32% (3677/11488)
remote: Counting objects: 33% (3792/11488)
remote: Counting objects: 34% (3906/11488)
remote: Counting objects: 35% (4021/11488)
remote: Counting objects: 36% (4136/11488)
remote: Counting objects: 37% (4251/11488)
remote: Counting objects: 38% (4366/11488)
remote: Counting objects: 39% (4481/11488)
remote: Counting objects: 40% (4596/11488)
remote: Counting objects: 41% (4711/11488)
remote: Counting objects: 42% (4825/11488)
remote: Counting objects: 43% (4940/11488)
remote: Counting objects: 44% (5055/11488)
remote: Counting objects: 45% (5170/11488)
remote: Counting objects: 46% (5285/11488)
remote: Counting objects: 47% (5400/11488)
remote: Counting objects: 48% (5515/11488)
remote: Counting objects: 49% (5630/11488)
remote: Counting objects: 50% (5744/11488)
remote: Counting objects: 51% (5859/11488)
remote: Counting objects: 52% (5974/11488)
remote: Counting objects: 53% (6089/11488)
remote: Counting objects: 54% (6204/11488)
remote: Counting objects: 55% (6319/11488)
remote: Counting objects: 56% (6434/11488)
remote: Counting objects: 57% (6549/11488)
remote: Counting objects: 58% (6664/11488)
remote: Counting objects: 59% (6778/11488)
remote: Counting objects: 60% (6893/11488)
remote: Counting objects: 61% (7008/11488)
remote: Counting objects: 62% (7123/11488)
remote: Counting objects: 63% (7238/11488)
remote: Counting objects: 64% (7353/11488)
remote: Counting objects: 65% (7468/11488)
remote: Counting objects: 66% (7583/11488)
remote: Counting objects: 67% (7697/11488)
remote: Counting objects: 68% (7812/11488)
remote: Counting objects: 69% (7927/11488)
remote: Counting objects: 70% (8042/11488)
remote: Counting objects: 71% (8157/11488)
remote: Counting objects: 72% (8272/11488)
remote: Counting objects: 73% (8387/11488)
remote: Counting objects: 74% (8502/11488)
remote: Counting objects: 75% (8616/11488)
remote: Counting objects: 76% (8731/11488)
remote: Counting objects: 77% (8846/11488)
remote: Counting objects: 78% (8961/11488)
remote: Counting objects: 79% (9076/11488)
remote: Counting objects: 80% (9191/11488)
remote: Counting objects: 81% (9306/11488)
remote: Counting objects: 82% (9421/11488)
remote: Counting objects: 83% (9536/11488)
remote: Counting objects: 84% (9650/11488)
remote: Counting objects: 85% (9765/11488)
remote: Counting objects: 86% (9880/11488)
remote: Counting objects: 87% (9995/11488)
remote: Counting objects: 88% (10110/11488)
remote: Counting objects: 89% (10225/11488)
remote: Counting objects: 90% (10340/11488)
remote: Counting objects: 91% (10455/11488)
remote: Counting objects: 92% (10569/11488)
remote: Counting objects: 93% (10684/11488)
remote: Counting objects: 94% (10799/11488)
remote: Counting objects: 95% (10914/11488)
remote: Counting objects: 96% (11029/11488)
remote: Counting objects: 97% (11144/11488)
remote: Counting objects: 98% (11259/11488)
remote: Counting objects: 99% (11374/11488)
remote: Counting objects: 100% (11488/11488)
remote: Counting objects: 100% (11488/11488), done.
4.49 s
remote: Compressing objects: 0% (1/2649)
remote: Compressing objects: 1% (27/2649)
remote: Compressing objects: 2% (53/2649)
remote: Compressing objects: 3% (80/2649)
remote: Compressing objects: 4% (106/2649)
remote: Compressing objects: 5% (133/2649)
remote: Compressing objects: 6% (159/2649)
remote: Compressing objects: 7% (186/2649)
remote: Compressing objects: 8% (212/2649)
remote: Compressing objects: 9% (239/2649)
remote: Compressing objects: 10% (265/2649)
remote: Compressing objects: 11% (292/2649)
remote: Compressing objects: 12% (318/2649)
remote: Compressing objects: 13% (345/2649)
remote: Compressing objects: 14% (371/2649)
remote: Compressing objects: 15% (398/2649)
remote: Compressing objects: 16% (424/2649)
remote: Compressing objects: 17% (451/2649)
remote: Compressing objects: 18% (477/2649)
remote: Compressing objects: 19% (504/2649)
remote: Compressing objects: 19% (522/2649)
remote: Compressing objects: 20% (530/2649)
remote: Compressing objects: 21% (557/2649)
remote: Compressing objects: 22% (583/2649)
remote: Compressing objects: 23% (610/2649)
remote: Compressing objects: 24% (636/2649)
remote: Compressing objects: 24% (637/2649)
remote: Compressing objects: 25% (663/2649)
remote: Compressing objects: 26% (689/2649)
remote: Compressing objects: 27% (716/2649)
remote: Compressing objects: 28% (742/2649)
remote: Compressing objects: 29% (769/2649)
remote: Compressing objects: 30% (795/2649)
remote: Compressing objects: 31% (822/2649)
remote: Compressing objects: 32% (848/2649)
remote: Compressing objects: 33% (875/2649)
remote: Compressing objects: 34% (901/2649)
remote: Compressing objects: 35% (928/2649)
remote: Compressing objects: 36% (954/2649)
remote: Compressing objects: 37% (981/2649)
remote: Compressing objects: 38% (1007/2649)
remote: Compressing objects: 39% (1034/2649)
remote: Compressing objects: 40% (1060/2649)
remote: Compressing objects: 41% (1087/2649)
remote: Compressing objects: 42% (1113/2649)
remote: Compressing objects: 43% (1140/2649)
remote: Compressing objects: 44% (1166/2649)
remote: Compressing objects: 45% (1193/2649)
remote: Compressing objects: 46% (1219/2649)
remote: Compressing objects: 47% (1246/2649)
remote: Compressing objects: 48% (1272/2649)
remote: Compressing objects: 49% (1299/2649)
remote: Compressing objects: 50% (1325/2649)
remote: Compressing objects: 51% (1351/2649)
remote: Compressing objects: 52% (1378/2649)
remote: Compressing objects: 53% (1404/2649)
remote: Compressing objects: 54% (1431/2649)
remote: Compressing objects: 55% (1457/2649)
remote: Compressing objects: 56% (1484/2649)
remote: Compressing objects: 57% (1510/2649)
remote: Compressing objects: 58% (1537/2649)
remote: Compressing objects: 59% (1563/2649)
remote: Compressing objects: 60% (1590/2649)
remote: Compressing objects: 61% (1616/2649)
remote: Compressing objects: 62% (1643/2649)
remote: Compressing objects: 63% (1669/2649)
remote: Compressing objects: 64% (1696/2649)
remote: Compressing objects: 65% (1722/2649)
remote: Compressing objects: 66% (1749/2649)
remote: Compressing objects: 67% (1775/2649)
remote: Compressing objects: 68% (1802/2649)
remote: Compressing objects: 69% (1828/2649)
remote: Compressing objects: 70% (1855/2649)
remote: Compressing objects: 71% (1881/2649)
remote: Compressing objects: 72% (1908/2649)
remote: Compressing objects: 73% (1934/2649)
remote: Compressing objects: 74% (1961/2649)
remote: Compressing objects: 75% (1987/2649)
remote: Compressing objects: 76% (2014/2649)
remote: Compressing objects: 77% (2040/2649)
remote: Compressing objects: 78% (2067/2649)
remote: Compressing objects: 79% (2093/2649)
remote: Compressing objects: 80% (2120/2649)
remote: Compressing objects: 81% (2146/2649)
remote: Compressing objects: 82% (2173/2649)
remote: Compressing objects: 83% (2199/2649)
remote: Compressing objects: 84% (2226/2649)
remote: Compressing objects: 85% (2252/2649)
remote: Compressing objects: 86% (2279/2649)
remote: Compressing objects: 87% (2305/2649)
remote: Compressing objects: 88% (2332/2649)
remote: Compressing objects: 89% (2358/2649)
remote: Compressing objects: 90% (2385/2649)
remote: Compressing objects: 91% (2411/2649)
remote: Compressing objects: 92% (2438/2649)
remote: Compressing objects: 93% (2464/2649)
remote: Compressing objects: 94% (2491/2649)
remote: Compressing objects: 95% (2517/2649)
remote: Compressing objects: 96% (2544/2649)
remote: Compressing objects: 97% (2570/2649)
remote: Compressing objects: 98% (2597/2649)
remote: Compressing objects: 99% (2623/2649)
remote: Compressing objects: 100% (2649/2649)
remote: Compressing objects: 100% (2649/2649), done.
8.38 s
Receiving objects: 0% (1/81893)
Receiving objects: 1% (819/81893)
Receiving objects: 2% (1638/81893)
Receiving objects: 3% (2457/81893)
Receiving objects: 4% (3276/81893)
Receiving objects: 5% (4095/81893)
Receiving objects: 6% (4914/81893)
Receiving objects: 7% (5733/81893)
Receiving objects: 8% (6552/81893)
Receiving objects: 9% (7371/81893), 12.20 MiB | 24.43 MiB/s
Receiving objects: 10% (8190/81893), 12.20 MiB | 24.43 MiB/s
Receiving objects: 11% (9009/81893), 12.20 MiB | 24.43 MiB/s
Receiving objects: 12% (9828/81893), 12.20 MiB | 24.43 MiB/s
Receiving objects: 13% (10647/81893), 12.20 MiB | 24.43 MiB/s
Receiving objects: 14% (11466/81893), 12.20 MiB | 24.43 MiB/s
Receiving objects: 15% (12284/81893), 12.20 MiB | 24.43 MiB/s
Receiving objects: 16% (13103/81893), 12.20 MiB | 24.43 MiB/s
Receiving objects: 17% (13922/81893), 12.20 MiB | 24.43 MiB/s
Receiving objects: 18% (14741/81893), 12.20 MiB | 24.43 MiB/s
Receiving objects: 19% (15560/81893), 12.20 MiB | 24.43 MiB/s
Receiving objects: 20% (16379/81893), 12.20 MiB | 24.43 MiB/s
Receiving objects: 21% (17198/81893), 12.20 MiB | 24.43 MiB/s
Receiving objects: 22% (18017/81893), 12.20 MiB | 24.43 MiB/s
Receiving objects: 23% (18836/81893), 12.20 MiB | 24.43 MiB/s
Receiving objects: 24% (19655/81893), 12.20 MiB | 24.43 MiB/s
Receiving objects: 25% (20474/81893), 12.20 MiB | 24.43 MiB/s
Receiving objects: 26% (21293/81893), 12.20 MiB | 24.43 MiB/s
Receiving objects: 27% (22112/81893), 12.20 MiB | 24.43 MiB/s
Receiving objects: 28% (22931/81893), 12.20 MiB | 24.43 MiB/s
Receiving objects: 29% (23749/81893), 12.20 MiB | 24.43 MiB/s
Receiving objects: 30% (24568/81893), 12.20 MiB | 24.43 MiB/s
Receiving objects: 31% (25387/81893), 12.20 MiB | 24.43 MiB/s
Receiving objects: 32% (26206/81893), 12.20 MiB | 24.43 MiB/s
Receiving objects: 33% (27025/81893), 12.20 MiB | 24.43 MiB/s
Receiving objects: 34% (27844/81893), 12.20 MiB | 24.43 MiB/s
Receiving objects: 35% (28663/81893), 12.20 MiB | 24.43 MiB/s
Receiving objects: 36% (29482/81893), 12.20 MiB | 24.43 MiB/s
Receiving objects: 37% (30301/81893), 12.20 MiB | 24.43 MiB/s
Receiving objects: 38% (31120/81893), 12.20 MiB | 24.43 MiB/s
Receiving objects: 39% (31939/81893), 12.20 MiB | 24.43 MiB/s
Receiving objects: 40% (32758/81893), 12.20 MiB | 24.43 MiB/s
Receiving objects: 41% (33577/81893), 12.20 MiB | 24.43 MiB/s
Receiving objects: 41% (33939/81893), 12.20 MiB | 24.43 MiB/s
Receiving objects: 42% (34396/81893), 32.94 MiB | 32.96 MiB/s
Receiving objects: 43% (35214/81893), 32.94 MiB | 32.96 MiB/s
Receiving objects: 44% (36033/81893), 32.94 MiB | 32.96 MiB/s
Receiving objects: 45% (36852/81893), 32.94 MiB | 32.96 MiB/s
Receiving objects: 46% (37671/81893), 32.94 MiB | 32.96 MiB/s
Receiving objects: 47% (38490/81893), 32.94 MiB | 32.96 MiB/s
Receiving objects: 48% (39309/81893), 32.94 MiB | 32.96 MiB/s
Receiving objects: 49% (40128/81893), 32.94 MiB | 32.96 MiB/s
Receiving objects: 50% (40947/81893), 49.52 MiB | 32.99 MiB/s
Receiving objects: 51% (41766/81893), 49.52 MiB | 32.99 MiB/s
Receiving objects: 52% (42585/81893), 49.52 MiB | 32.99 MiB/s
Receiving objects: 53% (43404/81893), 49.52 MiB | 32.99 MiB/s
Receiving objects: 54% (44223/81893), 49.52 MiB | 32.99 MiB/s
Receiving objects: 55% (45042/81893), 49.52 MiB | 32.99 MiB/s
Receiving objects: 56% (45861/81893), 49.52 MiB | 32.99 MiB/s
Receiving objects: 57% (46680/81893), 49.52 MiB | 32.99 MiB/s
Receiving objects: 58% (47498/81893), 49.52 MiB | 32.99 MiB/s
Receiving objects: 59% (48317/81893), 49.52 MiB | 32.99 MiB/s
Receiving objects: 59% (48653/81893), 66.18 MiB | 33.07 MiB/s
Receiving objects: 60% (49136/81893), 66.18 MiB | 33.07 MiB/s
Receiving objects: 61% (49955/81893), 66.18 MiB | 33.07 MiB/s
Receiving objects: 62% (50774/81893), 66.18 MiB | 33.07 MiB/s
Receiving objects: 63% (51593/81893), 66.18 MiB | 33.07 MiB/s
Receiving objects: 64% (52412/81893), 66.18 MiB | 33.07 MiB/s
Receiving objects: 65% (53231/81893), 66.18 MiB | 33.07 MiB/s
Receiving objects: 66% (54050/81893), 66.18 MiB | 33.07 MiB/s
Receiving objects: 67% (54869/81893), 66.18 MiB | 33.07 MiB/s
Receiving objects: 68% (55688/81893), 66.18 MiB | 33.07 MiB/s
Receiving objects: 69% (56507/81893), 66.18 MiB | 33.07 MiB/s
Receiving objects: 70% (57326/81893), 82.92 MiB | 33.15 MiB/s
Receiving objects: 71% (58145/81893), 82.92 MiB | 33.15 MiB/s
Receiving objects: 72% (58963/81893), 82.92 MiB | 33.15 MiB/s
Receiving objects: 73% (59782/81893), 82.92 MiB | 33.15 MiB/s
Receiving objects: 74% (60601/81893), 82.92 MiB | 33.15 MiB/s
Receiving objects: 75% (61420/81893), 82.92 MiB | 33.15 MiB/s
Receiving objects: 76% (62239/81893), 82.92 MiB | 33.15 MiB/s
Receiving objects: 76% (62597/81893), 99.34 MiB | 33.10 MiB/s
Receiving objects: 77% (63058/81893), 99.34 MiB | 33.10 MiB/s
Receiving objects: 78% (63877/81893), 99.34 MiB | 33.10 MiB/s
Receiving objects: 79% (64696/81893), 99.34 MiB | 33.10 MiB/s
Receiving objects: 80% (65515/81893), 99.34 MiB | 33.10 MiB/s
Receiving objects: 81% (66334/81893), 99.34 MiB | 33.10 MiB/s
Receiving objects: 82% (67153/81893), 99.34 MiB | 33.10 MiB/s
Receiving objects: 83% (67972/81893), 99.34 MiB | 33.10 MiB/s
Receiving objects: 84% (68791/81893), 99.34 MiB | 33.10 MiB/s
Receiving objects: 85% (69610/81893), 99.34 MiB | 33.10 MiB/s
Receiving objects: 86% (70428/81893), 99.34 MiB | 33.10 MiB/s
Receiving objects: 87% (71247/81893), 115.29 MiB | 32.93 MiB/s
Receiving objects: 88% (72066/81893), 115.29 MiB | 32.93 MiB/s
Receiving objects: 89% (72885/81893), 115.29 MiB | 32.93 MiB/s
Receiving objects: 90% (73704/81893), 115.29 MiB | 32.93 MiB/s
Receiving objects: 91% (74523/81893), 115.29 MiB | 32.93 MiB/s
Receiving objects: 92% (75342/81893), 115.29 MiB | 32.93 MiB/s
Receiving objects: 93% (76161/81893), 115.29 MiB | 32.93 MiB/s
Receiving objects: 94% (76980/81893), 115.29 MiB | 32.93 MiB/s
Receiving objects: 95% (77799/81893), 115.29 MiB | 32.93 MiB/s
Receiving objects: 96% (78618/81893), 115.29 MiB | 32.93 MiB/s
Receiving objects: 97% (79437/81893), 115.29 MiB | 32.93 MiB/s
Receiving objects: 98% (80256/81893), 115.29 MiB | 32.93 MiB/s
Receiving objects: 99% (81075/81893), 115.29 MiB | 32.93 MiB/s
remote: Total 81893 (delta 8914), reused 9443 (delta 8046), pack-reused 70405 (from 2)
8.38 s
Receiving objects: 100% (81893/81893), 115.29 MiB | 32.93 MiB/s
Receiving objects: 100% (81893/81893), 127.83 MiB | 32.95 MiB/s, done.
9.52 s
Resolving deltas: 0% (0/55395)
Resolving deltas: 1% (554/55395)
Resolving deltas: 2% (1108/55395)
Resolving deltas: 3% (1662/55395)
Resolving deltas: 4% (2216/55395)
Resolving deltas: 5% (2770/55395)
Resolving deltas: 6% (3325/55395)
Resolving deltas: 7% (3878/55395)
Resolving deltas: 8% (4432/55395)
Resolving deltas: 9% (4986/55395)
Resolving deltas: 10% (5541/55395)
Resolving deltas: 11% (6097/55395)
Resolving deltas: 12% (6648/55395)
Resolving deltas: 13% (7202/55395)
Resolving deltas: 14% (7757/55395)
Resolving deltas: 15% (8310/55395)
Resolving deltas: 16% (8864/55395)
Resolving deltas: 17% (9418/55395)
Resolving deltas: 18% (9972/55395)
Resolving deltas: 19% (10526/55395)
Resolving deltas: 20% (11079/55395)
Resolving deltas: 21% (11633/55395)
Resolving deltas: 22% (12188/55395)
Resolving deltas: 23% (12741/55395)
Resolving deltas: 24% (13295/55395)
Resolving deltas: 25% (13851/55395)
Resolving deltas: 26% (14404/55395)
Resolving deltas: 27% (14957/55395)
Resolving deltas: 28% (15511/55395)
Resolving deltas: 29% (16066/55395)
Resolving deltas: 30% (16619/55395)
Resolving deltas: 31% (17174/55395)
Resolving deltas: 32% (17727/55395)
Resolving deltas: 33% (18281/55395)
Resolving deltas: 34% (18835/55395)
Resolving deltas: 35% (19389/55395)
Resolving deltas: 36% (19943/55395)
Resolving deltas: 37% (20497/55395)
Resolving deltas: 38% (21051/55395)
Resolving deltas: 39% (21605/55395)
Resolving deltas: 40% (22159/55395)
Resolving deltas: 41% (22712/55395)
Resolving deltas: 42% (23266/55395)
Resolving deltas: 43% (23821/55395)
Resolving deltas: 44% (24375/55395)
Resolving deltas: 45% (24928/55395)
Resolving deltas: 46% (25482/55395)
Resolving deltas: 47% (26036/55395)
Resolving deltas: 48% (26590/55395)
Resolving deltas: 49% (27144/55395)
Resolving deltas: 50% (27698/55395)
Resolving deltas: 51% (28252/55395)
Resolving deltas: 52% (28806/55395)
Resolving deltas: 53% (29360/55395)
Resolving deltas: 54% (29914/55395)
Resolving deltas: 55% (30468/55395)
Resolving deltas: 56% (31022/55395)
Resolving deltas: 57% (31577/55395)
Resolving deltas: 58% (32130/55395)
Resolving deltas: 59% (32684/55395)
Resolving deltas: 60% (33237/55395)
Resolving deltas: 61% (33791/55395)
Resolving deltas: 62% (34345/55395)
Resolving deltas: 63% (34899/55395)
Resolving deltas: 64% (35455/55395)
Resolving deltas: 65% (36007/55395)
Resolving deltas: 66% (36562/55395)
Resolving deltas: 67% (37115/55395)
Resolving deltas: 68% (37669/55395)
Resolving deltas: 69% (38224/55395)
Resolving deltas: 70% (38777/55395)
Resolving deltas: 71% (39331/55395)
Resolving deltas: 72% (39885/55395)
Resolving deltas: 73% (40439/55395)
Resolving deltas: 74% (40993/55395)
Resolving deltas: 75% (41547/55395)
Resolving deltas: 76% (42101/55395)
Resolving deltas: 77% (42655/55395)
Resolving deltas: 78% (43209/55395)
Resolving deltas: 79% (43763/55395)
Resolving deltas: 80% (44316/55395)
Resolving deltas: 81% (44870/55395)
Resolving deltas: 82% (45425/55395)
Resolving deltas: 83% (45978/55395)
Resolving deltas: 84% (46532/55395)
Resolving deltas: 85% (47086/55395)
Resolving deltas: 86% (47640/55395)
Resolving deltas: 87% (48194/55395)
Resolving deltas: 88% (48748/55395)
Resolving deltas: 89% (49302/55395)
Resolving deltas: 89% (49332/55395)
Resolving deltas: 90% (49856/55395)
Resolving deltas: 91% (50410/55395)
Resolving deltas: 92% (50966/55395)
Resolving deltas: 93% (51518/55395)
Resolving deltas: 94% (52072/55395)
Resolving deltas: 95% (52626/55395)
Resolving deltas: 96% (53180/55395)
Resolving deltas: 97% (53734/55395)
Resolving deltas: 98% (54290/55395)
Resolving deltas: 99% (54842/55395)
Resolving deltas: 100% (55395/55395)
Resolving deltas: 100% (55395/55395), done.
10.14 s
Fetching commit 5d6a4ea85d6186bb1d72615a4d7a9642d8b673fa for docs ...
10.14 s
$ /nix/store/bcnisk3ydfgv26v2gw3zlky24g00yww2-git-2.54.0/bin/git fetch origin 5d6a4ea85d6186bb1d72615a4d7a9642d8b673fa
10.57 s
From https://github.com/alphal00p/gammaloop
10.57 s
* branch 5d6a4ea85d6186bb1d72615a4d7a9642d8b673fa -> FETCH_HEAD
10.58 s
$ /nix/store/9ypz3flqsrl5xl495mm8h645gadjsxi1-coreutils-9.11/bin/timeout --kill-after=15s 7200s /nix/store/bcnisk3ydfgv26v2gw3zlky24g00yww2-git-2.54.0/bin/git -c advice.detachedHead=false checkout 5d6a4ea85d6186bb1d72615a4d7a9642d8b673fa
10.83 s
HEAD is now at 5d6a4ea85 restore pre-regression About institutions layout
10.84 s
$ /nix/store/9ypz3flqsrl5xl495mm8h645gadjsxi1-coreutils-9.11/bin/timeout --kill-after=15s 7200s /nix/store/23zk8sgzamrbmj1fday15szf7f2279s8-nix-2.34.7/bin/nix --extra-experimental-features nix-command --extra-experimental-features flakes --log-format internal-json run .#packages.x86_64-linux.nix-ci-check-gammaloop-nextest-docs --print-build-logs
10.94 s
error (ignored): SQLite database '/var/cache/nix-ci-worker/eval-cache-v6/833cc54ace5235770fb39698f15e39b76caad26be22db5b87c5fb6af901f3960.sqlite ' is busy
11.08 s
stdenv.isDarwin is deprecated, use stdenv.hostPlatform.isDarwin instead
16.98 s
17.51 s
Downloading cached gammaloop-nextest-binaries-docs-alphal00p-docs-builder from https://cache.nix-ci.com
17.51 s
Downloading cached gammaloop-nextest-binaries-docs-alphal00p-docs-catalogs from https://cache.nix-ci.com
17.51 s
Downloading cached gammaloop-nextest-binaries-docs-alphal00p-docs-macros from https://cache.nix-ci.com
17.51 s
Downloading cached gammaloop-nextest-binaries-docs-alphal00p-docs-python-exporter from https://cache.nix-ci.com
17.51 s
Downloading cached gammaloop-nextest-binaries-docs-alphal00p-docs-schema from https://cache.nix-ci.com
17.52 s
Downloading cached gammaloop-ci-test-binary-dependencies-ccb1c8a19b0027d8-Cargo.toml from https://cache.nix-ci.com
17.55 s
Downloading cached gammaloop-crate-test-dependencies-c2a9e942000317c9-inputs from https://cache.nix-ci.com
17.57 s
Downloaded cached gammaloop-ci-test-binary-dependencies-ccb1c8a19b0027d8-Cargo.toml (1480 B) in 55ms
17.59 s
Building /nix/store/b3rkj7nnfw90aqfj93jfkyy9yyrhrm5c-gammaloop-ci-test-binary-dependencies-ccb1c8a19b0027d8-alphal00p-docs-examples-dev-dependency.toml.drv
17.59 s
Progress: 0 of 11 built (1 building), 1 of 12 downloaded from cache (6 downloading)
17.65 s
[gammaloop-ci-test-binary-dependencies-ccb1c8a19b0027d8-alphal00p-docs-examples-dev-dependency.toml:post-build] Uploading to the NixCI cache: /nix/store/j3ygj5m1ss0yfs7pcrqczvpvvsb889sr-gammaloop-ci-test-binary-dependencies-ccb1c8a19b0027d8-alphal00p-docs-examples-dev-dependency.toml
17.66 s
Downloaded cached gammaloop-nextest-binaries-docs-alphal00p-docs-python-exporter (2.2 MiB) in 154ms
17.67 s
Downloaded cached gammaloop-nextest-binaries-docs-alphal00p-docs-schema (2.4 MiB) in 157ms
17.69 s
Downloaded cached gammaloop-nextest-binaries-docs-alphal00p-docs-catalogs (2.8 MiB) in 181ms
17.71 s
[gammaloop-ci-test-binary-dependencies-ccb1c8a19b0027d8-alphal00p-docs-examples-dev-dependency.toml:post-build] warning: 'warn-short-path-literals' is deprecated, use 'lint-short-path-literals = ignore' instead
17.71 s
Downloaded cached gammaloop-nextest-binaries-docs-alphal00p-docs-macros (3.7 MiB) in 199ms
17.73 s
Downloaded cached gammaloop-nextest-binaries-docs-alphal00p-docs-builder (4.8 MiB) in 219ms
17.75 s
[gammaloop-ci-test-binary-dependencies-ccb1c8a19b0027d8-alphal00p-docs-examples-dev-dependency.toml:post-build] copying 0 paths...
17.81 s
[gammaloop-ci-test-binary-dependencies-ccb1c8a19b0027d8-alphal00p-docs-examples-dev-dependency.toml:post-build] warning: 'warn-short-path-literals' is deprecated, use 'lint-short-path-literals = ignore' instead
17.87 s
[gammaloop-ci-test-binary-dependencies-ccb1c8a19b0027d8-alphal00p-docs-examples-dev-dependency.toml:post-build] copying 0 paths...
17.89 s
Uploaded gammaloop-ci-test-binary-dependencies-ccb1c8a19b0027d8-alphal00p-docs-examples-dev-dependency.toml in 252ms
17.89 s
Progress: 1 of 11 built, 1 of 12 downloaded from cache (6 downloading)
17.89 s
Built gammaloop-ci-test-binary-dependencies-ccb1c8a19b0027d8-alphal00p-docs-examples-dev-dependency.toml in 300ms
17.89 s
Progress: 1 of 10 built, 2 of 12 downloaded from cache (5 downloading)
17.89 s
Progress: 1 of 10 built, 3 of 12 downloaded from cache (4 downloading)
17.89 s
Progress: 1 of 10 built, 4 of 12 downloaded from cache (3 downloading)
17.89 s
Progress: 1 of 10 built, 5 of 12 downloaded from cache (2 downloading)
17.89 s
Progress: 1 of 10 built, 6 of 12 downloaded from cache (1 downloading)
44.22 s
Downloaded cached gammaloop-crate-test-dependencies-c2a9e942000317c9-inputs (3.8 GiB) in 26.6s
44.23 s
Progress: 1 of 5 built, 7 of 12 downloaded from cache
44.23 s
Downloading cached gammaloop-crate-test-dependencies-c2a9e942000317c9-deps from https://cache.nix-ci.com
44.23 s
Downloaded cached gammaloop-crate-test-dependencies-c2a9e942000317c9-deps in 0ms
44.23 s
Progress: 1 of 5 built, 8 of 12 downloaded from cache
44.23 s
Downloading cached gammaloop-crate-test-dependencies-ccb1c8a19b0027d8-inputs from https://cache.nix-ci.com
72.55 s
Downloaded cached gammaloop-crate-test-dependencies-ccb1c8a19b0027d8-inputs (3.8 GiB) in 28.3s
72.55 s
Progress: 1 of 5 built, 9 of 12 downloaded from cache
72.55 s
Downloading cached gammaloop-crate-test-dependencies-ccb1c8a19b0027d8-deps from https://cache.nix-ci.com
72.55 s
Downloaded cached gammaloop-crate-test-dependencies-ccb1c8a19b0027d8-deps in 0ms
72.55 s
Progress: 1 of 5 built, 10 of 12 downloaded from cache
72.56 s
Downloading cached gammaloop-crate-test-binaries-alphal00p-docs-examples-ccb1c8a19b0027d8-inputs from https://cache.nix-ci.com
101.70 s
Downloaded cached gammaloop-crate-test-binaries-alphal00p-docs-examples-ccb1c8a19b0027d8-inputs (3.9 GiB) in 29.1s
101.70 s
Progress: 1 of 5 built, 11 of 12 downloaded from cache
101.70 s
Downloading cached gammaloop-crate-test-binaries-alphal00p-docs-examples-ccb1c8a19b0027d8-deps from https://cache.nix-ci.com
101.84 s
Downloaded cached gammaloop-crate-test-binaries-alphal00p-docs-examples-ccb1c8a19b0027d8-deps (7 MiB) in 136ms
101.84 s
Progress: 1 of 5 built, 12 of 12 downloaded from cache
102.04 s
Building /nix/store/363npsxghg9grvdnb2fchqy5bx5xcamk-gammaloop-nextest-binaries-docs-alphal00p-docs-examples-0.1.0.drv
102.13 s
[gammaloop-nextest-binaries-docs-alphal00p-docs-examples] Phase: unpackPhase
102.13 s
[gammaloop-nextest-binaries-docs-alphal00p-docs-examples] unpacking source archive /nix/store/pca3d4zg70xxkq4p1m49i7hfs73kd150-source
102.36 s
[gammaloop-nextest-binaries-docs-alphal00p-docs-examples] source root is source
102.38 s
[gammaloop-nextest-binaries-docs-alphal00p-docs-examples] Phase: patchPhase
102.50 s
[gammaloop-nextest-binaries-docs-alphal00p-docs-examples] copying cargo artifacts from /nix/store/8wy10h0k22hx4i946sbz141k68dygfxj-gammaloop-crate-test-binaries-alphal00p-docs-examples-ccb1c8a19b0027d8-inputs/target to target
102.50 s
[gammaloop-nextest-binaries-docs-alphal00p-docs-examples] will deep copy artifacts (instead of symlinking) as requested
113.21 s
[gammaloop-nextest-binaries-docs-alphal00p-docs-examples] Executing configureCargoCommonVars
113.21 s
[gammaloop-nextest-binaries-docs-alphal00p-docs-examples] decompressing cargo artifacts from /nix/store/xzy187j2i47lhxjfjkhlzq0rhzryxl5n-gammaloop-crate-test-binaries-alphal00p-docs-examples-ccb1c8a19b0027d8-deps-0.1.0/target.tar.zst to target
113.26 s
[gammaloop-nextest-binaries-docs-alphal00p-docs-examples] Phase: updateAutotoolsGnuConfigScriptsPhase
113.32 s
[gammaloop-nextest-binaries-docs-alphal00p-docs-examples] Phase: configurePhase
113.33 s
[gammaloop-nextest-binaries-docs-alphal00p-docs-examples] will append /build/source/.cargo-home/config.toml with contents of /nix/store/29aa708jkn8wd8vjwja1a5gh8k8wpi2b-vendor-cargo-deps/config.toml
113.33 s
[gammaloop-nextest-binaries-docs-alphal00p-docs-examples] default configurePhase, nothing to do
113.34 s
[gammaloop-nextest-binaries-docs-alphal00p-docs-examples] Phase: buildPhase
113.34 s
[gammaloop-nextest-binaries-docs-alphal00p-docs-examples] +++ command cargo --version
113.35 s
[gammaloop-nextest-binaries-docs-alphal00p-docs-examples] cargo 1.98.0 (797e8a9bc 2026-08-05)
113.43 s
[gammaloop-nextest-binaries-docs-alphal00p-docs-examples] +++ command cargo nextest --version
113.44 s
[gammaloop-nextest-binaries-docs-alphal00p-docs-examples] cargo-nextest 0.9.143
113.44 s
[gammaloop-nextest-binaries-docs-alphal00p-docs-examples] release: 0.9.143
113.44 s
[gammaloop-nextest-binaries-docs-alphal00p-docs-examples] host: x86_64-unknown-linux-gnu
113.44 s
[gammaloop-nextest-binaries-docs-alphal00p-docs-examples] +++ command cargo nextest archive --cargo-profile ci-optim --offline -p alphal00p-docs-examples -E 'package(alphal00p-docs-examples)' --profile ci_gammaloop --archive-file /nix/store/y0c3n4i9ck8cyjzhbvavjswp2gq2k857-gammaloop-nextest-binaries-docs-alphal00p-docs-examples-0.1.0/gammaloop-nextest-docs-alphal00p-docs-examples.tar.zst
115.11 s
[gammaloop-nextest-binaries-docs-alphal00p-docs-examples] Finished `ci-optim` profile [optimized] target(s) in 0.69s
115.30 s
[gammaloop-nextest-binaries-docs-alphal00p-docs-examples] warning : the following packages contain code that will be rejected by a future version of Rust: proc-macro-error2 v2.0.1
115.30 s
[gammaloop-nextest-binaries-docs-alphal00p-docs-examples] note : to see what the problems were, use the option `--future-incompat-report`, or run `cargo report future-incompatibilities --id 1`
115.36 s
[gammaloop-nextest-binaries-docs-alphal00p-docs-examples] Archiving 3 binaries (including 2 non-test binaries), 1 build script output directory, 2 linked paths, and 1 standard library to /nix/store/y0c3n4i9ck8cyjzhbvavjswp2gq2k857-gammaloop-nextest-binaries-docs-alphal00p-docs-examples-0.1.0/gammaloop-nextest-docs-alphal00p-docs-examples.tar.zst
115.69 s
[gammaloop-nextest-binaries-docs-alphal00p-docs-examples] Archived 22 files to /nix/store/y0c3n4i9ck8cyjzhbvavjswp2gq2k857-gammaloop-nextest-binaries-docs-alphal00p-docs-examples-0.1.0/gammaloop-nextest-docs-alphal00p-docs-examples.tar.zst in 0.32s
115.70 s
[gammaloop-nextest-binaries-docs-alphal00p-docs-examples] Phase: installPhase
115.70 s
[gammaloop-nextest-binaries-docs-alphal00p-docs-examples] Phase: fixupPhase
115.72 s
[gammaloop-nextest-binaries-docs-alphal00p-docs-examples] shrinking RPATHs of ELF executables and libraries in /nix/store/y0c3n4i9ck8cyjzhbvavjswp2gq2k857-gammaloop-nextest-binaries-docs-alphal00p-docs-examples-0.1.0
115.72 s
[gammaloop-nextest-binaries-docs-alphal00p-docs-examples] checking for references to /build/ in /nix/store/y0c3n4i9ck8cyjzhbvavjswp2gq2k857-gammaloop-nextest-binaries-docs-alphal00p-docs-examples-0.1.0...
115.73 s
[gammaloop-nextest-binaries-docs-alphal00p-docs-examples] patching script interpreter paths in /nix/store/y0c3n4i9ck8cyjzhbvavjswp2gq2k857-gammaloop-nextest-binaries-docs-alphal00p-docs-examples-0.1.0
116.14 s
[gammaloop-nextest-binaries-docs-alphal00p-docs-examples:post-build] Uploading to the NixCI cache: /nix/store/y0c3n4i9ck8cyjzhbvavjswp2gq2k857-gammaloop-nextest-binaries-docs-alphal00p-docs-examples-0.1.0
116.19 s
[gammaloop-nextest-binaries-docs-alphal00p-docs-examples:post-build] warning: 'warn-short-path-literals' is deprecated, use 'lint-short-path-literals = ignore' instead
116.19 s
[gammaloop-nextest-binaries-docs-alphal00p-docs-examples:post-build] copying 1 paths...
116.19 s
[gammaloop-nextest-binaries-docs-alphal00p-docs-examples:post-build] copying path '/nix/store/y0c3n4i9ck8cyjzhbvavjswp2gq2k857-gammaloop-nextest-binaries-docs-alphal00p-docs-examples-0.1.0' to 'https://cache.nix-ci.com'...
273.84 s
[gammaloop-nextest-binaries-docs-alphal00p-docs-examples:post-build] warning: 'warn-short-path-literals' is deprecated, use 'lint-short-path-literals = ignore' instead
274.05 s
[gammaloop-nextest-binaries-docs-alphal00p-docs-examples:post-build] copying 1 paths...
274.05 s
[gammaloop-nextest-binaries-docs-alphal00p-docs-examples:post-build] copying path '/nix/store/363npsxghg9grvdnb2fchqy5bx5xcamk-gammaloop-nextest-binaries-docs-alphal00p-docs-examples-0.1.0.drv' to 'https://cache.nix-ci.com'...
274.29 s
Uploaded gammaloop-nextest-binaries-docs-alphal00p-docs-examples in 2m38s
274.29 s
Progress: 2 of 5 built, 12 of 12 downloaded from cache
274.29 s
Built gammaloop-nextest-binaries-docs-alphal00p-docs-examples in 2m52s
274.32 s
Building /nix/store/gq5dq0akllm47pqlbz5f3x7clqbz290w-gammaloop-nextest-binaries-docs.drv
274.39 s
[gammaloop-nextest-binaries-docs:post-build] Uploading to the NixCI cache: /nix/store/w6nbv0j4vwdgnmqxwgm18ffhilm99kxi-gammaloop-nextest-binaries-docs
274.43 s
[gammaloop-nextest-binaries-docs:post-build] warning: 'warn-short-path-literals' is deprecated, use 'lint-short-path-literals = ignore' instead
274.65 s
[gammaloop-nextest-binaries-docs:post-build] copying 1 paths...
274.65 s
[gammaloop-nextest-binaries-docs:post-build] copying path '/nix/store/w6nbv0j4vwdgnmqxwgm18ffhilm99kxi-gammaloop-nextest-binaries-docs' to 'https://cache.nix-ci.com'...
275.76 s
[gammaloop-nextest-binaries-docs:post-build] warning: 'warn-short-path-literals' is deprecated, use 'lint-short-path-literals = ignore' instead
275.99 s
[gammaloop-nextest-binaries-docs:post-build] copying 1 paths...
275.99 s
[gammaloop-nextest-binaries-docs:post-build] copying path '/nix/store/gq5dq0akllm47pqlbz5f3x7clqbz290w-gammaloop-nextest-binaries-docs.drv' to 'https://cache.nix-ci.com'...
276.19 s
Uploaded gammaloop-nextest-binaries-docs in 1.8s
276.19 s
Progress: 3 of 5 built, 12 of 12 downloaded from cache
276.19 s
Built gammaloop-nextest-binaries-docs in 1.8s
276.23 s
Building /nix/store/9v540gjbnsi0njf78s6dnybmrcc6vcqb-nix-ci-check-gammaloop-nextest-docs.drv
276.29 s
[nix-ci-check-gammaloop-nextest-docs:post-build] Uploading to the NixCI cache: /nix/store/hyglqrkz4m07ni6m41zsxf2m4zq8rd4k-nix-ci-check-gammaloop-nextest-docs
276.34 s
[nix-ci-check-gammaloop-nextest-docs:post-build] warning: 'warn-short-path-literals' is deprecated, use 'lint-short-path-literals = ignore' instead
276.35 s
[nix-ci-check-gammaloop-nextest-docs:post-build] copying 1 paths...
276.35 s
[nix-ci-check-gammaloop-nextest-docs:post-build] copying path '/nix/store/hyglqrkz4m07ni6m41zsxf2m4zq8rd4k-nix-ci-check-gammaloop-nextest-docs' to 'https://cache.nix-ci.com'...
276.57 s
[nix-ci-check-gammaloop-nextest-docs:post-build] warning: 'warn-short-path-literals' is deprecated, use 'lint-short-path-literals = ignore' instead
276.83 s
[nix-ci-check-gammaloop-nextest-docs:post-build] copying 1 paths...
276.83 s
[nix-ci-check-gammaloop-nextest-docs:post-build] copying path '/nix/store/9v540gjbnsi0njf78s6dnybmrcc6vcqb-nix-ci-check-gammaloop-nextest-docs.drv' to 'https://cache.nix-ci.com'...
277.03 s
Uploaded nix-ci-check-gammaloop-nextest-docs in 749ms
277.03 s
Progress: 4 of 5 built, 12 of 12 downloaded from cache
277.03 s
Built nix-ci-check-gammaloop-nextest-docs in 804ms
277.03 s
Progress: 5 of 5 built, 12 of 12 downloaded from cache
277.32 s
evaluating derivation 'gevaluation warning: stdenv.isDarwin is deprecated, use stdenv.hostPlatform.isDarwin instead
285.44 s
copying '/nix/store/04ws
evaluating derivation 'g
copying '/nix/store/04ws
evaluating derivation 'g
copying '/nix/store/04ws
evaluating derivation 'g
copying '/nix/store/04ws
evaluating derivation 'g
copying '/nix/store/04ws
evaluating derivation 'g
copying '/nix/store/04ws
evaluating derivation 'g
querying gammaloop-nexte
[2.3 KiB DL] querying pe
[11.8 KiB DL] querying p
[22.5 KiB DL] querying p
[0 /7 built, 34.9 KiB DL]
[0 /2 built, 15 /8 /42 copi
[0 /2 built, 10 /22 /42 cop
[0 /2 built, 3 /31 /42 copi
[0 /2 built, 5 /33 /42 copi
[0 /2 built, 2 /39 /42 copi
[0 /2 built, 1 /40 /42 copi
[0 /2 built, 1 /41 /42 copi
[0 /1 built, 42 copied (2
[1 /0 /1 built, 42 copied gammaloop-nextest-docs> Extracting 2 binaries to /build/source/target/nix-ci-tmp/nextest-archive-WzuZQK
285.48 s
gammaloop-nextest-docs> Extracted 5 files to /build/source/target/nix-ci-tmp/nextest-archive-WzuZQK in 0.05s
285.49 s
gammaloop-nextest-docs> ------------
285.49 s
gammaloop-nextest-docs> Nextest run ID 232fcf41-8378-42a5-8442-177ad9438059 with nextest profile: ci_gammaloop
285.49 s
gammaloop-nextest-docs> Starting 119 tests across 2 binaries
285.62 s
gammaloop-nextest-docs> FAIL [ 0.072s] ( 69/119) alphal00p-docs-builder tests :: portal_focuses_on_projects_and_keeps_dedicated_routes
285.62 s
gammaloop-nextest-docs> stdout ---
285.62 s
gammaloop-nextest-docs>
285.62 s
gammaloop-nextest-docs> running 1 test
285.62 s
gammaloop-nextest-docs> test tests::portal_focuses_on_projects_and_keeps_dedicated_routes ... FAILED
285.62 s
gammaloop-nextest-docs>
285.62 s
gammaloop-nextest-docs> failures:
285.62 s
gammaloop-nextest-docs>
285.62 s
gammaloop-nextest-docs> failures:
285.62 s
gammaloop-nextest-docs> tests::portal_focuses_on_projects_and_keeps_dedicated_routes
285.62 s
gammaloop-nextest-docs>
285.62 s
gammaloop-nextest-docs> test result: FAILED. 0 passed; 1 failed; 0 ignored; 0 measured; 118 filtered out; finished in 0.07s
285.62 s
gammaloop-nextest-docs>
285.62 s
gammaloop-nextest-docs> stderr ---
285.62 s
gammaloop-nextest-docs> warning: bundle export is experimental
285.62 s
gammaloop-nextest-docs> = hint: its behaviour may change at any time
285.62 s
gammaloop-nextest-docs> = hint: do not rely on this feature for production use cases
285.62 s
gammaloop-nextest-docs>
285.62 s
gammaloop-nextest-docs>
285.62 s
gammaloop-nextest-docs> thread 'tests::portal_focuses_on_projects_and_keeps_dedicated_routes' (347) panicked at crates/alphal00p-docs-builder/src/lib.rs:11904:9:
285.62 s
gammaloop-nextest-docs> assertion `left == right` failed
285.62 s
gammaloop-nextest-docs> left: 8
285.62 s
gammaloop-nextest-docs> right: 7
285.62 s
gammaloop-nextest-docs> stack backtrace:
285.62 s
gammaloop-nextest-docs> 0: __rustc::rust_begin_unwind
285.62 s
gammaloop-nextest-docs> 1: core::panicking::panic_fmt
285.62 s
gammaloop-nextest-docs> 2: core::panicking::assert_failed_inner
285.62 s
gammaloop-nextest-docs> 3: core::panicking::assert_failed::<usize, usize>
285.62 s
gammaloop-nextest-docs> 4: alphal00p_docs_builder::tests::portal_focuses_on_projects_and_keeps_dedicated_routes
285.62 s
gammaloop-nextest-docs> 5: <alphal00p_docs_builder::tests::portal_focuses_on_projects_and_keeps_dedicated_routes::{closure#0} as core::ops::function::FnOnce<()>>::call_once
285.62 s
gammaloop-nextest-docs> note: Some details are omitted, run with `RUST_BACKTRACE=full` for a verbose backtrace.
285.62 s
gammaloop-nextest-docs>
303.86 s
gammaloop-nextest-docs> ------------
303.86 s
gammaloop-nextest-docs> Summary [ 18.364s] 119 tests run: 118 passed , 1 failed , 0 skipped
303.86 s
gammaloop-nextest-docs> FAIL [ 0.072s] ( 69/119) alphal00p-docs-builder tests :: portal_focuses_on_projects_and_keeps_dedicated_routes
303.86 s
gammaloop-nextest-docs> stdout ---
303.86 s
gammaloop-nextest-docs>
303.86 s
gammaloop-nextest-docs> running 1 test
303.86 s
gammaloop-nextest-docs> test tests::portal_focuses_on_projects_and_keeps_dedicated_routes ... FAILED
303.86 s
gammaloop-nextest-docs>
303.86 s
gammaloop-nextest-docs> failures:
303.86 s
gammaloop-nextest-docs>
303.86 s
gammaloop-nextest-docs> failures:
303.86 s
gammaloop-nextest-docs> tests::portal_focuses_on_projects_and_keeps_dedicated_routes
303.86 s
gammaloop-nextest-docs>
303.86 s
gammaloop-nextest-docs> test result: FAILED. 0 passed; 1 failed; 0 ignored; 0 measured; 118 filtered out; finished in 0.07s
303.86 s
gammaloop-nextest-docs>
303.86 s
gammaloop-nextest-docs> stderr ---
303.86 s
gammaloop-nextest-docs> warning: bundle export is experimental
303.86 s
gammaloop-nextest-docs> = hint: its behaviour may change at any time
303.86 s
gammaloop-nextest-docs> = hint: do not rely on this feature for production use cases
303.86 s
gammaloop-nextest-docs>
303.86 s
gammaloop-nextest-docs>
303.86 s
gammaloop-nextest-docs> thread 'tests::portal_focuses_on_projects_and_keeps_dedicated_routes' (347) panicked at crates/alphal00p-docs-builder/src/lib.rs:11904:9:
303.86 s
gammaloop-nextest-docs> assertion `left == right` failed
303.86 s
gammaloop-nextest-docs> left: 8
303.86 s
gammaloop-nextest-docs> right: 7
303.86 s
gammaloop-nextest-docs> stack backtrace:
303.86 s
gammaloop-nextest-docs> 0: __rustc::rust_begin_unwind
303.86 s
gammaloop-nextest-docs> 1: core::panicking::panic_fmt
303.86 s
gammaloop-nextest-docs> 2: core::panicking::assert_failed_inner
303.86 s
gammaloop-nextest-docs> 3: core::panicking::assert_failed::<usize, usize>
303.86 s
gammaloop-nextest-docs> 4: alphal00p_docs_builder::tests::portal_focuses_on_projects_and_keeps_dedicated_routes
303.86 s
gammaloop-nextest-docs> 5: <alphal00p_docs_builder::tests::portal_focuses_on_projects_and_keeps_dedicated_routes::{closure#0} as core::ops::function::FnOnce<()>>::call_once
303.86 s
gammaloop-nextest-docs> note: Some details are omitted, run with `RUST_BACKTRACE=full` for a verbose backtrace.
303.86 s
gammaloop-nextest-docs>
303.87 s
gammaloop-nextest-docs> error : test run failed
303.90 s
gammaloop-nextest-docs>
303.90 s
gammaloop-nextest-docs> ========== nextest test summary ==========
303.90 s
gammaloop-nextest-docs> report: target/nextest/ci_gammaloop/junit.xml
303.90 s
gammaloop-nextest-docs> tests: 119, failures: 1, errors: 0
303.90 s
gammaloop-nextest-docs>
303.90 s
gammaloop-nextest-docs> 1. alphal00p-docs-builder::tests::portal_focuses_on_projects_and_keeps_dedicated_routes
303.90 s
gammaloop-nextest-docs> failure: test failure with exit code 101
303.90 s
gammaloop-nextest-docs> thread 'tests::portal_focuses_on_projects_and_keeps_dedicated_routes' (347) panicked at crates/alphal00p-docs-builder/src/lib.rs:11904:9:
303.90 s
gammaloop-nextest-docs> assertion `left == right` failed
303.90 s
gammaloop-nextest-docs> left: 8
303.90 s
gammaloop-nextest-docs> right: 7
303.90 s
gammaloop-nextest-docs> stack backtrace:
303.90 s
gammaloop-nextest-docs> 0: __rustc::rust_begin_unwind
303.90 s
gammaloop-nextest-docs> 1: core::panicking::panic_fmt
303.90 s
gammaloop-nextest-docs> 2: core::panicking::assert_failed_inner
303.90 s
gammaloop-nextest-docs> 3: core::panicking::assert_failed::<usize, usize>
303.90 s
gammaloop-nextest-docs> 4: alphal00p_docs_builder::tests::portal_focuses_on_projects_and_keeps_dedicated_routes
303.90 s
gammaloop-nextest-docs> 5: <alphal00p_docs_builder::tests::portal_focuses_on_projects_and_keeps_dedicated_routes::{closure#0} as core::ops::function::FnOnce<()>>::call_once
303.90 s
gammaloop-nextest-docs> note: Some details are omitted, run with `RUST_BACKTRACE=full` for a verbose backtrace.
303.90 s
gammaloop-nextest-docs> system-out
303.90 s
gammaloop-nextest-docs> running 1 test
303.90 s
gammaloop-nextest-docs> test tests::portal_focuses_on_projects_and_keeps_dedicated_routes ... FAILED
303.90 s
gammaloop-nextest-docs>
303.90 s
gammaloop-nextest-docs> failures:
303.90 s
gammaloop-nextest-docs>
303.90 s
gammaloop-nextest-docs> failures:
303.90 s
gammaloop-nextest-docs> tests::portal_focuses_on_projects_and_keeps_dedicated_routes
303.90 s
gammaloop-nextest-docs>
303.90 s
gammaloop-nextest-docs> test result: FAILED. 0 passed; 1 failed; 0 ignored; 0 measured; 118 filtered out; finished in 0.07s
303.90 s
gammaloop-nextest-docs> system-err
303.90 s
gammaloop-nextest-docs> warning: bundle export is experimental
303.90 s
gammaloop-nextest-docs> = hint: its behaviour may change at any time
303.90 s
gammaloop-nextest-docs> = hint: do not rely on this feature for production use cases
303.90 s
gammaloop-nextest-docs>
303.90 s
gammaloop-nextest-docs>
303.90 s
gammaloop-nextest-docs> thread 'tests::portal_focuses_on_projects_and_keeps_dedicated_routes' (347) panicked at crates/alphal00p-docs-builder/src/lib.rs:11904:9:
303.90 s
gammaloop-nextest-docs> assertion `left == right` failed
303.90 s
gammaloop-nextest-docs> left: 8
303.90 s
gammaloop-nextest-docs> right: 7
303.90 s
gammaloop-nextest-docs> stack backtrace:
303.90 s
gammaloop-nextest-docs> 0: __rustc::rust_begin_unwind
303.90 s
gammaloop-nextest-docs> 1: core::panicking::panic_fmt
303.90 s
gammaloop-nextest-docs> 2: core::panicking::assert_failed_inner
303.90 s
gammaloop-nextest-docs> 3: core::panicking::assert_failed::<usize, usize>
303.90 s
gammaloop-nextest-docs> 4: alphal00p_docs_builder::tests::portal_focuses_on_projects_and_keeps_dedicated_routes
303.90 s
gammaloop-nextest-docs> 5: <alphal00p_docs_builder::tests::portal_focuses_on_projects_and_keeps_dedicated_routes::{closure#0} as core::ops::function::FnOnce<()>>::call_once
303.90 s
gammaloop-nextest-docs> note: Some details are omitted, run with `RUST_BACKTRACE=full` for a verbose backtrace.
303.90 s
gammaloop-nextest-docs> =========================================
303.91 s
gammaloop-nextest-docs> Extracting 2 binaries to /build/source/target/nix-ci-tmp/nextest-archive-YW9yWx
303.95 s
gammaloop-nextest-docs> Extracted 5 files to /build/source/target/nix-ci-tmp/nextest-archive-YW9yWx in 0.04s
303.96 s
gammaloop-nextest-docs> ------------
303.96 s
gammaloop-nextest-docs> Nextest run ID 3ca19bea-f16c-4bb8-9a43-ee6c0820f657 with nextest profile: ci_gammaloop
303.96 s
gammaloop-nextest-docs> Starting 21 tests across 2 binaries
303.98 s
gammaloop-nextest-docs> ------------
303.98 s
gammaloop-nextest-docs> Summary [ 0.015s] 21 tests run: 21 passed , 0 skipped
304.01 s
gammaloop-nextest-docs>
304.01 s
gammaloop-nextest-docs> ========== nextest test summary ==========
304.01 s
gammaloop-nextest-docs> report: target/nextest/ci_gammaloop/junit.xml
304.01 s
gammaloop-nextest-docs> tests: 21, failures: 0, errors: 0
304.01 s
gammaloop-nextest-docs> No failing testcases found.
304.01 s
gammaloop-nextest-docs> =========================================
304.03 s
gammaloop-nextest-docs> Extracting 3 binaries (including 2 non-test binaries), 1 build script output directory, and 2 linked paths to /build/source/target/nix-ci-tmp/nextest-archive-N0C7V5
304.28 s
gammaloop-nextest-docs> Extracted 22 files to /build/source/target/nix-ci-tmp/nextest-archive-N0C7V5 in 0.26s
304.29 s
gammaloop-nextest-docs> ------------
304.29 s
gammaloop-nextest-docs> Nextest run ID 1259a3f4-1607-4911-8232-1a5c1b20e730 with nextest profile: ci_gammaloop
304.29 s
gammaloop-nextest-docs> Starting 89 tests across 1 binary
304.33 s
gammaloop-nextest-docs> ------------
304.33 s
gammaloop-nextest-docs> Summary [ 0.040s] 89 tests run: 89 passed , 0 skipped
304.40 s
gammaloop-nextest-docs>
304.40 s
gammaloop-nextest-docs> ========== nextest test summary ==========
304.40 s
gammaloop-nextest-docs> report: target/nextest/ci_gammaloop/junit.xml
304.40 s
gammaloop-nextest-docs> tests: 89, failures: 0, errors: 0
304.40 s
gammaloop-nextest-docs> No failing testcases found.
304.40 s
gammaloop-nextest-docs> =========================================
304.41 s
gammaloop-nextest-docs> Extracting 2 binaries to /build/source/target/nix-ci-tmp/nextest-archive-PP81g9
304.46 s
gammaloop-nextest-docs> Extracted 5 files to /build/source/target/nix-ci-tmp/nextest-archive-PP81g9 in 0.04s
304.46 s
gammaloop-nextest-docs> ------------
304.46 s
gammaloop-nextest-docs> Nextest run ID 4a51133f-9c4b-4741-8e4c-5fd79a3360b8 with nextest profile: ci_gammaloop
304.46 s
gammaloop-nextest-docs> Starting 10 tests across 2 binaries
317.13 s
gammaloop-nextest-docs> ------------
317.13 s
gammaloop-nextest-docs> Summary [ 12.662s] 10 tests run: 10 passed , 0 skipped
317.16 s
gammaloop-nextest-docs>
317.16 s
gammaloop-nextest-docs> ========== nextest test summary ==========
317.16 s
gammaloop-nextest-docs> report: target/nextest/ci_gammaloop/junit.xml
317.16 s
gammaloop-nextest-docs> tests: 10, failures: 0, errors: 0
317.16 s
gammaloop-nextest-docs> No failing testcases found.
317.16 s
gammaloop-nextest-docs> =========================================
317.18 s
gammaloop-nextest-docs> Extracting 1 binary to /build/source/target/nix-ci-tmp/nextest-archive-7MyRwC
317.21 s
gammaloop-nextest-docs> Extracted 4 files to /build/source/target/nix-ci-tmp/nextest-archive-7MyRwC in 0.04s
317.22 s
gammaloop-nextest-docs> ------------
317.22 s
gammaloop-nextest-docs> Nextest run ID e7dd3f18-73c6-498c-992c-8722fe82bcca with nextest profile: ci_gammaloop
317.22 s
gammaloop-nextest-docs> Starting 0 tests across 1 binary
317.22 s
gammaloop-nextest-docs> ------------
317.22 s
gammaloop-nextest-docs> Summary [ 0.000s] 0 tests run: 0 passed , 0 skipped
317.25 s
gammaloop-nextest-docs>
317.25 s
gammaloop-nextest-docs> ========== nextest test summary ==========
317.25 s
gammaloop-nextest-docs> report: target/nextest/ci_gammaloop/junit.xml
317.25 s
gammaloop-nextest-docs> tests: 0, failures: 0, errors: 0
317.25 s
gammaloop-nextest-docs> No failing testcases found.
317.25 s
gammaloop-nextest-docs> =========================================
317.26 s
gammaloop-nextest-docs> Extracting 1 binary to /build/source/target/nix-ci-tmp/nextest-archive-ZotY4x
317.30 s
gammaloop-nextest-docs> Extracted 4 files to /build/source/target/nix-ci-tmp/nextest-archive-ZotY4x in 0.04s
317.31 s
gammaloop-nextest-docs> ------------
317.31 s
gammaloop-nextest-docs> Nextest run ID 2b987167-3867-46a4-99cb-31a40510a477 with nextest profile: ci_gammaloop
317.31 s
gammaloop-nextest-docs> Starting 4 tests across 1 binary
317.31 s
gammaloop-nextest-docs> ------------
317.31 s
gammaloop-nextest-docs> Summary [ 0.005s] 4 tests run: 4 passed , 0 skipped
317.35 s
gammaloop-nextest-docs>
317.35 s
gammaloop-nextest-docs> ========== nextest test summary ==========
317.35 s
gammaloop-nextest-docs> report: target/nextest/ci_gammaloop/junit.xml
317.35 s
gammaloop-nextest-docs> tests: 4, failures: 0, errors: 0
317.35 s
gammaloop-nextest-docs> No failing testcases found.
317.35 s
gammaloop-nextest-docs> =========================================
317.51 s
error: Cannot build '/nix/store/s6iwkk5yfm0lqw2zljscawlwklzvv71v-gammaloop-nextest-docs.drv '.
317.51 s
Reason: builder failed with exit code 100 .
317.51 s
Output paths:
317.51 s
/nix/store/x42iadyxwmrz96xva82kghb1sx3lld6g-gammaloop-nextest-docs
317.51 s
Last 185 log lines:
317.51 s
> Extracting 2 binaries to /build/source/target/nix-ci-tmp/nextest-archive-WzuZQK
317.51 s
> Extracted 5 files to /build/source/target/nix-ci-tmp/nextest-archive-WzuZQK in 0.05s
317.51 s
> ------------
317.51 s
> Nextest run ID 232fcf41-8378-42a5-8442-177ad9438059 with nextest profile: ci_gammaloop
317.51 s
> Starting 119 tests across 2 binaries
317.51 s
> FAIL [ 0.072s] ( 69/119) alphal00p-docs-builder tests :: portal_focuses_on_projects_and_keeps_dedicated_routes
317.51 s
> stdout ---
317.51 s
>
317.51 s
> running 1 test
317.51 s
> test tests::portal_focuses_on_projects_and_keeps_dedicated_routes ... FAILED
317.51 s
>
317.51 s
> failures:
317.51 s
>
317.51 s
> failures:
317.51 s
> tests::portal_focuses_on_projects_and_keeps_dedicated_routes
317.51 s
>
317.51 s
> test result: FAILED. 0 passed; 1 failed; 0 ignored; 0 measured; 118 filtered out; finished in 0.07s
317.51 s
>
317.51 s
> stderr ---
317.51 s
> warning: bundle export is experimental
317.51 s
> = hint: its behaviour may change at any time
317.51 s
> = hint: do not rely on this feature for production use cases
317.51 s
>
317.51 s
>
317.51 s
> thread 'tests::portal_focuses_on_projects_and_keeps_dedicated_routes' (347) panicked at crates/alphal00p-docs-builder/src/lib.rs:11904:9:
317.51 s
> assertion `left == right` failed
317.51 s
> left: 8
317.51 s
> right: 7
317.51 s
> stack backtrace:
317.51 s
> 0: __rustc::rust_begin_unwind
317.51 s
> 1: core::panicking::panic_fmt
317.51 s
> 2: core::panicking::assert_failed_inner
317.51 s
> 3: core::panicking::assert_failed::<usize, usize>
317.51 s
> 4: alphal00p_docs_builder::tests::portal_focuses_on_projects_and_keeps_dedicated_routes
317.51 s
> 5: <alphal00p_docs_builder::tests::portal_focuses_on_projects_and_keeps_dedicated_routes::{closure#0} as core::ops::function::FnOnce<()>>::call_once
317.51 s
> note: Some details are omitted, run with `RUST_BACKTRACE=full` for a verbose backtrace.
317.51 s
>
317.51 s
> ------------
317.51 s
> Summary [ 18.364s] 119 tests run: 118 passed , 1 failed , 0 skipped
317.51 s
> FAIL [ 0.072s] ( 69/119) alphal00p-docs-builder tests :: portal_focuses_on_projects_and_keeps_dedicated_routes
317.51 s
> stdout ---
317.51 s
>
317.51 s
> running 1 test
317.51 s
> test tests::portal_focuses_on_projects_and_keeps_dedicated_routes ... FAILED
317.51 s
>
317.51 s
> failures:
317.51 s
>
317.51 s
> failures:
317.51 s
> tests::portal_focuses_on_projects_and_keeps_dedicated_routes
317.51 s
>
317.51 s
> test result: FAILED. 0 passed; 1 failed; 0 ignored; 0 measured; 118 filtered out; finished in 0.07s
317.51 s
>
317.51 s
> stderr ---
317.51 s
> warning: bundle export is experimental
317.51 s
> = hint: its behaviour may change at any time
317.51 s
> = hint: do not rely on this feature for production use cases
317.51 s
>
317.51 s
>
317.51 s
> thread 'tests::portal_focuses_on_projects_and_keeps_dedicated_routes' (347) panicked at crates/alphal00p-docs-builder/src/lib.rs:11904:9:
317.51 s
> assertion `left == right` failed
317.51 s
> left: 8
317.51 s
> right: 7
317.51 s
> stack backtrace:
317.51 s
> 0: __rustc::rust_begin_unwind
317.51 s
> 1: core::panicking::panic_fmt
317.51 s
> 2: core::panicking::assert_failed_inner
317.51 s
> 3: core::panicking::assert_failed::<usize, usize>
317.51 s
> 4: alphal00p_docs_builder::tests::portal_focuses_on_projects_and_keeps_dedicated_routes
317.51 s
> 5: <alphal00p_docs_builder::tests::portal_focuses_on_projects_and_keeps_dedicated_routes::{closure#0} as core::ops::function::FnOnce<()>>::call_once
317.51 s
> note: Some details are omitted, run with `RUST_BACKTRACE=full` for a verbose backtrace.
317.51 s
>
317.51 s
> error : test run failed
317.51 s
>
317.51 s
> ========== nextest test summary ==========
317.51 s
> report: target/nextest/ci_gammaloop/junit.xml
317.51 s
> tests: 119, failures: 1, errors: 0
317.51 s
>
317.51 s
> 1. alphal00p-docs-builder::tests::portal_focuses_on_projects_and_keeps_dedicated_routes
317.51 s
> failure: test failure with exit code 101
317.51 s
> thread 'tests::portal_focuses_on_projects_and_keeps_dedicated_routes' (347) panicked at crates/alphal00p-docs-builder/src/lib.rs:11904:9:
317.51 s
> assertion `left == right` failed
317.51 s
> left: 8
317.51 s
> right: 7
317.51 s
> stack backtrace:
317.51 s
> 0: __rustc::rust_begin_unwind
317.51 s
> 1: core::panicking::panic_fmt
317.51 s
> 2: core::panicking::assert_failed_inner
317.51 s
> 3: core::panicking::assert_failed::<usize, usize>
317.51 s
> 4: alphal00p_docs_builder::tests::portal_focuses_on_projects_and_keeps_dedicated_routes
317.51 s
> 5: <alphal00p_docs_builder::tests::portal_focuses_on_projects_and_keeps_dedicated_routes::{closure#0} as core::ops::function::FnOnce<()>>::call_once
317.51 s
> note: Some details are omitted, run with `RUST_BACKTRACE=full` for a verbose backtrace.
317.51 s
> system-out
317.51 s
> running 1 test
317.51 s
> test tests::portal_focuses_on_projects_and_keeps_dedicated_routes ... FAILED
317.51 s
>
317.51 s
> failures:
317.51 s
>
317.51 s
> failures:
317.51 s
> tests::portal_focuses_on_projects_and_keeps_dedicated_routes
317.51 s
>
317.51 s
> test result: FAILED. 0 passed; 1 failed; 0 ignored; 0 measured; 118 filtered out; finished in 0.07s
317.51 s
> system-err
317.51 s
> warning: bundle export is experimental
317.51 s
> = hint: its behaviour may change at any time
317.51 s
> = hint: do not rely on this feature for production use cases
317.51 s
>
317.51 s
>
317.51 s
> thread 'tests::portal_focuses_on_projects_and_keeps_dedicated_routes' (347) panicked at crates/alphal00p-docs-builder/src/lib.rs:11904:9:
317.51 s
> assertion `left == right` failed
317.51 s
> left: 8
317.51 s
> right: 7
317.51 s
> stack backtrace:
317.51 s
> 0: __rustc::rust_begin_unwind
317.51 s
> 1: core::panicking::panic_fmt
317.51 s
> 2: core::panicking::assert_failed_inner
317.51 s
> 3: core::panicking::assert_failed::<usize, usize>
317.51 s
> 4: alphal00p_docs_builder::tests::portal_focuses_on_projects_and_keeps_dedicated_routes
317.51 s
> 5: <alphal00p_docs_builder::tests::portal_focuses_on_projects_and_keeps_dedicated_routes::{closure#0} as core::ops::function::FnOnce<()>>::call_once
317.51 s
> note: Some details are omitted, run with `RUST_BACKTRACE=full` for a verbose backtrace.
317.51 s
> =========================================
317.51 s
> Extracting 2 binaries to /build/source/target/nix-ci-tmp/nextest-archive-YW9yWx
317.51 s
> Extracted 5 files to /build/source/target/nix-ci-tmp/nextest-archive-YW9yWx in 0.04s
317.51 s
> ------------
317.51 s
> Nextest run ID 3ca19bea-f16c-4bb8-9a43-ee6c0820f657 with nextest profile: ci_gammaloop
317.51 s
> Starting 21 tests across 2 binaries
317.51 s
> ------------
317.51 s
> Summary [ 0.015s] 21 tests run: 21 passed , 0 skipped
317.51 s
>
317.51 s
> ========== nextest test summary ==========
317.51 s
> report: target/nextest/ci_gammaloop/junit.xml
317.51 s
> tests: 21, failures: 0, errors: 0
317.51 s
> No failing testcases found.
317.51 s
> =========================================
317.51 s
> Extracting 3 binaries (including 2 non-test binaries), 1 build script output directory, and 2 linked paths to /build/source/target/nix-ci-tmp/nextest-archive-N0C7V5
317.51 s
> Extracted 22 files to /build/source/target/nix-ci-tmp/nextest-archive-N0C7V5 in 0.26s
317.51 s
> ------------
317.51 s
> Nextest run ID 1259a3f4-1607-4911-8232-1a5c1b20e730 with nextest profile: ci_gammaloop
317.51 s
> Starting 89 tests across 1 binary
317.51 s
> ------------
317.51 s
> Summary [ 0.040s] 89 tests run: 89 passed , 0 skipped
317.51 s
>
317.51 s
> ========== nextest test summary ==========
317.51 s
> report: target/nextest/ci_gammaloop/junit.xml
317.51 s
> tests: 89, failures: 0, errors: 0
317.51 s
> No failing testcases found.
317.51 s
> =========================================
317.51 s
> Extracting 2 binaries to /build/source/target/nix-ci-tmp/nextest-archive-PP81g9
317.51 s
> Extracted 5 files to /build/source/target/nix-ci-tmp/nextest-archive-PP81g9 in 0.04s
317.51 s
> ------------
317.51 s
> Nextest run ID 4a51133f-9c4b-4741-8e4c-5fd79a3360b8 with nextest profile: ci_gammaloop
317.51 s
> Starting 10 tests across 2 binaries
317.51 s
> ------------
317.51 s
> Summary [ 12.662s] 10 tests run: 10 passed , 0 skipped
317.51 s
>
317.51 s
> ========== nextest test summary ==========
317.51 s
> report: target/nextest/ci_gammaloop/junit.xml
317.51 s
> tests: 10, failures: 0, errors: 0
317.51 s
> No failing testcases found.
317.51 s
> =========================================
317.51 s
> Extracting 1 binary to /build/source/target/nix-ci-tmp/nextest-archive-7MyRwC
317.51 s
> Extracted 4 files to /build/source/target/nix-ci-tmp/nextest-archive-7MyRwC in 0.04s
317.51 s
> ------------
317.51 s
> Nextest run ID e7dd3f18-73c6-498c-992c-8722fe82bcca with nextest profile: ci_gammaloop
317.51 s
> Starting 0 tests across 1 binary
317.51 s
> ------------
317.51 s
> Summary [ 0.000s] 0 tests run: 0 passed , 0 skipped
317.51 s
>
317.51 s
> ========== nextest test summary ==========
317.51 s
> report: target/nextest/ci_gammaloop/junit.xml
317.51 s
> tests: 0, failures: 0, errors: 0
317.51 s
> No failing testcases found.
317.51 s
> =========================================
317.51 s
> Extracting 1 binary to /build/source/target/nix-ci-tmp/nextest-archive-ZotY4x
317.51 s
> Extracted 4 files to /build/source/target/nix-ci-tmp/nextest-archive-ZotY4x in 0.04s
317.51 s
> ------------
317.51 s
> Nextest run ID 2b987167-3867-46a4-99cb-31a40510a477 with nextest profile: ci_gammaloop
317.51 s
> Starting 4 tests across 1 binary
317.51 s
> ------------
317.51 s
> Summary [ 0.005s] 4 tests run: 4 passed , 0 skipped
317.51 s
>
317.51 s
> ========== nextest test summary ==========
317.51 s
> report: target/nextest/ci_gammaloop/junit.xml
317.51 s
> tests: 4, failures: 0, errors: 0
317.51 s
> No failing testcases found.
317.51 s
> =========================================
317.51 s
For full logs, run:
317.51 s
nix log /nix/store/s6iwkk5yfm0lqw2zljscawlwklzvv71v-gammaloop-nextest-docs.drv
317.63 s
[0 built (1 failed ), 42 Run failed.