test packages.x86_64-linux.nix-ci-check-gammaloop-nextest-docs
0.00 s
$ /nix/store/9ypz3flqsrl5xl495mm8h645gadjsxi1-coreutils-9.11/bin/timeout --kill-after=15s 7200s /nix/store/23zk8sgzamrbmj1fday15szf7f2279s8-nix-2.34.7/bin/nix --extra-experimental-features nix-command --extra-experimental-features flakes flake clone git+https://github.com/alphal00p/gammaloop --dest /tmp/nix-ci-worker/stable-pwd/repo/
0.06 s
Cloning into '/tmp/nix-ci-worker/stable-pwd/repo'...
0.79 s
remote: Enumerating objects: 81893, done.
0.90 s
remote: Counting objects: 0% (1/11488)
remote: Counting objects: 1% (115/11488)
remote: Counting objects: 2% (230/11488)
remote: Counting objects: 3% (345/11488)
remote: Counting objects: 4% (460/11488)
remote: Counting objects: 5% (575/11488)
remote: Counting objects: 6% (690/11488)
remote: Counting objects: 7% (805/11488)
remote: Counting objects: 8% (920/11488)
remote: Counting objects: 9% (1034/11488)
remote: Counting objects: 10% (1149/11488)
remote: Counting objects: 11% (1264/11488)
remote: Counting objects: 12% (1379/11488)
remote: Counting objects: 13% (1494/11488)
remote: Counting objects: 14% (1609/11488)
remote: Counting objects: 15% (1724/11488)
remote: Counting objects: 16% (1839/11488)
remote: Counting objects: 17% (1953/11488)
remote: Counting objects: 18% (2068/11488)
remote: Counting objects: 19% (2183/11488)
remote: Counting objects: 20% (2298/11488)
remote: Counting objects: 21% (2413/11488)
remote: Counting objects: 22% (2528/11488)
remote: Counting objects: 23% (2643/11488)
remote: Counting objects: 24% (2758/11488)
remote: Counting objects: 25% (2872/11488)
remote: Counting objects: 26% (2987/11488)
remote: Counting objects: 27% (3102/11488)
remote: Counting objects: 28% (3217/11488)
remote: Counting objects: 29% (3332/11488)
remote: Counting objects: 30% (3447/11488)
remote: Counting objects: 31% (3562/11488)
remote: Counting objects: 32% (3677/11488)
remote: Counting objects: 33% (3792/11488)
remote: Counting objects: 34% (3906/11488)
remote: Counting objects: 35% (4021/11488)
remote: Counting objects: 36% (4136/11488)
remote: Counting objects: 37% (4251/11488)
remote: Counting objects: 38% (4366/11488)
remote: Counting objects: 39% (4481/11488)
remote: Counting objects: 40% (4596/11488)
remote: Counting objects: 41% (4711/11488)
remote: Counting objects: 42% (4825/11488)
remote: Counting objects: 43% (4940/11488)
remote: Counting objects: 44% (5055/11488)
remote: Counting objects: 45% (5170/11488)
remote: Counting objects: 46% (5285/11488)
remote: Counting objects: 47% (5400/11488)
remote: Counting objects: 48% (5515/11488)
remote: Counting objects: 49% (5630/11488)
remote: Counting objects: 50% (5744/11488)
remote: Counting objects: 51% (5859/11488)
remote: Counting objects: 52% (5974/11488)
remote: Counting objects: 53% (6089/11488)
remote: Counting objects: 54% (6204/11488)
remote: Counting objects: 55% (6319/11488)
remote: Counting objects: 56% (6434/11488)
remote: Counting objects: 57% (6549/11488)
remote: Counting objects: 58% (6664/11488)
remote: Counting objects: 59% (6778/11488)
remote: Counting objects: 60% (6893/11488)
remote: Counting objects: 61% (7008/11488)
remote: Counting objects: 62% (7123/11488)
remote: Counting objects: 63% (7238/11488)
remote: Counting objects: 64% (7353/11488)
remote: Counting objects: 65% (7468/11488)
remote: Counting objects: 66% (7583/11488)
remote: Counting objects: 67% (7697/11488)
remote: Counting objects: 68% (7812/11488)
remote: Counting objects: 69% (7927/11488)
remote: Counting objects: 70% (8042/11488)
remote: Counting objects: 71% (8157/11488)
remote: Counting objects: 72% (8272/11488)
remote: Counting objects: 73% (8387/11488)
remote: Counting objects: 74% (8502/11488)
remote: Counting objects: 75% (8616/11488)
remote: Counting objects: 76% (8731/11488)
remote: Counting objects: 77% (8846/11488)
remote: Counting objects: 78% (8961/11488)
remote: Counting objects: 79% (9076/11488)
remote: Counting objects: 80% (9191/11488)
remote: Counting objects: 81% (9306/11488)
remote: Counting objects: 82% (9421/11488)
remote: Counting objects: 83% (9536/11488)
remote: Counting objects: 84% (9650/11488)
remote: Counting objects: 85% (9765/11488)
remote: Counting objects: 86% (9880/11488)
remote: Counting objects: 87% (9995/11488)
remote: Counting objects: 88% (10110/11488)
remote: Counting objects: 89% (10225/11488)
remote: Counting objects: 90% (10340/11488)
remote: Counting objects: 91% (10455/11488)
remote: Counting objects: 92% (10569/11488)
remote: Counting objects: 93% (10684/11488)
remote: Counting objects: 94% (10799/11488)
remote: Counting objects: 95% (10914/11488)
remote: Counting objects: 96% (11029/11488)
remote: Counting objects: 97% (11144/11488)
remote: Counting objects: 98% (11259/11488)
remote: Counting objects: 99% (11374/11488)
remote: Counting objects: 100% (11488/11488)
remote: Counting objects: 100% (11488/11488), done.
3.63 s
remote: Compressing objects: 0% (1/2649)
remote: Compressing objects: 1% (27/2649)
remote: Compressing objects: 2% (53/2649)
remote: Compressing objects: 3% (80/2649)
remote: Compressing objects: 4% (106/2649)
remote: Compressing objects: 5% (133/2649)
remote: Compressing objects: 6% (159/2649)
remote: Compressing objects: 7% (186/2649)
remote: Compressing objects: 8% (212/2649)
remote: Compressing objects: 9% (239/2649)
remote: Compressing objects: 10% (265/2649)
remote: Compressing objects: 11% (292/2649)
remote: Compressing objects: 12% (318/2649)
remote: Compressing objects: 13% (345/2649)
remote: Compressing objects: 14% (371/2649)
remote: Compressing objects: 15% (398/2649)
remote: Compressing objects: 16% (424/2649)
remote: Compressing objects: 17% (451/2649)
remote: Compressing objects: 18% (477/2649)
remote: Compressing objects: 19% (504/2649)
remote: Compressing objects: 19% (523/2649)
remote: Compressing objects: 20% (530/2649)
remote: Compressing objects: 21% (557/2649)
remote: Compressing objects: 22% (583/2649)
remote: Compressing objects: 23% (610/2649)
remote: Compressing objects: 24% (636/2649)
remote: Compressing objects: 24% (662/2649)
remote: Compressing objects: 25% (663/2649)
remote: Compressing objects: 26% (689/2649)
remote: Compressing objects: 27% (716/2649)
remote: Compressing objects: 28% (742/2649)
remote: Compressing objects: 29% (769/2649)
remote: Compressing objects: 30% (795/2649)
remote: Compressing objects: 31% (822/2649)
remote: Compressing objects: 32% (848/2649)
remote: Compressing objects: 33% (875/2649)
remote: Compressing objects: 34% (901/2649)
remote: Compressing objects: 35% (928/2649)
remote: Compressing objects: 36% (954/2649)
remote: Compressing objects: 37% (981/2649)
remote: Compressing objects: 38% (1007/2649)
remote: Compressing objects: 39% (1034/2649)
remote: Compressing objects: 40% (1060/2649)
remote: Compressing objects: 41% (1087/2649)
remote: Compressing objects: 42% (1113/2649)
remote: Compressing objects: 43% (1140/2649)
remote: Compressing objects: 44% (1166/2649)
remote: Compressing objects: 45% (1193/2649)
remote: Compressing objects: 46% (1219/2649)
remote: Compressing objects: 47% (1246/2649)
remote: Compressing objects: 48% (1272/2649)
remote: Compressing objects: 49% (1299/2649)
remote: Compressing objects: 50% (1325/2649)
remote: Compressing objects: 51% (1351/2649)
remote: Compressing objects: 52% (1378/2649)
remote: Compressing objects: 53% (1404/2649)
remote: Compressing objects: 54% (1431/2649)
remote: Compressing objects: 55% (1457/2649)
remote: Compressing objects: 56% (1484/2649)
remote: Compressing objects: 57% (1510/2649)
remote: Compressing objects: 58% (1537/2649)
remote: Compressing objects: 59% (1563/2649)
remote: Compressing objects: 60% (1590/2649)
remote: Compressing objects: 61% (1616/2649)
remote: Compressing objects: 62% (1643/2649)
remote: Compressing objects: 63% (1669/2649)
remote: Compressing objects: 64% (1696/2649)
remote: Compressing objects: 65% (1722/2649)
remote: Compressing objects: 66% (1749/2649)
remote: Compressing objects: 67% (1775/2649)
remote: Compressing objects: 68% (1802/2649)
remote: Compressing objects: 69% (1828/2649)
remote: Compressing objects: 70% (1855/2649)
remote: Compressing objects: 71% (1881/2649)
remote: Compressing objects: 72% (1908/2649)
remote: Compressing objects: 73% (1934/2649)
remote: Compressing objects: 74% (1961/2649)
remote: Compressing objects: 75% (1987/2649)
remote: Compressing objects: 76% (2014/2649)
remote: Compressing objects: 77% (2040/2649)
remote: Compressing objects: 78% (2067/2649)
remote: Compressing objects: 79% (2093/2649)
remote: Compressing objects: 80% (2120/2649)
remote: Compressing objects: 81% (2146/2649)
remote: Compressing objects: 82% (2173/2649)
remote: Compressing objects: 83% (2199/2649)
remote: Compressing objects: 84% (2226/2649)
remote: Compressing objects: 85% (2252/2649)
remote: Compressing objects: 86% (2279/2649)
remote: Compressing objects: 87% (2305/2649)
remote: Compressing objects: 88% (2332/2649)
remote: Compressing objects: 89% (2358/2649)
remote: Compressing objects: 90% (2385/2649)
remote: Compressing objects: 91% (2411/2649)
remote: Compressing objects: 92% (2438/2649)
remote: Compressing objects: 93% (2464/2649)
remote: Compressing objects: 94% (2491/2649)
remote: Compressing objects: 95% (2517/2649)
remote: Compressing objects: 96% (2544/2649)
remote: Compressing objects: 97% (2570/2649)
remote: Compressing objects: 98% (2597/2649)
remote: Compressing objects: 99% (2623/2649)
remote: Compressing objects: 100% (2649/2649)
remote: Compressing objects: 100% (2649/2649), done.
7.55 s
Receiving objects: 0% (1/81893)
Receiving objects: 1% (819/81893)
Receiving objects: 2% (1638/81893)
Receiving objects: 3% (2457/81893)
Receiving objects: 4% (3276/81893)
Receiving objects: 5% (4095/81893)
Receiving objects: 6% (4914/81893)
Receiving objects: 7% (5733/81893)
Receiving objects: 8% (6552/81893)
Receiving objects: 9% (7371/81893), 14.09 MiB | 28.16 MiB/s
Receiving objects: 10% (8190/81893), 14.09 MiB | 28.16 MiB/s
Receiving objects: 11% (9009/81893), 14.09 MiB | 28.16 MiB/s
Receiving objects: 12% (9828/81893), 14.09 MiB | 28.16 MiB/s
Receiving objects: 13% (10647/81893), 14.09 MiB | 28.16 MiB/s
Receiving objects: 14% (11466/81893), 14.09 MiB | 28.16 MiB/s
Receiving objects: 15% (12284/81893), 14.09 MiB | 28.16 MiB/s
Receiving objects: 16% (13103/81893), 14.09 MiB | 28.16 MiB/s
Receiving objects: 17% (13922/81893), 14.09 MiB | 28.16 MiB/s
Receiving objects: 18% (14741/81893), 14.09 MiB | 28.16 MiB/s
Receiving objects: 19% (15560/81893), 14.09 MiB | 28.16 MiB/s
Receiving objects: 20% (16379/81893), 14.09 MiB | 28.16 MiB/s
Receiving objects: 21% (17198/81893), 14.09 MiB | 28.16 MiB/s
Receiving objects: 22% (18017/81893), 14.09 MiB | 28.16 MiB/s
Receiving objects: 23% (18836/81893), 14.09 MiB | 28.16 MiB/s
Receiving objects: 24% (19655/81893), 14.09 MiB | 28.16 MiB/s
Receiving objects: 25% (20474/81893), 14.09 MiB | 28.16 MiB/s
Receiving objects: 26% (21293/81893), 14.09 MiB | 28.16 MiB/s
Receiving objects: 27% (22112/81893), 14.09 MiB | 28.16 MiB/s
Receiving objects: 28% (22931/81893), 14.09 MiB | 28.16 MiB/s
Receiving objects: 29% (23749/81893), 14.09 MiB | 28.16 MiB/s
Receiving objects: 30% (24568/81893), 14.09 MiB | 28.16 MiB/s
Receiving objects: 31% (25387/81893), 14.09 MiB | 28.16 MiB/s
Receiving objects: 32% (26206/81893), 14.09 MiB | 28.16 MiB/s
Receiving objects: 33% (27025/81893), 14.09 MiB | 28.16 MiB/s
Receiving objects: 34% (27844/81893), 14.09 MiB | 28.16 MiB/s
Receiving objects: 35% (28663/81893), 14.09 MiB | 28.16 MiB/s
Receiving objects: 36% (29482/81893), 14.09 MiB | 28.16 MiB/s
Receiving objects: 37% (30301/81893), 14.09 MiB | 28.16 MiB/s
Receiving objects: 38% (31120/81893), 14.09 MiB | 28.16 MiB/s
Receiving objects: 39% (31939/81893), 14.09 MiB | 28.16 MiB/s
Receiving objects: 40% (32758/81893), 14.09 MiB | 28.16 MiB/s
Receiving objects: 40% (33019/81893), 30.93 MiB | 30.92 MiB/s
Receiving objects: 41% (33577/81893), 30.93 MiB | 30.92 MiB/s
Receiving objects: 42% (34396/81893), 30.93 MiB | 30.92 MiB/s
Receiving objects: 43% (35214/81893), 30.93 MiB | 30.92 MiB/s
Receiving objects: 44% (36033/81893), 30.93 MiB | 30.92 MiB/s
Receiving objects: 45% (36852/81893), 30.93 MiB | 30.92 MiB/s
Receiving objects: 46% (37671/81893), 30.93 MiB | 30.92 MiB/s
Receiving objects: 47% (38490/81893), 30.93 MiB | 30.92 MiB/s
Receiving objects: 48% (39309/81893), 30.93 MiB | 30.92 MiB/s
Receiving objects: 49% (40128/81893), 46.97 MiB | 31.31 MiB/s
Receiving objects: 50% (40947/81893), 46.97 MiB | 31.31 MiB/s
Receiving objects: 51% (41766/81893), 46.97 MiB | 31.31 MiB/s
Receiving objects: 52% (42585/81893), 46.97 MiB | 31.31 MiB/s
Receiving objects: 53% (43404/81893), 46.97 MiB | 31.31 MiB/s
Receiving objects: 54% (44223/81893), 46.97 MiB | 31.31 MiB/s
Receiving objects: 55% (45042/81893), 46.97 MiB | 31.31 MiB/s
Receiving objects: 56% (45861/81893), 46.97 MiB | 31.31 MiB/s
Receiving objects: 57% (46680/81893), 46.97 MiB | 31.31 MiB/s
Receiving objects: 58% (47498/81893), 46.97 MiB | 31.31 MiB/s
Receiving objects: 59% (48317/81893), 46.97 MiB | 31.31 MiB/s
Receiving objects: 59% (48653/81893), 64.52 MiB | 32.26 MiB/s
Receiving objects: 60% (49136/81893), 64.52 MiB | 32.26 MiB/s
Receiving objects: 61% (49955/81893), 64.52 MiB | 32.26 MiB/s
Receiving objects: 62% (50774/81893), 64.52 MiB | 32.26 MiB/s
Receiving objects: 63% (51593/81893), 64.52 MiB | 32.26 MiB/s
Receiving objects: 64% (52412/81893), 64.52 MiB | 32.26 MiB/s
Receiving objects: 65% (53231/81893), 64.52 MiB | 32.26 MiB/s
Receiving objects: 66% (54050/81893), 64.52 MiB | 32.26 MiB/s
Receiving objects: 67% (54869/81893), 80.44 MiB | 32.11 MiB/s
Receiving objects: 68% (55688/81893), 80.44 MiB | 32.11 MiB/s
Receiving objects: 69% (56507/81893), 80.44 MiB | 32.11 MiB/s
Receiving objects: 70% (57326/81893), 80.44 MiB | 32.11 MiB/s
Receiving objects: 71% (58145/81893), 80.44 MiB | 32.11 MiB/s
Receiving objects: 72% (58963/81893), 80.44 MiB | 32.11 MiB/s
Receiving objects: 73% (59782/81893), 80.44 MiB | 32.11 MiB/s
Receiving objects: 74% (60601/81893), 80.44 MiB | 32.11 MiB/s
Receiving objects: 75% (61420/81893), 80.44 MiB | 32.11 MiB/s
Receiving objects: 76% (62239/81893), 80.44 MiB | 32.11 MiB/s
Receiving objects: 76% (62597/81893), 97.53 MiB | 32.45 MiB/s
Receiving objects: 77% (63058/81893), 97.53 MiB | 32.45 MiB/s
Receiving objects: 78% (63877/81893), 97.53 MiB | 32.45 MiB/s
Receiving objects: 79% (64696/81893), 97.53 MiB | 32.45 MiB/s
Receiving objects: 80% (65515/81893), 97.53 MiB | 32.45 MiB/s
Receiving objects: 81% (66334/81893), 97.53 MiB | 32.45 MiB/s
Receiving objects: 82% (67153/81893), 97.53 MiB | 32.45 MiB/s
Receiving objects: 83% (67972/81893), 97.53 MiB | 32.45 MiB/s
Receiving objects: 84% (68791/81893), 113.68 MiB | 32.43 MiB/s
Receiving objects: 85% (69610/81893), 113.68 MiB | 32.43 MiB/s
Receiving objects: 86% (70428/81893), 113.68 MiB | 32.43 MiB/s
Receiving objects: 87% (71247/81893), 113.68 MiB | 32.43 MiB/s
Receiving objects: 88% (72066/81893), 113.68 MiB | 32.43 MiB/s
Receiving objects: 89% (72885/81893), 113.68 MiB | 32.43 MiB/s
Receiving objects: 90% (73704/81893), 113.68 MiB | 32.43 MiB/s
Receiving objects: 91% (74523/81893), 113.68 MiB | 32.43 MiB/s
Receiving objects: 92% (75342/81893), 113.68 MiB | 32.43 MiB/s
Receiving objects: 93% (76161/81893), 113.68 MiB | 32.43 MiB/s
Receiving objects: 94% (76980/81893), 113.68 MiB | 32.43 MiB/s
Receiving objects: 95% (77799/81893), 113.68 MiB | 32.43 MiB/s
Receiving objects: 96% (78618/81893), 113.68 MiB | 32.43 MiB/s
Receiving objects: 97% (79437/81893), 113.68 MiB | 32.43 MiB/s
Receiving objects: 98% (80256/81893), 113.68 MiB | 32.43 MiB/s
Receiving objects: 99% (81075/81893), 113.68 MiB | 32.43 MiB/s
remote: Total 81893 (delta 8914), reused 9443 (delta 8046), pack-reused 70405 (from 2)
7.55 s
Receiving objects: 100% (81893/81893), 113.68 MiB | 32.43 MiB/s
Receiving objects: 100% (81893/81893), 127.83 MiB | 32.64 MiB/s, done.
8.49 s
Resolving deltas: 0% (0/55395)
Resolving deltas: 1% (554/55395)
Resolving deltas: 2% (1109/55395)
Resolving deltas: 3% (1662/55395)
Resolving deltas: 4% (2216/55395)
Resolving deltas: 5% (2770/55395)
Resolving deltas: 6% (3324/55395)
Resolving deltas: 7% (3878/55395)
Resolving deltas: 8% (4432/55395)
Resolving deltas: 9% (4986/55395)
Resolving deltas: 10% (5542/55395)
Resolving deltas: 11% (6094/55395)
Resolving deltas: 12% (6650/55395)
Resolving deltas: 13% (7202/55395)
Resolving deltas: 14% (7756/55395)
Resolving deltas: 15% (8310/55395)
Resolving deltas: 16% (8864/55395)
Resolving deltas: 17% (9420/55395)
Resolving deltas: 18% (9973/55395)
Resolving deltas: 19% (10527/55395)
Resolving deltas: 20% (11079/55395)
Resolving deltas: 21% (11633/55395)
Resolving deltas: 22% (12187/55395)
Resolving deltas: 23% (12741/55395)
Resolving deltas: 24% (13295/55395)
Resolving deltas: 25% (13849/55395)
Resolving deltas: 26% (14405/55395)
Resolving deltas: 27% (14960/55395)
Resolving deltas: 28% (15511/55395)
Resolving deltas: 29% (16065/55395)
Resolving deltas: 30% (16619/55395)
Resolving deltas: 31% (17173/55395)
Resolving deltas: 32% (17727/55395)
Resolving deltas: 33% (18281/55395)
Resolving deltas: 34% (18835/55395)
Resolving deltas: 35% (19389/55395)
Resolving deltas: 36% (19943/55395)
Resolving deltas: 37% (20498/55395)
Resolving deltas: 38% (21051/55395)
Resolving deltas: 39% (21605/55395)
Resolving deltas: 40% (22158/55395)
Resolving deltas: 41% (22714/55395)
Resolving deltas: 42% (23266/55395)
Resolving deltas: 43% (23820/55395)
Resolving deltas: 44% (24374/55395)
Resolving deltas: 45% (24928/55395)
Resolving deltas: 46% (25482/55395)
Resolving deltas: 47% (26036/55395)
Resolving deltas: 48% (26590/55395)
Resolving deltas: 49% (27144/55395)
Resolving deltas: 50% (27699/55395)
Resolving deltas: 51% (28252/55395)
Resolving deltas: 52% (28806/55395)
Resolving deltas: 53% (29360/55395)
Resolving deltas: 54% (29914/55395)
Resolving deltas: 55% (30468/55395)
Resolving deltas: 56% (31023/55395)
Resolving deltas: 57% (31576/55395)
Resolving deltas: 58% (32130/55395)
Resolving deltas: 59% (32684/55395)
Resolving deltas: 60% (33237/55395)
Resolving deltas: 61% (33791/55395)
Resolving deltas: 62% (34345/55395)
Resolving deltas: 63% (34899/55395)
Resolving deltas: 64% (35453/55395)
Resolving deltas: 65% (36007/55395)
Resolving deltas: 66% (36561/55395)
Resolving deltas: 67% (37115/55395)
Resolving deltas: 68% (37669/55395)
Resolving deltas: 69% (38223/55395)
Resolving deltas: 70% (38777/55395)
Resolving deltas: 71% (39331/55395)
Resolving deltas: 72% (39886/55395)
Resolving deltas: 73% (40439/55395)
Resolving deltas: 74% (40994/55395)
Resolving deltas: 75% (41547/55395)
Resolving deltas: 76% (42101/55395)
Resolving deltas: 77% (42655/55395)
Resolving deltas: 78% (43210/55395)
Resolving deltas: 79% (43763/55395)
Resolving deltas: 80% (44316/55395)
Resolving deltas: 81% (44870/55395)
Resolving deltas: 82% (45424/55395)
Resolving deltas: 83% (45980/55395)
Resolving deltas: 84% (46532/55395)
Resolving deltas: 85% (47086/55395)
Resolving deltas: 86% (47640/55395)
Resolving deltas: 87% (48194/55395)
Resolving deltas: 88% (48748/55395)
Resolving deltas: 89% (49302/55395)
Resolving deltas: 90% (49856/55395)
Resolving deltas: 91% (50410/55395)
Resolving deltas: 92% (50964/55395)
Resolving deltas: 93% (51518/55395)
Resolving deltas: 94% (52073/55395)
Resolving deltas: 95% (52626/55395)
Resolving deltas: 96% (53181/55395)
Resolving deltas: 97% (53734/55395)
Resolving deltas: 98% (54288/55395)
Resolving deltas: 99% (54845/55395)
Resolving deltas: 100% (55395/55395)
Resolving deltas: 100% (55395/55395), done.
8.87 s
Fetching commit 5d6a4ea85d6186bb1d72615a4d7a9642d8b673fa for docs ...
8.87 s
$ /nix/store/bcnisk3ydfgv26v2gw3zlky24g00yww2-git-2.54.0/bin/git fetch origin 5d6a4ea85d6186bb1d72615a4d7a9642d8b673fa
9.31 s
From https://github.com/alphal00p/gammaloop
9.31 s
* branch 5d6a4ea85d6186bb1d72615a4d7a9642d8b673fa -> FETCH_HEAD
9.32 s
$ /nix/store/9ypz3flqsrl5xl495mm8h645gadjsxi1-coreutils-9.11/bin/timeout --kill-after=15s 7200s /nix/store/bcnisk3ydfgv26v2gw3zlky24g00yww2-git-2.54.0/bin/git -c advice.detachedHead=false checkout 5d6a4ea85d6186bb1d72615a4d7a9642d8b673fa
9.54 s
HEAD is now at 5d6a4ea85 restore pre-regression About institutions layout
9.55 s
$ /nix/store/9ypz3flqsrl5xl495mm8h645gadjsxi1-coreutils-9.11/bin/timeout --kill-after=15s 7200s /nix/store/23zk8sgzamrbmj1fday15szf7f2279s8-nix-2.34.7/bin/nix --extra-experimental-features nix-command --extra-experimental-features flakes --log-format internal-json run .#packages.x86_64-linux.nix-ci-check-gammaloop-nextest-docs --print-build-logs
9.84 s
stdenv.isDarwin is deprecated, use stdenv.hostPlatform.isDarwin instead
14.35 s
14.84 s
evaluating derivation 'gevaluation warning: stdenv.isDarwin is deprecated, use stdenv.hostPlatform.isDarwin instead
20.46 s
copying '/nix/store/04ws
evaluating derivation 'g
copying '/nix/store/04ws
evaluating derivation 'g
copying '/nix/store/04ws
evaluating derivation 'g
copying '/nix/store/04ws
evaluating derivation 'g
copying '/nix/store/04ws
evaluating derivation 'g
copying '/nix/store/04ws
evaluating derivation 'g
[0 /1 built]
[1 /0 /1 built] building g gammaloop-nextest-docs> Extracting 2 binaries to /build/source/target/nix-ci-tmp/nextest-archive-vsYfDW
20.51 s
gammaloop-nextest-docs> Extracted 5 files to /build/source/target/nix-ci-tmp/nextest-archive-vsYfDW in 0.04s
20.51 s
gammaloop-nextest-docs> ------------
20.51 s
gammaloop-nextest-docs> Nextest run ID c87ef220-cfd8-4c86-8a64-45c72567f34b with nextest profile: ci_gammaloop
20.51 s
gammaloop-nextest-docs> Starting 119 tests across 2 binaries
20.62 s
gammaloop-nextest-docs> FAIL [ 0.058s] ( 67/119) alphal00p-docs-builder tests :: portal_focuses_on_projects_and_keeps_dedicated_routes
20.62 s
gammaloop-nextest-docs> stdout ---
20.62 s
gammaloop-nextest-docs>
20.62 s
gammaloop-nextest-docs> running 1 test
20.62 s
gammaloop-nextest-docs> test tests::portal_focuses_on_projects_and_keeps_dedicated_routes ... FAILED
20.62 s
gammaloop-nextest-docs>
20.62 s
gammaloop-nextest-docs> failures:
20.62 s
gammaloop-nextest-docs>
20.62 s
gammaloop-nextest-docs> failures:
20.62 s
gammaloop-nextest-docs> tests::portal_focuses_on_projects_and_keeps_dedicated_routes
20.62 s
gammaloop-nextest-docs>
20.62 s
gammaloop-nextest-docs> test result: FAILED. 0 passed; 1 failed; 0 ignored; 0 measured; 118 filtered out; finished in 0.05s
20.62 s
gammaloop-nextest-docs>
20.62 s
gammaloop-nextest-docs> stderr ---
20.62 s
gammaloop-nextest-docs> warning: bundle export is experimental
20.62 s
gammaloop-nextest-docs> = hint: its behaviour may change at any time
20.62 s
gammaloop-nextest-docs> = hint: do not rely on this feature for production use cases
20.62 s
gammaloop-nextest-docs>
20.62 s
gammaloop-nextest-docs>
20.62 s
gammaloop-nextest-docs> thread 'tests::portal_focuses_on_projects_and_keeps_dedicated_routes' (355) panicked at crates/alphal00p-docs-builder/src/lib.rs:11904:9:
20.62 s
gammaloop-nextest-docs> assertion `left == right` failed
20.62 s
gammaloop-nextest-docs> left: 8
20.62 s
gammaloop-nextest-docs> right: 7
20.62 s
gammaloop-nextest-docs> stack backtrace:
20.62 s
gammaloop-nextest-docs> 0: __rustc::rust_begin_unwind
20.62 s
gammaloop-nextest-docs> 1: core::panicking::panic_fmt
20.62 s
gammaloop-nextest-docs> 2: core::panicking::assert_failed_inner
20.62 s
gammaloop-nextest-docs> 3: core::panicking::assert_failed::<usize, usize>
20.62 s
gammaloop-nextest-docs> 4: alphal00p_docs_builder::tests::portal_focuses_on_projects_and_keeps_dedicated_routes
20.62 s
gammaloop-nextest-docs> 5: <alphal00p_docs_builder::tests::portal_focuses_on_projects_and_keeps_dedicated_routes::{closure#0} as core::ops::function::FnOnce<()>>::call_once
20.62 s
gammaloop-nextest-docs> note: Some details are omitted, run with `RUST_BACKTRACE=full` for a verbose backtrace.
20.62 s
gammaloop-nextest-docs>
36.98 s
gammaloop-nextest-docs> ------------
36.98 s
gammaloop-nextest-docs> Summary [ 16.460s] 119 tests run: 118 passed , 1 failed , 0 skipped
36.98 s
gammaloop-nextest-docs> FAIL [ 0.058s] ( 67/119) alphal00p-docs-builder tests :: portal_focuses_on_projects_and_keeps_dedicated_routes
36.98 s
gammaloop-nextest-docs> stdout ---
36.98 s
gammaloop-nextest-docs>
36.98 s
gammaloop-nextest-docs> running 1 test
36.98 s
gammaloop-nextest-docs> test tests::portal_focuses_on_projects_and_keeps_dedicated_routes ... FAILED
36.98 s
gammaloop-nextest-docs>
36.98 s
gammaloop-nextest-docs> failures:
36.98 s
gammaloop-nextest-docs>
36.98 s
gammaloop-nextest-docs> failures:
36.98 s
gammaloop-nextest-docs> tests::portal_focuses_on_projects_and_keeps_dedicated_routes
36.98 s
gammaloop-nextest-docs>
36.98 s
gammaloop-nextest-docs> test result: FAILED. 0 passed; 1 failed; 0 ignored; 0 measured; 118 filtered out; finished in 0.05s
36.98 s
gammaloop-nextest-docs>
36.98 s
gammaloop-nextest-docs> stderr ---
36.98 s
gammaloop-nextest-docs> warning: bundle export is experimental
36.98 s
gammaloop-nextest-docs> = hint: its behaviour may change at any time
36.98 s
gammaloop-nextest-docs> = hint: do not rely on this feature for production use cases
36.98 s
gammaloop-nextest-docs>
36.98 s
gammaloop-nextest-docs>
36.98 s
gammaloop-nextest-docs> thread 'tests::portal_focuses_on_projects_and_keeps_dedicated_routes' (355) panicked at crates/alphal00p-docs-builder/src/lib.rs:11904:9:
36.98 s
gammaloop-nextest-docs> assertion `left == right` failed
36.98 s
gammaloop-nextest-docs> left: 8
36.98 s
gammaloop-nextest-docs> right: 7
36.98 s
gammaloop-nextest-docs> stack backtrace:
36.98 s
gammaloop-nextest-docs> 0: __rustc::rust_begin_unwind
36.98 s
gammaloop-nextest-docs> 1: core::panicking::panic_fmt
36.98 s
gammaloop-nextest-docs> 2: core::panicking::assert_failed_inner
36.98 s
gammaloop-nextest-docs> 3: core::panicking::assert_failed::<usize, usize>
36.98 s
gammaloop-nextest-docs> 4: alphal00p_docs_builder::tests::portal_focuses_on_projects_and_keeps_dedicated_routes
36.98 s
gammaloop-nextest-docs> 5: <alphal00p_docs_builder::tests::portal_focuses_on_projects_and_keeps_dedicated_routes::{closure#0} as core::ops::function::FnOnce<()>>::call_once
36.98 s
gammaloop-nextest-docs> note: Some details are omitted, run with `RUST_BACKTRACE=full` for a verbose backtrace.
36.98 s
gammaloop-nextest-docs>
36.99 s
gammaloop-nextest-docs> error : test run failed
37.01 s
gammaloop-nextest-docs>
37.01 s
gammaloop-nextest-docs> ========== nextest test summary ==========
37.01 s
gammaloop-nextest-docs> report: target/nextest/ci_gammaloop/junit.xml
37.01 s
gammaloop-nextest-docs> tests: 119, failures: 1, errors: 0
37.01 s
gammaloop-nextest-docs>
37.01 s
gammaloop-nextest-docs> 1. alphal00p-docs-builder::tests::portal_focuses_on_projects_and_keeps_dedicated_routes
37.01 s
gammaloop-nextest-docs> failure: test failure with exit code 101
37.01 s
gammaloop-nextest-docs> thread 'tests::portal_focuses_on_projects_and_keeps_dedicated_routes' (355) panicked at crates/alphal00p-docs-builder/src/lib.rs:11904:9:
37.01 s
gammaloop-nextest-docs> assertion `left == right` failed
37.01 s
gammaloop-nextest-docs> left: 8
37.01 s
gammaloop-nextest-docs> right: 7
37.01 s
gammaloop-nextest-docs> stack backtrace:
37.01 s
gammaloop-nextest-docs> 0: __rustc::rust_begin_unwind
37.01 s
gammaloop-nextest-docs> 1: core::panicking::panic_fmt
37.01 s
gammaloop-nextest-docs> 2: core::panicking::assert_failed_inner
37.01 s
gammaloop-nextest-docs> 3: core::panicking::assert_failed::<usize, usize>
37.01 s
gammaloop-nextest-docs> 4: alphal00p_docs_builder::tests::portal_focuses_on_projects_and_keeps_dedicated_routes
37.01 s
gammaloop-nextest-docs> 5: <alphal00p_docs_builder::tests::portal_focuses_on_projects_and_keeps_dedicated_routes::{closure#0} as core::ops::function::FnOnce<()>>::call_once
37.01 s
gammaloop-nextest-docs> note: Some details are omitted, run with `RUST_BACKTRACE=full` for a verbose backtrace.
37.01 s
gammaloop-nextest-docs> system-out
37.01 s
gammaloop-nextest-docs> running 1 test
37.01 s
gammaloop-nextest-docs> test tests::portal_focuses_on_projects_and_keeps_dedicated_routes ... FAILED
37.01 s
gammaloop-nextest-docs>
37.01 s
gammaloop-nextest-docs> failures:
37.01 s
gammaloop-nextest-docs>
37.01 s
gammaloop-nextest-docs> failures:
37.01 s
gammaloop-nextest-docs> tests::portal_focuses_on_projects_and_keeps_dedicated_routes
37.01 s
gammaloop-nextest-docs>
37.01 s
gammaloop-nextest-docs> test result: FAILED. 0 passed; 1 failed; 0 ignored; 0 measured; 118 filtered out; finished in 0.05s
37.01 s
gammaloop-nextest-docs> system-err
37.01 s
gammaloop-nextest-docs> warning: bundle export is experimental
37.01 s
gammaloop-nextest-docs> = hint: its behaviour may change at any time
37.01 s
gammaloop-nextest-docs> = hint: do not rely on this feature for production use cases
37.01 s
gammaloop-nextest-docs>
37.01 s
gammaloop-nextest-docs>
37.01 s
gammaloop-nextest-docs> thread 'tests::portal_focuses_on_projects_and_keeps_dedicated_routes' (355) panicked at crates/alphal00p-docs-builder/src/lib.rs:11904:9:
37.01 s
gammaloop-nextest-docs> assertion `left == right` failed
37.01 s
gammaloop-nextest-docs> left: 8
37.01 s
gammaloop-nextest-docs> right: 7
37.01 s
gammaloop-nextest-docs> stack backtrace:
37.01 s
gammaloop-nextest-docs> 0: __rustc::rust_begin_unwind
37.01 s
gammaloop-nextest-docs> 1: core::panicking::panic_fmt
37.01 s
gammaloop-nextest-docs> 2: core::panicking::assert_failed_inner
37.01 s
gammaloop-nextest-docs> 3: core::panicking::assert_failed::<usize, usize>
37.01 s
gammaloop-nextest-docs> 4: alphal00p_docs_builder::tests::portal_focuses_on_projects_and_keeps_dedicated_routes
37.01 s
gammaloop-nextest-docs> 5: <alphal00p_docs_builder::tests::portal_focuses_on_projects_and_keeps_dedicated_routes::{closure#0} as core::ops::function::FnOnce<()>>::call_once
37.01 s
gammaloop-nextest-docs> note: Some details are omitted, run with `RUST_BACKTRACE=full` for a verbose backtrace.
37.01 s
gammaloop-nextest-docs> =========================================
37.03 s
gammaloop-nextest-docs> Extracting 2 binaries to /build/source/target/nix-ci-tmp/nextest-archive-FjJHUo
37.06 s
gammaloop-nextest-docs> Extracted 5 files to /build/source/target/nix-ci-tmp/nextest-archive-FjJHUo in 0.04s
37.07 s
gammaloop-nextest-docs> ------------
37.07 s
gammaloop-nextest-docs> Nextest run ID 0c993efd-3910-4929-be63-7dc2693b1a84 with nextest profile: ci_gammaloop
37.07 s
gammaloop-nextest-docs> Starting 21 tests across 2 binaries
37.08 s
gammaloop-nextest-docs> ------------
37.08 s
gammaloop-nextest-docs> Summary [ 0.012s] 21 tests run: 21 passed , 0 skipped
37.12 s
gammaloop-nextest-docs>
37.12 s
gammaloop-nextest-docs> ========== nextest test summary ==========
37.12 s
gammaloop-nextest-docs> report: target/nextest/ci_gammaloop/junit.xml
37.12 s
gammaloop-nextest-docs> tests: 21, failures: 0, errors: 0
37.12 s
gammaloop-nextest-docs> No failing testcases found.
37.12 s
gammaloop-nextest-docs> =========================================
37.13 s
gammaloop-nextest-docs> Extracting 3 binaries (including 2 non-test binaries), 1 build script output directory, and 2 linked paths to /build/source/target/nix-ci-tmp/nextest-archive-k6NIjS
37.37 s
gammaloop-nextest-docs> Extracted 22 files to /build/source/target/nix-ci-tmp/nextest-archive-k6NIjS in 0.23s
37.38 s
gammaloop-nextest-docs> ------------
37.38 s
gammaloop-nextest-docs> Nextest run ID 2ab28787-3e3c-4dca-b60c-99d15e4a3782 with nextest profile: ci_gammaloop
37.38 s
gammaloop-nextest-docs> Starting 89 tests across 1 binary
37.41 s
gammaloop-nextest-docs> ------------
37.41 s
gammaloop-nextest-docs> Summary [ 0.037s] 89 tests run: 89 passed , 0 skipped
37.48 s
gammaloop-nextest-docs>
37.48 s
gammaloop-nextest-docs> ========== nextest test summary ==========
37.48 s
gammaloop-nextest-docs> report: target/nextest/ci_gammaloop/junit.xml
37.48 s
gammaloop-nextest-docs> tests: 89, failures: 0, errors: 0
37.48 s
gammaloop-nextest-docs> No failing testcases found.
37.48 s
gammaloop-nextest-docs> =========================================
37.49 s
gammaloop-nextest-docs> Extracting 2 binaries to /build/source/target/nix-ci-tmp/nextest-archive-8E231w
37.53 s
gammaloop-nextest-docs> Extracted 5 files to /build/source/target/nix-ci-tmp/nextest-archive-8E231w in 0.04s
37.54 s
gammaloop-nextest-docs> ------------
37.54 s
gammaloop-nextest-docs> Nextest run ID aa023de6-e9ef-40cc-b59a-c9ab6bee9d65 with nextest profile: ci_gammaloop
37.54 s
gammaloop-nextest-docs> Starting 10 tests across 2 binaries
49.84 s
gammaloop-nextest-docs> ------------
49.84 s
gammaloop-nextest-docs> Summary [ 12.296s] 10 tests run: 10 passed , 0 skipped
49.87 s
gammaloop-nextest-docs>
49.87 s
gammaloop-nextest-docs> ========== nextest test summary ==========
49.87 s
gammaloop-nextest-docs> report: target/nextest/ci_gammaloop/junit.xml
49.87 s
gammaloop-nextest-docs> tests: 10, failures: 0, errors: 0
49.87 s
gammaloop-nextest-docs> No failing testcases found.
49.87 s
gammaloop-nextest-docs> =========================================
49.88 s
gammaloop-nextest-docs> Extracting 1 binary to /build/source/target/nix-ci-tmp/nextest-archive-CooXX8
49.92 s
gammaloop-nextest-docs> Extracted 4 files to /build/source/target/nix-ci-tmp/nextest-archive-CooXX8 in 0.03s
49.93 s
gammaloop-nextest-docs> ------------
49.93 s
gammaloop-nextest-docs> Nextest run ID 44e3df82-0a94-408f-bf2f-a31ff1587dc7 with nextest profile: ci_gammaloop
49.93 s
gammaloop-nextest-docs> Starting 0 tests across 1 binary
49.93 s
gammaloop-nextest-docs> ------------
49.93 s
gammaloop-nextest-docs> Summary [ 0.000s] 0 tests run: 0 passed , 0 skipped
49.96 s
gammaloop-nextest-docs>
49.96 s
gammaloop-nextest-docs> ========== nextest test summary ==========
49.96 s
gammaloop-nextest-docs> report: target/nextest/ci_gammaloop/junit.xml
49.96 s
gammaloop-nextest-docs> tests: 0, failures: 0, errors: 0
49.96 s
gammaloop-nextest-docs> No failing testcases found.
49.96 s
gammaloop-nextest-docs> =========================================
49.97 s
gammaloop-nextest-docs> Extracting 1 binary to /build/source/target/nix-ci-tmp/nextest-archive-0ri1CQ
50.00 s
gammaloop-nextest-docs> Extracted 4 files to /build/source/target/nix-ci-tmp/nextest-archive-0ri1CQ in 0.03s
50.01 s
gammaloop-nextest-docs> ------------
50.01 s
gammaloop-nextest-docs> Nextest run ID 43251f96-9827-4090-9917-60bacd9ef228 with nextest profile: ci_gammaloop
50.01 s
gammaloop-nextest-docs> Starting 4 tests across 1 binary
50.02 s
gammaloop-nextest-docs> ------------
50.02 s
gammaloop-nextest-docs> Summary [ 0.005s] 4 tests run: 4 passed , 0 skipped
50.05 s
gammaloop-nextest-docs>
50.05 s
gammaloop-nextest-docs> ========== nextest test summary ==========
50.05 s
gammaloop-nextest-docs> report: target/nextest/ci_gammaloop/junit.xml
50.05 s
gammaloop-nextest-docs> tests: 4, failures: 0, errors: 0
50.05 s
gammaloop-nextest-docs> No failing testcases found.
50.05 s
gammaloop-nextest-docs> =========================================
50.23 s
error: Cannot build '/nix/store/s6iwkk5yfm0lqw2zljscawlwklzvv71v-gammaloop-nextest-docs.drv '.
50.23 s
Reason: builder failed with exit code 100 .
50.23 s
Output paths:
50.23 s
/nix/store/x42iadyxwmrz96xva82kghb1sx3lld6g-gammaloop-nextest-docs
50.23 s
Last 185 log lines:
50.23 s
> Extracting 2 binaries to /build/source/target/nix-ci-tmp/nextest-archive-vsYfDW
50.23 s
> Extracted 5 files to /build/source/target/nix-ci-tmp/nextest-archive-vsYfDW in 0.04s
50.23 s
> ------------
50.23 s
> Nextest run ID c87ef220-cfd8-4c86-8a64-45c72567f34b with nextest profile: ci_gammaloop
50.23 s
> Starting 119 tests across 2 binaries
50.23 s
> FAIL [ 0.058s] ( 67/119) alphal00p-docs-builder tests :: portal_focuses_on_projects_and_keeps_dedicated_routes
50.23 s
> stdout ---
50.23 s
>
50.23 s
> running 1 test
50.23 s
> test tests::portal_focuses_on_projects_and_keeps_dedicated_routes ... FAILED
50.23 s
>
50.23 s
> failures:
50.23 s
>
50.23 s
> failures:
50.23 s
> tests::portal_focuses_on_projects_and_keeps_dedicated_routes
50.23 s
>
50.23 s
> test result: FAILED. 0 passed; 1 failed; 0 ignored; 0 measured; 118 filtered out; finished in 0.05s
50.23 s
>
50.23 s
> stderr ---
50.23 s
> warning: bundle export is experimental
50.23 s
> = hint: its behaviour may change at any time
50.23 s
> = hint: do not rely on this feature for production use cases
50.23 s
>
50.23 s
>
50.23 s
> thread 'tests::portal_focuses_on_projects_and_keeps_dedicated_routes' (355) panicked at crates/alphal00p-docs-builder/src/lib.rs:11904:9:
50.23 s
> assertion `left == right` failed
50.23 s
> left: 8
50.23 s
> right: 7
50.23 s
> stack backtrace:
50.23 s
> 0: __rustc::rust_begin_unwind
50.23 s
> 1: core::panicking::panic_fmt
50.23 s
> 2: core::panicking::assert_failed_inner
50.23 s
> 3: core::panicking::assert_failed::<usize, usize>
50.23 s
> 4: alphal00p_docs_builder::tests::portal_focuses_on_projects_and_keeps_dedicated_routes
50.23 s
> 5: <alphal00p_docs_builder::tests::portal_focuses_on_projects_and_keeps_dedicated_routes::{closure#0} as core::ops::function::FnOnce<()>>::call_once
50.23 s
> note: Some details are omitted, run with `RUST_BACKTRACE=full` for a verbose backtrace.
50.23 s
>
50.23 s
> ------------
50.23 s
> Summary [ 16.460s] 119 tests run: 118 passed , 1 failed , 0 skipped
50.23 s
> FAIL [ 0.058s] ( 67/119) alphal00p-docs-builder tests :: portal_focuses_on_projects_and_keeps_dedicated_routes
50.23 s
> stdout ---
50.23 s
>
50.23 s
> running 1 test
50.23 s
> test tests::portal_focuses_on_projects_and_keeps_dedicated_routes ... FAILED
50.23 s
>
50.23 s
> failures:
50.23 s
>
50.23 s
> failures:
50.23 s
> tests::portal_focuses_on_projects_and_keeps_dedicated_routes
50.23 s
>
50.23 s
> test result: FAILED. 0 passed; 1 failed; 0 ignored; 0 measured; 118 filtered out; finished in 0.05s
50.23 s
>
50.23 s
> stderr ---
50.23 s
> warning: bundle export is experimental
50.23 s
> = hint: its behaviour may change at any time
50.23 s
> = hint: do not rely on this feature for production use cases
50.23 s
>
50.23 s
>
50.23 s
> thread 'tests::portal_focuses_on_projects_and_keeps_dedicated_routes' (355) panicked at crates/alphal00p-docs-builder/src/lib.rs:11904:9:
50.23 s
> assertion `left == right` failed
50.23 s
> left: 8
50.23 s
> right: 7
50.23 s
> stack backtrace:
50.23 s
> 0: __rustc::rust_begin_unwind
50.23 s
> 1: core::panicking::panic_fmt
50.23 s
> 2: core::panicking::assert_failed_inner
50.23 s
> 3: core::panicking::assert_failed::<usize, usize>
50.23 s
> 4: alphal00p_docs_builder::tests::portal_focuses_on_projects_and_keeps_dedicated_routes
50.23 s
> 5: <alphal00p_docs_builder::tests::portal_focuses_on_projects_and_keeps_dedicated_routes::{closure#0} as core::ops::function::FnOnce<()>>::call_once
50.23 s
> note: Some details are omitted, run with `RUST_BACKTRACE=full` for a verbose backtrace.
50.23 s
>
50.23 s
> error : test run failed
50.23 s
>
50.23 s
> ========== nextest test summary ==========
50.23 s
> report: target/nextest/ci_gammaloop/junit.xml
50.23 s
> tests: 119, failures: 1, errors: 0
50.23 s
>
50.23 s
> 1. alphal00p-docs-builder::tests::portal_focuses_on_projects_and_keeps_dedicated_routes
50.23 s
> failure: test failure with exit code 101
50.23 s
> thread 'tests::portal_focuses_on_projects_and_keeps_dedicated_routes' (355) panicked at crates/alphal00p-docs-builder/src/lib.rs:11904:9:
50.23 s
> assertion `left == right` failed
50.23 s
> left: 8
50.23 s
> right: 7
50.23 s
> stack backtrace:
50.23 s
> 0: __rustc::rust_begin_unwind
50.23 s
> 1: core::panicking::panic_fmt
50.23 s
> 2: core::panicking::assert_failed_inner
50.23 s
> 3: core::panicking::assert_failed::<usize, usize>
50.23 s
> 4: alphal00p_docs_builder::tests::portal_focuses_on_projects_and_keeps_dedicated_routes
50.23 s
> 5: <alphal00p_docs_builder::tests::portal_focuses_on_projects_and_keeps_dedicated_routes::{closure#0} as core::ops::function::FnOnce<()>>::call_once
50.23 s
> note: Some details are omitted, run with `RUST_BACKTRACE=full` for a verbose backtrace.
50.23 s
> system-out
50.23 s
> running 1 test
50.23 s
> test tests::portal_focuses_on_projects_and_keeps_dedicated_routes ... FAILED
50.23 s
>
50.23 s
> failures:
50.23 s
>
50.23 s
> failures:
50.23 s
> tests::portal_focuses_on_projects_and_keeps_dedicated_routes
50.23 s
>
50.23 s
> test result: FAILED. 0 passed; 1 failed; 0 ignored; 0 measured; 118 filtered out; finished in 0.05s
50.23 s
> system-err
50.23 s
> warning: bundle export is experimental
50.23 s
> = hint: its behaviour may change at any time
50.23 s
> = hint: do not rely on this feature for production use cases
50.23 s
>
50.23 s
>
50.23 s
> thread 'tests::portal_focuses_on_projects_and_keeps_dedicated_routes' (355) panicked at crates/alphal00p-docs-builder/src/lib.rs:11904:9:
50.23 s
> assertion `left == right` failed
50.23 s
> left: 8
50.23 s
> right: 7
50.23 s
> stack backtrace:
50.23 s
> 0: __rustc::rust_begin_unwind
50.23 s
> 1: core::panicking::panic_fmt
50.23 s
> 2: core::panicking::assert_failed_inner
50.23 s
> 3: core::panicking::assert_failed::<usize, usize>
50.23 s
> 4: alphal00p_docs_builder::tests::portal_focuses_on_projects_and_keeps_dedicated_routes
50.23 s
> 5: <alphal00p_docs_builder::tests::portal_focuses_on_projects_and_keeps_dedicated_routes::{closure#0} as core::ops::function::FnOnce<()>>::call_once
50.23 s
> note: Some details are omitted, run with `RUST_BACKTRACE=full` for a verbose backtrace.
50.23 s
> =========================================
50.23 s
> Extracting 2 binaries to /build/source/target/nix-ci-tmp/nextest-archive-FjJHUo
50.23 s
> Extracted 5 files to /build/source/target/nix-ci-tmp/nextest-archive-FjJHUo in 0.04s
50.23 s
> ------------
50.23 s
> Nextest run ID 0c993efd-3910-4929-be63-7dc2693b1a84 with nextest profile: ci_gammaloop
50.23 s
> Starting 21 tests across 2 binaries
50.23 s
> ------------
50.23 s
> Summary [ 0.012s] 21 tests run: 21 passed , 0 skipped
50.23 s
>
50.23 s
> ========== nextest test summary ==========
50.23 s
> report: target/nextest/ci_gammaloop/junit.xml
50.23 s
> tests: 21, failures: 0, errors: 0
50.23 s
> No failing testcases found.
50.23 s
> =========================================
50.23 s
> Extracting 3 binaries (including 2 non-test binaries), 1 build script output directory, and 2 linked paths to /build/source/target/nix-ci-tmp/nextest-archive-k6NIjS
50.23 s
> Extracted 22 files to /build/source/target/nix-ci-tmp/nextest-archive-k6NIjS in 0.23s
50.23 s
> ------------
50.23 s
> Nextest run ID 2ab28787-3e3c-4dca-b60c-99d15e4a3782 with nextest profile: ci_gammaloop
50.23 s
> Starting 89 tests across 1 binary
50.23 s
> ------------
50.23 s
> Summary [ 0.037s] 89 tests run: 89 passed , 0 skipped
50.23 s
>
50.23 s
> ========== nextest test summary ==========
50.23 s
> report: target/nextest/ci_gammaloop/junit.xml
50.23 s
> tests: 89, failures: 0, errors: 0
50.23 s
> No failing testcases found.
50.23 s
> =========================================
50.23 s
> Extracting 2 binaries to /build/source/target/nix-ci-tmp/nextest-archive-8E231w
50.23 s
> Extracted 5 files to /build/source/target/nix-ci-tmp/nextest-archive-8E231w in 0.04s
50.23 s
> ------------
50.23 s
> Nextest run ID aa023de6-e9ef-40cc-b59a-c9ab6bee9d65 with nextest profile: ci_gammaloop
50.23 s
> Starting 10 tests across 2 binaries
50.23 s
> ------------
50.23 s
> Summary [ 12.296s] 10 tests run: 10 passed , 0 skipped
50.23 s
>
50.23 s
> ========== nextest test summary ==========
50.23 s
> report: target/nextest/ci_gammaloop/junit.xml
50.23 s
> tests: 10, failures: 0, errors: 0
50.23 s
> No failing testcases found.
50.23 s
> =========================================
50.23 s
> Extracting 1 binary to /build/source/target/nix-ci-tmp/nextest-archive-CooXX8
50.23 s
> Extracted 4 files to /build/source/target/nix-ci-tmp/nextest-archive-CooXX8 in 0.03s
50.23 s
> ------------
50.23 s
> Nextest run ID 44e3df82-0a94-408f-bf2f-a31ff1587dc7 with nextest profile: ci_gammaloop
50.23 s
> Starting 0 tests across 1 binary
50.23 s
> ------------
50.23 s
> Summary [ 0.000s] 0 tests run: 0 passed , 0 skipped
50.23 s
>
50.23 s
> ========== nextest test summary ==========
50.23 s
> report: target/nextest/ci_gammaloop/junit.xml
50.23 s
> tests: 0, failures: 0, errors: 0
50.23 s
> No failing testcases found.
50.23 s
> =========================================
50.23 s
> Extracting 1 binary to /build/source/target/nix-ci-tmp/nextest-archive-0ri1CQ
50.23 s
> Extracted 4 files to /build/source/target/nix-ci-tmp/nextest-archive-0ri1CQ in 0.03s
50.23 s
> ------------
50.23 s
> Nextest run ID 43251f96-9827-4090-9917-60bacd9ef228 with nextest profile: ci_gammaloop
50.23 s
> Starting 4 tests across 1 binary
50.23 s
> ------------
50.23 s
> Summary [ 0.005s] 4 tests run: 4 passed , 0 skipped
50.23 s
>
50.23 s
> ========== nextest test summary ==========
50.23 s
> report: target/nextest/ci_gammaloop/junit.xml
50.23 s
> tests: 4, failures: 0, errors: 0
50.23 s
> No failing testcases found.
50.23 s
> =========================================
50.23 s
For full logs, run:
50.23 s
nix log /nix/store/s6iwkk5yfm0lqw2zljscawlwklzvv71v-gammaloop-nextest-docs.drv
50.36 s
[0 built (1 failed )]Run failed.