test packages.x86_64-linux.nix-ci-check-gammaloop-nextest-core

Reproduce this run
Original Run
  1. 0.01 s $ /nix/store/9ypz3flqsrl5xl495mm8h645gadjsxi1-coreutils-9.11/bin/timeout --kill-after=15s 7200s /nix/store/23zk8sgzamrbmj1fday15szf7f2279s8-nix-2.34.7/bin/nix --extra-experimental-features nix-command --extra-experimental-features flakes flake clone git+https://github.com/alphal00p/gammaloop --dest /tmp/nix-ci-worker/stable-pwd/repo/
  2. 0.39 s Cloning into '/tmp/nix-ci-worker/stable-pwd/repo'...
  3. 1.43 s remote: Enumerating objects: 87950, done.
  4. 1.53 s remote: Counting objects: 0% (1/10548) remote: Counting objects: 1% (106/10548) remote: Counting objects: 2% (211/10548) remote: Counting objects: 3% (317/10548) remote: Counting objects: 4% (422/10548) remote: Counting objects: 5% (528/10548) remote: Counting objects: 6% (633/10548) remote: Counting objects: 7% (739/10548) remote: Counting objects: 8% (844/10548) remote: Counting objects: 9% (950/10548) remote: Counting objects: 10% (1055/10548) remote: Counting objects: 11% (1161/10548) remote: Counting objects: 12% (1266/10548) remote: Counting objects: 13% (1372/10548) remote: Counting objects: 14% (1477/10548) remote: Counting objects: 15% (1583/10548) remote: Counting objects: 16% (1688/10548) remote: Counting objects: 17% (1794/10548) remote: Counting objects: 18% (1899/10548) remote: Counting objects: 19% (2005/10548) remote: Counting objects: 20% (2110/10548) remote: Counting objects: 21% (2216/10548) remote: Counting objects: 22% (2321/10548) remote: Counting objects: 23% (2427/10548) remote: Counting objects: 24% (2532/10548) remote: Counting objects: 25% (2637/10548) remote: Counting objects: 26% (2743/10548) remote: Counting objects: 27% (2848/10548) remote: Counting objects: 28% (2954/10548) remote: Counting objects: 29% (3059/10548) remote: Counting objects: 30% (3165/10548) remote: Counting objects: 31% (3270/10548) remote: Counting objects: 32% (3376/10548) remote: Counting objects: 33% (3481/10548) remote: Counting objects: 34% (3587/10548) remote: Counting objects: 35% (3692/10548) remote: Counting objects: 36% (3798/10548) remote: Counting objects: 37% (3903/10548) remote: Counting objects: 38% (4009/10548) remote: Counting objects: 39% (4114/10548) remote: Counting objects: 40% (4220/10548) remote: Counting objects: 41% (4325/10548) remote: Counting objects: 42% (4431/10548) remote: Counting objects: 43% (4536/10548) remote: Counting objects: 44% (4642/10548) remote: Counting objects: 45% (4747/10548) remote: Counting objects: 46% (4853/10548) remote: Counting objects: 47% (4958/10548) remote: Counting objects: 48% (5064/10548) remote: Counting objects: 49% (5169/10548) remote: Counting objects: 50% (5274/10548) remote: Counting objects: 51% (5380/10548) remote: Counting objects: 52% (5485/10548) remote: Counting objects: 53% (5591/10548) remote: Counting objects: 54% (5696/10548) remote: Counting objects: 55% (5802/10548) remote: Counting objects: 56% (5907/10548) remote: Counting objects: 57% (6013/10548) remote: Counting objects: 58% (6118/10548) remote: Counting objects: 59% (6224/10548) remote: Counting objects: 60% (6329/10548) remote: Counting objects: 61% (6435/10548) remote: Counting objects: 62% (6540/10548) remote: Counting objects: 63% (6646/10548) remote: Counting objects: 64% (6751/10548) remote: Counting objects: 65% (6857/10548) remote: Counting objects: 66% (6962/10548) remote: Counting objects: 67% (7068/10548) remote: Counting objects: 68% (7173/10548) remote: Counting objects: 69% (7279/10548) remote: Counting objects: 70% (7384/10548) remote: Counting objects: 71% (7490/10548) remote: Counting objects: 72% (7595/10548) remote: Counting objects: 73% (7701/10548) remote: Counting objects: 74% (7806/10548) remote: Counting objects: 75% (7911/10548) remote: Counting objects: 76% (8017/10548) remote: Counting objects: 77% (8122/10548) remote: Counting objects: 78% (8228/10548) remote: Counting objects: 79% (8333/10548) remote: Counting objects: 80% (8439/10548) remote: Counting objects: 81% (8544/10548) remote: Counting objects: 82% (8650/10548) remote: Counting objects: 83% (8755/10548) remote: Counting objects: 84% (8861/10548) remote: Counting objects: 85% (8966/10548) remote: Counting objects: 86% (9072/10548) remote: Counting objects: 87% (9177/10548) remote: Counting objects: 88% (9283/10548) remote: Counting objects: 89% (9388/10548) remote: Counting objects: 90% (9494/10548) remote: Counting objects: 91% (9599/10548) remote: Counting objects: 92% (9705/10548) remote: Counting objects: 93% (9810/10548) remote: Counting objects: 94% (9916/10548) remote: Counting objects: 95% (10021/10548) remote: Counting objects: 96% (10127/10548) remote: Counting objects: 97% (10232/10548) remote: Counting objects: 98% (10338/10548) remote: Counting objects: 99% (10443/10548) remote: Counting objects: 100% (10548/10548) remote: Counting objects: 100% (10548/10548), done.
  5. 4.42 s remote: Compressing objects: 0% (1/2960) remote: Compressing objects: 1% (30/2960) remote: Compressing objects: 2% (60/2960) remote: Compressing objects: 3% (89/2960) remote: Compressing objects: 4% (119/2960) remote: Compressing objects: 5% (148/2960) remote: Compressing objects: 6% (178/2960) remote: Compressing objects: 7% (208/2960) remote: Compressing objects: 8% (237/2960) remote: Compressing objects: 9% (267/2960) remote: Compressing objects: 10% (296/2960) remote: Compressing objects: 11% (326/2960) remote: Compressing objects: 12% (356/2960) remote: Compressing objects: 13% (385/2960) remote: Compressing objects: 14% (415/2960) remote: Compressing objects: 15% (444/2960) remote: Compressing objects: 15% (450/2960) remote: Compressing objects: 16% (474/2960) remote: Compressing objects: 17% (504/2960) remote: Compressing objects: 18% (533/2960) remote: Compressing objects: 19% (563/2960) remote: Compressing objects: 20% (592/2960) remote: Compressing objects: 21% (622/2960) remote: Compressing objects: 22% (652/2960) remote: Compressing objects: 23% (681/2960) remote: Compressing objects: 24% (711/2960) remote: Compressing objects: 25% (740/2960) remote: Compressing objects: 26% (770/2960) remote: Compressing objects: 26% (781/2960) remote: Compressing objects: 27% (800/2960) remote: Compressing objects: 28% (829/2960) remote: Compressing objects: 29% (859/2960) remote: Compressing objects: 30% (888/2960) remote: Compressing objects: 31% (918/2960) remote: Compressing objects: 32% (948/2960) remote: Compressing objects: 33% (977/2960) remote: Compressing objects: 34% (1007/2960) remote: Compressing objects: 35% (1036/2960) remote: Compressing objects: 36% (1066/2960) remote: Compressing objects: 37% (1096/2960) remote: Compressing objects: 38% (1125/2960) remote: Compressing objects: 39% (1155/2960) remote: Compressing objects: 40% (1184/2960) remote: Compressing objects: 41% (1214/2960) remote: Compressing objects: 42% (1244/2960) remote: Compressing objects: 43% (1273/2960) remote: Compressing objects: 44% (1303/2960) remote: Compressing objects: 45% (1332/2960) remote: Compressing objects: 46% (1362/2960) remote: Compressing objects: 47% (1392/2960) remote: Compressing objects: 48% (1421/2960) remote: Compressing objects: 49% (1451/2960) remote: Compressing objects: 50% (1480/2960) remote: Compressing objects: 51% (1510/2960) remote: Compressing objects: 52% (1540/2960) remote: Compressing objects: 53% (1569/2960) remote: Compressing objects: 54% (1599/2960) remote: Compressing objects: 55% (1628/2960) remote: Compressing objects: 56% (1658/2960) remote: Compressing objects: 57% (1688/2960) remote: Compressing objects: 58% (1717/2960) remote: Compressing objects: 59% (1747/2960) remote: Compressing objects: 60% (1776/2960) remote: Compressing objects: 61% (1806/2960) remote: Compressing objects: 62% (1836/2960) remote: Compressing objects: 63% (1865/2960) remote: Compressing objects: 64% (1895/2960) remote: Compressing objects: 65% (1924/2960) remote: Compressing objects: 66% (1954/2960) remote: Compressing objects: 67% (1984/2960) remote: Compressing objects: 68% (2013/2960) remote: Compressing objects: 69% (2043/2960) remote: Compressing objects: 70% (2072/2960) remote: Compressing objects: 71% (2102/2960) remote: Compressing objects: 72% (2132/2960) remote: Compressing objects: 73% (2161/2960) remote: Compressing objects: 74% (2191/2960) remote: Compressing objects: 75% (2220/2960) remote: Compressing objects: 76% (2250/2960) remote: Compressing objects: 77% (2280/2960) remote: Compressing objects: 78% (2309/2960) remote: Compressing objects: 79% (2339/2960) remote: Compressing objects: 80% (2368/2960) remote: Compressing objects: 81% (2398/2960) remote: Compressing objects: 82% (2428/2960) remote: Compressing objects: 83% (2457/2960) remote: Compressing objects: 84% (2487/2960) remote: Compressing objects: 85% (2516/2960) remote: Compressing objects: 86% (2546/2960) remote: Compressing objects: 87% (2576/2960) remote: Compressing objects: 88% (2605/2960) remote: Compressing objects: 89% (2635/2960) remote: Compressing objects: 90% (2664/2960) remote: Compressing objects: 91% (2694/2960) remote: Compressing objects: 92% (2724/2960) remote: Compressing objects: 93% (2753/2960) remote: Compressing objects: 94% (2783/2960) remote: Compressing objects: 95% (2812/2960) remote: Compressing objects: 96% (2842/2960) remote: Compressing objects: 97% (2872/2960) remote: Compressing objects: 98% (2901/2960) remote: Compressing objects: 99% (2931/2960) remote: Compressing objects: 100% (2960/2960) remote: Compressing objects: 100% (2960/2960), done.
  6. 9.37 s Receiving objects: 0% (1/87950) Receiving objects: 1% (880/87950) Receiving objects: 2% (1759/87950) Receiving objects: 3% (2639/87950) Receiving objects: 4% (3518/87950) Receiving objects: 5% (4398/87950) Receiving objects: 6% (5277/87950), 9.33 MiB | 18.64 MiB/s Receiving objects: 7% (6157/87950), 9.33 MiB | 18.64 MiB/s Receiving objects: 8% (7036/87950), 9.33 MiB | 18.64 MiB/s Receiving objects: 9% (7916/87950), 9.33 MiB | 18.64 MiB/s Receiving objects: 10% (8795/87950), 9.33 MiB | 18.64 MiB/s Receiving objects: 11% (9675/87950), 9.33 MiB | 18.64 MiB/s Receiving objects: 12% (10554/87950), 9.33 MiB | 18.64 MiB/s Receiving objects: 13% (11434/87950), 9.33 MiB | 18.64 MiB/s Receiving objects: 14% (12313/87950), 9.33 MiB | 18.64 MiB/s Receiving objects: 15% (13193/87950), 9.33 MiB | 18.64 MiB/s Receiving objects: 16% (14072/87950), 9.33 MiB | 18.64 MiB/s Receiving objects: 17% (14952/87950), 9.33 MiB | 18.64 MiB/s Receiving objects: 18% (15831/87950), 9.33 MiB | 18.64 MiB/s Receiving objects: 19% (16711/87950), 9.33 MiB | 18.64 MiB/s Receiving objects: 20% (17590/87950), 9.33 MiB | 18.64 MiB/s Receiving objects: 21% (18470/87950), 9.33 MiB | 18.64 MiB/s Receiving objects: 22% (19349/87950), 9.33 MiB | 18.64 MiB/s Receiving objects: 23% (20229/87950), 9.33 MiB | 18.64 MiB/s Receiving objects: 24% (21108/87950), 9.33 MiB | 18.64 MiB/s Receiving objects: 25% (21988/87950), 9.33 MiB | 18.64 MiB/s Receiving objects: 26% (22867/87950), 9.33 MiB | 18.64 MiB/s Receiving objects: 27% (23747/87950), 9.33 MiB | 18.64 MiB/s Receiving objects: 28% (24626/87950), 9.33 MiB | 18.64 MiB/s Receiving objects: 29% (25506/87950), 9.33 MiB | 18.64 MiB/s Receiving objects: 30% (26385/87950), 9.33 MiB | 18.64 MiB/s Receiving objects: 31% (27265/87950), 9.33 MiB | 18.64 MiB/s Receiving objects: 32% (28144/87950), 9.33 MiB | 18.64 MiB/s Receiving objects: 33% (29024/87950), 9.33 MiB | 18.64 MiB/s Receiving objects: 34% (29903/87950), 9.33 MiB | 18.64 MiB/s Receiving objects: 35% (30783/87950), 9.33 MiB | 18.64 MiB/s Receiving objects: 36% (31662/87950), 9.33 MiB | 18.64 MiB/s Receiving objects: 37% (32542/87950), 9.33 MiB | 18.64 MiB/s Receiving objects: 37% (33340/87950), 9.33 MiB | 18.64 MiB/s Receiving objects: 38% (33421/87950), 31.23 MiB | 31.22 MiB/s Receiving objects: 39% (34301/87950), 31.23 MiB | 31.22 MiB/s Receiving objects: 40% (35180/87950), 31.23 MiB | 31.22 MiB/s Receiving objects: 41% (36060/87950), 31.23 MiB | 31.22 MiB/s Receiving objects: 42% (36939/87950), 31.23 MiB | 31.22 MiB/s Receiving objects: 43% (37819/87950), 31.23 MiB | 31.22 MiB/s Receiving objects: 44% (38698/87950), 31.23 MiB | 31.22 MiB/s Receiving objects: 45% (39578/87950), 31.23 MiB | 31.22 MiB/s Receiving objects: 46% (40457/87950), 31.23 MiB | 31.22 MiB/s Receiving objects: 47% (41337/87950), 49.81 MiB | 33.20 MiB/s Receiving objects: 48% (42216/87950), 49.81 MiB | 33.20 MiB/s Receiving objects: 49% (43096/87950), 49.81 MiB | 33.20 MiB/s Receiving objects: 50% (43975/87950), 49.81 MiB | 33.20 MiB/s Receiving objects: 51% (44855/87950), 49.81 MiB | 33.20 MiB/s Receiving objects: 52% (45734/87950), 49.81 MiB | 33.20 MiB/s Receiving objects: 53% (46614/87950), 49.81 MiB | 33.20 MiB/s Receiving objects: 54% (47493/87950), 49.81 MiB | 33.20 MiB/s Receiving objects: 55% (48373/87950), 49.81 MiB | 33.20 MiB/s Receiving objects: 55% (49016/87950), 67.67 MiB | 33.83 MiB/s Receiving objects: 56% (49252/87950), 67.67 MiB | 33.83 MiB/s Receiving objects: 57% (50132/87950), 67.67 MiB | 33.83 MiB/s Receiving objects: 58% (51011/87950), 67.67 MiB | 33.83 MiB/s Receiving objects: 59% (51891/87950), 67.67 MiB | 33.83 MiB/s Receiving objects: 60% (52770/87950), 67.67 MiB | 33.83 MiB/s Receiving objects: 61% (53650/87950), 67.67 MiB | 33.83 MiB/s Receiving objects: 62% (54529/87950), 67.67 MiB | 33.83 MiB/s Receiving objects: 63% (55409/87950), 67.67 MiB | 33.83 MiB/s Receiving objects: 64% (56288/87950), 67.67 MiB | 33.83 MiB/s Receiving objects: 65% (57168/87950), 67.67 MiB | 33.83 MiB/s Receiving objects: 65% (57341/87950), 103.20 MiB | 34.40 MiB/s Receiving objects: 66% (58047/87950), 103.20 MiB | 34.40 MiB/s Receiving objects: 67% (58927/87950), 103.20 MiB | 34.40 MiB/s Receiving objects: 68% (59806/87950), 103.20 MiB | 34.40 MiB/s Receiving objects: 69% (60686/87950), 103.20 MiB | 34.40 MiB/s Receiving objects: 70% (61565/87950), 103.20 MiB | 34.40 MiB/s Receiving objects: 71% (62445/87950), 103.20 MiB | 34.40 MiB/s Receiving objects: 72% (63324/87950), 103.20 MiB | 34.40 MiB/s Receiving objects: 73% (64204/87950), 123.44 MiB | 35.26 MiB/s Receiving objects: 74% (65083/87950), 123.44 MiB | 35.26 MiB/s Receiving objects: 75% (65963/87950), 123.44 MiB | 35.26 MiB/s Receiving objects: 76% (66842/87950), 123.44 MiB | 35.26 MiB/s Receiving objects: 77% (67722/87950), 123.44 MiB | 35.26 MiB/s Receiving objects: 78% (68601/87950), 123.44 MiB | 35.26 MiB/s Receiving objects: 79% (69481/87950), 123.44 MiB | 35.26 MiB/s Receiving objects: 80% (70360/87950), 123.44 MiB | 35.26 MiB/s Receiving objects: 81% (71240/87950), 123.44 MiB | 35.26 MiB/s Receiving objects: 82% (72119/87950), 123.44 MiB | 35.26 MiB/s Receiving objects: 83% (72999/87950), 123.44 MiB | 35.26 MiB/s Receiving objects: 84% (73878/87950), 123.44 MiB | 35.26 MiB/s Receiving objects: 84% (74051/87950), 141.78 MiB | 35.44 MiB/s Receiving objects: 85% (74758/87950), 141.78 MiB | 35.44 MiB/s Receiving objects: 86% (75637/87950), 141.78 MiB | 35.44 MiB/s Receiving objects: 87% (76517/87950), 141.78 MiB | 35.44 MiB/s Receiving objects: 88% (77396/87950), 141.78 MiB | 35.44 MiB/s Receiving objects: 89% (78276/87950), 141.78 MiB | 35.44 MiB/s Receiving objects: 90% (79155/87950), 141.78 MiB | 35.44 MiB/s Receiving objects: 91% (80035/87950), 141.78 MiB | 35.44 MiB/s Receiving objects: 92% (80914/87950), 141.78 MiB | 35.44 MiB/s Receiving objects: 93% (81794/87950), 141.78 MiB | 35.44 MiB/s Receiving objects: 94% (82673/87950), 141.78 MiB | 35.44 MiB/s Receiving objects: 95% (83553/87950), 141.78 MiB | 35.44 MiB/s Receiving objects: 96% (84432/87950), 141.78 MiB | 35.44 MiB/s Receiving objects: 97% (85312/87950), 141.78 MiB | 35.44 MiB/s Receiving objects: 98% (86191/87950), 141.78 MiB | 35.44 MiB/s Receiving objects: 99% (87071/87950), 159.71 MiB | 35.49 MiB/s remote: Total 87950 (delta 8613), reused 8357 (delta 7562), pack-reused 77402 (from 3)
  7. 9.37 s Receiving objects: 100% (87950/87950), 159.71 MiB | 35.49 MiB/s Receiving objects: 100% (87950/87950), 176.58 MiB | 35.69 MiB/s, done.
  8. 11.80 s Resolving deltas: 0% (0/59478) Resolving deltas: 1% (595/59478) Resolving deltas: 2% (1190/59478) Resolving deltas: 3% (1785/59478) Resolving deltas: 4% (2380/59478) Resolving deltas: 5% (2975/59478) Resolving deltas: 6% (3570/59478) Resolving deltas: 7% (4164/59478) Resolving deltas: 8% (4759/59478) Resolving deltas: 9% (5354/59478) Resolving deltas: 10% (5948/59478) Resolving deltas: 11% (6543/59478) Resolving deltas: 12% (7139/59478) Resolving deltas: 13% (7733/59478) Resolving deltas: 14% (8327/59478) Resolving deltas: 15% (8922/59478) Resolving deltas: 16% (9517/59478) Resolving deltas: 17% (10112/59478) Resolving deltas: 18% (10707/59478) Resolving deltas: 19% (11301/59478) Resolving deltas: 20% (11896/59478) Resolving deltas: 21% (12491/59478) Resolving deltas: 22% (13086/59478) Resolving deltas: 23% (13680/59478) Resolving deltas: 24% (14275/59478) Resolving deltas: 25% (14870/59478) Resolving deltas: 26% (15465/59478) Resolving deltas: 27% (16060/59478) Resolving deltas: 28% (16654/59478) Resolving deltas: 29% (17249/59478) Resolving deltas: 30% (17844/59478) Resolving deltas: 31% (18439/59478) Resolving deltas: 32% (19033/59478) Resolving deltas: 33% (19628/59478) Resolving deltas: 34% (20223/59478) Resolving deltas: 35% (20819/59478) Resolving deltas: 36% (21414/59478) Resolving deltas: 37% (22007/59478) Resolving deltas: 38% (22602/59478) Resolving deltas: 39% (23197/59478) Resolving deltas: 40% (23792/59478) Resolving deltas: 41% (24386/59478) Resolving deltas: 42% (24981/59478) Resolving deltas: 43% (25576/59478) Resolving deltas: 44% (26171/59478) Resolving deltas: 45% (26767/59478) Resolving deltas: 46% (27360/59478) Resolving deltas: 47% (27955/59478) Resolving deltas: 48% (28550/59478) Resolving deltas: 49% (29145/59478) Resolving deltas: 50% (29739/59478) Resolving deltas: 51% (30334/59478) Resolving deltas: 51% (30903/59478) Resolving deltas: 52% (30929/59478) Resolving deltas: 53% (31524/59478) Resolving deltas: 54% (32119/59478) Resolving deltas: 55% (32713/59478) Resolving deltas: 56% (33308/59478) Resolving deltas: 57% (33905/59478) Resolving deltas: 58% (34498/59478) Resolving deltas: 59% (35093/59478) Resolving deltas: 60% (35687/59478) Resolving deltas: 61% (36282/59478) Resolving deltas: 62% (36877/59478) Resolving deltas: 63% (37472/59478) Resolving deltas: 64% (38066/59478) Resolving deltas: 65% (38661/59478) Resolving deltas: 66% (39256/59478) Resolving deltas: 67% (39851/59478) Resolving deltas: 68% (40446/59478) Resolving deltas: 69% (41040/59478) Resolving deltas: 70% (41635/59478) Resolving deltas: 71% (42230/59478) Resolving deltas: 72% (42825/59478) Resolving deltas: 73% (43419/59478) Resolving deltas: 74% (44014/59478) Resolving deltas: 75% (44609/59478) Resolving deltas: 76% (45204/59478) Resolving deltas: 77% (45802/59478) Resolving deltas: 78% (46393/59478) Resolving deltas: 79% (46988/59478) Resolving deltas: 80% (47583/59478) Resolving deltas: 80% (48070/59478) Resolving deltas: 81% (48178/59478) Resolving deltas: 82% (48773/59478) Resolving deltas: 83% (49367/59478) Resolving deltas: 84% (49962/59478) Resolving deltas: 85% (50557/59478) Resolving deltas: 86% (51152/59478) Resolving deltas: 87% (51746/59478) Resolving deltas: 88% (52341/59478) Resolving deltas: 89% (52936/59478) Resolving deltas: 90% (53532/59478) Resolving deltas: 91% (54125/59478) Resolving deltas: 92% (54720/59478) Resolving deltas: 93% (55315/59478) Resolving deltas: 94% (55910/59478) Resolving deltas: 95% (56505/59478) Resolving deltas: 96% (57099/59478) Resolving deltas: 97% (57694/59478) Resolving deltas: 98% (58289/59478) Resolving deltas: 99% (58884/59478) Resolving deltas: 100% (59478/59478) Resolving deltas: 100% (59478/59478), done.
  9. 12.38 s Fetching commit 891dec7c25b5d9026c099da021ec7ae3b757dee9 for docs ...
  10. 12.38 s $ /nix/store/bcnisk3ydfgv26v2gw3zlky24g00yww2-git-2.54.0/bin/git fetch origin 891dec7c25b5d9026c099da021ec7ae3b757dee9
  11. 13.03 s From https://github.com/alphal00p/gammaloop
  12. 13.03 s * branch 891dec7c25b5d9026c099da021ec7ae3b757dee9 -> FETCH_HEAD
  13. 13.10 s $ /nix/store/9ypz3flqsrl5xl495mm8h645gadjsxi1-coreutils-9.11/bin/timeout --kill-after=15s 7200s /nix/store/bcnisk3ydfgv26v2gw3zlky24g00yww2-git-2.54.0/bin/git -c advice.detachedHead=false checkout 891dec7c25b5d9026c099da021ec7ae3b757dee9
  14. 13.31 s HEAD is now at 891dec7c2 change photos
  15. 13.33 s $ /nix/store/9ypz3flqsrl5xl495mm8h645gadjsxi1-coreutils-9.11/bin/timeout --kill-after=15s 7200s /nix/store/23zk8sgzamrbmj1fday15szf7f2279s8-nix-2.34.7/bin/nix --extra-experimental-features nix-command --extra-experimental-features flakes --log-format internal-json run .#packages.x86_64-linux.nix-ci-check-gammaloop-nextest-core --print-build-logs
  16. 19.73 s
  17. 19.89 s Downloading cached gammaloop-nextest-binaries-core-gammaloop-tracing-filter from https://cache.nix-ci.com
  18. 19.89 s Downloading cached gammaloop-nextest-binaries-core-gammaloop-tracing-filter-macros from https://cache.nix-ci.com
  19. 19.89 s Downloading cached gammaloop-nextest-binaries-core-gammalooprs from https://cache.nix-ci.com
  20. 19.89 s Downloading cached gammaloop-nextest-binaries-core-gammaloop-api from https://cache.nix-ci.com
  21. 20.21 s Downloaded cached gammaloop-nextest-binaries-core-gammaloop-tracing-filter-macros (2.2 MiB) in 319ms
  22. 20.21 s Progress: 0 of 1 built, 1 of 6 downloaded from cache (3 downloading)
  23. 21.63 s Downloaded cached gammaloop-nextest-binaries-core-gammaloop-tracing-filter (8.5 MiB) in 1.7s
  24. 21.63 s Progress: 0 of 1 built, 2 of 6 downloaded from cache (2 downloading)
  25. 21.81 s Downloaded cached gammaloop-nextest-binaries-core-gammaloop-api (70.6 MiB) in 1.9s
  26. 21.81 s Progress: 0 of 1 built, 3 of 6 downloaded from cache (1 downloading)
  27. 22.32 s Downloaded cached gammaloop-nextest-binaries-core-gammalooprs (81.3 MiB) in 2.4s
  28. 22.32 s Progress: 0 of 1 built, 4 of 6 downloaded from cache
  29. 22.32 s Downloading cached gammaloop-nextest-binaries-core from https://cache.nix-ci.com
  30. 22.38 s Downloaded cached gammaloop-nextest-binaries-core (1640 B) in 58ms
  31. 22.38 s Progress: 0 of 1 built, 5 of 6 downloaded from cache
  32. 22.38 s Downloading cached nix-ci-check-gammaloop-nextest-core from https://cache.nix-ci.com
  33. 22.45 s Downloaded cached nix-ci-check-gammaloop-nextest-core (1016 B) in 69ms
  34. 22.45 s Progress: 0 of 1 built, 6 of 6 downloaded from cache
  35. 32.24 s evaluating derivation 'g copying '/nix/store/bgss evaluating derivation 'g copying '/nix/store/bgss evaluating derivation 'g copying '/nix/store/bgss evaluating derivation 'g copying '/nix/store/bgss evaluating derivation 'g copying '/nix/store/bgss evaluating derivation 'g copying '/nix/store/bgss evaluating derivation 'g copying '/nix/store/bgss evaluating derivation 'g copying '/nix/store/bgss evaluating derivation 'g copying '/nix/store/bgss evaluating derivation 'g copying '/nix/store/bgss evaluating derivation 'g querying gammaloop-nexte querying info about miss querying gammaloop-nexte [0.0 KiB DL] querying in [0/1 built, 0.0 KiB DL] [1/0/1 built, 0.0 KiB DLgammaloop-nextest-core> Extracting 4 binaries (including 2 non-test binaries), 1 build script output directory, and 2 linked paths to /build/source
  36. 32.98 s gammaloop-nextest-core> Extracted 20 files to /build/source in 0.74s
  37. 33.01 s gammaloop-nextest-core> ------------
  38. 33.01 s gammaloop-nextest-core> Nextest run ID c4264ff8-419b-46a9-b017-a0f0311b1317 with nextest profile: ci_gammaloop
  39. 33.01 s gammaloop-nextest-core> Starting 339 tests across 2 binaries (1 test skipped)
  40. 33.81 s gammaloop-nextest-core> FAIL [ 0.057s] (245/339) gammaloop-api repl::tests::completion_shows_type_hint_for_non_boolean_settings_leaf
  41. 33.81 s gammaloop-nextest-core> stdout ---
  42. 33.81 s gammaloop-nextest-core>
  43. 33.81 s gammaloop-nextest-core> running 1 test
  44. 33.81 s gammaloop-nextest-core> test repl::tests::completion_shows_type_hint_for_non_boolean_settings_leaf ... FAILED
  45. 33.81 s gammaloop-nextest-core>
  46. 33.81 s gammaloop-nextest-core> failures:
  47. 33.81 s gammaloop-nextest-core>
  48. 33.81 s gammaloop-nextest-core> failures:
  49. 33.81 s gammaloop-nextest-core> repl::tests::completion_shows_type_hint_for_non_boolean_settings_leaf
  50. 33.81 s gammaloop-nextest-core>
  51. 33.81 s gammaloop-nextest-core> test result: FAILED. 0 passed; 1 failed; 0 ignored; 0 measured; 339 filtered out; finished in 0.03s
  52. 33.81 s gammaloop-nextest-core>
  53. 33.81 s gammaloop-nextest-core> stderr ---
  54. 33.81 s gammaloop-nextest-core>
  55. 33.81 s gammaloop-nextest-core> thread 'repl::tests::completion_shows_type_hint_for_non_boolean_settings_leaf' (790) panicked at crates/gammaloop-api/src/repl.rs:5772:9:
  56. 33.81 s gammaloop-nextest-core> [Suggestion { value: "", description: Some("expects an integer"), style: None, extra: None, span: Span { start: 42, end: 42 }, append_whitespace: false }]
  57. 33.81 s gammaloop-nextest-core> stack backtrace:
  58. 33.81 s gammaloop-nextest-core> 0: __rustc::rust_begin_unwind
  59. 33.81 s gammaloop-nextest-core> 1: core::panicking::panic_fmt
  60. 33.81 s gammaloop-nextest-core> 2: gammaloop_api::repl::tests::completion_shows_type_hint_for_non_boolean_settings_leaf
  61. 33.81 s gammaloop-nextest-core> 3: <gammaloop_api::repl::tests::completion_shows_type_hint_for_non_boolean_settings_leaf::{closure#0} as core::ops::function::FnOnce<()>>::call_once
  62. 33.81 s gammaloop-nextest-core> note: Some details are omitted, run with `RUST_BACKTRACE=full` for a verbose backtrace.
  63. 33.81 s gammaloop-nextest-core>
  64. 34.16 s gammaloop-nextest-core> ------------
  65. 34.16 s gammaloop-nextest-core> Summary [ 1.149s] 339 tests run: 338 passed, 1 failed, 1 skipped
  66. 34.16 s gammaloop-nextest-core> FAIL [ 0.057s] (245/339) gammaloop-api repl::tests::completion_shows_type_hint_for_non_boolean_settings_leaf
  67. 34.16 s gammaloop-nextest-core> stdout ---
  68. 34.16 s gammaloop-nextest-core>
  69. 34.16 s gammaloop-nextest-core> running 1 test
  70. 34.16 s gammaloop-nextest-core> test repl::tests::completion_shows_type_hint_for_non_boolean_settings_leaf ... FAILED
  71. 34.16 s gammaloop-nextest-core>
  72. 34.16 s gammaloop-nextest-core> failures:
  73. 34.16 s gammaloop-nextest-core>
  74. 34.16 s gammaloop-nextest-core> failures:
  75. 34.16 s gammaloop-nextest-core> repl::tests::completion_shows_type_hint_for_non_boolean_settings_leaf
  76. 34.16 s gammaloop-nextest-core>
  77. 34.16 s gammaloop-nextest-core> test result: FAILED. 0 passed; 1 failed; 0 ignored; 0 measured; 339 filtered out; finished in 0.03s
  78. 34.16 s gammaloop-nextest-core>
  79. 34.16 s gammaloop-nextest-core> stderr ---
  80. 34.16 s gammaloop-nextest-core>
  81. 34.16 s gammaloop-nextest-core> thread 'repl::tests::completion_shows_type_hint_for_non_boolean_settings_leaf' (790) panicked at crates/gammaloop-api/src/repl.rs:5772:9:
  82. 34.16 s gammaloop-nextest-core> [Suggestion { value: "", description: Some("expects an integer"), style: None, extra: None, span: Span { start: 42, end: 42 }, append_whitespace: false }]
  83. 34.16 s gammaloop-nextest-core> stack backtrace:
  84. 34.16 s gammaloop-nextest-core> 0: __rustc::rust_begin_unwind
  85. 34.16 s gammaloop-nextest-core> 1: core::panicking::panic_fmt
  86. 34.16 s gammaloop-nextest-core> 2: gammaloop_api::repl::tests::completion_shows_type_hint_for_non_boolean_settings_leaf
  87. 34.16 s gammaloop-nextest-core> 3: <gammaloop_api::repl::tests::completion_shows_type_hint_for_non_boolean_settings_leaf::{closure#0} as core::ops::function::FnOnce<()>>::call_once
  88. 34.16 s gammaloop-nextest-core> note: Some details are omitted, run with `RUST_BACKTRACE=full` for a verbose backtrace.
  89. 34.16 s gammaloop-nextest-core>
  90. 34.18 s gammaloop-nextest-core> error: test run failed
  91. 34.22 s gammaloop-nextest-core>
  92. 34.22 s gammaloop-nextest-core> ========== nextest test summary ==========
  93. 34.22 s gammaloop-nextest-core> report: target/nextest/ci_gammaloop/junit.xml
  94. 34.22 s gammaloop-nextest-core> tests: 339, failures: 1, errors: 0
  95. 34.22 s gammaloop-nextest-core>
  96. 34.22 s gammaloop-nextest-core> 1. gammaloop-api::repl::tests::completion_shows_type_hint_for_non_boolean_settings_leaf
  97. 34.22 s gammaloop-nextest-core> failure: test failure with exit code 101
  98. 34.22 s gammaloop-nextest-core> thread 'repl::tests::completion_shows_type_hint_for_non_boolean_settings_leaf' (790) panicked at crates/gammaloop-api/src/repl.rs:5772:9:
  99. 34.22 s gammaloop-nextest-core> [Suggestion { value: "", description: Some("expects an integer"), style: None, extra: None, span: Span { start: 42, end: 42 }, append_whitespace: false }]
  100. 34.22 s gammaloop-nextest-core> stack backtrace:
  101. 34.22 s gammaloop-nextest-core> 0: __rustc::rust_begin_unwind
  102. 34.22 s gammaloop-nextest-core> 1: core::panicking::panic_fmt
  103. 34.22 s gammaloop-nextest-core> 2: gammaloop_api::repl::tests::completion_shows_type_hint_for_non_boolean_settings_leaf
  104. 34.22 s gammaloop-nextest-core> 3: <gammaloop_api::repl::tests::completion_shows_type_hint_for_non_boolean_settings_leaf::{closure#0} as core::ops::function::FnOnce<()>>::call_once
  105. 34.22 s gammaloop-nextest-core> note: Some details are omitted, run with `RUST_BACKTRACE=full` for a verbose backtrace.
  106. 34.22 s gammaloop-nextest-core> system-out
  107. 34.22 s gammaloop-nextest-core> running 1 test
  108. 34.22 s gammaloop-nextest-core> test repl::tests::completion_shows_type_hint_for_non_boolean_settings_leaf ... FAILED
  109. 34.22 s gammaloop-nextest-core>
  110. 34.22 s gammaloop-nextest-core> failures:
  111. 34.22 s gammaloop-nextest-core>
  112. 34.22 s gammaloop-nextest-core> failures:
  113. 34.22 s gammaloop-nextest-core> repl::tests::completion_shows_type_hint_for_non_boolean_settings_leaf
  114. 34.22 s gammaloop-nextest-core>
  115. 34.22 s gammaloop-nextest-core> test result: FAILED. 0 passed; 1 failed; 0 ignored; 0 measured; 339 filtered out; finished in 0.03s
  116. 34.22 s gammaloop-nextest-core> system-err
  117. 34.22 s gammaloop-nextest-core> thread 'repl::tests::completion_shows_type_hint_for_non_boolean_settings_leaf' (790) panicked at crates/gammaloop-api/src/repl.rs:5772:9:
  118. 34.22 s gammaloop-nextest-core> [Suggestion { value: "", description: Some("expects an integer"), style: None, extra: None, span: Span { start: 42, end: 42 }, append_whitespace: false }]
  119. 34.22 s gammaloop-nextest-core> stack backtrace:
  120. 34.22 s gammaloop-nextest-core> 0: __rustc::rust_begin_unwind
  121. 34.22 s gammaloop-nextest-core> 1: core::panicking::panic_fmt
  122. 34.22 s gammaloop-nextest-core> 2: gammaloop_api::repl::tests::completion_shows_type_hint_for_non_boolean_settings_leaf
  123. 34.22 s gammaloop-nextest-core> 3: <gammaloop_api::repl::tests::completion_shows_type_hint_for_non_boolean_settings_leaf::{closure#0} as core::ops::function::FnOnce<()>>::call_once
  124. 34.22 s gammaloop-nextest-core> note: Some details are omitted, run with `RUST_BACKTRACE=full` for a verbose backtrace.
  125. 34.22 s gammaloop-nextest-core> =========================================
  126. 34.23 s gammaloop-nextest-core> Extracting 1 binary and 1 linked path to /build/source
  127. 34.32 s gammaloop-nextest-core> Extracted 7 files to /build/source in 0.08s
  128. 34.33 s gammaloop-nextest-core> ------------
  129. 34.34 s gammaloop-nextest-core> Nextest run ID 899428b7-745e-46f6-a69b-d0e04ac74b27 with nextest profile: ci_gammaloop
  130. 34.34 s gammaloop-nextest-core> Starting 19 tests across 1 binary
  131. 34.36 s gammaloop-nextest-core> ------------
  132. 34.36 s gammaloop-nextest-core> Summary [ 0.028s] 19 tests run: 19 passed, 0 skipped
  133. 34.41 s gammaloop-nextest-core>
  134. 34.41 s gammaloop-nextest-core> ========== nextest test summary ==========
  135. 34.41 s gammaloop-nextest-core> report: target/nextest/ci_gammaloop/junit.xml
  136. 34.41 s gammaloop-nextest-core> tests: 19, failures: 0, errors: 0
  137. 34.41 s gammaloop-nextest-core> No failing testcases found.
  138. 34.41 s gammaloop-nextest-core> =========================================
  139. 34.43 s gammaloop-nextest-core> Extracting 1 binary to /build/source
  140. 34.48 s gammaloop-nextest-core> Extracted 4 files to /build/source in 0.05s
  141. 34.50 s gammaloop-nextest-core> ------------
  142. 34.50 s gammaloop-nextest-core> Nextest run ID a90c0e0e-c879-4d05-bfc6-6919f1fcfeaf with nextest profile: ci_gammaloop
  143. 34.50 s gammaloop-nextest-core> Starting 0 tests across 1 binary
  144. 34.50 s gammaloop-nextest-core> ------------
  145. 34.50 s gammaloop-nextest-core> Summary [ 0.000s] 0 tests run: 0 passed, 0 skipped
  146. 34.55 s gammaloop-nextest-core>
  147. 34.55 s gammaloop-nextest-core> ========== nextest test summary ==========
  148. 34.55 s gammaloop-nextest-core> report: target/nextest/ci_gammaloop/junit.xml
  149. 34.55 s gammaloop-nextest-core> tests: 0, failures: 0, errors: 0
  150. 34.55 s gammaloop-nextest-core> No failing testcases found.
  151. 34.55 s gammaloop-nextest-core> =========================================
  152. 34.57 s gammaloop-nextest-core> Extracting 5 binaries (including 1 non-test binary), 1 build script output directory, and 2 linked paths to /build/source
  153. 35.36 s gammaloop-nextest-core> Extracted 20 files to /build/source in 0.79s
  154. 35.38 s gammaloop-nextest-core> ------------
  155. 35.38 s gammaloop-nextest-core> Nextest run ID ef09228d-3ef8-459c-8464-b8c1714f00a4 with nextest profile: ci_gammaloop
  156. 35.38 s gammaloop-nextest-core> Starting 456 tests across 4 binaries (61 tests skipped, including 60 tests via profile.ci_gammaloop.default-filter)
  157. 50.16 s gammaloop-nextest-core> ------------
  158. 50.16 s gammaloop-nextest-core> Summary [ 14.773s] 456 tests run: 456 passed, 61 skipped
  159. 50.21 s gammaloop-nextest-core>
  160. 50.21 s gammaloop-nextest-core> ========== nextest test summary ==========
  161. 50.21 s gammaloop-nextest-core> report: target/nextest/ci_gammaloop/junit.xml
  162. 50.21 s gammaloop-nextest-core> tests: 456, failures: 0, errors: 0
  163. 50.21 s gammaloop-nextest-core> No failing testcases found.
  164. 50.21 s gammaloop-nextest-core> =========================================
  165. 50.46 s error: Cannot build '/nix/store/02car8gk7i8dx2vfklks1bn8vxkmhh2r-gammaloop-nextest-core.drv'.
  166. 50.46 s Reason: builder failed with exit code 100.
  167. 50.46 s Output paths:
  168. 50.46 s /nix/store/mmzjp7789sw5r7w83acrb3ly0aj0pkbl-gammaloop-nextest-core
  169. 50.46 s Last 130 log lines:
  170. 50.46 s > Extracting 4 binaries (including 2 non-test binaries), 1 build script output directory, and 2 linked paths to /build/source
  171. 50.46 s > Extracted 20 files to /build/source in 0.74s
  172. 50.46 s > ------------
  173. 50.46 s > Nextest run ID c4264ff8-419b-46a9-b017-a0f0311b1317 with nextest profile: ci_gammaloop
  174. 50.46 s > Starting 339 tests across 2 binaries (1 test skipped)
  175. 50.46 s > FAIL [ 0.057s] (245/339) gammaloop-api repl::tests::completion_shows_type_hint_for_non_boolean_settings_leaf
  176. 50.46 s > stdout ---
  177. 50.46 s >
  178. 50.46 s > running 1 test
  179. 50.46 s > test repl::tests::completion_shows_type_hint_for_non_boolean_settings_leaf ... FAILED
  180. 50.46 s >
  181. 50.46 s > failures:
  182. 50.46 s >
  183. 50.46 s > failures:
  184. 50.46 s > repl::tests::completion_shows_type_hint_for_non_boolean_settings_leaf
  185. 50.46 s >
  186. 50.46 s > test result: FAILED. 0 passed; 1 failed; 0 ignored; 0 measured; 339 filtered out; finished in 0.03s
  187. 50.46 s >
  188. 50.46 s > stderr ---
  189. 50.46 s >
  190. 50.46 s > thread 'repl::tests::completion_shows_type_hint_for_non_boolean_settings_leaf' (790) panicked at crates/gammaloop-api/src/repl.rs:5772:9:
  191. 50.46 s > [Suggestion { value: "", description: Some("expects an integer"), style: None, extra: None, span: Span { start: 42, end: 42 }, append_whitespace: false }]
  192. 50.46 s > stack backtrace:
  193. 50.46 s > 0: __rustc::rust_begin_unwind
  194. 50.46 s > 1: core::panicking::panic_fmt
  195. 50.46 s > 2: gammaloop_api::repl::tests::completion_shows_type_hint_for_non_boolean_settings_leaf
  196. 50.46 s > 3: <gammaloop_api::repl::tests::completion_shows_type_hint_for_non_boolean_settings_leaf::{closure#0} as core::ops::function::FnOnce<()>>::call_once
  197. 50.46 s > note: Some details are omitted, run with `RUST_BACKTRACE=full` for a verbose backtrace.
  198. 50.46 s >
  199. 50.46 s > ------------
  200. 50.46 s > Summary [ 1.149s] 339 tests run: 338 passed, 1 failed, 1 skipped
  201. 50.46 s > FAIL [ 0.057s] (245/339) gammaloop-api repl::tests::completion_shows_type_hint_for_non_boolean_settings_leaf
  202. 50.46 s > stdout ---
  203. 50.46 s >
  204. 50.46 s > running 1 test
  205. 50.46 s > test repl::tests::completion_shows_type_hint_for_non_boolean_settings_leaf ... FAILED
  206. 50.46 s >
  207. 50.46 s > failures:
  208. 50.46 s >
  209. 50.46 s > failures:
  210. 50.46 s > repl::tests::completion_shows_type_hint_for_non_boolean_settings_leaf
  211. 50.46 s >
  212. 50.46 s > test result: FAILED. 0 passed; 1 failed; 0 ignored; 0 measured; 339 filtered out; finished in 0.03s
  213. 50.46 s >
  214. 50.46 s > stderr ---
  215. 50.46 s >
  216. 50.46 s > thread 'repl::tests::completion_shows_type_hint_for_non_boolean_settings_leaf' (790) panicked at crates/gammaloop-api/src/repl.rs:5772:9:
  217. 50.46 s > [Suggestion { value: "", description: Some("expects an integer"), style: None, extra: None, span: Span { start: 42, end: 42 }, append_whitespace: false }]
  218. 50.46 s > stack backtrace:
  219. 50.46 s > 0: __rustc::rust_begin_unwind
  220. 50.46 s > 1: core::panicking::panic_fmt
  221. 50.46 s > 2: gammaloop_api::repl::tests::completion_shows_type_hint_for_non_boolean_settings_leaf
  222. 50.46 s > 3: <gammaloop_api::repl::tests::completion_shows_type_hint_for_non_boolean_settings_leaf::{closure#0} as core::ops::function::FnOnce<()>>::call_once
  223. 50.46 s > note: Some details are omitted, run with `RUST_BACKTRACE=full` for a verbose backtrace.
  224. 50.46 s >
  225. 50.46 s > error: test run failed
  226. 50.46 s >
  227. 50.46 s > ========== nextest test summary ==========
  228. 50.46 s > report: target/nextest/ci_gammaloop/junit.xml
  229. 50.46 s > tests: 339, failures: 1, errors: 0
  230. 50.46 s >
  231. 50.46 s > 1. gammaloop-api::repl::tests::completion_shows_type_hint_for_non_boolean_settings_leaf
  232. 50.46 s > failure: test failure with exit code 101
  233. 50.46 s > thread 'repl::tests::completion_shows_type_hint_for_non_boolean_settings_leaf' (790) panicked at crates/gammaloop-api/src/repl.rs:5772:9:
  234. 50.46 s > [Suggestion { value: "", description: Some("expects an integer"), style: None, extra: None, span: Span { start: 42, end: 42 }, append_whitespace: false }]
  235. 50.46 s > stack backtrace:
  236. 50.46 s > 0: __rustc::rust_begin_unwind
  237. 50.46 s > 1: core::panicking::panic_fmt
  238. 50.46 s > 2: gammaloop_api::repl::tests::completion_shows_type_hint_for_non_boolean_settings_leaf
  239. 50.46 s > 3: <gammaloop_api::repl::tests::completion_shows_type_hint_for_non_boolean_settings_leaf::{closure#0} as core::ops::function::FnOnce<()>>::call_once
  240. 50.46 s > note: Some details are omitted, run with `RUST_BACKTRACE=full` for a verbose backtrace.
  241. 50.46 s > system-out
  242. 50.46 s > running 1 test
  243. 50.46 s > test repl::tests::completion_shows_type_hint_for_non_boolean_settings_leaf ... FAILED
  244. 50.46 s >
  245. 50.46 s > failures:
  246. 50.46 s >
  247. 50.46 s > failures:
  248. 50.46 s > repl::tests::completion_shows_type_hint_for_non_boolean_settings_leaf
  249. 50.46 s >
  250. 50.46 s > test result: FAILED. 0 passed; 1 failed; 0 ignored; 0 measured; 339 filtered out; finished in 0.03s
  251. 50.46 s > system-err
  252. 50.46 s > thread 'repl::tests::completion_shows_type_hint_for_non_boolean_settings_leaf' (790) panicked at crates/gammaloop-api/src/repl.rs:5772:9:
  253. 50.46 s > [Suggestion { value: "", description: Some("expects an integer"), style: None, extra: None, span: Span { start: 42, end: 42 }, append_whitespace: false }]
  254. 50.46 s > stack backtrace:
  255. 50.46 s > 0: __rustc::rust_begin_unwind
  256. 50.46 s > 1: core::panicking::panic_fmt
  257. 50.46 s > 2: gammaloop_api::repl::tests::completion_shows_type_hint_for_non_boolean_settings_leaf
  258. 50.46 s > 3: <gammaloop_api::repl::tests::completion_shows_type_hint_for_non_boolean_settings_leaf::{closure#0} as core::ops::function::FnOnce<()>>::call_once
  259. 50.46 s > note: Some details are omitted, run with `RUST_BACKTRACE=full` for a verbose backtrace.
  260. 50.46 s > =========================================
  261. 50.46 s > Extracting 1 binary and 1 linked path to /build/source
  262. 50.46 s > Extracted 7 files to /build/source in 0.08s
  263. 50.46 s > ------------
  264. 50.46 s > Nextest run ID 899428b7-745e-46f6-a69b-d0e04ac74b27 with nextest profile: ci_gammaloop
  265. 50.46 s > Starting 19 tests across 1 binary
  266. 50.46 s > ------------
  267. 50.46 s > Summary [ 0.028s] 19 tests run: 19 passed, 0 skipped
  268. 50.46 s >
  269. 50.46 s > ========== nextest test summary ==========
  270. 50.46 s > report: target/nextest/ci_gammaloop/junit.xml
  271. 50.46 s > tests: 19, failures: 0, errors: 0
  272. 50.46 s > No failing testcases found.
  273. 50.46 s > =========================================
  274. 50.46 s > Extracting 1 binary to /build/source
  275. 50.46 s > Extracted 4 files to /build/source in 0.05s
  276. 50.46 s > ------------
  277. 50.46 s > Nextest run ID a90c0e0e-c879-4d05-bfc6-6919f1fcfeaf with nextest profile: ci_gammaloop
  278. 50.46 s > Starting 0 tests across 1 binary
  279. 50.46 s > ------------
  280. 50.46 s > Summary [ 0.000s] 0 tests run: 0 passed, 0 skipped
  281. 50.46 s >
  282. 50.46 s > ========== nextest test summary ==========
  283. 50.46 s > report: target/nextest/ci_gammaloop/junit.xml
  284. 50.46 s > tests: 0, failures: 0, errors: 0
  285. 50.46 s > No failing testcases found.
  286. 50.46 s > =========================================
  287. 50.46 s > Extracting 5 binaries (including 1 non-test binary), 1 build script output directory, and 2 linked paths to /build/source
  288. 50.46 s > Extracted 20 files to /build/source in 0.79s
  289. 50.46 s > ------------
  290. 50.46 s > Nextest run ID ef09228d-3ef8-459c-8464-b8c1714f00a4 with nextest profile: ci_gammaloop
  291. 50.46 s > Starting 456 tests across 4 binaries (61 tests skipped, including 60 tests via profile.ci_gammaloop.default-filter)
  292. 50.46 s > ------------
  293. 50.46 s > Summary [ 14.773s] 456 tests run: 456 passed, 61 skipped
  294. 50.46 s >
  295. 50.46 s > ========== nextest test summary ==========
  296. 50.46 s > report: target/nextest/ci_gammaloop/junit.xml
  297. 50.46 s > tests: 456, failures: 0, errors: 0
  298. 50.46 s > No failing testcases found.
  299. 50.46 s > =========================================
  300. 50.46 s For full logs, run:
  301. 50.46 s nix log /nix/store/02car8gk7i8dx2vfklks1bn8vxkmhh2r-gammaloop-nextest-core.drv
  302. 50.66 s [0 built (1 failed), 0.0Run failed.