test packages.x86_64-linux.nix-ci-check-gammaloop-nextest-core
0.00 s
$ /nix/store/9ypz3flqsrl5xl495mm8h645gadjsxi1-coreutils-9.11/bin/timeout --kill-after=15s 7200s /nix/store/23zk8sgzamrbmj1fday15szf7f2279s8-nix-2.34.7/bin/nix --extra-experimental-features nix-command --extra-experimental-features flakes flake clone git+https://github.com/alphal00p/gammaloop --dest /tmp/nix-ci-worker/stable-pwd/repo/
0.37 s
Cloning into '/tmp/nix-ci-worker/stable-pwd/repo'...
1.30 s
remote: Enumerating objects: 87950, done.
1.54 s
remote: Counting objects: 0% (1/10548)
remote: Counting objects: 1% (106/10548)
remote: Counting objects: 2% (211/10548)
remote: Counting objects: 3% (317/10548)
remote: Counting objects: 4% (422/10548)
remote: Counting objects: 5% (528/10548)
remote: Counting objects: 6% (633/10548)
remote: Counting objects: 7% (739/10548)
remote: Counting objects: 8% (844/10548)
remote: Counting objects: 9% (950/10548)
remote: Counting objects: 10% (1055/10548)
remote: Counting objects: 11% (1161/10548)
remote: Counting objects: 12% (1266/10548)
remote: Counting objects: 13% (1372/10548)
remote: Counting objects: 14% (1477/10548)
remote: Counting objects: 15% (1583/10548)
remote: Counting objects: 16% (1688/10548)
remote: Counting objects: 17% (1794/10548)
remote: Counting objects: 18% (1899/10548)
remote: Counting objects: 19% (2005/10548)
remote: Counting objects: 20% (2110/10548)
remote: Counting objects: 21% (2216/10548)
remote: Counting objects: 22% (2321/10548)
remote: Counting objects: 23% (2427/10548)
remote: Counting objects: 24% (2532/10548)
remote: Counting objects: 25% (2637/10548)
remote: Counting objects: 26% (2743/10548)
remote: Counting objects: 27% (2848/10548)
remote: Counting objects: 28% (2954/10548)
remote: Counting objects: 29% (3059/10548)
remote: Counting objects: 30% (3165/10548)
remote: Counting objects: 31% (3270/10548)
remote: Counting objects: 32% (3376/10548)
remote: Counting objects: 33% (3481/10548)
remote: Counting objects: 34% (3587/10548)
remote: Counting objects: 35% (3692/10548)
remote: Counting objects: 36% (3798/10548)
remote: Counting objects: 37% (3903/10548)
remote: Counting objects: 38% (4009/10548)
remote: Counting objects: 39% (4114/10548)
remote: Counting objects: 40% (4220/10548)
remote: Counting objects: 41% (4325/10548)
remote: Counting objects: 42% (4431/10548)
remote: Counting objects: 43% (4536/10548)
remote: Counting objects: 44% (4642/10548)
remote: Counting objects: 45% (4747/10548)
remote: Counting objects: 46% (4853/10548)
remote: Counting objects: 47% (4958/10548)
remote: Counting objects: 48% (5064/10548)
remote: Counting objects: 49% (5169/10548)
remote: Counting objects: 50% (5274/10548)
remote: Counting objects: 51% (5380/10548)
remote: Counting objects: 52% (5485/10548)
remote: Counting objects: 53% (5591/10548)
remote: Counting objects: 54% (5696/10548)
remote: Counting objects: 55% (5802/10548)
remote: Counting objects: 56% (5907/10548)
remote: Counting objects: 57% (6013/10548)
remote: Counting objects: 58% (6118/10548)
remote: Counting objects: 59% (6224/10548)
remote: Counting objects: 60% (6329/10548)
remote: Counting objects: 61% (6435/10548)
remote: Counting objects: 62% (6540/10548)
remote: Counting objects: 63% (6646/10548)
remote: Counting objects: 64% (6751/10548)
remote: Counting objects: 65% (6857/10548)
remote: Counting objects: 66% (6962/10548)
remote: Counting objects: 67% (7068/10548)
remote: Counting objects: 68% (7173/10548)
remote: Counting objects: 69% (7279/10548)
remote: Counting objects: 70% (7384/10548)
remote: Counting objects: 71% (7490/10548)
remote: Counting objects: 72% (7595/10548)
remote: Counting objects: 73% (7701/10548)
remote: Counting objects: 74% (7806/10548)
remote: Counting objects: 75% (7911/10548)
remote: Counting objects: 76% (8017/10548)
remote: Counting objects: 77% (8122/10548)
remote: Counting objects: 78% (8228/10548)
remote: Counting objects: 79% (8333/10548)
remote: Counting objects: 80% (8439/10548)
remote: Counting objects: 81% (8544/10548)
remote: Counting objects: 82% (8650/10548)
remote: Counting objects: 83% (8755/10548)
remote: Counting objects: 84% (8861/10548)
remote: Counting objects: 85% (8966/10548)
remote: Counting objects: 86% (9072/10548)
remote: Counting objects: 87% (9177/10548)
remote: Counting objects: 88% (9283/10548)
remote: Counting objects: 89% (9388/10548)
remote: Counting objects: 90% (9494/10548)
remote: Counting objects: 91% (9599/10548)
remote: Counting objects: 92% (9705/10548)
remote: Counting objects: 93% (9810/10548)
remote: Counting objects: 94% (9916/10548)
remote: Counting objects: 95% (10021/10548)
remote: Counting objects: 96% (10127/10548)
remote: Counting objects: 97% (10232/10548)
remote: Counting objects: 98% (10338/10548)
remote: Counting objects: 99% (10443/10548)
remote: Counting objects: 100% (10548/10548)
remote: Counting objects: 100% (10548/10548), done.
4.38 s
remote: Compressing objects: 0% (1/2960)
remote: Compressing objects: 1% (30/2960)
remote: Compressing objects: 2% (60/2960)
remote: Compressing objects: 3% (89/2960)
remote: Compressing objects: 4% (119/2960)
remote: Compressing objects: 5% (148/2960)
remote: Compressing objects: 6% (178/2960)
remote: Compressing objects: 7% (208/2960)
remote: Compressing objects: 8% (237/2960)
remote: Compressing objects: 9% (267/2960)
remote: Compressing objects: 10% (296/2960)
remote: Compressing objects: 11% (326/2960)
remote: Compressing objects: 12% (356/2960)
remote: Compressing objects: 13% (385/2960)
remote: Compressing objects: 14% (415/2960)
remote: Compressing objects: 14% (440/2960)
remote: Compressing objects: 15% (444/2960)
remote: Compressing objects: 16% (474/2960)
remote: Compressing objects: 17% (504/2960)
remote: Compressing objects: 18% (533/2960)
remote: Compressing objects: 19% (563/2960)
remote: Compressing objects: 20% (592/2960)
remote: Compressing objects: 21% (622/2960)
remote: Compressing objects: 22% (652/2960)
remote: Compressing objects: 23% (681/2960)
remote: Compressing objects: 24% (711/2960)
remote: Compressing objects: 25% (740/2960)
remote: Compressing objects: 26% (770/2960)
remote: Compressing objects: 27% (800/2960)
remote: Compressing objects: 28% (829/2960)
remote: Compressing objects: 29% (859/2960)
remote: Compressing objects: 30% (888/2960)
remote: Compressing objects: 31% (918/2960)
remote: Compressing objects: 32% (948/2960)
remote: Compressing objects: 33% (977/2960)
remote: Compressing objects: 34% (1007/2960)
remote: Compressing objects: 35% (1036/2960)
remote: Compressing objects: 36% (1066/2960)
remote: Compressing objects: 37% (1096/2960)
remote: Compressing objects: 38% (1125/2960)
remote: Compressing objects: 39% (1155/2960)
remote: Compressing objects: 40% (1184/2960)
remote: Compressing objects: 41% (1214/2960)
remote: Compressing objects: 42% (1244/2960)
remote: Compressing objects: 43% (1273/2960)
remote: Compressing objects: 43% (1286/2960)
remote: Compressing objects: 44% (1303/2960)
remote: Compressing objects: 45% (1332/2960)
remote: Compressing objects: 46% (1362/2960)
remote: Compressing objects: 47% (1392/2960)
remote: Compressing objects: 48% (1421/2960)
remote: Compressing objects: 49% (1451/2960)
remote: Compressing objects: 50% (1480/2960)
remote: Compressing objects: 51% (1510/2960)
remote: Compressing objects: 52% (1540/2960)
remote: Compressing objects: 53% (1569/2960)
remote: Compressing objects: 54% (1599/2960)
remote: Compressing objects: 55% (1628/2960)
remote: Compressing objects: 56% (1658/2960)
remote: Compressing objects: 57% (1688/2960)
remote: Compressing objects: 58% (1717/2960)
remote: Compressing objects: 59% (1747/2960)
remote: Compressing objects: 60% (1776/2960)
remote: Compressing objects: 61% (1806/2960)
remote: Compressing objects: 62% (1836/2960)
remote: Compressing objects: 63% (1865/2960)
remote: Compressing objects: 64% (1895/2960)
remote: Compressing objects: 65% (1924/2960)
remote: Compressing objects: 66% (1954/2960)
remote: Compressing objects: 67% (1984/2960)
remote: Compressing objects: 68% (2013/2960)
remote: Compressing objects: 69% (2043/2960)
remote: Compressing objects: 70% (2072/2960)
remote: Compressing objects: 71% (2102/2960)
remote: Compressing objects: 72% (2132/2960)
remote: Compressing objects: 73% (2161/2960)
remote: Compressing objects: 74% (2191/2960)
remote: Compressing objects: 75% (2220/2960)
remote: Compressing objects: 76% (2250/2960)
remote: Compressing objects: 77% (2280/2960)
remote: Compressing objects: 78% (2309/2960)
remote: Compressing objects: 79% (2339/2960)
remote: Compressing objects: 80% (2368/2960)
remote: Compressing objects: 81% (2398/2960)
remote: Compressing objects: 82% (2428/2960)
remote: Compressing objects: 83% (2457/2960)
remote: Compressing objects: 84% (2487/2960)
remote: Compressing objects: 85% (2516/2960)
remote: Compressing objects: 86% (2546/2960)
remote: Compressing objects: 87% (2576/2960)
remote: Compressing objects: 88% (2605/2960)
remote: Compressing objects: 89% (2635/2960)
remote: Compressing objects: 90% (2664/2960)
remote: Compressing objects: 91% (2694/2960)
remote: Compressing objects: 92% (2724/2960)
remote: Compressing objects: 93% (2753/2960)
remote: Compressing objects: 94% (2783/2960)
remote: Compressing objects: 95% (2812/2960)
remote: Compressing objects: 96% (2842/2960)
remote: Compressing objects: 97% (2872/2960)
remote: Compressing objects: 98% (2901/2960)
remote: Compressing objects: 99% (2931/2960)
remote: Compressing objects: 100% (2960/2960)
remote: Compressing objects: 100% (2960/2960), done.
9.93 s
Receiving objects: 0% (1/87950)
Receiving objects: 1% (880/87950)
Receiving objects: 2% (1759/87950)
Receiving objects: 3% (2639/87950)
Receiving objects: 4% (3518/87950)
Receiving objects: 5% (4398/87950)
Receiving objects: 6% (5277/87950)
Receiving objects: 7% (6157/87950)
Receiving objects: 8% (7036/87950)
Receiving objects: 9% (7916/87950), 12.85 MiB | 25.68 MiB/s
Receiving objects: 10% (8795/87950), 12.85 MiB | 25.68 MiB/s
Receiving objects: 11% (9675/87950), 12.85 MiB | 25.68 MiB/s
Receiving objects: 12% (10554/87950), 12.85 MiB | 25.68 MiB/s
Receiving objects: 13% (11434/87950), 12.85 MiB | 25.68 MiB/s
Receiving objects: 14% (12313/87950), 12.85 MiB | 25.68 MiB/s
Receiving objects: 15% (13193/87950), 12.85 MiB | 25.68 MiB/s
Receiving objects: 16% (14072/87950), 12.85 MiB | 25.68 MiB/s
Receiving objects: 17% (14952/87950), 12.85 MiB | 25.68 MiB/s
Receiving objects: 18% (15831/87950), 12.85 MiB | 25.68 MiB/s
Receiving objects: 19% (16711/87950), 12.85 MiB | 25.68 MiB/s
Receiving objects: 20% (17590/87950), 12.85 MiB | 25.68 MiB/s
Receiving objects: 21% (18470/87950), 12.85 MiB | 25.68 MiB/s
Receiving objects: 22% (19349/87950), 12.85 MiB | 25.68 MiB/s
Receiving objects: 23% (20229/87950), 12.85 MiB | 25.68 MiB/s
Receiving objects: 24% (21108/87950), 12.85 MiB | 25.68 MiB/s
Receiving objects: 25% (21988/87950), 12.85 MiB | 25.68 MiB/s
Receiving objects: 26% (22867/87950), 12.85 MiB | 25.68 MiB/s
Receiving objects: 27% (23747/87950), 12.85 MiB | 25.68 MiB/s
Receiving objects: 28% (24626/87950), 12.85 MiB | 25.68 MiB/s
Receiving objects: 29% (25506/87950), 12.85 MiB | 25.68 MiB/s
Receiving objects: 30% (26385/87950), 12.85 MiB | 25.68 MiB/s
Receiving objects: 31% (27265/87950), 12.85 MiB | 25.68 MiB/s
Receiving objects: 32% (28144/87950), 12.85 MiB | 25.68 MiB/s
Receiving objects: 33% (29024/87950), 12.85 MiB | 25.68 MiB/s
Receiving objects: 34% (29903/87950), 12.85 MiB | 25.68 MiB/s
Receiving objects: 35% (30783/87950), 12.85 MiB | 25.68 MiB/s
Receiving objects: 36% (31662/87950), 12.85 MiB | 25.68 MiB/s
Receiving objects: 37% (32542/87950), 12.85 MiB | 25.68 MiB/s
Receiving objects: 38% (33421/87950), 12.85 MiB | 25.68 MiB/s
Receiving objects: 38% (33797/87950), 32.44 MiB | 32.43 MiB/s
Receiving objects: 39% (34301/87950), 32.44 MiB | 32.43 MiB/s
Receiving objects: 40% (35180/87950), 32.44 MiB | 32.43 MiB/s
Receiving objects: 41% (36060/87950), 32.44 MiB | 32.43 MiB/s
Receiving objects: 42% (36939/87950), 32.44 MiB | 32.43 MiB/s
Receiving objects: 43% (37819/87950), 32.44 MiB | 32.43 MiB/s
Receiving objects: 44% (38698/87950), 32.44 MiB | 32.43 MiB/s
Receiving objects: 45% (39578/87950), 32.44 MiB | 32.43 MiB/s
Receiving objects: 46% (40457/87950), 32.44 MiB | 32.43 MiB/s
Receiving objects: 47% (41337/87950), 48.71 MiB | 32.42 MiB/s
Receiving objects: 48% (42216/87950), 48.71 MiB | 32.42 MiB/s
Receiving objects: 49% (43096/87950), 48.71 MiB | 32.42 MiB/s
Receiving objects: 50% (43975/87950), 48.71 MiB | 32.42 MiB/s
Receiving objects: 51% (44855/87950), 48.71 MiB | 32.42 MiB/s
Receiving objects: 52% (45734/87950), 48.71 MiB | 32.42 MiB/s
Receiving objects: 53% (46614/87950), 48.71 MiB | 32.42 MiB/s
Receiving objects: 54% (47493/87950), 48.71 MiB | 32.42 MiB/s
Receiving objects: 55% (48373/87950), 48.71 MiB | 32.42 MiB/s
Receiving objects: 55% (48725/87950), 64.02 MiB | 31.98 MiB/s
Receiving objects: 56% (49252/87950), 64.02 MiB | 31.98 MiB/s
Receiving objects: 57% (50132/87950), 64.02 MiB | 31.98 MiB/s
Receiving objects: 58% (51011/87950), 64.02 MiB | 31.98 MiB/s
Receiving objects: 59% (51891/87950), 64.02 MiB | 31.98 MiB/s
Receiving objects: 60% (52770/87950), 64.02 MiB | 31.98 MiB/s
Receiving objects: 61% (53650/87950), 64.02 MiB | 31.98 MiB/s
Receiving objects: 62% (54529/87950), 79.55 MiB | 31.75 MiB/s
Receiving objects: 63% (55409/87950), 79.55 MiB | 31.75 MiB/s
Receiving objects: 64% (56288/87950), 79.55 MiB | 31.75 MiB/s
Receiving objects: 65% (57168/87950), 79.55 MiB | 31.75 MiB/s
Receiving objects: 65% (57330/87950), 96.11 MiB | 31.99 MiB/s
Receiving objects: 66% (58047/87950), 96.11 MiB | 31.99 MiB/s
Receiving objects: 67% (58927/87950), 96.11 MiB | 31.99 MiB/s
Receiving objects: 68% (59806/87950), 96.11 MiB | 31.99 MiB/s
Receiving objects: 69% (60686/87950), 96.11 MiB | 31.99 MiB/s
Receiving objects: 70% (61565/87950), 112.87 MiB | 32.21 MiB/s
Receiving objects: 71% (62445/87950), 112.87 MiB | 32.21 MiB/s
Receiving objects: 72% (63324/87950), 112.87 MiB | 32.21 MiB/s
Receiving objects: 73% (64204/87950), 112.87 MiB | 32.21 MiB/s
Receiving objects: 73% (64299/87950), 112.87 MiB | 32.21 MiB/s
Receiving objects: 74% (65083/87950), 128.93 MiB | 32.13 MiB/s
Receiving objects: 75% (65963/87950), 128.93 MiB | 32.13 MiB/s
Receiving objects: 76% (66842/87950), 128.93 MiB | 32.13 MiB/s
Receiving objects: 77% (67722/87950), 128.93 MiB | 32.13 MiB/s
Receiving objects: 78% (68601/87950), 128.93 MiB | 32.13 MiB/s
Receiving objects: 79% (69481/87950), 128.93 MiB | 32.13 MiB/s
Receiving objects: 80% (70360/87950), 128.93 MiB | 32.13 MiB/s
Receiving objects: 81% (71240/87950), 128.93 MiB | 32.13 MiB/s
Receiving objects: 82% (72119/87950), 128.93 MiB | 32.13 MiB/s
Receiving objects: 83% (72999/87950), 128.93 MiB | 32.13 MiB/s
Receiving objects: 84% (73878/87950), 128.93 MiB | 32.13 MiB/s
Receiving objects: 85% (74758/87950), 144.46 MiB | 31.83 MiB/s
Receiving objects: 86% (75637/87950), 144.46 MiB | 31.83 MiB/s
Receiving objects: 87% (76517/87950), 144.46 MiB | 31.83 MiB/s
Receiving objects: 88% (77396/87950), 144.46 MiB | 31.83 MiB/s
Receiving objects: 89% (78276/87950), 144.46 MiB | 31.83 MiB/s
Receiving objects: 90% (79155/87950), 144.46 MiB | 31.83 MiB/s
Receiving objects: 91% (80035/87950), 144.46 MiB | 31.83 MiB/s
Receiving objects: 92% (80914/87950), 144.46 MiB | 31.83 MiB/s
Receiving objects: 93% (81794/87950), 144.46 MiB | 31.83 MiB/s
Receiving objects: 94% (82673/87950), 144.46 MiB | 31.83 MiB/s
Receiving objects: 95% (83553/87950), 144.46 MiB | 31.83 MiB/s
Receiving objects: 96% (84432/87950), 144.46 MiB | 31.83 MiB/s
Receiving objects: 97% (85312/87950), 144.46 MiB | 31.83 MiB/s
Receiving objects: 98% (86191/87950), 144.46 MiB | 31.83 MiB/s
Receiving objects: 98% (86329/87950), 144.46 MiB | 31.83 MiB/s
Receiving objects: 99% (87071/87950), 176.32 MiB | 31.70 MiB/s
remote: Total 87950 (delta 8613), reused 8357 (delta 7562), pack-reused 77402 (from 3)
9.94 s
Receiving objects: 100% (87950/87950), 176.32 MiB | 31.70 MiB/s
Receiving objects: 100% (87950/87950), 176.58 MiB | 31.81 MiB/s, done.
12.67 s
Resolving deltas: 0% (0/59478)
Resolving deltas: 1% (595/59478)
Resolving deltas: 2% (1190/59478)
Resolving deltas: 3% (1785/59478)
Resolving deltas: 4% (2380/59478)
Resolving deltas: 5% (2974/59478)
Resolving deltas: 6% (3569/59478)
Resolving deltas: 7% (4164/59478)
Resolving deltas: 8% (4759/59478)
Resolving deltas: 9% (5354/59478)
Resolving deltas: 10% (5948/59478)
Resolving deltas: 11% (6543/59478)
Resolving deltas: 12% (7138/59478)
Resolving deltas: 13% (7733/59478)
Resolving deltas: 14% (8327/59478)
Resolving deltas: 15% (8922/59478)
Resolving deltas: 16% (9517/59478)
Resolving deltas: 17% (10112/59478)
Resolving deltas: 18% (10707/59478)
Resolving deltas: 19% (11301/59478)
Resolving deltas: 20% (11896/59478)
Resolving deltas: 21% (12491/59478)
Resolving deltas: 22% (13086/59478)
Resolving deltas: 23% (13680/59478)
Resolving deltas: 24% (14275/59478)
Resolving deltas: 25% (14870/59478)
Resolving deltas: 26% (15465/59478)
Resolving deltas: 27% (16060/59478)
Resolving deltas: 28% (16654/59478)
Resolving deltas: 29% (17249/59478)
Resolving deltas: 30% (17844/59478)
Resolving deltas: 31% (18439/59478)
Resolving deltas: 32% (19033/59478)
Resolving deltas: 33% (19628/59478)
Resolving deltas: 34% (20223/59478)
Resolving deltas: 35% (20818/59478)
Resolving deltas: 36% (21413/59478)
Resolving deltas: 37% (22007/59478)
Resolving deltas: 38% (22602/59478)
Resolving deltas: 39% (23197/59478)
Resolving deltas: 40% (23792/59478)
Resolving deltas: 41% (24386/59478)
Resolving deltas: 42% (24981/59478)
Resolving deltas: 43% (25576/59478)
Resolving deltas: 44% (26171/59478)
Resolving deltas: 45% (26766/59478)
Resolving deltas: 46% (27360/59478)
Resolving deltas: 47% (27955/59478)
Resolving deltas: 48% (28550/59478)
Resolving deltas: 49% (29145/59478)
Resolving deltas: 50% (29739/59478)
Resolving deltas: 51% (30334/59478)
Resolving deltas: 51% (30807/59478)
Resolving deltas: 52% (30929/59478)
Resolving deltas: 53% (31524/59478)
Resolving deltas: 54% (32119/59478)
Resolving deltas: 55% (32713/59478)
Resolving deltas: 56% (33308/59478)
Resolving deltas: 57% (33903/59478)
Resolving deltas: 58% (34498/59478)
Resolving deltas: 59% (35093/59478)
Resolving deltas: 60% (35688/59478)
Resolving deltas: 61% (36282/59478)
Resolving deltas: 62% (36877/59478)
Resolving deltas: 63% (37472/59478)
Resolving deltas: 64% (38066/59478)
Resolving deltas: 65% (38661/59478)
Resolving deltas: 66% (39256/59478)
Resolving deltas: 67% (39851/59478)
Resolving deltas: 68% (40446/59478)
Resolving deltas: 69% (41040/59478)
Resolving deltas: 70% (41635/59478)
Resolving deltas: 71% (42230/59478)
Resolving deltas: 72% (42825/59478)
Resolving deltas: 73% (43419/59478)
Resolving deltas: 74% (44014/59478)
Resolving deltas: 75% (44609/59478)
Resolving deltas: 76% (45204/59478)
Resolving deltas: 76% (45357/59478)
Resolving deltas: 77% (45799/59478)
Resolving deltas: 78% (46393/59478)
Resolving deltas: 79% (46988/59478)
Resolving deltas: 80% (47583/59478)
Resolving deltas: 81% (48178/59478)
Resolving deltas: 82% (48776/59478)
Resolving deltas: 83% (49367/59478)
Resolving deltas: 84% (49962/59478)
Resolving deltas: 85% (50557/59478)
Resolving deltas: 86% (51152/59478)
Resolving deltas: 87% (51746/59478)
Resolving deltas: 88% (52341/59478)
Resolving deltas: 89% (52936/59478)
Resolving deltas: 90% (53531/59478)
Resolving deltas: 91% (54125/59478)
Resolving deltas: 92% (54720/59478)
Resolving deltas: 93% (55315/59478)
Resolving deltas: 94% (55910/59478)
Resolving deltas: 95% (56506/59478)
Resolving deltas: 96% (57099/59478)
Resolving deltas: 97% (57694/59478)
Resolving deltas: 98% (58289/59478)
Resolving deltas: 99% (58887/59478)
Resolving deltas: 100% (59478/59478)
Resolving deltas: 100% (59478/59478), done.
13.39 s
Fetching commit 891dec7c25b5d9026c099da021ec7ae3b757dee9 for docs ...
13.39 s
$ /nix/store/bcnisk3ydfgv26v2gw3zlky24g00yww2-git-2.54.0/bin/git fetch origin 891dec7c25b5d9026c099da021ec7ae3b757dee9
13.98 s
From https://github.com/alphal00p/gammaloop
13.98 s
* branch 891dec7c25b5d9026c099da021ec7ae3b757dee9 -> FETCH_HEAD
14.06 s
$ /nix/store/9ypz3flqsrl5xl495mm8h645gadjsxi1-coreutils-9.11/bin/timeout --kill-after=15s 7200s /nix/store/bcnisk3ydfgv26v2gw3zlky24g00yww2-git-2.54.0/bin/git -c advice.detachedHead=false checkout 891dec7c25b5d9026c099da021ec7ae3b757dee9
14.41 s
HEAD is now at 891dec7c2 change photos
14.43 s
$ /nix/store/9ypz3flqsrl5xl495mm8h645gadjsxi1-coreutils-9.11/bin/timeout --kill-after=15s 7200s /nix/store/23zk8sgzamrbmj1fday15szf7f2279s8-nix-2.34.7/bin/nix --extra-experimental-features nix-command --extra-experimental-features flakes --log-format internal-json run .#packages.x86_64-linux.nix-ci-check-gammaloop-nextest-core --print-build-logs
20.02 s
29.04 s
evaluating derivation 'g
copying '/nix/store/bgss
evaluating derivation 'g
copying '/nix/store/bgss
evaluating derivation 'g
copying '/nix/store/bgss
evaluating derivation 'g
copying '/nix/store/bgss
evaluating derivation 'g
copying '/nix/store/bgss
evaluating derivation 'g
copying '/nix/store/bgss
evaluating derivation 'g
copying '/nix/store/bgss
evaluating derivation 'g
copying '/nix/store/bgss
evaluating derivation 'g
copying '/nix/store/bgss
evaluating derivation 'g
copying '/nix/store/bgss
evaluating derivation 'g
querying gammaloop-nexte
[0.0 KiB DL]
[0 /1 built, 0.0 KiB DL]
[1 /0 /1 built, 0.0 KiB DLgammaloop-nextest-core> Extracting 4 binaries (including 2 non-test binaries), 1 build script output directory, and 2 linked paths to /build/source
29.54 s
gammaloop-nextest-core> Extracted 20 files to /build/source in 0.50s
29.57 s
gammaloop-nextest-core> ------------
29.57 s
gammaloop-nextest-core> Nextest run ID 8fc91579-d972-40f9-b814-3511fcc888e8 with nextest profile: ci_gammaloop
29.57 s
gammaloop-nextest-core> Starting 339 tests across 2 binaries (1 test skipped )
30.25 s
gammaloop-nextest-core> FAIL [ 0.047s] (242/339) gammaloop-api repl::tests :: completion_shows_type_hint_for_non_boolean_settings_leaf
30.25 s
gammaloop-nextest-core> stdout ---
30.25 s
gammaloop-nextest-core>
30.25 s
gammaloop-nextest-core> running 1 test
30.25 s
gammaloop-nextest-core> test repl::tests::completion_shows_type_hint_for_non_boolean_settings_leaf ... FAILED
30.25 s
gammaloop-nextest-core>
30.25 s
gammaloop-nextest-core> failures:
30.25 s
gammaloop-nextest-core>
30.25 s
gammaloop-nextest-core> failures:
30.25 s
gammaloop-nextest-core> repl::tests::completion_shows_type_hint_for_non_boolean_settings_leaf
30.25 s
gammaloop-nextest-core>
30.25 s
gammaloop-nextest-core> test result: FAILED. 0 passed; 1 failed; 0 ignored; 0 measured; 339 filtered out; finished in 0.02s
30.25 s
gammaloop-nextest-core>
30.25 s
gammaloop-nextest-core> stderr ---
30.25 s
gammaloop-nextest-core>
30.25 s
gammaloop-nextest-core> thread 'repl::tests::completion_shows_type_hint_for_non_boolean_settings_leaf' (761) panicked at crates/gammaloop-api/src/repl.rs:5772:9:
30.25 s
gammaloop-nextest-core> [Suggestion { value: "", description: Some("expects an integer"), style: None, extra: None, span: Span { start: 42, end: 42 }, append_whitespace: false }]
30.25 s
gammaloop-nextest-core> stack backtrace:
30.25 s
gammaloop-nextest-core> 0: __rustc::rust_begin_unwind
30.25 s
gammaloop-nextest-core> 1: core::panicking::panic_fmt
30.25 s
gammaloop-nextest-core> 2: gammaloop_api::repl::tests::completion_shows_type_hint_for_non_boolean_settings_leaf
30.25 s
gammaloop-nextest-core> 3: <gammaloop_api::repl::tests::completion_shows_type_hint_for_non_boolean_settings_leaf::{closure#0} as core::ops::function::FnOnce<()>>::call_once
30.25 s
gammaloop-nextest-core> note: Some details are omitted, run with `RUST_BACKTRACE=full` for a verbose backtrace.
30.25 s
gammaloop-nextest-core>
30.72 s
gammaloop-nextest-core> ------------
30.72 s
gammaloop-nextest-core> Summary [ 1.144s] 339 tests run: 338 passed , 1 failed , 1 skipped
30.72 s
gammaloop-nextest-core> FAIL [ 0.047s] (242/339) gammaloop-api repl::tests :: completion_shows_type_hint_for_non_boolean_settings_leaf
30.72 s
gammaloop-nextest-core> stdout ---
30.72 s
gammaloop-nextest-core>
30.72 s
gammaloop-nextest-core> running 1 test
30.72 s
gammaloop-nextest-core> test repl::tests::completion_shows_type_hint_for_non_boolean_settings_leaf ... FAILED
30.72 s
gammaloop-nextest-core>
30.72 s
gammaloop-nextest-core> failures:
30.72 s
gammaloop-nextest-core>
30.72 s
gammaloop-nextest-core> failures:
30.72 s
gammaloop-nextest-core> repl::tests::completion_shows_type_hint_for_non_boolean_settings_leaf
30.72 s
gammaloop-nextest-core>
30.72 s
gammaloop-nextest-core> test result: FAILED. 0 passed; 1 failed; 0 ignored; 0 measured; 339 filtered out; finished in 0.02s
30.72 s
gammaloop-nextest-core>
30.72 s
gammaloop-nextest-core> stderr ---
30.72 s
gammaloop-nextest-core>
30.72 s
gammaloop-nextest-core> thread 'repl::tests::completion_shows_type_hint_for_non_boolean_settings_leaf' (761) panicked at crates/gammaloop-api/src/repl.rs:5772:9:
30.72 s
gammaloop-nextest-core> [Suggestion { value: "", description: Some("expects an integer"), style: None, extra: None, span: Span { start: 42, end: 42 }, append_whitespace: false }]
30.72 s
gammaloop-nextest-core> stack backtrace:
30.72 s
gammaloop-nextest-core> 0: __rustc::rust_begin_unwind
30.72 s
gammaloop-nextest-core> 1: core::panicking::panic_fmt
30.72 s
gammaloop-nextest-core> 2: gammaloop_api::repl::tests::completion_shows_type_hint_for_non_boolean_settings_leaf
30.72 s
gammaloop-nextest-core> 3: <gammaloop_api::repl::tests::completion_shows_type_hint_for_non_boolean_settings_leaf::{closure#0} as core::ops::function::FnOnce<()>>::call_once
30.72 s
gammaloop-nextest-core> note: Some details are omitted, run with `RUST_BACKTRACE=full` for a verbose backtrace.
30.72 s
gammaloop-nextest-core>
30.73 s
gammaloop-nextest-core> error : test run failed
30.77 s
gammaloop-nextest-core>
30.77 s
gammaloop-nextest-core> ========== nextest test summary ==========
30.77 s
gammaloop-nextest-core> report: target/nextest/ci_gammaloop/junit.xml
30.77 s
gammaloop-nextest-core> tests: 339, failures: 1, errors: 0
30.77 s
gammaloop-nextest-core>
30.77 s
gammaloop-nextest-core> 1. gammaloop-api::repl::tests::completion_shows_type_hint_for_non_boolean_settings_leaf
30.77 s
gammaloop-nextest-core> failure: test failure with exit code 101
30.77 s
gammaloop-nextest-core> thread 'repl::tests::completion_shows_type_hint_for_non_boolean_settings_leaf' (761) panicked at crates/gammaloop-api/src/repl.rs:5772:9:
30.77 s
gammaloop-nextest-core> [Suggestion { value: "", description: Some("expects an integer"), style: None, extra: None, span: Span { start: 42, end: 42 }, append_whitespace: false }]
30.77 s
gammaloop-nextest-core> stack backtrace:
30.77 s
gammaloop-nextest-core> 0: __rustc::rust_begin_unwind
30.77 s
gammaloop-nextest-core> 1: core::panicking::panic_fmt
30.77 s
gammaloop-nextest-core> 2: gammaloop_api::repl::tests::completion_shows_type_hint_for_non_boolean_settings_leaf
30.77 s
gammaloop-nextest-core> 3: <gammaloop_api::repl::tests::completion_shows_type_hint_for_non_boolean_settings_leaf::{closure#0} as core::ops::function::FnOnce<()>>::call_once
30.77 s
gammaloop-nextest-core> note: Some details are omitted, run with `RUST_BACKTRACE=full` for a verbose backtrace.
30.77 s
gammaloop-nextest-core> system-out
30.77 s
gammaloop-nextest-core> running 1 test
30.77 s
gammaloop-nextest-core> test repl::tests::completion_shows_type_hint_for_non_boolean_settings_leaf ... FAILED
30.77 s
gammaloop-nextest-core>
30.77 s
gammaloop-nextest-core> failures:
30.77 s
gammaloop-nextest-core>
30.77 s
gammaloop-nextest-core> failures:
30.77 s
gammaloop-nextest-core> repl::tests::completion_shows_type_hint_for_non_boolean_settings_leaf
30.77 s
gammaloop-nextest-core>
30.77 s
gammaloop-nextest-core> test result: FAILED. 0 passed; 1 failed; 0 ignored; 0 measured; 339 filtered out; finished in 0.02s
30.77 s
gammaloop-nextest-core> system-err
30.77 s
gammaloop-nextest-core> thread 'repl::tests::completion_shows_type_hint_for_non_boolean_settings_leaf' (761) panicked at crates/gammaloop-api/src/repl.rs:5772:9:
30.77 s
gammaloop-nextest-core> [Suggestion { value: "", description: Some("expects an integer"), style: None, extra: None, span: Span { start: 42, end: 42 }, append_whitespace: false }]
30.77 s
gammaloop-nextest-core> stack backtrace:
30.77 s
gammaloop-nextest-core> 0: __rustc::rust_begin_unwind
30.77 s
gammaloop-nextest-core> 1: core::panicking::panic_fmt
30.77 s
gammaloop-nextest-core> 2: gammaloop_api::repl::tests::completion_shows_type_hint_for_non_boolean_settings_leaf
30.77 s
gammaloop-nextest-core> 3: <gammaloop_api::repl::tests::completion_shows_type_hint_for_non_boolean_settings_leaf::{closure#0} as core::ops::function::FnOnce<()>>::call_once
30.77 s
gammaloop-nextest-core> note: Some details are omitted, run with `RUST_BACKTRACE=full` for a verbose backtrace.
30.77 s
gammaloop-nextest-core> =========================================
30.80 s
gammaloop-nextest-core> Extracting 1 binary and 1 linked path to /build/source
30.88 s
gammaloop-nextest-core> Extracted 7 files to /build/source in 0.08s
30.91 s
gammaloop-nextest-core> ------------
30.91 s
gammaloop-nextest-core> Nextest run ID 3f112794-cc60-47e3-9f71-83f9c1148577 with nextest profile: ci_gammaloop
30.91 s
gammaloop-nextest-core> Starting 19 tests across 1 binary
30.97 s
gammaloop-nextest-core> ------------
30.97 s
gammaloop-nextest-core> Summary [ 0.055s] 19 tests run: 19 passed , 0 skipped
31.02 s
gammaloop-nextest-core>
31.02 s
gammaloop-nextest-core> ========== nextest test summary ==========
31.02 s
gammaloop-nextest-core> report: target/nextest/ci_gammaloop/junit.xml
31.02 s
gammaloop-nextest-core> tests: 19, failures: 0, errors: 0
31.02 s
gammaloop-nextest-core> No failing testcases found.
31.02 s
gammaloop-nextest-core> =========================================
31.06 s
gammaloop-nextest-core> Extracting 1 binary to /build/source
31.11 s
gammaloop-nextest-core> Extracted 4 files to /build/source in 0.06s
31.14 s
gammaloop-nextest-core> ------------
31.14 s
gammaloop-nextest-core> Nextest run ID 3707414c-2f0e-456c-bc57-51bcf69daf37 with nextest profile: ci_gammaloop
31.14 s
gammaloop-nextest-core> Starting 0 tests across 1 binary
31.14 s
gammaloop-nextest-core> ------------
31.14 s
gammaloop-nextest-core> Summary [ 0.000s] 0 tests run: 0 passed , 0 skipped
31.20 s
gammaloop-nextest-core>
31.20 s
gammaloop-nextest-core> ========== nextest test summary ==========
31.20 s
gammaloop-nextest-core> report: target/nextest/ci_gammaloop/junit.xml
31.20 s
gammaloop-nextest-core> tests: 0, failures: 0, errors: 0
31.20 s
gammaloop-nextest-core> No failing testcases found.
31.20 s
gammaloop-nextest-core> =========================================
31.24 s
gammaloop-nextest-core> Extracting 5 binaries (including 1 non-test binary), 1 build script output directory, and 2 linked paths to /build/source
31.90 s
gammaloop-nextest-core> Extracted 20 files to /build/source in 0.66s
31.95 s
gammaloop-nextest-core> ------------
31.95 s
gammaloop-nextest-core> Nextest run ID acda58fe-68f2-4dd0-a999-0d6478ca0a09 with nextest profile: ci_gammaloop
31.95 s
gammaloop-nextest-core> Starting 456 tests across 4 binaries (61 tests skipped , including 60 tests via profile.ci_gammaloop.default-filter )
47.52 s
gammaloop-nextest-core> ------------
47.52 s
gammaloop-nextest-core> Summary [ 15.565s] 456 tests run: 456 passed , 61 skipped
47.56 s
gammaloop-nextest-core>
47.56 s
gammaloop-nextest-core> ========== nextest test summary ==========
47.56 s
gammaloop-nextest-core> report: target/nextest/ci_gammaloop/junit.xml
47.56 s
gammaloop-nextest-core> tests: 456, failures: 0, errors: 0
47.56 s
gammaloop-nextest-core> No failing testcases found.
47.56 s
gammaloop-nextest-core> =========================================
47.82 s
error: Cannot build '/nix/store/02car8gk7i8dx2vfklks1bn8vxkmhh2r-gammaloop-nextest-core.drv '.
47.82 s
Reason: builder failed with exit code 100 .
47.82 s
Output paths:
47.82 s
/nix/store/mmzjp7789sw5r7w83acrb3ly0aj0pkbl-gammaloop-nextest-core
47.82 s
Last 130 log lines:
47.82 s
> Extracting 4 binaries (including 2 non-test binaries), 1 build script output directory, and 2 linked paths to /build/source
47.82 s
> Extracted 20 files to /build/source in 0.50s
47.82 s
> ------------
47.82 s
> Nextest run ID 8fc91579-d972-40f9-b814-3511fcc888e8 with nextest profile: ci_gammaloop
47.82 s
> Starting 339 tests across 2 binaries (1 test skipped )
47.82 s
> FAIL [ 0.047s] (242/339) gammaloop-api repl::tests :: completion_shows_type_hint_for_non_boolean_settings_leaf
47.82 s
> stdout ---
47.82 s
>
47.82 s
> running 1 test
47.82 s
> test repl::tests::completion_shows_type_hint_for_non_boolean_settings_leaf ... FAILED
47.82 s
>
47.82 s
> failures:
47.82 s
>
47.82 s
> failures:
47.82 s
> repl::tests::completion_shows_type_hint_for_non_boolean_settings_leaf
47.82 s
>
47.82 s
> test result: FAILED. 0 passed; 1 failed; 0 ignored; 0 measured; 339 filtered out; finished in 0.02s
47.82 s
>
47.82 s
> stderr ---
47.82 s
>
47.82 s
> thread 'repl::tests::completion_shows_type_hint_for_non_boolean_settings_leaf' (761) panicked at crates/gammaloop-api/src/repl.rs:5772:9:
47.82 s
> [Suggestion { value: "", description: Some("expects an integer"), style: None, extra: None, span: Span { start: 42, end: 42 }, append_whitespace: false }]
47.82 s
> stack backtrace:
47.82 s
> 0: __rustc::rust_begin_unwind
47.82 s
> 1: core::panicking::panic_fmt
47.82 s
> 2: gammaloop_api::repl::tests::completion_shows_type_hint_for_non_boolean_settings_leaf
47.82 s
> 3: <gammaloop_api::repl::tests::completion_shows_type_hint_for_non_boolean_settings_leaf::{closure#0} as core::ops::function::FnOnce<()>>::call_once
47.82 s
> note: Some details are omitted, run with `RUST_BACKTRACE=full` for a verbose backtrace.
47.82 s
>
47.82 s
> ------------
47.82 s
> Summary [ 1.144s] 339 tests run: 338 passed , 1 failed , 1 skipped
47.82 s
> FAIL [ 0.047s] (242/339) gammaloop-api repl::tests :: completion_shows_type_hint_for_non_boolean_settings_leaf
47.82 s
> stdout ---
47.82 s
>
47.82 s
> running 1 test
47.82 s
> test repl::tests::completion_shows_type_hint_for_non_boolean_settings_leaf ... FAILED
47.82 s
>
47.82 s
> failures:
47.82 s
>
47.82 s
> failures:
47.82 s
> repl::tests::completion_shows_type_hint_for_non_boolean_settings_leaf
47.82 s
>
47.82 s
> test result: FAILED. 0 passed; 1 failed; 0 ignored; 0 measured; 339 filtered out; finished in 0.02s
47.82 s
>
47.82 s
> stderr ---
47.82 s
>
47.82 s
> thread 'repl::tests::completion_shows_type_hint_for_non_boolean_settings_leaf' (761) panicked at crates/gammaloop-api/src/repl.rs:5772:9:
47.82 s
> [Suggestion { value: "", description: Some("expects an integer"), style: None, extra: None, span: Span { start: 42, end: 42 }, append_whitespace: false }]
47.82 s
> stack backtrace:
47.82 s
> 0: __rustc::rust_begin_unwind
47.82 s
> 1: core::panicking::panic_fmt
47.82 s
> 2: gammaloop_api::repl::tests::completion_shows_type_hint_for_non_boolean_settings_leaf
47.82 s
> 3: <gammaloop_api::repl::tests::completion_shows_type_hint_for_non_boolean_settings_leaf::{closure#0} as core::ops::function::FnOnce<()>>::call_once
47.82 s
> note: Some details are omitted, run with `RUST_BACKTRACE=full` for a verbose backtrace.
47.82 s
>
47.82 s
> error : test run failed
47.82 s
>
47.82 s
> ========== nextest test summary ==========
47.82 s
> report: target/nextest/ci_gammaloop/junit.xml
47.82 s
> tests: 339, failures: 1, errors: 0
47.82 s
>
47.82 s
> 1. gammaloop-api::repl::tests::completion_shows_type_hint_for_non_boolean_settings_leaf
47.82 s
> failure: test failure with exit code 101
47.82 s
> thread 'repl::tests::completion_shows_type_hint_for_non_boolean_settings_leaf' (761) panicked at crates/gammaloop-api/src/repl.rs:5772:9:
47.82 s
> [Suggestion { value: "", description: Some("expects an integer"), style: None, extra: None, span: Span { start: 42, end: 42 }, append_whitespace: false }]
47.82 s
> stack backtrace:
47.82 s
> 0: __rustc::rust_begin_unwind
47.82 s
> 1: core::panicking::panic_fmt
47.82 s
> 2: gammaloop_api::repl::tests::completion_shows_type_hint_for_non_boolean_settings_leaf
47.82 s
> 3: <gammaloop_api::repl::tests::completion_shows_type_hint_for_non_boolean_settings_leaf::{closure#0} as core::ops::function::FnOnce<()>>::call_once
47.82 s
> note: Some details are omitted, run with `RUST_BACKTRACE=full` for a verbose backtrace.
47.82 s
> system-out
47.82 s
> running 1 test
47.82 s
> test repl::tests::completion_shows_type_hint_for_non_boolean_settings_leaf ... FAILED
47.82 s
>
47.82 s
> failures:
47.82 s
>
47.82 s
> failures:
47.82 s
> repl::tests::completion_shows_type_hint_for_non_boolean_settings_leaf
47.82 s
>
47.82 s
> test result: FAILED. 0 passed; 1 failed; 0 ignored; 0 measured; 339 filtered out; finished in 0.02s
47.82 s
> system-err
47.82 s
> thread 'repl::tests::completion_shows_type_hint_for_non_boolean_settings_leaf' (761) panicked at crates/gammaloop-api/src/repl.rs:5772:9:
47.82 s
> [Suggestion { value: "", description: Some("expects an integer"), style: None, extra: None, span: Span { start: 42, end: 42 }, append_whitespace: false }]
47.82 s
> stack backtrace:
47.82 s
> 0: __rustc::rust_begin_unwind
47.82 s
> 1: core::panicking::panic_fmt
47.82 s
> 2: gammaloop_api::repl::tests::completion_shows_type_hint_for_non_boolean_settings_leaf
47.82 s
> 3: <gammaloop_api::repl::tests::completion_shows_type_hint_for_non_boolean_settings_leaf::{closure#0} as core::ops::function::FnOnce<()>>::call_once
47.82 s
> note: Some details are omitted, run with `RUST_BACKTRACE=full` for a verbose backtrace.
47.82 s
> =========================================
47.82 s
> Extracting 1 binary and 1 linked path to /build/source
47.82 s
> Extracted 7 files to /build/source in 0.08s
47.82 s
> ------------
47.82 s
> Nextest run ID 3f112794-cc60-47e3-9f71-83f9c1148577 with nextest profile: ci_gammaloop
47.82 s
> Starting 19 tests across 1 binary
47.82 s
> ------------
47.82 s
> Summary [ 0.055s] 19 tests run: 19 passed , 0 skipped
47.82 s
>
47.82 s
> ========== nextest test summary ==========
47.82 s
> report: target/nextest/ci_gammaloop/junit.xml
47.82 s
> tests: 19, failures: 0, errors: 0
47.82 s
> No failing testcases found.
47.82 s
> =========================================
47.82 s
> Extracting 1 binary to /build/source
47.82 s
> Extracted 4 files to /build/source in 0.06s
47.82 s
> ------------
47.82 s
> Nextest run ID 3707414c-2f0e-456c-bc57-51bcf69daf37 with nextest profile: ci_gammaloop
47.82 s
> Starting 0 tests across 1 binary
47.82 s
> ------------
47.82 s
> Summary [ 0.000s] 0 tests run: 0 passed , 0 skipped
47.82 s
>
47.82 s
> ========== nextest test summary ==========
47.82 s
> report: target/nextest/ci_gammaloop/junit.xml
47.82 s
> tests: 0, failures: 0, errors: 0
47.82 s
> No failing testcases found.
47.82 s
> =========================================
47.82 s
> Extracting 5 binaries (including 1 non-test binary), 1 build script output directory, and 2 linked paths to /build/source
47.82 s
> Extracted 20 files to /build/source in 0.66s
47.82 s
> ------------
47.82 s
> Nextest run ID acda58fe-68f2-4dd0-a999-0d6478ca0a09 with nextest profile: ci_gammaloop
47.82 s
> Starting 456 tests across 4 binaries (61 tests skipped , including 60 tests via profile.ci_gammaloop.default-filter )
47.82 s
> ------------
47.82 s
> Summary [ 15.565s] 456 tests run: 456 passed , 61 skipped
47.82 s
>
47.82 s
> ========== nextest test summary ==========
47.82 s
> report: target/nextest/ci_gammaloop/junit.xml
47.82 s
> tests: 456, failures: 0, errors: 0
47.82 s
> No failing testcases found.
47.82 s
> =========================================
47.82 s
For full logs, run:
47.82 s
nix log /nix/store/02car8gk7i8dx2vfklks1bn8vxkmhh2r-gammaloop-nextest-core.drv
47.97 s
[0 built (1 failed ), 0.0 Run failed.