test packages.x86_64-linux.nix-ci-check-gammaloop-nextest-docs

Reproduce this run
Original Run
  1. 0.00 s $ /nix/store/9ypz3flqsrl5xl495mm8h645gadjsxi1-coreutils-9.11/bin/timeout --kill-after=15s 7200s /nix/store/23zk8sgzamrbmj1fday15szf7f2279s8-nix-2.34.7/bin/nix --extra-experimental-features nix-command --extra-experimental-features flakes flake clone git+https://github.com/alphal00p/gammaloop --dest /tmp/nix-ci-worker/stable-pwd/repo/
  2. 0.08 s Cloning into '/tmp/nix-ci-worker/stable-pwd/repo'...
  3. 0.83 s remote: Enumerating objects: 87950, done.
  4. 0.93 s remote: Counting objects: 0% (1/10548) remote: Counting objects: 1% (106/10548) remote: Counting objects: 2% (211/10548) remote: Counting objects: 3% (317/10548) remote: Counting objects: 4% (422/10548) remote: Counting objects: 5% (528/10548) remote: Counting objects: 6% (633/10548) remote: Counting objects: 7% (739/10548) remote: Counting objects: 8% (844/10548) remote: Counting objects: 9% (950/10548) remote: Counting objects: 10% (1055/10548) remote: Counting objects: 11% (1161/10548) remote: Counting objects: 12% (1266/10548) remote: Counting objects: 13% (1372/10548) remote: Counting objects: 14% (1477/10548) remote: Counting objects: 15% (1583/10548) remote: Counting objects: 16% (1688/10548) remote: Counting objects: 17% (1794/10548) remote: Counting objects: 18% (1899/10548) remote: Counting objects: 19% (2005/10548) remote: Counting objects: 20% (2110/10548) remote: Counting objects: 21% (2216/10548) remote: Counting objects: 22% (2321/10548) remote: Counting objects: 23% (2427/10548) remote: Counting objects: 24% (2532/10548) remote: Counting objects: 25% (2637/10548) remote: Counting objects: 26% (2743/10548) remote: Counting objects: 27% (2848/10548) remote: Counting objects: 28% (2954/10548) remote: Counting objects: 29% (3059/10548) remote: Counting objects: 30% (3165/10548) remote: Counting objects: 31% (3270/10548) remote: Counting objects: 32% (3376/10548) remote: Counting objects: 33% (3481/10548) remote: Counting objects: 34% (3587/10548) remote: Counting objects: 35% (3692/10548) remote: Counting objects: 36% (3798/10548) remote: Counting objects: 37% (3903/10548) remote: Counting objects: 38% (4009/10548) remote: Counting objects: 39% (4114/10548) remote: Counting objects: 40% (4220/10548) remote: Counting objects: 41% (4325/10548) remote: Counting objects: 42% (4431/10548) remote: Counting objects: 43% (4536/10548) remote: Counting objects: 44% (4642/10548) remote: Counting objects: 45% (4747/10548) remote: Counting objects: 46% (4853/10548) remote: Counting objects: 47% (4958/10548) remote: Counting objects: 48% (5064/10548) remote: Counting objects: 49% (5169/10548) remote: Counting objects: 50% (5274/10548) remote: Counting objects: 51% (5380/10548) remote: Counting objects: 52% (5485/10548) remote: Counting objects: 53% (5591/10548) remote: Counting objects: 54% (5696/10548) remote: Counting objects: 55% (5802/10548) remote: Counting objects: 56% (5907/10548) remote: Counting objects: 57% (6013/10548) remote: Counting objects: 58% (6118/10548) remote: Counting objects: 59% (6224/10548) remote: Counting objects: 60% (6329/10548) remote: Counting objects: 61% (6435/10548) remote: Counting objects: 62% (6540/10548) remote: Counting objects: 63% (6646/10548) remote: Counting objects: 64% (6751/10548) remote: Counting objects: 65% (6857/10548) remote: Counting objects: 66% (6962/10548) remote: Counting objects: 67% (7068/10548) remote: Counting objects: 68% (7173/10548) remote: Counting objects: 69% (7279/10548) remote: Counting objects: 70% (7384/10548) remote: Counting objects: 71% (7490/10548) remote: Counting objects: 72% (7595/10548) remote: Counting objects: 73% (7701/10548) remote: Counting objects: 74% (7806/10548) remote: Counting objects: 75% (7911/10548) remote: Counting objects: 76% (8017/10548) remote: Counting objects: 77% (8122/10548) remote: Counting objects: 78% (8228/10548) remote: Counting objects: 79% (8333/10548) remote: Counting objects: 80% (8439/10548) remote: Counting objects: 81% (8544/10548) remote: Counting objects: 82% (8650/10548) remote: Counting objects: 83% (8755/10548) remote: Counting objects: 84% (8861/10548) remote: Counting objects: 85% (8966/10548) remote: Counting objects: 86% (9072/10548) remote: Counting objects: 87% (9177/10548) remote: Counting objects: 88% (9283/10548) remote: Counting objects: 89% (9388/10548) remote: Counting objects: 90% (9494/10548) remote: Counting objects: 91% (9599/10548) remote: Counting objects: 92% (9705/10548) remote: Counting objects: 93% (9810/10548) remote: Counting objects: 94% (9916/10548) remote: Counting objects: 95% (10021/10548) remote: Counting objects: 96% (10127/10548) remote: Counting objects: 97% (10232/10548) remote: Counting objects: 98% (10338/10548) remote: Counting objects: 99% (10443/10548) remote: Counting objects: 100% (10548/10548) remote: Counting objects: 100% (10548/10548), done.
  5. 3.92 s remote: Compressing objects: 0% (1/2960) remote: Compressing objects: 1% (30/2960) remote: Compressing objects: 2% (60/2960) remote: Compressing objects: 3% (89/2960) remote: Compressing objects: 4% (119/2960) remote: Compressing objects: 5% (148/2960) remote: Compressing objects: 6% (178/2960) remote: Compressing objects: 7% (208/2960) remote: Compressing objects: 8% (237/2960) remote: Compressing objects: 9% (267/2960) remote: Compressing objects: 10% (296/2960) remote: Compressing objects: 11% (326/2960) remote: Compressing objects: 12% (356/2960) remote: Compressing objects: 13% (385/2960) remote: Compressing objects: 14% (415/2960) remote: Compressing objects: 15% (444/2960) remote: Compressing objects: 15% (449/2960) remote: Compressing objects: 16% (474/2960) remote: Compressing objects: 17% (504/2960) remote: Compressing objects: 18% (533/2960) remote: Compressing objects: 19% (563/2960) remote: Compressing objects: 20% (592/2960) remote: Compressing objects: 21% (622/2960) remote: Compressing objects: 22% (652/2960) remote: Compressing objects: 23% (681/2960) remote: Compressing objects: 24% (711/2960) remote: Compressing objects: 25% (740/2960) remote: Compressing objects: 26% (770/2960) remote: Compressing objects: 26% (773/2960) remote: Compressing objects: 27% (800/2960) remote: Compressing objects: 28% (829/2960) remote: Compressing objects: 29% (859/2960) remote: Compressing objects: 30% (888/2960) remote: Compressing objects: 31% (918/2960) remote: Compressing objects: 32% (948/2960) remote: Compressing objects: 33% (977/2960) remote: Compressing objects: 34% (1007/2960) remote: Compressing objects: 35% (1036/2960) remote: Compressing objects: 36% (1066/2960) remote: Compressing objects: 37% (1096/2960) remote: Compressing objects: 38% (1125/2960) remote: Compressing objects: 39% (1155/2960) remote: Compressing objects: 40% (1184/2960) remote: Compressing objects: 41% (1214/2960) remote: Compressing objects: 41% (1225/2960) remote: Compressing objects: 42% (1244/2960) remote: Compressing objects: 43% (1273/2960) remote: Compressing objects: 44% (1303/2960) remote: Compressing objects: 45% (1332/2960) remote: Compressing objects: 46% (1362/2960) remote: Compressing objects: 47% (1392/2960) remote: Compressing objects: 48% (1421/2960) remote: Compressing objects: 49% (1451/2960) remote: Compressing objects: 50% (1480/2960) remote: Compressing objects: 51% (1510/2960) remote: Compressing objects: 52% (1540/2960) remote: Compressing objects: 53% (1569/2960) remote: Compressing objects: 54% (1599/2960) remote: Compressing objects: 55% (1628/2960) remote: Compressing objects: 56% (1658/2960) remote: Compressing objects: 57% (1688/2960) remote: Compressing objects: 58% (1717/2960) remote: Compressing objects: 59% (1747/2960) remote: Compressing objects: 60% (1776/2960) remote: Compressing objects: 61% (1806/2960) remote: Compressing objects: 62% (1836/2960) remote: Compressing objects: 63% (1865/2960) remote: Compressing objects: 64% (1895/2960) remote: Compressing objects: 65% (1924/2960) remote: Compressing objects: 66% (1954/2960) remote: Compressing objects: 67% (1984/2960) remote: Compressing objects: 68% (2013/2960) remote: Compressing objects: 69% (2043/2960) remote: Compressing objects: 70% (2072/2960) remote: Compressing objects: 71% (2102/2960) remote: Compressing objects: 72% (2132/2960) remote: Compressing objects: 73% (2161/2960) remote: Compressing objects: 74% (2191/2960) remote: Compressing objects: 75% (2220/2960) remote: Compressing objects: 76% (2250/2960) remote: Compressing objects: 77% (2280/2960) remote: Compressing objects: 78% (2309/2960) remote: Compressing objects: 79% (2339/2960) remote: Compressing objects: 80% (2368/2960) remote: Compressing objects: 81% (2398/2960) remote: Compressing objects: 82% (2428/2960) remote: Compressing objects: 83% (2457/2960) remote: Compressing objects: 84% (2487/2960) remote: Compressing objects: 85% (2516/2960) remote: Compressing objects: 86% (2546/2960) remote: Compressing objects: 87% (2576/2960) remote: Compressing objects: 88% (2605/2960) remote: Compressing objects: 89% (2635/2960) remote: Compressing objects: 90% (2664/2960) remote: Compressing objects: 91% (2694/2960) remote: Compressing objects: 92% (2724/2960) remote: Compressing objects: 93% (2753/2960) remote: Compressing objects: 94% (2783/2960) remote: Compressing objects: 95% (2812/2960) remote: Compressing objects: 96% (2842/2960) remote: Compressing objects: 97% (2872/2960) remote: Compressing objects: 98% (2901/2960) remote: Compressing objects: 99% (2931/2960) remote: Compressing objects: 100% (2960/2960) remote: Compressing objects: 100% (2960/2960), done.
  6. 9.37 s Receiving objects: 0% (1/87950) Receiving objects: 1% (880/87950) Receiving objects: 2% (1759/87950) Receiving objects: 3% (2639/87950) Receiving objects: 4% (3518/87950) Receiving objects: 5% (4398/87950) Receiving objects: 6% (5277/87950) Receiving objects: 7% (6157/87950) Receiving objects: 8% (7036/87950) Receiving objects: 9% (7916/87950), 13.97 MiB | 27.93 MiB/s Receiving objects: 10% (8795/87950), 13.97 MiB | 27.93 MiB/s Receiving objects: 11% (9675/87950), 13.97 MiB | 27.93 MiB/s Receiving objects: 12% (10554/87950), 13.97 MiB | 27.93 MiB/s Receiving objects: 13% (11434/87950), 13.97 MiB | 27.93 MiB/s Receiving objects: 14% (12313/87950), 13.97 MiB | 27.93 MiB/s Receiving objects: 15% (13193/87950), 13.97 MiB | 27.93 MiB/s Receiving objects: 16% (14072/87950), 13.97 MiB | 27.93 MiB/s Receiving objects: 17% (14952/87950), 13.97 MiB | 27.93 MiB/s Receiving objects: 18% (15831/87950), 13.97 MiB | 27.93 MiB/s Receiving objects: 19% (16711/87950), 13.97 MiB | 27.93 MiB/s Receiving objects: 20% (17590/87950), 13.97 MiB | 27.93 MiB/s Receiving objects: 21% (18470/87950), 13.97 MiB | 27.93 MiB/s Receiving objects: 22% (19349/87950), 13.97 MiB | 27.93 MiB/s Receiving objects: 23% (20229/87950), 13.97 MiB | 27.93 MiB/s Receiving objects: 24% (21108/87950), 13.97 MiB | 27.93 MiB/s Receiving objects: 25% (21988/87950), 13.97 MiB | 27.93 MiB/s Receiving objects: 26% (22867/87950), 13.97 MiB | 27.93 MiB/s Receiving objects: 27% (23747/87950), 13.97 MiB | 27.93 MiB/s Receiving objects: 28% (24626/87950), 13.97 MiB | 27.93 MiB/s Receiving objects: 29% (25506/87950), 13.97 MiB | 27.93 MiB/s Receiving objects: 30% (26385/87950), 13.97 MiB | 27.93 MiB/s Receiving objects: 31% (27265/87950), 13.97 MiB | 27.93 MiB/s Receiving objects: 32% (28144/87950), 13.97 MiB | 27.93 MiB/s Receiving objects: 33% (29024/87950), 13.97 MiB | 27.93 MiB/s Receiving objects: 34% (29903/87950), 13.97 MiB | 27.93 MiB/s Receiving objects: 35% (30783/87950), 13.97 MiB | 27.93 MiB/s Receiving objects: 36% (31662/87950), 13.97 MiB | 27.93 MiB/s Receiving objects: 37% (32542/87950), 13.97 MiB | 27.93 MiB/s Receiving objects: 38% (33421/87950), 13.97 MiB | 27.93 MiB/s Receiving objects: 39% (34301/87950), 13.97 MiB | 27.93 MiB/s Receiving objects: 39% (34955/87950), 13.97 MiB | 27.93 MiB/s Receiving objects: 40% (35180/87950), 36.76 MiB | 36.75 MiB/s Receiving objects: 41% (36060/87950), 36.76 MiB | 36.75 MiB/s Receiving objects: 42% (36939/87950), 36.76 MiB | 36.75 MiB/s Receiving objects: 43% (37819/87950), 36.76 MiB | 36.75 MiB/s Receiving objects: 44% (38698/87950), 36.76 MiB | 36.75 MiB/s Receiving objects: 45% (39578/87950), 36.76 MiB | 36.75 MiB/s Receiving objects: 46% (40457/87950), 36.76 MiB | 36.75 MiB/s Receiving objects: 47% (41337/87950), 36.76 MiB | 36.75 MiB/s Receiving objects: 48% (42216/87950), 36.76 MiB | 36.75 MiB/s Receiving objects: 49% (43096/87950), 36.76 MiB | 36.75 MiB/s Receiving objects: 50% (43975/87950), 36.76 MiB | 36.75 MiB/s Receiving objects: 51% (44855/87950), 53.91 MiB | 35.93 MiB/s Receiving objects: 52% (45734/87950), 53.91 MiB | 35.93 MiB/s Receiving objects: 53% (46614/87950), 53.91 MiB | 35.93 MiB/s Receiving objects: 54% (47493/87950), 53.91 MiB | 35.93 MiB/s Receiving objects: 55% (48373/87950), 53.91 MiB | 35.93 MiB/s Receiving objects: 56% (49252/87950), 53.91 MiB | 35.93 MiB/s Receiving objects: 57% (50132/87950), 53.91 MiB | 35.93 MiB/s Receiving objects: 57% (50451/87950), 71.17 MiB | 35.58 MiB/s Receiving objects: 58% (51011/87950), 71.17 MiB | 35.58 MiB/s Receiving objects: 59% (51891/87950), 71.17 MiB | 35.58 MiB/s Receiving objects: 60% (52770/87950), 71.17 MiB | 35.58 MiB/s Receiving objects: 61% (53650/87950), 71.17 MiB | 35.58 MiB/s Receiving objects: 62% (54529/87950), 71.17 MiB | 35.58 MiB/s Receiving objects: 63% (55409/87950), 71.17 MiB | 35.58 MiB/s Receiving objects: 64% (56288/87950), 71.17 MiB | 35.58 MiB/s Receiving objects: 65% (57168/87950), 71.17 MiB | 35.58 MiB/s Receiving objects: 65% (57348/87950), 104.40 MiB | 34.80 MiB/s Receiving objects: 66% (58047/87950), 104.40 MiB | 34.80 MiB/s Receiving objects: 67% (58927/87950), 104.40 MiB | 34.80 MiB/s Receiving objects: 68% (59806/87950), 104.40 MiB | 34.80 MiB/s Receiving objects: 69% (60686/87950), 104.40 MiB | 34.80 MiB/s Receiving objects: 70% (61565/87950), 104.40 MiB | 34.80 MiB/s Receiving objects: 71% (62445/87950), 104.40 MiB | 34.80 MiB/s Receiving objects: 72% (63324/87950), 116.37 MiB | 33.25 MiB/s Receiving objects: 73% (64204/87950), 116.37 MiB | 33.25 MiB/s Receiving objects: 74% (65083/87950), 116.37 MiB | 33.25 MiB/s Receiving objects: 74% (65167/87950), 116.37 MiB | 33.25 MiB/s Receiving objects: 75% (65963/87950), 132.00 MiB | 33.00 MiB/s Receiving objects: 76% (66842/87950), 132.00 MiB | 33.00 MiB/s Receiving objects: 77% (67722/87950), 132.00 MiB | 33.00 MiB/s Receiving objects: 78% (68601/87950), 132.00 MiB | 33.00 MiB/s Receiving objects: 79% (69481/87950), 132.00 MiB | 33.00 MiB/s Receiving objects: 80% (70360/87950), 132.00 MiB | 33.00 MiB/s Receiving objects: 81% (71240/87950), 132.00 MiB | 33.00 MiB/s Receiving objects: 82% (72119/87950), 132.00 MiB | 33.00 MiB/s Receiving objects: 83% (72999/87950), 132.00 MiB | 33.00 MiB/s Receiving objects: 84% (73878/87950), 132.00 MiB | 33.00 MiB/s Receiving objects: 85% (74758/87950), 145.57 MiB | 32.35 MiB/s Receiving objects: 86% (75637/87950), 145.57 MiB | 32.35 MiB/s Receiving objects: 87% (76517/87950), 145.57 MiB | 32.35 MiB/s Receiving objects: 88% (77396/87950), 145.57 MiB | 32.35 MiB/s Receiving objects: 89% (78276/87950), 145.57 MiB | 32.35 MiB/s Receiving objects: 90% (79155/87950), 145.57 MiB | 32.35 MiB/s Receiving objects: 91% (80035/87950), 145.57 MiB | 32.35 MiB/s Receiving objects: 92% (80914/87950), 145.57 MiB | 32.35 MiB/s Receiving objects: 93% (81794/87950), 145.57 MiB | 32.35 MiB/s Receiving objects: 94% (82673/87950), 145.57 MiB | 32.35 MiB/s Receiving objects: 95% (83553/87950), 145.57 MiB | 32.35 MiB/s Receiving objects: 96% (84432/87950), 145.57 MiB | 32.35 MiB/s Receiving objects: 97% (85312/87950), 145.57 MiB | 32.35 MiB/s Receiving objects: 98% (86191/87950), 145.57 MiB | 32.35 MiB/s Receiving objects: 98% (86345/87950), 145.57 MiB | 32.35 MiB/s Receiving objects: 99% (87071/87950), 160.52 MiB | 32.56 MiB/s remote: Total 87950 (delta 8613), reused 8357 (delta 7562), pack-reused 77402 (from 3)
  7. 9.37 s Receiving objects: 100% (87950/87950), 160.52 MiB | 32.56 MiB/s Receiving objects: 100% (87950/87950), 176.58 MiB | 32.45 MiB/s, done.
  8. 10.92 s Resolving deltas: 0% (0/59478) Resolving deltas: 1% (595/59478) Resolving deltas: 2% (1190/59478) Resolving deltas: 3% (1785/59478) Resolving deltas: 4% (2381/59478) Resolving deltas: 5% (2974/59478) Resolving deltas: 6% (3569/59478) Resolving deltas: 7% (4164/59478) Resolving deltas: 8% (4760/59478) Resolving deltas: 9% (5354/59478) Resolving deltas: 10% (5948/59478) Resolving deltas: 11% (6543/59478) Resolving deltas: 12% (7138/59478) Resolving deltas: 13% (7733/59478) Resolving deltas: 14% (8329/59478) Resolving deltas: 15% (8922/59478) Resolving deltas: 16% (9518/59478) Resolving deltas: 17% (10113/59478) Resolving deltas: 18% (10708/59478) Resolving deltas: 19% (11302/59478) Resolving deltas: 20% (11896/59478) Resolving deltas: 21% (12492/59478) Resolving deltas: 22% (13086/59478) Resolving deltas: 23% (13680/59478) Resolving deltas: 24% (14275/59478) Resolving deltas: 25% (14870/59478) Resolving deltas: 26% (15465/59478) Resolving deltas: 27% (16060/59478) Resolving deltas: 28% (16654/59478) Resolving deltas: 29% (17249/59478) Resolving deltas: 30% (17844/59478) Resolving deltas: 31% (18439/59478) Resolving deltas: 32% (19033/59478) Resolving deltas: 33% (19628/59478) Resolving deltas: 34% (20223/59478) Resolving deltas: 35% (20818/59478) Resolving deltas: 36% (21416/59478) Resolving deltas: 37% (22008/59478) Resolving deltas: 38% (22602/59478) Resolving deltas: 39% (23198/59478) Resolving deltas: 40% (23792/59478) Resolving deltas: 41% (24386/59478) Resolving deltas: 42% (24981/59478) Resolving deltas: 43% (25580/59478) Resolving deltas: 44% (26171/59478) Resolving deltas: 45% (26768/59478) Resolving deltas: 46% (27360/59478) Resolving deltas: 47% (27957/59478) Resolving deltas: 48% (28551/59478) Resolving deltas: 49% (29145/59478) Resolving deltas: 50% (29739/59478) Resolving deltas: 51% (30334/59478) Resolving deltas: 52% (30929/59478) Resolving deltas: 53% (31524/59478) Resolving deltas: 54% (32119/59478) Resolving deltas: 55% (32713/59478) Resolving deltas: 56% (33309/59478) Resolving deltas: 57% (33903/59478) Resolving deltas: 58% (34498/59478) Resolving deltas: 59% (35093/59478) Resolving deltas: 60% (35687/59478) Resolving deltas: 61% (36282/59478) Resolving deltas: 62% (36877/59478) Resolving deltas: 63% (37472/59478) Resolving deltas: 64% (38066/59478) Resolving deltas: 65% (38661/59478) Resolving deltas: 65% (39247/59478) Resolving deltas: 66% (39256/59478) Resolving deltas: 67% (39851/59478) Resolving deltas: 68% (40446/59478) Resolving deltas: 69% (41040/59478) Resolving deltas: 70% (41635/59478) Resolving deltas: 71% (42230/59478) Resolving deltas: 72% (42825/59478) Resolving deltas: 73% (43419/59478) Resolving deltas: 74% (44015/59478) Resolving deltas: 75% (44609/59478) Resolving deltas: 76% (45206/59478) Resolving deltas: 77% (45801/59478) Resolving deltas: 78% (46393/59478) Resolving deltas: 79% (46988/59478) Resolving deltas: 80% (47583/59478) Resolving deltas: 81% (48178/59478) Resolving deltas: 82% (48772/59478) Resolving deltas: 83% (49367/59478) Resolving deltas: 84% (49963/59478) Resolving deltas: 85% (50557/59478) Resolving deltas: 86% (51152/59478) Resolving deltas: 87% (51746/59478) Resolving deltas: 88% (52341/59478) Resolving deltas: 89% (52937/59478) Resolving deltas: 90% (53531/59478) Resolving deltas: 91% (54125/59478) Resolving deltas: 92% (54720/59478) Resolving deltas: 93% (55315/59478) Resolving deltas: 94% (55910/59478) Resolving deltas: 95% (56505/59478) Resolving deltas: 96% (57099/59478) Resolving deltas: 97% (57696/59478) Resolving deltas: 98% (58290/59478) Resolving deltas: 99% (58884/59478) Resolving deltas: 100% (59478/59478) Resolving deltas: 100% (59478/59478), done.
  9. 11.48 s Fetching commit 891dec7c25b5d9026c099da021ec7ae3b757dee9 for docs ...
  10. 11.48 s $ /nix/store/bcnisk3ydfgv26v2gw3zlky24g00yww2-git-2.54.0/bin/git fetch origin 891dec7c25b5d9026c099da021ec7ae3b757dee9
  11. 11.98 s From https://github.com/alphal00p/gammaloop
  12. 11.98 s * branch 891dec7c25b5d9026c099da021ec7ae3b757dee9 -> FETCH_HEAD
  13. 12.00 s $ /nix/store/9ypz3flqsrl5xl495mm8h645gadjsxi1-coreutils-9.11/bin/timeout --kill-after=15s 7200s /nix/store/bcnisk3ydfgv26v2gw3zlky24g00yww2-git-2.54.0/bin/git -c advice.detachedHead=false checkout 891dec7c25b5d9026c099da021ec7ae3b757dee9
  14. 12.40 s HEAD is now at 891dec7c2 change photos
  15. 12.40 s $ /nix/store/9ypz3flqsrl5xl495mm8h645gadjsxi1-coreutils-9.11/bin/timeout --kill-after=15s 7200s /nix/store/23zk8sgzamrbmj1fday15szf7f2279s8-nix-2.34.7/bin/nix --extra-experimental-features nix-command --extra-experimental-features flakes --log-format internal-json run .#packages.x86_64-linux.nix-ci-check-gammaloop-nextest-docs --print-build-logs
  16. 19.32 s
  17. 28.62 s evaluating derivation 'g copying '/nix/store/bgss evaluating derivation 'g copying '/nix/store/bgss evaluating derivation 'g copying '/nix/store/bgss evaluating derivation 'g copying '/nix/store/bgss evaluating derivation 'g copying '/nix/store/bgss evaluating derivation 'g copying '/nix/store/bgss evaluating derivation 'g [0/1 built] [1/0/1 built] [1/0/1 built] building ggammaloop-nextest-docs> Extracting 2 binaries to /build/source
  18. 28.70 s gammaloop-nextest-docs> Extracted 5 files to /build/source in 0.09s
  19. 28.72 s gammaloop-nextest-docs> ------------
  20. 28.72 s gammaloop-nextest-docs> Nextest run ID d79544b5-ac22-4bad-9353-3451cf10a614 with nextest profile: ci_gammaloop
  21. 28.72 s gammaloop-nextest-docs> Starting 129 tests across 2 binaries
  22. 65.85 s gammaloop-nextest-docs> FAIL [ 37.130s] (128/129) alphal00p-docs-builder provenance_tests::each_build_captures_one_revision_before_rendering
  23. 65.85 s gammaloop-nextest-docs> stdout ---
  24. 65.85 s gammaloop-nextest-docs>
  25. 65.85 s gammaloop-nextest-docs> running 1 test
  26. 65.85 s gammaloop-nextest-docs>
  27. 65.85 s gammaloop-nextest-docs> running 1 test
  28. 65.85 s gammaloop-nextest-docs> test provenance_tests::each_build_captures_one_revision_before_rendering ... FAILED
  29. 65.85 s gammaloop-nextest-docs>
  30. 65.85 s gammaloop-nextest-docs> failures:
  31. 65.85 s gammaloop-nextest-docs>
  32. 65.85 s gammaloop-nextest-docs> failures:
  33. 65.85 s gammaloop-nextest-docs> provenance_tests::each_build_captures_one_revision_before_rendering
  34. 65.85 s gammaloop-nextest-docs>
  35. 65.85 s gammaloop-nextest-docs> test result: FAILED. 0 passed; 1 failed; 0 ignored; 0 measured; 128 filtered out; finished in 37.05s
  36. 65.85 s gammaloop-nextest-docs>
  37. 65.85 s gammaloop-nextest-docs> test provenance_tests::each_build_captures_one_revision_before_rendering ... FAILED
  38. 65.85 s gammaloop-nextest-docs>
  39. 65.85 s gammaloop-nextest-docs> failures:
  40. 65.85 s gammaloop-nextest-docs>
  41. 65.85 s gammaloop-nextest-docs> failures:
  42. 65.85 s gammaloop-nextest-docs> provenance_tests::each_build_captures_one_revision_before_rendering
  43. 65.85 s gammaloop-nextest-docs>
  44. 65.85 s gammaloop-nextest-docs> test result: FAILED. 0 passed; 1 failed; 0 ignored; 0 measured; 128 filtered out; finished in 37.12s
  45. 65.85 s gammaloop-nextest-docs>
  46. 65.85 s gammaloop-nextest-docs> stderr ---
  47. 65.85 s gammaloop-nextest-docs> warning: bundle export is experimental
  48. 65.85 s gammaloop-nextest-docs> = hint: its behaviour may change at any time
  49. 65.85 s gammaloop-nextest-docs> = hint: do not rely on this feature for production use cases
  50. 65.85 s gammaloop-nextest-docs>
  51. 65.85 s gammaloop-nextest-docs> warning: unknown font family: roboto
  52. 65.85 s gammaloop-nextest-docs> ┌─ crates/linnest/typst/docs/manual.typ:11:28
  53. 65.85 s gammaloop-nextest-docs> │
  54. 65.85 s gammaloop-nextest-docs> 11 │ #set text(size: 10pt, font: "Roboto")
  55. 65.85 s gammaloop-nextest-docs> │ ^^^^^^^^
  56. 65.85 s gammaloop-nextest-docs>
  57. 65.85 s gammaloop-nextest-docs> warning: unknown font family: roboto
  58. 65.85 s gammaloop-nextest-docs> ┌─ crates/linnest/typst/docs/manual.typ:14:29
  59. 65.85 s gammaloop-nextest-docs> │
  60. 65.85 s gammaloop-nextest-docs> 14 │ #set text(size: 3em, font: "Roboto")
  61. 65.85 s gammaloop-nextest-docs> │ ^^^^^^^^
  62. 65.85 s gammaloop-nextest-docs>
  63. 65.85 s gammaloop-nextest-docs> warning: unknown font family: roboto
  64. 65.85 s gammaloop-nextest-docs> ┌─ crates/linnest/typst/docs/manual.typ:16:31
  65. 65.85 s gammaloop-nextest-docs> │
  66. 65.85 s gammaloop-nextest-docs> 16 │ #set text(size: 0.3em, font: "Roboto")
  67. 65.85 s gammaloop-nextest-docs> │ ^^^^^^^^
  68. 65.85 s gammaloop-nextest-docs>
  69. 65.85 s gammaloop-nextest-docs> warning: overline was ignored during MathML export
  70. 65.85 s gammaloop-nextest-docs> ┌─ crates/linnest/typst/docs/manual.typ:949:55
  71. 65.85 s gammaloop-nextest-docs> │
  72. 65.85 s gammaloop-nextest-docs> 949 │ + sum_("dangling" e) c_("dangling-centroid") / (d(e, overline(v)) + epsilon)
  73. 65.85 s gammaloop-nextest-docs> │ ^^^^^^^^^^^
  74. 65.85 s gammaloop-nextest-docs>
  75. 65.85 s gammaloop-nextest-docs> warning: overline was ignored during MathML export
  76. 65.85 s gammaloop-nextest-docs> ┌─ crates/linnest/typst/docs/manual.typ:953:8
  77. 65.85 s gammaloop-nextest-docs> │
  78. 65.85 s gammaloop-nextest-docs> 953 │ Here $overline(v)$ is the mean node position. The centroid term pushes every
  79. 65.85 s gammaloop-nextest-docs> │ ^^^^^^^^^^^
  80. 65.85 s gammaloop-nextest-docs>
  81. 65.85 s gammaloop-nextest-docs>
  82. 65.85 s gammaloop-nextest-docs> thread 'provenance_tests::each_build_captures_one_revision_before_rendering' (231) panicked at crates/alphal00p-docs-builder/src/provenance_tests.rs:297:14:
  83. 65.85 s gammaloop-nextest-docs> called `Result::unwrap()` on an `Err` value: generated site has broken links:
  84. 65.85 s gammaloop-nextest-docs> products/linnet/latest/reference/interfaces/index.html -> https://github.com/alphal00p/gammaloop/blob/1111111111111111111111111111111111111111/crates/linnet-py/examples/physics_render_settings.py (missing repository source file crates/linnet-py/examples/physics_render_settings.py)
  85. 65.85 s gammaloop-nextest-docs> products/linnet/latest/reference/interfaces/index.html -> https://github.com/alphal00p/gammaloop/blob/1111111111111111111111111111111111111111/crates/linnet-py/examples/layout_stream.py (missing repository source file crates/linnet-py/examples/layout_stream.py)
  86. 65.85 s gammaloop-nextest-docs> products/linnet/latest/playground/index.html -> https://github.com/alphal00p/gammaloop/blob/1111111111111111111111111111111111111111/crates/linnet-py/examples/layout_stream.py (missing repository source file crates/linnet-py/examples/layout_stream.py)
  87. 65.85 s gammaloop-nextest-docs> products/linnet/latest/guides/python-rendering/index.html -> https://github.com/alphal00p/gammaloop/blob/1111111111111111111111111111111111111111/crates/linnet-py/examples/rendering_api.py (missing repository source file crates/linnet-py/examples/rendering_api.py)
  88. 65.85 s gammaloop-nextest-docs>
  89. 65.85 s gammaloop-nextest-docs> Location:
  90. 65.85 s gammaloop-nextest-docs> crates/alphal00p-docs-builder/src/lib.rs:4940:9
  91. 65.85 s gammaloop-nextest-docs> stack backtrace:
  92. 65.85 s gammaloop-nextest-docs> 0: __rustc::rust_begin_unwind
  93. 65.85 s gammaloop-nextest-docs> 1: core::panicking::panic_fmt
  94. 65.85 s gammaloop-nextest-docs> 2: core::result::unwrap_failed
  95. 65.85 s gammaloop-nextest-docs> 3: alphal00p_docs_builder::provenance_tests::each_build_captures_one_revision_before_rendering
  96. 65.85 s gammaloop-nextest-docs> 4: <alphal00p_docs_builder::provenance_tests::each_build_captures_one_revision_before_rendering::{closure#0} as core::ops::function::FnOnce<()>>::call_once
  97. 65.85 s gammaloop-nextest-docs> note: Some details are omitted, run with `RUST_BACKTRACE=full` for a verbose backtrace.
  98. 65.85 s gammaloop-nextest-docs>
  99. 65.85 s gammaloop-nextest-docs> thread 'provenance_tests::each_build_captures_one_revision_before_rendering' (191) panicked at crates/alphal00p-docs-builder/src/provenance_tests.rs:274:9:
  100. 65.85 s gammaloop-nextest-docs> assertion failed: command.status().unwrap().success()
  101. 65.85 s gammaloop-nextest-docs> stack backtrace:
  102. 65.85 s gammaloop-nextest-docs> 0: __rustc::rust_begin_unwind
  103. 65.85 s gammaloop-nextest-docs> 1: core::panicking::panic_fmt
  104. 65.85 s gammaloop-nextest-docs> 2: core::panicking::panic
  105. 65.85 s gammaloop-nextest-docs> 3: alphal00p_docs_builder::provenance_tests::each_build_captures_one_revision_before_rendering
  106. 65.85 s gammaloop-nextest-docs> 4: <alphal00p_docs_builder::provenance_tests::each_build_captures_one_revision_before_rendering::{closure#0} as core::ops::function::FnOnce<()>>::call_once
  107. 65.85 s gammaloop-nextest-docs> note: Some details are omitted, run with `RUST_BACKTRACE=full` for a verbose backtrace.
  108. 65.85 s gammaloop-nextest-docs>
  109. 72.69 s gammaloop-nextest-docs> ------------
  110. 72.69 s gammaloop-nextest-docs> Summary [ 43.971s] 129 tests run: 128 passed, 1 failed, 0 skipped
  111. 72.69 s gammaloop-nextest-docs> FAIL [ 37.130s] (128/129) alphal00p-docs-builder provenance_tests::each_build_captures_one_revision_before_rendering
  112. 72.69 s gammaloop-nextest-docs> stdout ---
  113. 72.69 s gammaloop-nextest-docs>
  114. 72.69 s gammaloop-nextest-docs> running 1 test
  115. 72.69 s gammaloop-nextest-docs>
  116. 72.69 s gammaloop-nextest-docs> running 1 test
  117. 72.69 s gammaloop-nextest-docs> test provenance_tests::each_build_captures_one_revision_before_rendering ... FAILED
  118. 72.69 s gammaloop-nextest-docs>
  119. 72.69 s gammaloop-nextest-docs> failures:
  120. 72.69 s gammaloop-nextest-docs>
  121. 72.69 s gammaloop-nextest-docs> failures:
  122. 72.69 s gammaloop-nextest-docs> provenance_tests::each_build_captures_one_revision_before_rendering
  123. 72.69 s gammaloop-nextest-docs>
  124. 72.69 s gammaloop-nextest-docs> test result: FAILED. 0 passed; 1 failed; 0 ignored; 0 measured; 128 filtered out; finished in 37.05s
  125. 72.69 s gammaloop-nextest-docs>
  126. 72.69 s gammaloop-nextest-docs> test provenance_tests::each_build_captures_one_revision_before_rendering ... FAILED
  127. 72.69 s gammaloop-nextest-docs>
  128. 72.69 s gammaloop-nextest-docs> failures:
  129. 72.69 s gammaloop-nextest-docs>
  130. 72.69 s gammaloop-nextest-docs> failures:
  131. 72.69 s gammaloop-nextest-docs> provenance_tests::each_build_captures_one_revision_before_rendering
  132. 72.69 s gammaloop-nextest-docs>
  133. 72.69 s gammaloop-nextest-docs> test result: FAILED. 0 passed; 1 failed; 0 ignored; 0 measured; 128 filtered out; finished in 37.12s
  134. 72.69 s gammaloop-nextest-docs>
  135. 72.69 s gammaloop-nextest-docs> stderr ---
  136. 72.69 s gammaloop-nextest-docs> warning: bundle export is experimental
  137. 72.69 s gammaloop-nextest-docs> = hint: its behaviour may change at any time
  138. 72.69 s gammaloop-nextest-docs> = hint: do not rely on this feature for production use cases
  139. 72.69 s gammaloop-nextest-docs>
  140. 72.69 s gammaloop-nextest-docs> warning: unknown font family: roboto
  141. 72.69 s gammaloop-nextest-docs> ┌─ crates/linnest/typst/docs/manual.typ:11:28
  142. 72.69 s gammaloop-nextest-docs> │
  143. 72.69 s gammaloop-nextest-docs> 11 │ #set text(size: 10pt, font: "Roboto")
  144. 72.69 s gammaloop-nextest-docs> │ ^^^^^^^^
  145. 72.69 s gammaloop-nextest-docs>
  146. 72.69 s gammaloop-nextest-docs> warning: unknown font family: roboto
  147. 72.69 s gammaloop-nextest-docs> ┌─ crates/linnest/typst/docs/manual.typ:14:29
  148. 72.69 s gammaloop-nextest-docs> │
  149. 72.69 s gammaloop-nextest-docs> 14 │ #set text(size: 3em, font: "Roboto")
  150. 72.69 s gammaloop-nextest-docs> │ ^^^^^^^^
  151. 72.69 s gammaloop-nextest-docs>
  152. 72.69 s gammaloop-nextest-docs> warning: unknown font family: roboto
  153. 72.69 s gammaloop-nextest-docs> ┌─ crates/linnest/typst/docs/manual.typ:16:31
  154. 72.69 s gammaloop-nextest-docs> │
  155. 72.69 s gammaloop-nextest-docs> 16 │ #set text(size: 0.3em, font: "Roboto")
  156. 72.69 s gammaloop-nextest-docs> │ ^^^^^^^^
  157. 72.69 s gammaloop-nextest-docs>
  158. 72.69 s gammaloop-nextest-docs> warning: overline was ignored during MathML export
  159. 72.69 s gammaloop-nextest-docs> ┌─ crates/linnest/typst/docs/manual.typ:949:55
  160. 72.69 s gammaloop-nextest-docs> │
  161. 72.69 s gammaloop-nextest-docs> 949 │ + sum_("dangling" e) c_("dangling-centroid") / (d(e, overline(v)) + epsilon)
  162. 72.69 s gammaloop-nextest-docs> │ ^^^^^^^^^^^
  163. 72.69 s gammaloop-nextest-docs>
  164. 72.69 s gammaloop-nextest-docs> warning: overline was ignored during MathML export
  165. 72.69 s gammaloop-nextest-docs> ┌─ crates/linnest/typst/docs/manual.typ:953:8
  166. 72.69 s gammaloop-nextest-docs> │
  167. 72.69 s gammaloop-nextest-docs> 953 │ Here $overline(v)$ is the mean node position. The centroid term pushes every
  168. 72.69 s gammaloop-nextest-docs> │ ^^^^^^^^^^^
  169. 72.69 s gammaloop-nextest-docs>
  170. 72.69 s gammaloop-nextest-docs>
  171. 72.69 s gammaloop-nextest-docs> thread 'provenance_tests::each_build_captures_one_revision_before_rendering' (231) panicked at crates/alphal00p-docs-builder/src/provenance_tests.rs:297:14:
  172. 72.69 s gammaloop-nextest-docs> called `Result::unwrap()` on an `Err` value: generated site has broken links:
  173. 72.69 s gammaloop-nextest-docs> products/linnet/latest/reference/interfaces/index.html -> https://github.com/alphal00p/gammaloop/blob/1111111111111111111111111111111111111111/crates/linnet-py/examples/physics_render_settings.py (missing repository source file crates/linnet-py/examples/physics_render_settings.py)
  174. 72.69 s gammaloop-nextest-docs> products/linnet/latest/reference/interfaces/index.html -> https://github.com/alphal00p/gammaloop/blob/1111111111111111111111111111111111111111/crates/linnet-py/examples/layout_stream.py (missing repository source file crates/linnet-py/examples/layout_stream.py)
  175. 72.69 s gammaloop-nextest-docs> products/linnet/latest/playground/index.html -> https://github.com/alphal00p/gammaloop/blob/1111111111111111111111111111111111111111/crates/linnet-py/examples/layout_stream.py (missing repository source file crates/linnet-py/examples/layout_stream.py)
  176. 72.69 s gammaloop-nextest-docs> products/linnet/latest/guides/python-rendering/index.html -> https://github.com/alphal00p/gammaloop/blob/1111111111111111111111111111111111111111/crates/linnet-py/examples/rendering_api.py (missing repository source file crates/linnet-py/examples/rendering_api.py)
  177. 72.69 s gammaloop-nextest-docs>
  178. 72.69 s gammaloop-nextest-docs> Location:
  179. 72.69 s gammaloop-nextest-docs> crates/alphal00p-docs-builder/src/lib.rs:4940:9
  180. 72.69 s gammaloop-nextest-docs> stack backtrace:
  181. 72.69 s gammaloop-nextest-docs> 0: __rustc::rust_begin_unwind
  182. 72.69 s gammaloop-nextest-docs> 1: core::panicking::panic_fmt
  183. 72.69 s gammaloop-nextest-docs> 2: core::result::unwrap_failed
  184. 72.69 s gammaloop-nextest-docs> 3: alphal00p_docs_builder::provenance_tests::each_build_captures_one_revision_before_rendering
  185. 72.69 s gammaloop-nextest-docs> 4: <alphal00p_docs_builder::provenance_tests::each_build_captures_one_revision_before_rendering::{closure#0} as core::ops::function::FnOnce<()>>::call_once
  186. 72.69 s gammaloop-nextest-docs> note: Some details are omitted, run with `RUST_BACKTRACE=full` for a verbose backtrace.
  187. 72.69 s gammaloop-nextest-docs>
  188. 72.69 s gammaloop-nextest-docs> thread 'provenance_tests::each_build_captures_one_revision_before_rendering' (191) panicked at crates/alphal00p-docs-builder/src/provenance_tests.rs:274:9:
  189. 72.69 s gammaloop-nextest-docs> assertion failed: command.status().unwrap().success()
  190. 72.69 s gammaloop-nextest-docs> stack backtrace:
  191. 72.69 s gammaloop-nextest-docs> 0: __rustc::rust_begin_unwind
  192. 72.69 s gammaloop-nextest-docs> 1: core::panicking::panic_fmt
  193. 72.69 s gammaloop-nextest-docs> 2: core::panicking::panic
  194. 72.69 s gammaloop-nextest-docs> 3: alphal00p_docs_builder::provenance_tests::each_build_captures_one_revision_before_rendering
  195. 72.69 s gammaloop-nextest-docs> 4: <alphal00p_docs_builder::provenance_tests::each_build_captures_one_revision_before_rendering::{closure#0} as core::ops::function::FnOnce<()>>::call_once
  196. 72.69 s gammaloop-nextest-docs> note: Some details are omitted, run with `RUST_BACKTRACE=full` for a verbose backtrace.
  197. 72.69 s gammaloop-nextest-docs>
  198. 72.69 s gammaloop-nextest-docs> error: test run failed
  199. 72.72 s gammaloop-nextest-docs>
  200. 72.72 s gammaloop-nextest-docs> ========== nextest test summary ==========
  201. 72.72 s gammaloop-nextest-docs> report: target/nextest/ci_gammaloop/junit.xml
  202. 72.72 s gammaloop-nextest-docs> tests: 129, failures: 1, errors: 0
  203. 72.72 s gammaloop-nextest-docs>
  204. 72.72 s gammaloop-nextest-docs> 1. alphal00p-docs-builder::provenance_tests::each_build_captures_one_revision_before_rendering
  205. 72.72 s gammaloop-nextest-docs> failure: test failure with exit code 101
  206. 72.72 s gammaloop-nextest-docs> thread 'provenance_tests::each_build_captures_one_revision_before_rendering' (191) panicked at crates/alphal00p-docs-builder/src/provenance_tests.rs:274:9:
  207. 72.72 s gammaloop-nextest-docs> assertion failed: command.status().unwrap().success()
  208. 72.72 s gammaloop-nextest-docs> stack backtrace:
  209. 72.72 s gammaloop-nextest-docs> 0: __rustc::rust_begin_unwind
  210. 72.72 s gammaloop-nextest-docs> 1: core::panicking::panic_fmt
  211. 72.72 s gammaloop-nextest-docs> 2: core::panicking::panic
  212. 72.72 s gammaloop-nextest-docs> 3: alphal00p_docs_builder::provenance_tests::each_build_captures_one_revision_before_rendering
  213. 72.72 s gammaloop-nextest-docs> 4: <alphal00p_docs_builder::provenance_tests::each_build_captures_one_revision_before_rendering::{closure#0} as core::ops::function::FnOnce<()>>::call_once
  214. 72.72 s gammaloop-nextest-docs> note: Some details are omitted, run with `RUST_BACKTRACE=full` for a verbose backtrace.
  215. 72.72 s gammaloop-nextest-docs> system-out
  216. 72.72 s gammaloop-nextest-docs> running 1 test
  217. 72.72 s gammaloop-nextest-docs>
  218. 72.72 s gammaloop-nextest-docs> running 1 test
  219. 72.72 s gammaloop-nextest-docs> test provenance_tests::each_build_captures_one_revision_before_rendering ... FAILED
  220. 72.72 s gammaloop-nextest-docs>
  221. 72.72 s gammaloop-nextest-docs> failures:
  222. 72.72 s gammaloop-nextest-docs>
  223. 72.72 s gammaloop-nextest-docs> failures:
  224. 72.72 s gammaloop-nextest-docs> provenance_tests::each_build_captures_one_revision_before_rendering
  225. 72.72 s gammaloop-nextest-docs>
  226. 72.72 s gammaloop-nextest-docs> test result: FAILED. 0 passed; 1 failed; 0 ignored; 0 measured; 128 filtered out; finished in 37.05s
  227. 72.72 s gammaloop-nextest-docs>
  228. 72.72 s gammaloop-nextest-docs> test provenance_tests::each_build_captures_one_revision_before_rendering ... FAILED
  229. 72.72 s gammaloop-nextest-docs>
  230. 72.72 s gammaloop-nextest-docs> failures:
  231. 72.72 s gammaloop-nextest-docs>
  232. 72.72 s gammaloop-nextest-docs> failures:
  233. 72.72 s gammaloop-nextest-docs> provenance_tests::each_build_captures_one_revision_before_rendering
  234. 72.72 s gammaloop-nextest-docs>
  235. 72.72 s gammaloop-nextest-docs> test result: FAILED. 0 passed; 1 failed; 0 ignored; 0 measured; 128 filtered out; finished in 37.12s
  236. 72.72 s gammaloop-nextest-docs> system-err
  237. 72.72 s gammaloop-nextest-docs> warning: bundle export is experimental
  238. 72.72 s gammaloop-nextest-docs> = hint: its behaviour may change at any time
  239. 72.72 s gammaloop-nextest-docs> = hint: do not rely on this feature for production use cases
  240. 72.72 s gammaloop-nextest-docs>
  241. 72.72 s gammaloop-nextest-docs> warning: unknown font family: roboto
  242. 72.72 s gammaloop-nextest-docs> ┌─ crates/linnest/typst/docs/manual.typ:11:28
  243. 72.72 s gammaloop-nextest-docs> │
  244. 72.72 s gammaloop-nextest-docs> 11 │ #set text(size: 10pt, font: "Roboto")
  245. 72.72 s gammaloop-nextest-docs> │ ^^^^^^^^
  246. 72.72 s gammaloop-nextest-docs>
  247. 72.72 s gammaloop-nextest-docs> warning: unknown font family: roboto
  248. 72.72 s gammaloop-nextest-docs> ┌─ crates/linnest/typst/docs/manual.typ:14:29
  249. 72.72 s gammaloop-nextest-docs> │
  250. 72.72 s gammaloop-nextest-docs> 14 │ #set text(size: 3em, font: "Roboto")
  251. 72.72 s gammaloop-nextest-docs> │ ^^^^^^^^
  252. 72.72 s gammaloop-nextest-docs>
  253. 72.72 s gammaloop-nextest-docs> warning: unknown font family: roboto
  254. 72.72 s gammaloop-nextest-docs> ┌─ crates/linnest/typst/docs/manual.typ:16:31
  255. 72.72 s gammaloop-nextest-docs> │
  256. 72.72 s gammaloop-nextest-docs> 16 │ #set text(size: 0.3em, font: "Roboto")
  257. 72.72 s gammaloop-nextest-docs> │ ^^^^^^^^
  258. 72.72 s gammaloop-nextest-docs>
  259. 72.72 s gammaloop-nextest-docs> warning: overline was ignored during MathML export
  260. 72.72 s gammaloop-nextest-docs> ┌─ crates/linnest/typst/docs/manual.typ:949:55
  261. 72.72 s gammaloop-nextest-docs> │
  262. 72.72 s gammaloop-nextest-docs> 949 │ + sum_("dangling" e) c_("dangling-centroid") / (d(e, overline(v)) + epsilon)
  263. 72.72 s gammaloop-nextest-docs> │ ^^^^^^^^^^^
  264. 72.72 s gammaloop-nextest-docs>
  265. 72.72 s gammaloop-nextest-docs> warning: overline was ignored during MathML export
  266. 72.72 s gammaloop-nextest-docs> ┌─ crates/linnest/typst/docs/manual.typ:953:8
  267. 72.72 s gammaloop-nextest-docs> │
  268. 72.72 s gammaloop-nextest-docs> 953 │ Here $overline(v)$ is the mean node position. The centroid term pushes every
  269. 72.72 s gammaloop-nextest-docs> │ ^^^^^^^^^^^
  270. 72.72 s gammaloop-nextest-docs>
  271. 72.72 s gammaloop-nextest-docs>
  272. 72.72 s gammaloop-nextest-docs> thread 'provenance_tests::each_build_captures_one_revision_before_rendering' (231) panicked at crates/alphal00p-docs-builder/src/provenance_tests.rs:297:14:
  273. 72.72 s gammaloop-nextest-docs> called `Result::unwrap()` on an `Err` value: generated site has broken links:
  274. 72.72 s gammaloop-nextest-docs> products/linnet/latest/reference/interfaces/index.html -> https://github.com/alphal00p/gammaloop/blob/1111111111111111111111111111111111111111/crates/linnet-py/examples/physics_render_settings.py (missing repository source file crates/linnet-py/examples/physics_render_settings.py)
  275. 72.73 s gammaloop-nextest-docs> products/linnet/latest/reference/interfaces/index.html -> https://github.com/alphal00p/gammaloop/blob/1111111111111111111111111111111111111111/crates/linnet-py/examples/layout_stream.py (missing repository source file crates/linnet-py/examples/layout_stream.py)
  276. 72.73 s gammaloop-nextest-docs> products/linnet/latest/playground/index.html -> https://github.com/alphal00p/gammaloop/blob/1111111111111111111111111111111111111111/crates/linnet-py/examples/layout_stream.py (missing repository source file crates/linnet-py/examples/layout_stream.py)
  277. 72.73 s gammaloop-nextest-docs> products/linnet/latest/guides/python-rendering/index.html -> https://github.com/alphal00p/gammaloop/blob/1111111111111111111111111111111111111111/crates/linnet-py/examples/rendering_api.py (missing repository source file crates/linnet-py/examples/rendering_api.py)
  278. 72.73 s gammaloop-nextest-docs>
  279. 72.73 s gammaloop-nextest-docs> Location:
  280. 72.73 s gammaloop-nextest-docs> crates/alphal00p-docs-builder/src/lib.rs:4940:9
  281. 72.73 s gammaloop-nextest-docs> stack backtrace:
  282. 72.73 s gammaloop-nextest-docs> 0: __rustc::rust_begin_unwind
  283. 72.73 s gammaloop-nextest-docs> 1: core::panicking::panic_fmt
  284. 72.73 s gammaloop-nextest-docs> 2: core::result::unwrap_failed
  285. 72.73 s gammaloop-nextest-docs> 3: alphal00p_docs_builder::provenance_tests::each_build_captures_one_revision_before_rendering
  286. 72.73 s gammaloop-nextest-docs> 4: <alphal00p_docs_builder::provenance_tests::each_build_captures_one_revision_before_rendering::{closure#0} as core::ops::function::FnOnce<()>>::call_once
  287. 72.73 s gammaloop-nextest-docs> note: Some details are omitted, run with `RUST_BACKTRACE=full` for a verbose backtrace.
  288. 72.73 s gammaloop-nextest-docs>
  289. 72.73 s gammaloop-nextest-docs> thread 'provenance_tests::each_build_captures_one_revision_before_rendering' (191) panicked at crates/alphal00p-docs-builder/src/provenance_tests.rs:274:9:
  290. 72.73 s gammaloop-nextest-docs> assertion failed: command.status().unwrap().success()
  291. 72.73 s gammaloop-nextest-docs> stack backtrace:
  292. 72.73 s gammaloop-nextest-docs> 0: __rustc::rust_begin_unwind
  293. 72.73 s gammaloop-nextest-docs> 1: core::panicking::panic_fmt
  294. 72.73 s gammaloop-nextest-docs> 2: core::panicking::panic
  295. 72.73 s gammaloop-nextest-docs> 3: alphal00p_docs_builder::provenance_tests::each_build_captures_one_revision_before_rendering
  296. 72.73 s gammaloop-nextest-docs> 4: <alphal00p_docs_builder::provenance_tests::each_build_captures_one_revision_before_rendering::{closure#0} as core::ops::function::FnOnce<()>>::call_once
  297. 72.73 s gammaloop-nextest-docs> note: Some details are omitted, run with `RUST_BACKTRACE=full` for a verbose backtrace.
  298. 72.73 s gammaloop-nextest-docs> =========================================
  299. 72.74 s gammaloop-nextest-docs> Extracting 2 binaries to /build/source
  300. 72.78 s gammaloop-nextest-docs> Extracted 5 files to /build/source in 0.04s
  301. 72.79 s gammaloop-nextest-docs> ------------
  302. 72.79 s gammaloop-nextest-docs> Nextest run ID 914177fb-bf7e-4474-8ad6-3e4e5dedec49 with nextest profile: ci_gammaloop
  303. 72.79 s gammaloop-nextest-docs> Starting 22 tests across 2 binaries
  304. 72.81 s gammaloop-nextest-docs> ------------
  305. 72.81 s gammaloop-nextest-docs> Summary [ 0.018s] 22 tests run: 22 passed, 0 skipped
  306. 72.85 s gammaloop-nextest-docs>
  307. 72.85 s gammaloop-nextest-docs> ========== nextest test summary ==========
  308. 72.85 s gammaloop-nextest-docs> report: target/nextest/ci_gammaloop/junit.xml
  309. 72.85 s gammaloop-nextest-docs> tests: 22, failures: 0, errors: 0
  310. 72.85 s gammaloop-nextest-docs> No failing testcases found.
  311. 72.85 s gammaloop-nextest-docs> =========================================
  312. 72.87 s gammaloop-nextest-docs> Extracting 3 binaries (including 2 non-test binaries), 1 build script output directory, and 2 linked paths to /build/source
  313. 73.15 s gammaloop-nextest-docs> Extracted 22 files to /build/source in 0.28s
  314. 73.16 s gammaloop-nextest-docs> ------------
  315. 73.16 s gammaloop-nextest-docs> Nextest run ID 26be5934-c657-482d-a987-5ba714b6b925 with nextest profile: ci_gammaloop
  316. 73.16 s gammaloop-nextest-docs> Starting 89 tests across 1 binary
  317. 73.20 s gammaloop-nextest-docs> ------------
  318. 73.20 s gammaloop-nextest-docs> Summary [ 0.041s] 89 tests run: 89 passed, 0 skipped
  319. 73.23 s gammaloop-nextest-docs>
  320. 73.23 s gammaloop-nextest-docs> ========== nextest test summary ==========
  321. 73.23 s gammaloop-nextest-docs> report: target/nextest/ci_gammaloop/junit.xml
  322. 73.23 s gammaloop-nextest-docs> tests: 89, failures: 0, errors: 0
  323. 73.23 s gammaloop-nextest-docs> No failing testcases found.
  324. 73.23 s gammaloop-nextest-docs> =========================================
  325. 73.25 s gammaloop-nextest-docs> Extracting 2 binaries to /build/source
  326. 73.29 s gammaloop-nextest-docs> Extracted 5 files to /build/source in 0.05s
  327. 73.30 s gammaloop-nextest-docs> ------------
  328. 73.30 s gammaloop-nextest-docs> Nextest run ID 938aabdb-ba51-4988-b34a-221516f60b0c with nextest profile: ci_gammaloop
  329. 73.30 s gammaloop-nextest-docs> Starting 10 tests across 2 binaries
  330. 87.17 s gammaloop-nextest-docs> ------------
  331. 87.17 s gammaloop-nextest-docs> Summary [ 13.869s] 10 tests run: 10 passed, 0 skipped
  332. 87.20 s gammaloop-nextest-docs>
  333. 87.20 s gammaloop-nextest-docs> ========== nextest test summary ==========
  334. 87.20 s gammaloop-nextest-docs> report: target/nextest/ci_gammaloop/junit.xml
  335. 87.20 s gammaloop-nextest-docs> tests: 10, failures: 0, errors: 0
  336. 87.20 s gammaloop-nextest-docs> No failing testcases found.
  337. 87.20 s gammaloop-nextest-docs> =========================================
  338. 87.21 s gammaloop-nextest-docs> Extracting 1 binary to /build/source
  339. 87.25 s gammaloop-nextest-docs> Extracted 4 files to /build/source in 0.04s
  340. 87.26 s gammaloop-nextest-docs> ------------
  341. 87.26 s gammaloop-nextest-docs> Nextest run ID 15453a0e-968a-47d0-9371-4f77dc8e9777 with nextest profile: ci_gammaloop
  342. 87.26 s gammaloop-nextest-docs> Starting 0 tests across 1 binary
  343. 87.26 s gammaloop-nextest-docs> ------------
  344. 87.26 s gammaloop-nextest-docs> Summary [ 0.000s] 0 tests run: 0 passed, 0 skipped
  345. 87.29 s gammaloop-nextest-docs>
  346. 87.29 s gammaloop-nextest-docs> ========== nextest test summary ==========
  347. 87.29 s gammaloop-nextest-docs> report: target/nextest/ci_gammaloop/junit.xml
  348. 87.29 s gammaloop-nextest-docs> tests: 0, failures: 0, errors: 0
  349. 87.29 s gammaloop-nextest-docs> No failing testcases found.
  350. 87.29 s gammaloop-nextest-docs> =========================================
  351. 87.30 s gammaloop-nextest-docs> Extracting 1 binary to /build/source
  352. 87.33 s gammaloop-nextest-docs> Extracted 4 files to /build/source in 0.04s
  353. 87.34 s gammaloop-nextest-docs> ------------
  354. 87.34 s gammaloop-nextest-docs> Nextest run ID a88f4f5e-327e-4b6f-92b7-2a3ce444dbb8 with nextest profile: ci_gammaloop
  355. 87.34 s gammaloop-nextest-docs> Starting 5 tests across 1 binary
  356. 87.35 s gammaloop-nextest-docs> ------------
  357. 87.35 s gammaloop-nextest-docs> Summary [ 0.006s] 5 tests run: 5 passed, 0 skipped
  358. 87.38 s gammaloop-nextest-docs>
  359. 87.38 s gammaloop-nextest-docs> ========== nextest test summary ==========
  360. 87.38 s gammaloop-nextest-docs> report: target/nextest/ci_gammaloop/junit.xml
  361. 87.38 s gammaloop-nextest-docs> tests: 5, failures: 0, errors: 0
  362. 87.38 s gammaloop-nextest-docs> No failing testcases found.
  363. 87.38 s gammaloop-nextest-docs> =========================================
  364. 87.59 s error: Cannot build '/nix/store/9rs74w2crrwhaq7f0dxdi11wd515i6dj-gammaloop-nextest-docs.drv'.
  365. 87.59 s Reason: builder failed with exit code 100.
  366. 87.59 s Output paths:
  367. 87.59 s /nix/store/1jyipvscqlj4v0h7qjznydlgdlc4bjy7-gammaloop-nextest-docs
  368. 87.59 s Last 347 log lines:
  369. 87.59 s > Extracting 2 binaries to /build/source
  370. 87.59 s > Extracted 5 files to /build/source in 0.09s
  371. 87.59 s > ------------
  372. 87.59 s > Nextest run ID d79544b5-ac22-4bad-9353-3451cf10a614 with nextest profile: ci_gammaloop
  373. 87.59 s > Starting 129 tests across 2 binaries
  374. 87.59 s > FAIL [ 37.130s] (128/129) alphal00p-docs-builder provenance_tests::each_build_captures_one_revision_before_rendering
  375. 87.59 s > stdout ---
  376. 87.59 s >
  377. 87.59 s > running 1 test
  378. 87.59 s >
  379. 87.59 s > running 1 test
  380. 87.59 s > test provenance_tests::each_build_captures_one_revision_before_rendering ... FAILED
  381. 87.59 s >
  382. 87.59 s > failures:
  383. 87.59 s >
  384. 87.59 s > failures:
  385. 87.59 s > provenance_tests::each_build_captures_one_revision_before_rendering
  386. 87.59 s >
  387. 87.59 s > test result: FAILED. 0 passed; 1 failed; 0 ignored; 0 measured; 128 filtered out; finished in 37.05s
  388. 87.59 s >
  389. 87.59 s > test provenance_tests::each_build_captures_one_revision_before_rendering ... FAILED
  390. 87.59 s >
  391. 87.59 s > failures:
  392. 87.59 s >
  393. 87.59 s > failures:
  394. 87.59 s > provenance_tests::each_build_captures_one_revision_before_rendering
  395. 87.59 s >
  396. 87.59 s > test result: FAILED. 0 passed; 1 failed; 0 ignored; 0 measured; 128 filtered out; finished in 37.12s
  397. 87.59 s >
  398. 87.59 s > stderr ---
  399. 87.59 s > warning: bundle export is experimental
  400. 87.59 s > = hint: its behaviour may change at any time
  401. 87.59 s > = hint: do not rely on this feature for production use cases
  402. 87.59 s >
  403. 87.59 s > warning: unknown font family: roboto
  404. 87.59 s > ┌─ crates/linnest/typst/docs/manual.typ:11:28
  405. 87.59 s > │
  406. 87.59 s > 11 │ #set text(size: 10pt, font: "Roboto")
  407. 87.59 s > │ ^^^^^^^^
  408. 87.59 s >
  409. 87.59 s > warning: unknown font family: roboto
  410. 87.59 s > ┌─ crates/linnest/typst/docs/manual.typ:14:29
  411. 87.59 s > │
  412. 87.59 s > 14 │ #set text(size: 3em, font: "Roboto")
  413. 87.59 s > │ ^^^^^^^^
  414. 87.59 s >
  415. 87.59 s > warning: unknown font family: roboto
  416. 87.59 s > ┌─ crates/linnest/typst/docs/manual.typ:16:31
  417. 87.59 s > │
  418. 87.59 s > 16 │ #set text(size: 0.3em, font: "Roboto")
  419. 87.59 s > │ ^^^^^^^^
  420. 87.59 s >
  421. 87.59 s > warning: overline was ignored during MathML export
  422. 87.59 s > ┌─ crates/linnest/typst/docs/manual.typ:949:55
  423. 87.59 s > │
  424. 87.59 s > 949 │ + sum_("dangling" e) c_("dangling-centroid") / (d(e, overline(v)) + epsilon)
  425. 87.59 s > │ ^^^^^^^^^^^
  426. 87.59 s >
  427. 87.59 s > warning: overline was ignored during MathML export
  428. 87.59 s > ┌─ crates/linnest/typst/docs/manual.typ:953:8
  429. 87.59 s > │
  430. 87.59 s > 953 │ Here $overline(v)$ is the mean node position. The centroid term pushes every
  431. 87.59 s > │ ^^^^^^^^^^^
  432. 87.59 s >
  433. 87.59 s >
  434. 87.59 s > thread 'provenance_tests::each_build_captures_one_revision_before_rendering' (231) panicked at crates/alphal00p-docs-builder/src/provenance_tests.rs:297:14:
  435. 87.59 s > called `Result::unwrap()` on an `Err` value: generated site has broken links:
  436. 87.59 s > products/linnet/latest/reference/interfaces/index.html -> https://github.com/alphal00p/gammaloop/blob/1111111111111111111111111111111111111111/crates/linnet-py/examples/physics_render_settings.py (missing repository source file crates/linnet-py/examples/physics_render_settings.py)
  437. 87.59 s > products/linnet/latest/reference/interfaces/index.html -> https://github.com/alphal00p/gammaloop/blob/1111111111111111111111111111111111111111/crates/linnet-py/examples/layout_stream.py (missing repository source file crates/linnet-py/examples/layout_stream.py)
  438. 87.59 s > products/linnet/latest/playground/index.html -> https://github.com/alphal00p/gammaloop/blob/1111111111111111111111111111111111111111/crates/linnet-py/examples/layout_stream.py (missing repository source file crates/linnet-py/examples/layout_stream.py)
  439. 87.59 s > products/linnet/latest/guides/python-rendering/index.html -> https://github.com/alphal00p/gammaloop/blob/1111111111111111111111111111111111111111/crates/linnet-py/examples/rendering_api.py (missing repository source file crates/linnet-py/examples/rendering_api.py)
  440. 87.59 s >
  441. 87.59 s > Location:
  442. 87.59 s > crates/alphal00p-docs-builder/src/lib.rs:4940:9
  443. 87.59 s > stack backtrace:
  444. 87.59 s > 0: __rustc::rust_begin_unwind
  445. 87.59 s > 1: core::panicking::panic_fmt
  446. 87.59 s > 2: core::result::unwrap_failed
  447. 87.59 s > 3: alphal00p_docs_builder::provenance_tests::each_build_captures_one_revision_before_rendering
  448. 87.59 s > 4: <alphal00p_docs_builder::provenance_tests::each_build_captures_one_revision_before_rendering::{closure#0} as core::ops::function::FnOnce<()>>::call_once
  449. 87.59 s > note: Some details are omitted, run with `RUST_BACKTRACE=full` for a verbose backtrace.
  450. 87.59 s >
  451. 87.59 s > thread 'provenance_tests::each_build_captures_one_revision_before_rendering' (191) panicked at crates/alphal00p-docs-builder/src/provenance_tests.rs:274:9:
  452. 87.59 s > assertion failed: command.status().unwrap().success()
  453. 87.59 s > stack backtrace:
  454. 87.59 s > 0: __rustc::rust_begin_unwind
  455. 87.59 s > 1: core::panicking::panic_fmt
  456. 87.59 s > 2: core::panicking::panic
  457. 87.59 s > 3: alphal00p_docs_builder::provenance_tests::each_build_captures_one_revision_before_rendering
  458. 87.59 s > 4: <alphal00p_docs_builder::provenance_tests::each_build_captures_one_revision_before_rendering::{closure#0} as core::ops::function::FnOnce<()>>::call_once
  459. 87.59 s > note: Some details are omitted, run with `RUST_BACKTRACE=full` for a verbose backtrace.
  460. 87.59 s >
  461. 87.59 s > ------------
  462. 87.59 s > Summary [ 43.971s] 129 tests run: 128 passed, 1 failed, 0 skipped
  463. 87.59 s > FAIL [ 37.130s] (128/129) alphal00p-docs-builder provenance_tests::each_build_captures_one_revision_before_rendering
  464. 87.59 s > stdout ---
  465. 87.59 s >
  466. 87.59 s > running 1 test
  467. 87.59 s >
  468. 87.59 s > running 1 test
  469. 87.59 s > test provenance_tests::each_build_captures_one_revision_before_rendering ... FAILED
  470. 87.59 s >
  471. 87.59 s > failures:
  472. 87.59 s >
  473. 87.59 s > failures:
  474. 87.59 s > provenance_tests::each_build_captures_one_revision_before_rendering
  475. 87.59 s >
  476. 87.59 s > test result: FAILED. 0 passed; 1 failed; 0 ignored; 0 measured; 128 filtered out; finished in 37.05s
  477. 87.59 s >
  478. 87.59 s > test provenance_tests::each_build_captures_one_revision_before_rendering ... FAILED
  479. 87.59 s >
  480. 87.59 s > failures:
  481. 87.59 s >
  482. 87.59 s > failures:
  483. 87.59 s > provenance_tests::each_build_captures_one_revision_before_rendering
  484. 87.59 s >
  485. 87.59 s > test result: FAILED. 0 passed; 1 failed; 0 ignored; 0 measured; 128 filtered out; finished in 37.12s
  486. 87.59 s >
  487. 87.59 s > stderr ---
  488. 87.59 s > warning: bundle export is experimental
  489. 87.59 s > = hint: its behaviour may change at any time
  490. 87.59 s > = hint: do not rely on this feature for production use cases
  491. 87.59 s >
  492. 87.59 s > warning: unknown font family: roboto
  493. 87.59 s > ┌─ crates/linnest/typst/docs/manual.typ:11:28
  494. 87.59 s > │
  495. 87.59 s > 11 │ #set text(size: 10pt, font: "Roboto")
  496. 87.59 s > │ ^^^^^^^^
  497. 87.59 s >
  498. 87.59 s > warning: unknown font family: roboto
  499. 87.59 s > ┌─ crates/linnest/typst/docs/manual.typ:14:29
  500. 87.59 s > │
  501. 87.59 s > 14 │ #set text(size: 3em, font: "Roboto")
  502. 87.59 s > │ ^^^^^^^^
  503. 87.59 s >
  504. 87.59 s > warning: unknown font family: roboto
  505. 87.59 s > ┌─ crates/linnest/typst/docs/manual.typ:16:31
  506. 87.59 s > │
  507. 87.59 s > 16 │ #set text(size: 0.3em, font: "Roboto")
  508. 87.59 s > │ ^^^^^^^^
  509. 87.59 s >
  510. 87.59 s > warning: overline was ignored during MathML export
  511. 87.59 s > ┌─ crates/linnest/typst/docs/manual.typ:949:55
  512. 87.59 s > │
  513. 87.59 s > 949 │ + sum_("dangling" e) c_("dangling-centroid") / (d(e, overline(v)) + epsilon)
  514. 87.59 s > │ ^^^^^^^^^^^
  515. 87.59 s >
  516. 87.59 s > warning: overline was ignored during MathML export
  517. 87.59 s > ┌─ crates/linnest/typst/docs/manual.typ:953:8
  518. 87.59 s > │
  519. 87.59 s > 953 │ Here $overline(v)$ is the mean node position. The centroid term pushes every
  520. 87.59 s > │ ^^^^^^^^^^^
  521. 87.59 s >
  522. 87.59 s >
  523. 87.59 s > thread 'provenance_tests::each_build_captures_one_revision_before_rendering' (231) panicked at crates/alphal00p-docs-builder/src/provenance_tests.rs:297:14:
  524. 87.59 s > called `Result::unwrap()` on an `Err` value: generated site has broken links:
  525. 87.59 s > products/linnet/latest/reference/interfaces/index.html -> https://github.com/alphal00p/gammaloop/blob/1111111111111111111111111111111111111111/crates/linnet-py/examples/physics_render_settings.py (missing repository source file crates/linnet-py/examples/physics_render_settings.py)
  526. 87.59 s > products/linnet/latest/reference/interfaces/index.html -> https://github.com/alphal00p/gammaloop/blob/1111111111111111111111111111111111111111/crates/linnet-py/examples/layout_stream.py (missing repository source file crates/linnet-py/examples/layout_stream.py)
  527. 87.59 s > products/linnet/latest/playground/index.html -> https://github.com/alphal00p/gammaloop/blob/1111111111111111111111111111111111111111/crates/linnet-py/examples/layout_stream.py (missing repository source file crates/linnet-py/examples/layout_stream.py)
  528. 87.59 s > products/linnet/latest/guides/python-rendering/index.html -> https://github.com/alphal00p/gammaloop/blob/1111111111111111111111111111111111111111/crates/linnet-py/examples/rendering_api.py (missing repository source file crates/linnet-py/examples/rendering_api.py)
  529. 87.59 s >
  530. 87.59 s > Location:
  531. 87.59 s > crates/alphal00p-docs-builder/src/lib.rs:4940:9
  532. 87.59 s > stack backtrace:
  533. 87.59 s > 0: __rustc::rust_begin_unwind
  534. 87.59 s > 1: core::panicking::panic_fmt
  535. 87.59 s > 2: core::result::unwrap_failed
  536. 87.59 s > 3: alphal00p_docs_builder::provenance_tests::each_build_captures_one_revision_before_rendering
  537. 87.59 s > 4: <alphal00p_docs_builder::provenance_tests::each_build_captures_one_revision_before_rendering::{closure#0} as core::ops::function::FnOnce<()>>::call_once
  538. 87.59 s > note: Some details are omitted, run with `RUST_BACKTRACE=full` for a verbose backtrace.
  539. 87.59 s >
  540. 87.59 s > thread 'provenance_tests::each_build_captures_one_revision_before_rendering' (191) panicked at crates/alphal00p-docs-builder/src/provenance_tests.rs:274:9:
  541. 87.59 s > assertion failed: command.status().unwrap().success()
  542. 87.59 s > stack backtrace:
  543. 87.59 s > 0: __rustc::rust_begin_unwind
  544. 87.59 s > 1: core::panicking::panic_fmt
  545. 87.59 s > 2: core::panicking::panic
  546. 87.59 s > 3: alphal00p_docs_builder::provenance_tests::each_build_captures_one_revision_before_rendering
  547. 87.59 s > 4: <alphal00p_docs_builder::provenance_tests::each_build_captures_one_revision_before_rendering::{closure#0} as core::ops::function::FnOnce<()>>::call_once
  548. 87.59 s > note: Some details are omitted, run with `RUST_BACKTRACE=full` for a verbose backtrace.
  549. 87.59 s >
  550. 87.59 s > error: test run failed
  551. 87.59 s >
  552. 87.59 s > ========== nextest test summary ==========
  553. 87.59 s > report: target/nextest/ci_gammaloop/junit.xml
  554. 87.59 s > tests: 129, failures: 1, errors: 0
  555. 87.59 s >
  556. 87.59 s > 1. alphal00p-docs-builder::provenance_tests::each_build_captures_one_revision_before_rendering
  557. 87.59 s > failure: test failure with exit code 101
  558. 87.59 s > thread 'provenance_tests::each_build_captures_one_revision_before_rendering' (191) panicked at crates/alphal00p-docs-builder/src/provenance_tests.rs:274:9:
  559. 87.59 s > assertion failed: command.status().unwrap().success()
  560. 87.59 s > stack backtrace:
  561. 87.59 s > 0: __rustc::rust_begin_unwind
  562. 87.59 s > 1: core::panicking::panic_fmt
  563. 87.59 s > 2: core::panicking::panic
  564. 87.59 s > 3: alphal00p_docs_builder::provenance_tests::each_build_captures_one_revision_before_rendering
  565. 87.59 s > 4: <alphal00p_docs_builder::provenance_tests::each_build_captures_one_revision_before_rendering::{closure#0} as core::ops::function::FnOnce<()>>::call_once
  566. 87.59 s > note: Some details are omitted, run with `RUST_BACKTRACE=full` for a verbose backtrace.
  567. 87.59 s > system-out
  568. 87.59 s > running 1 test
  569. 87.59 s >
  570. 87.59 s > running 1 test
  571. 87.59 s > test provenance_tests::each_build_captures_one_revision_before_rendering ... FAILED
  572. 87.59 s >
  573. 87.59 s > failures:
  574. 87.59 s >
  575. 87.59 s > failures:
  576. 87.59 s > provenance_tests::each_build_captures_one_revision_before_rendering
  577. 87.59 s >
  578. 87.59 s > test result: FAILED. 0 passed; 1 failed; 0 ignored; 0 measured; 128 filtered out; finished in 37.05s
  579. 87.59 s >
  580. 87.59 s > test provenance_tests::each_build_captures_one_revision_before_rendering ... FAILED
  581. 87.59 s >
  582. 87.59 s > failures:
  583. 87.59 s >
  584. 87.59 s > failures:
  585. 87.59 s > provenance_tests::each_build_captures_one_revision_before_rendering
  586. 87.59 s >
  587. 87.59 s > test result: FAILED. 0 passed; 1 failed; 0 ignored; 0 measured; 128 filtered out; finished in 37.12s
  588. 87.59 s > system-err
  589. 87.59 s > warning: bundle export is experimental
  590. 87.59 s > = hint: its behaviour may change at any time
  591. 87.59 s > = hint: do not rely on this feature for production use cases
  592. 87.59 s >
  593. 87.59 s > warning: unknown font family: roboto
  594. 87.59 s > ┌─ crates/linnest/typst/docs/manual.typ:11:28
  595. 87.59 s > │
  596. 87.59 s > 11 │ #set text(size: 10pt, font: "Roboto")
  597. 87.59 s > │ ^^^^^^^^
  598. 87.59 s >
  599. 87.59 s > warning: unknown font family: roboto
  600. 87.59 s > ┌─ crates/linnest/typst/docs/manual.typ:14:29
  601. 87.59 s > │
  602. 87.59 s > 14 │ #set text(size: 3em, font: "Roboto")
  603. 87.59 s > │ ^^^^^^^^
  604. 87.59 s >
  605. 87.59 s > warning: unknown font family: roboto
  606. 87.59 s > ┌─ crates/linnest/typst/docs/manual.typ:16:31
  607. 87.59 s > │
  608. 87.59 s > 16 │ #set text(size: 0.3em, font: "Roboto")
  609. 87.59 s > │ ^^^^^^^^
  610. 87.59 s >
  611. 87.59 s > warning: overline was ignored during MathML export
  612. 87.59 s > ┌─ crates/linnest/typst/docs/manual.typ:949:55
  613. 87.59 s > │
  614. 87.59 s > 949 │ + sum_("dangling" e) c_("dangling-centroid") / (d(e, overline(v)) + epsilon)
  615. 87.59 s > │ ^^^^^^^^^^^
  616. 87.59 s >
  617. 87.59 s > warning: overline was ignored during MathML export
  618. 87.59 s > ┌─ crates/linnest/typst/docs/manual.typ:953:8
  619. 87.59 s > │
  620. 87.59 s > 953 │ Here $overline(v)$ is the mean node position. The centroid term pushes every
  621. 87.59 s > │ ^^^^^^^^^^^
  622. 87.59 s >
  623. 87.59 s >
  624. 87.59 s > thread 'provenance_tests::each_build_captures_one_revision_before_rendering' (231) panicked at crates/alphal00p-docs-builder/src/provenance_tests.rs:297:14:
  625. 87.59 s > called `Result::unwrap()` on an `Err` value: generated site has broken links:
  626. 87.59 s > products/linnet/latest/reference/interfaces/index.html -> https://github.com/alphal00p/gammaloop/blob/1111111111111111111111111111111111111111/crates/linnet-py/examples/physics_render_settings.py (missing repository source file crates/linnet-py/examples/physics_render_settings.py)
  627. 87.59 s > products/linnet/latest/reference/interfaces/index.html -> https://github.com/alphal00p/gammaloop/blob/1111111111111111111111111111111111111111/crates/linnet-py/examples/layout_stream.py (missing repository source file crates/linnet-py/examples/layout_stream.py)
  628. 87.59 s > products/linnet/latest/playground/index.html -> https://github.com/alphal00p/gammaloop/blob/1111111111111111111111111111111111111111/crates/linnet-py/examples/layout_stream.py (missing repository source file crates/linnet-py/examples/layout_stream.py)
  629. 87.59 s > products/linnet/latest/guides/python-rendering/index.html -> https://github.com/alphal00p/gammaloop/blob/1111111111111111111111111111111111111111/crates/linnet-py/examples/rendering_api.py (missing repository source file crates/linnet-py/examples/rendering_api.py)
  630. 87.59 s >
  631. 87.59 s > Location:
  632. 87.59 s > crates/alphal00p-docs-builder/src/lib.rs:4940:9
  633. 87.59 s > stack backtrace:
  634. 87.59 s > 0: __rustc::rust_begin_unwind
  635. 87.59 s > 1: core::panicking::panic_fmt
  636. 87.59 s > 2: core::result::unwrap_failed
  637. 87.59 s > 3: alphal00p_docs_builder::provenance_tests::each_build_captures_one_revision_before_rendering
  638. 87.59 s > 4: <alphal00p_docs_builder::provenance_tests::each_build_captures_one_revision_before_rendering::{closure#0} as core::ops::function::FnOnce<()>>::call_once
  639. 87.59 s > note: Some details are omitted, run with `RUST_BACKTRACE=full` for a verbose backtrace.
  640. 87.59 s >
  641. 87.59 s > thread 'provenance_tests::each_build_captures_one_revision_before_rendering' (191) panicked at crates/alphal00p-docs-builder/src/provenance_tests.rs:274:9:
  642. 87.59 s > assertion failed: command.status().unwrap().success()
  643. 87.59 s > stack backtrace:
  644. 87.59 s > 0: __rustc::rust_begin_unwind
  645. 87.59 s > 1: core::panicking::panic_fmt
  646. 87.59 s > 2: core::panicking::panic
  647. 87.59 s > 3: alphal00p_docs_builder::provenance_tests::each_build_captures_one_revision_before_rendering
  648. 87.59 s > 4: <alphal00p_docs_builder::provenance_tests::each_build_captures_one_revision_before_rendering::{closure#0} as core::ops::function::FnOnce<()>>::call_once
  649. 87.59 s > note: Some details are omitted, run with `RUST_BACKTRACE=full` for a verbose backtrace.
  650. 87.59 s > =========================================
  651. 87.59 s > Extracting 2 binaries to /build/source
  652. 87.59 s > Extracted 5 files to /build/source in 0.04s
  653. 87.59 s > ------------
  654. 87.59 s > Nextest run ID 914177fb-bf7e-4474-8ad6-3e4e5dedec49 with nextest profile: ci_gammaloop
  655. 87.59 s > Starting 22 tests across 2 binaries
  656. 87.59 s > ------------
  657. 87.59 s > Summary [ 0.018s] 22 tests run: 22 passed, 0 skipped
  658. 87.59 s >
  659. 87.59 s > ========== nextest test summary ==========
  660. 87.59 s > report: target/nextest/ci_gammaloop/junit.xml
  661. 87.59 s > tests: 22, failures: 0, errors: 0
  662. 87.59 s > No failing testcases found.
  663. 87.59 s > =========================================
  664. 87.59 s > Extracting 3 binaries (including 2 non-test binaries), 1 build script output directory, and 2 linked paths to /build/source
  665. 87.59 s > Extracted 22 files to /build/source in 0.28s
  666. 87.59 s > ------------
  667. 87.59 s > Nextest run ID 26be5934-c657-482d-a987-5ba714b6b925 with nextest profile: ci_gammaloop
  668. 87.59 s > Starting 89 tests across 1 binary
  669. 87.59 s > ------------
  670. 87.59 s > Summary [ 0.041s] 89 tests run: 89 passed, 0 skipped
  671. 87.59 s >
  672. 87.59 s > ========== nextest test summary ==========
  673. 87.59 s > report: target/nextest/ci_gammaloop/junit.xml
  674. 87.59 s > tests: 89, failures: 0, errors: 0
  675. 87.59 s > No failing testcases found.
  676. 87.59 s > =========================================
  677. 87.59 s > Extracting 2 binaries to /build/source
  678. 87.59 s > Extracted 5 files to /build/source in 0.05s
  679. 87.59 s > ------------
  680. 87.59 s > Nextest run ID 938aabdb-ba51-4988-b34a-221516f60b0c with nextest profile: ci_gammaloop
  681. 87.59 s > Starting 10 tests across 2 binaries
  682. 87.59 s > ------------
  683. 87.59 s > Summary [ 13.869s] 10 tests run: 10 passed, 0 skipped
  684. 87.59 s >
  685. 87.59 s > ========== nextest test summary ==========
  686. 87.59 s > report: target/nextest/ci_gammaloop/junit.xml
  687. 87.59 s > tests: 10, failures: 0, errors: 0
  688. 87.59 s > No failing testcases found.
  689. 87.59 s > =========================================
  690. 87.59 s > Extracting 1 binary to /build/source
  691. 87.59 s > Extracted 4 files to /build/source in 0.04s
  692. 87.59 s > ------------
  693. 87.59 s > Nextest run ID 15453a0e-968a-47d0-9371-4f77dc8e9777 with nextest profile: ci_gammaloop
  694. 87.59 s > Starting 0 tests across 1 binary
  695. 87.59 s > ------------
  696. 87.59 s > Summary [ 0.000s] 0 tests run: 0 passed, 0 skipped
  697. 87.59 s >
  698. 87.59 s > ========== nextest test summary ==========
  699. 87.59 s > report: target/nextest/ci_gammaloop/junit.xml
  700. 87.59 s > tests: 0, failures: 0, errors: 0
  701. 87.59 s > No failing testcases found.
  702. 87.59 s > =========================================
  703. 87.59 s > Extracting 1 binary to /build/source
  704. 87.59 s > Extracted 4 files to /build/source in 0.04s
  705. 87.59 s > ------------
  706. 87.59 s > Nextest run ID a88f4f5e-327e-4b6f-92b7-2a3ce444dbb8 with nextest profile: ci_gammaloop
  707. 87.59 s > Starting 5 tests across 1 binary
  708. 87.59 s > ------------
  709. 87.59 s > Summary [ 0.006s] 5 tests run: 5 passed, 0 skipped
  710. 87.59 s >
  711. 87.59 s > ========== nextest test summary ==========
  712. 87.59 s > report: target/nextest/ci_gammaloop/junit.xml
  713. 87.59 s > tests: 5, failures: 0, errors: 0
  714. 87.59 s > No failing testcases found.
  715. 87.59 s > =========================================
  716. 87.59 s For full logs, run:
  717. 87.59 s nix log /nix/store/9rs74w2crrwhaq7f0dxdi11wd515i6dj-gammaloop-nextest-docs.drv
  718. 87.74 s [0 built (1 failed)]Run failed.