0.00 s
$ /nix/store/9ypz3flqsrl5xl495mm8h645gadjsxi1-coreutils-9.11/bin/timeout --kill-after=15s 7200s /nix/store/23zk8sgzamrbmj1fday15szf7f2279s8-nix-2.34.7/bin/nix --extra-experimental-features nix-command --extra-experimental-features flakes flake clone git+https://github.com/alphal00p/gammaloop --dest /tmp/nix-ci-worker/stable-pwd/repo/
0.08 s
Cloning into '/tmp/nix-ci-worker/stable-pwd/repo'...
0.83 s
remote: Enumerating objects: 87950, done.
0.93 s
remote: Counting objects: 0% (1/10548)
remote: Counting objects: 1% (106/10548)
remote: Counting objects: 2% (211/10548)
remote: Counting objects: 3% (317/10548)
remote: Counting objects: 4% (422/10548)
remote: Counting objects: 5% (528/10548)
remote: Counting objects: 6% (633/10548)
remote: Counting objects: 7% (739/10548)
remote: Counting objects: 8% (844/10548)
remote: Counting objects: 9% (950/10548)
remote: Counting objects: 10% (1055/10548)
remote: Counting objects: 11% (1161/10548)
remote: Counting objects: 12% (1266/10548)
remote: Counting objects: 13% (1372/10548)
remote: Counting objects: 14% (1477/10548)
remote: Counting objects: 15% (1583/10548)
remote: Counting objects: 16% (1688/10548)
remote: Counting objects: 17% (1794/10548)
remote: Counting objects: 18% (1899/10548)
remote: Counting objects: 19% (2005/10548)
remote: Counting objects: 20% (2110/10548)
remote: Counting objects: 21% (2216/10548)
remote: Counting objects: 22% (2321/10548)
remote: Counting objects: 23% (2427/10548)
remote: Counting objects: 24% (2532/10548)
remote: Counting objects: 25% (2637/10548)
remote: Counting objects: 26% (2743/10548)
remote: Counting objects: 27% (2848/10548)
remote: Counting objects: 28% (2954/10548)
remote: Counting objects: 29% (3059/10548)
remote: Counting objects: 30% (3165/10548)
remote: Counting objects: 31% (3270/10548)
remote: Counting objects: 32% (3376/10548)
remote: Counting objects: 33% (3481/10548)
remote: Counting objects: 34% (3587/10548)
remote: Counting objects: 35% (3692/10548)
remote: Counting objects: 36% (3798/10548)
remote: Counting objects: 37% (3903/10548)
remote: Counting objects: 38% (4009/10548)
remote: Counting objects: 39% (4114/10548)
remote: Counting objects: 40% (4220/10548)
remote: Counting objects: 41% (4325/10548)
remote: Counting objects: 42% (4431/10548)
remote: Counting objects: 43% (4536/10548)
remote: Counting objects: 44% (4642/10548)
remote: Counting objects: 45% (4747/10548)
remote: Counting objects: 46% (4853/10548)
remote: Counting objects: 47% (4958/10548)
remote: Counting objects: 48% (5064/10548)
remote: Counting objects: 49% (5169/10548)
remote: Counting objects: 50% (5274/10548)
remote: Counting objects: 51% (5380/10548)
remote: Counting objects: 52% (5485/10548)
remote: Counting objects: 53% (5591/10548)
remote: Counting objects: 54% (5696/10548)
remote: Counting objects: 55% (5802/10548)
remote: Counting objects: 56% (5907/10548)
remote: Counting objects: 57% (6013/10548)
remote: Counting objects: 58% (6118/10548)
remote: Counting objects: 59% (6224/10548)
remote: Counting objects: 60% (6329/10548)
remote: Counting objects: 61% (6435/10548)
remote: Counting objects: 62% (6540/10548)
remote: Counting objects: 63% (6646/10548)
remote: Counting objects: 64% (6751/10548)
remote: Counting objects: 65% (6857/10548)
remote: Counting objects: 66% (6962/10548)
remote: Counting objects: 67% (7068/10548)
remote: Counting objects: 68% (7173/10548)
remote: Counting objects: 69% (7279/10548)
remote: Counting objects: 70% (7384/10548)
remote: Counting objects: 71% (7490/10548)
remote: Counting objects: 72% (7595/10548)
remote: Counting objects: 73% (7701/10548)
remote: Counting objects: 74% (7806/10548)
remote: Counting objects: 75% (7911/10548)
remote: Counting objects: 76% (8017/10548)
remote: Counting objects: 77% (8122/10548)
remote: Counting objects: 78% (8228/10548)
remote: Counting objects: 79% (8333/10548)
remote: Counting objects: 80% (8439/10548)
remote: Counting objects: 81% (8544/10548)
remote: Counting objects: 82% (8650/10548)
remote: Counting objects: 83% (8755/10548)
remote: Counting objects: 84% (8861/10548)
remote: Counting objects: 85% (8966/10548)
remote: Counting objects: 86% (9072/10548)
remote: Counting objects: 87% (9177/10548)
remote: Counting objects: 88% (9283/10548)
remote: Counting objects: 89% (9388/10548)
remote: Counting objects: 90% (9494/10548)
remote: Counting objects: 91% (9599/10548)
remote: Counting objects: 92% (9705/10548)
remote: Counting objects: 93% (9810/10548)
remote: Counting objects: 94% (9916/10548)
remote: Counting objects: 95% (10021/10548)
remote: Counting objects: 96% (10127/10548)
remote: Counting objects: 97% (10232/10548)
remote: Counting objects: 98% (10338/10548)
remote: Counting objects: 99% (10443/10548)
remote: Counting objects: 100% (10548/10548)
remote: Counting objects: 100% (10548/10548), done.
3.92 s
remote: Compressing objects: 0% (1/2960)
remote: Compressing objects: 1% (30/2960)
remote: Compressing objects: 2% (60/2960)
remote: Compressing objects: 3% (89/2960)
remote: Compressing objects: 4% (119/2960)
remote: Compressing objects: 5% (148/2960)
remote: Compressing objects: 6% (178/2960)
remote: Compressing objects: 7% (208/2960)
remote: Compressing objects: 8% (237/2960)
remote: Compressing objects: 9% (267/2960)
remote: Compressing objects: 10% (296/2960)
remote: Compressing objects: 11% (326/2960)
remote: Compressing objects: 12% (356/2960)
remote: Compressing objects: 13% (385/2960)
remote: Compressing objects: 14% (415/2960)
remote: Compressing objects: 15% (444/2960)
remote: Compressing objects: 15% (449/2960)
remote: Compressing objects: 16% (474/2960)
remote: Compressing objects: 17% (504/2960)
remote: Compressing objects: 18% (533/2960)
remote: Compressing objects: 19% (563/2960)
remote: Compressing objects: 20% (592/2960)
remote: Compressing objects: 21% (622/2960)
remote: Compressing objects: 22% (652/2960)
remote: Compressing objects: 23% (681/2960)
remote: Compressing objects: 24% (711/2960)
remote: Compressing objects: 25% (740/2960)
remote: Compressing objects: 26% (770/2960)
remote: Compressing objects: 26% (773/2960)
remote: Compressing objects: 27% (800/2960)
remote: Compressing objects: 28% (829/2960)
remote: Compressing objects: 29% (859/2960)
remote: Compressing objects: 30% (888/2960)
remote: Compressing objects: 31% (918/2960)
remote: Compressing objects: 32% (948/2960)
remote: Compressing objects: 33% (977/2960)
remote: Compressing objects: 34% (1007/2960)
remote: Compressing objects: 35% (1036/2960)
remote: Compressing objects: 36% (1066/2960)
remote: Compressing objects: 37% (1096/2960)
remote: Compressing objects: 38% (1125/2960)
remote: Compressing objects: 39% (1155/2960)
remote: Compressing objects: 40% (1184/2960)
remote: Compressing objects: 41% (1214/2960)
remote: Compressing objects: 41% (1225/2960)
remote: Compressing objects: 42% (1244/2960)
remote: Compressing objects: 43% (1273/2960)
remote: Compressing objects: 44% (1303/2960)
remote: Compressing objects: 45% (1332/2960)
remote: Compressing objects: 46% (1362/2960)
remote: Compressing objects: 47% (1392/2960)
remote: Compressing objects: 48% (1421/2960)
remote: Compressing objects: 49% (1451/2960)
remote: Compressing objects: 50% (1480/2960)
remote: Compressing objects: 51% (1510/2960)
remote: Compressing objects: 52% (1540/2960)
remote: Compressing objects: 53% (1569/2960)
remote: Compressing objects: 54% (1599/2960)
remote: Compressing objects: 55% (1628/2960)
remote: Compressing objects: 56% (1658/2960)
remote: Compressing objects: 57% (1688/2960)
remote: Compressing objects: 58% (1717/2960)
remote: Compressing objects: 59% (1747/2960)
remote: Compressing objects: 60% (1776/2960)
remote: Compressing objects: 61% (1806/2960)
remote: Compressing objects: 62% (1836/2960)
remote: Compressing objects: 63% (1865/2960)
remote: Compressing objects: 64% (1895/2960)
remote: Compressing objects: 65% (1924/2960)
remote: Compressing objects: 66% (1954/2960)
remote: Compressing objects: 67% (1984/2960)
remote: Compressing objects: 68% (2013/2960)
remote: Compressing objects: 69% (2043/2960)
remote: Compressing objects: 70% (2072/2960)
remote: Compressing objects: 71% (2102/2960)
remote: Compressing objects: 72% (2132/2960)
remote: Compressing objects: 73% (2161/2960)
remote: Compressing objects: 74% (2191/2960)
remote: Compressing objects: 75% (2220/2960)
remote: Compressing objects: 76% (2250/2960)
remote: Compressing objects: 77% (2280/2960)
remote: Compressing objects: 78% (2309/2960)
remote: Compressing objects: 79% (2339/2960)
remote: Compressing objects: 80% (2368/2960)
remote: Compressing objects: 81% (2398/2960)
remote: Compressing objects: 82% (2428/2960)
remote: Compressing objects: 83% (2457/2960)
remote: Compressing objects: 84% (2487/2960)
remote: Compressing objects: 85% (2516/2960)
remote: Compressing objects: 86% (2546/2960)
remote: Compressing objects: 87% (2576/2960)
remote: Compressing objects: 88% (2605/2960)
remote: Compressing objects: 89% (2635/2960)
remote: Compressing objects: 90% (2664/2960)
remote: Compressing objects: 91% (2694/2960)
remote: Compressing objects: 92% (2724/2960)
remote: Compressing objects: 93% (2753/2960)
remote: Compressing objects: 94% (2783/2960)
remote: Compressing objects: 95% (2812/2960)
remote: Compressing objects: 96% (2842/2960)
remote: Compressing objects: 97% (2872/2960)
remote: Compressing objects: 98% (2901/2960)
remote: Compressing objects: 99% (2931/2960)
remote: Compressing objects: 100% (2960/2960)
remote: Compressing objects: 100% (2960/2960), done.
9.37 s
Receiving objects: 0% (1/87950)
Receiving objects: 1% (880/87950)
Receiving objects: 2% (1759/87950)
Receiving objects: 3% (2639/87950)
Receiving objects: 4% (3518/87950)
Receiving objects: 5% (4398/87950)
Receiving objects: 6% (5277/87950)
Receiving objects: 7% (6157/87950)
Receiving objects: 8% (7036/87950)
Receiving objects: 9% (7916/87950), 13.97 MiB | 27.93 MiB/s
Receiving objects: 10% (8795/87950), 13.97 MiB | 27.93 MiB/s
Receiving objects: 11% (9675/87950), 13.97 MiB | 27.93 MiB/s
Receiving objects: 12% (10554/87950), 13.97 MiB | 27.93 MiB/s
Receiving objects: 13% (11434/87950), 13.97 MiB | 27.93 MiB/s
Receiving objects: 14% (12313/87950), 13.97 MiB | 27.93 MiB/s
Receiving objects: 15% (13193/87950), 13.97 MiB | 27.93 MiB/s
Receiving objects: 16% (14072/87950), 13.97 MiB | 27.93 MiB/s
Receiving objects: 17% (14952/87950), 13.97 MiB | 27.93 MiB/s
Receiving objects: 18% (15831/87950), 13.97 MiB | 27.93 MiB/s
Receiving objects: 19% (16711/87950), 13.97 MiB | 27.93 MiB/s
Receiving objects: 20% (17590/87950), 13.97 MiB | 27.93 MiB/s
Receiving objects: 21% (18470/87950), 13.97 MiB | 27.93 MiB/s
Receiving objects: 22% (19349/87950), 13.97 MiB | 27.93 MiB/s
Receiving objects: 23% (20229/87950), 13.97 MiB | 27.93 MiB/s
Receiving objects: 24% (21108/87950), 13.97 MiB | 27.93 MiB/s
Receiving objects: 25% (21988/87950), 13.97 MiB | 27.93 MiB/s
Receiving objects: 26% (22867/87950), 13.97 MiB | 27.93 MiB/s
Receiving objects: 27% (23747/87950), 13.97 MiB | 27.93 MiB/s
Receiving objects: 28% (24626/87950), 13.97 MiB | 27.93 MiB/s
Receiving objects: 29% (25506/87950), 13.97 MiB | 27.93 MiB/s
Receiving objects: 30% (26385/87950), 13.97 MiB | 27.93 MiB/s
Receiving objects: 31% (27265/87950), 13.97 MiB | 27.93 MiB/s
Receiving objects: 32% (28144/87950), 13.97 MiB | 27.93 MiB/s
Receiving objects: 33% (29024/87950), 13.97 MiB | 27.93 MiB/s
Receiving objects: 34% (29903/87950), 13.97 MiB | 27.93 MiB/s
Receiving objects: 35% (30783/87950), 13.97 MiB | 27.93 MiB/s
Receiving objects: 36% (31662/87950), 13.97 MiB | 27.93 MiB/s
Receiving objects: 37% (32542/87950), 13.97 MiB | 27.93 MiB/s
Receiving objects: 38% (33421/87950), 13.97 MiB | 27.93 MiB/s
Receiving objects: 39% (34301/87950), 13.97 MiB | 27.93 MiB/s
Receiving objects: 39% (34955/87950), 13.97 MiB | 27.93 MiB/s
Receiving objects: 40% (35180/87950), 36.76 MiB | 36.75 MiB/s
Receiving objects: 41% (36060/87950), 36.76 MiB | 36.75 MiB/s
Receiving objects: 42% (36939/87950), 36.76 MiB | 36.75 MiB/s
Receiving objects: 43% (37819/87950), 36.76 MiB | 36.75 MiB/s
Receiving objects: 44% (38698/87950), 36.76 MiB | 36.75 MiB/s
Receiving objects: 45% (39578/87950), 36.76 MiB | 36.75 MiB/s
Receiving objects: 46% (40457/87950), 36.76 MiB | 36.75 MiB/s
Receiving objects: 47% (41337/87950), 36.76 MiB | 36.75 MiB/s
Receiving objects: 48% (42216/87950), 36.76 MiB | 36.75 MiB/s
Receiving objects: 49% (43096/87950), 36.76 MiB | 36.75 MiB/s
Receiving objects: 50% (43975/87950), 36.76 MiB | 36.75 MiB/s
Receiving objects: 51% (44855/87950), 53.91 MiB | 35.93 MiB/s
Receiving objects: 52% (45734/87950), 53.91 MiB | 35.93 MiB/s
Receiving objects: 53% (46614/87950), 53.91 MiB | 35.93 MiB/s
Receiving objects: 54% (47493/87950), 53.91 MiB | 35.93 MiB/s
Receiving objects: 55% (48373/87950), 53.91 MiB | 35.93 MiB/s
Receiving objects: 56% (49252/87950), 53.91 MiB | 35.93 MiB/s
Receiving objects: 57% (50132/87950), 53.91 MiB | 35.93 MiB/s
Receiving objects: 57% (50451/87950), 71.17 MiB | 35.58 MiB/s
Receiving objects: 58% (51011/87950), 71.17 MiB | 35.58 MiB/s
Receiving objects: 59% (51891/87950), 71.17 MiB | 35.58 MiB/s
Receiving objects: 60% (52770/87950), 71.17 MiB | 35.58 MiB/s
Receiving objects: 61% (53650/87950), 71.17 MiB | 35.58 MiB/s
Receiving objects: 62% (54529/87950), 71.17 MiB | 35.58 MiB/s
Receiving objects: 63% (55409/87950), 71.17 MiB | 35.58 MiB/s
Receiving objects: 64% (56288/87950), 71.17 MiB | 35.58 MiB/s
Receiving objects: 65% (57168/87950), 71.17 MiB | 35.58 MiB/s
Receiving objects: 65% (57348/87950), 104.40 MiB | 34.80 MiB/s
Receiving objects: 66% (58047/87950), 104.40 MiB | 34.80 MiB/s
Receiving objects: 67% (58927/87950), 104.40 MiB | 34.80 MiB/s
Receiving objects: 68% (59806/87950), 104.40 MiB | 34.80 MiB/s
Receiving objects: 69% (60686/87950), 104.40 MiB | 34.80 MiB/s
Receiving objects: 70% (61565/87950), 104.40 MiB | 34.80 MiB/s
Receiving objects: 71% (62445/87950), 104.40 MiB | 34.80 MiB/s
Receiving objects: 72% (63324/87950), 116.37 MiB | 33.25 MiB/s
Receiving objects: 73% (64204/87950), 116.37 MiB | 33.25 MiB/s
Receiving objects: 74% (65083/87950), 116.37 MiB | 33.25 MiB/s
Receiving objects: 74% (65167/87950), 116.37 MiB | 33.25 MiB/s
Receiving objects: 75% (65963/87950), 132.00 MiB | 33.00 MiB/s
Receiving objects: 76% (66842/87950), 132.00 MiB | 33.00 MiB/s
Receiving objects: 77% (67722/87950), 132.00 MiB | 33.00 MiB/s
Receiving objects: 78% (68601/87950), 132.00 MiB | 33.00 MiB/s
Receiving objects: 79% (69481/87950), 132.00 MiB | 33.00 MiB/s
Receiving objects: 80% (70360/87950), 132.00 MiB | 33.00 MiB/s
Receiving objects: 81% (71240/87950), 132.00 MiB | 33.00 MiB/s
Receiving objects: 82% (72119/87950), 132.00 MiB | 33.00 MiB/s
Receiving objects: 83% (72999/87950), 132.00 MiB | 33.00 MiB/s
Receiving objects: 84% (73878/87950), 132.00 MiB | 33.00 MiB/s
Receiving objects: 85% (74758/87950), 145.57 MiB | 32.35 MiB/s
Receiving objects: 86% (75637/87950), 145.57 MiB | 32.35 MiB/s
Receiving objects: 87% (76517/87950), 145.57 MiB | 32.35 MiB/s
Receiving objects: 88% (77396/87950), 145.57 MiB | 32.35 MiB/s
Receiving objects: 89% (78276/87950), 145.57 MiB | 32.35 MiB/s
Receiving objects: 90% (79155/87950), 145.57 MiB | 32.35 MiB/s
Receiving objects: 91% (80035/87950), 145.57 MiB | 32.35 MiB/s
Receiving objects: 92% (80914/87950), 145.57 MiB | 32.35 MiB/s
Receiving objects: 93% (81794/87950), 145.57 MiB | 32.35 MiB/s
Receiving objects: 94% (82673/87950), 145.57 MiB | 32.35 MiB/s
Receiving objects: 95% (83553/87950), 145.57 MiB | 32.35 MiB/s
Receiving objects: 96% (84432/87950), 145.57 MiB | 32.35 MiB/s
Receiving objects: 97% (85312/87950), 145.57 MiB | 32.35 MiB/s
Receiving objects: 98% (86191/87950), 145.57 MiB | 32.35 MiB/s
Receiving objects: 98% (86345/87950), 145.57 MiB | 32.35 MiB/s
Receiving objects: 99% (87071/87950), 160.52 MiB | 32.56 MiB/s
remote: Total 87950 (delta 8613), reused 8357 (delta 7562), pack-reused 77402 (from 3)
9.37 s
Receiving objects: 100% (87950/87950), 160.52 MiB | 32.56 MiB/s
Receiving objects: 100% (87950/87950), 176.58 MiB | 32.45 MiB/s, done.
10.92 s
Resolving deltas: 0% (0/59478)
Resolving deltas: 1% (595/59478)
Resolving deltas: 2% (1190/59478)
Resolving deltas: 3% (1785/59478)
Resolving deltas: 4% (2381/59478)
Resolving deltas: 5% (2974/59478)
Resolving deltas: 6% (3569/59478)
Resolving deltas: 7% (4164/59478)
Resolving deltas: 8% (4760/59478)
Resolving deltas: 9% (5354/59478)
Resolving deltas: 10% (5948/59478)
Resolving deltas: 11% (6543/59478)
Resolving deltas: 12% (7138/59478)
Resolving deltas: 13% (7733/59478)
Resolving deltas: 14% (8329/59478)
Resolving deltas: 15% (8922/59478)
Resolving deltas: 16% (9518/59478)
Resolving deltas: 17% (10113/59478)
Resolving deltas: 18% (10708/59478)
Resolving deltas: 19% (11302/59478)
Resolving deltas: 20% (11896/59478)
Resolving deltas: 21% (12492/59478)
Resolving deltas: 22% (13086/59478)
Resolving deltas: 23% (13680/59478)
Resolving deltas: 24% (14275/59478)
Resolving deltas: 25% (14870/59478)
Resolving deltas: 26% (15465/59478)
Resolving deltas: 27% (16060/59478)
Resolving deltas: 28% (16654/59478)
Resolving deltas: 29% (17249/59478)
Resolving deltas: 30% (17844/59478)
Resolving deltas: 31% (18439/59478)
Resolving deltas: 32% (19033/59478)
Resolving deltas: 33% (19628/59478)
Resolving deltas: 34% (20223/59478)
Resolving deltas: 35% (20818/59478)
Resolving deltas: 36% (21416/59478)
Resolving deltas: 37% (22008/59478)
Resolving deltas: 38% (22602/59478)
Resolving deltas: 39% (23198/59478)
Resolving deltas: 40% (23792/59478)
Resolving deltas: 41% (24386/59478)
Resolving deltas: 42% (24981/59478)
Resolving deltas: 43% (25580/59478)
Resolving deltas: 44% (26171/59478)
Resolving deltas: 45% (26768/59478)
Resolving deltas: 46% (27360/59478)
Resolving deltas: 47% (27957/59478)
Resolving deltas: 48% (28551/59478)
Resolving deltas: 49% (29145/59478)
Resolving deltas: 50% (29739/59478)
Resolving deltas: 51% (30334/59478)
Resolving deltas: 52% (30929/59478)
Resolving deltas: 53% (31524/59478)
Resolving deltas: 54% (32119/59478)
Resolving deltas: 55% (32713/59478)
Resolving deltas: 56% (33309/59478)
Resolving deltas: 57% (33903/59478)
Resolving deltas: 58% (34498/59478)
Resolving deltas: 59% (35093/59478)
Resolving deltas: 60% (35687/59478)
Resolving deltas: 61% (36282/59478)
Resolving deltas: 62% (36877/59478)
Resolving deltas: 63% (37472/59478)
Resolving deltas: 64% (38066/59478)
Resolving deltas: 65% (38661/59478)
Resolving deltas: 65% (39247/59478)
Resolving deltas: 66% (39256/59478)
Resolving deltas: 67% (39851/59478)
Resolving deltas: 68% (40446/59478)
Resolving deltas: 69% (41040/59478)
Resolving deltas: 70% (41635/59478)
Resolving deltas: 71% (42230/59478)
Resolving deltas: 72% (42825/59478)
Resolving deltas: 73% (43419/59478)
Resolving deltas: 74% (44015/59478)
Resolving deltas: 75% (44609/59478)
Resolving deltas: 76% (45206/59478)
Resolving deltas: 77% (45801/59478)
Resolving deltas: 78% (46393/59478)
Resolving deltas: 79% (46988/59478)
Resolving deltas: 80% (47583/59478)
Resolving deltas: 81% (48178/59478)
Resolving deltas: 82% (48772/59478)
Resolving deltas: 83% (49367/59478)
Resolving deltas: 84% (49963/59478)
Resolving deltas: 85% (50557/59478)
Resolving deltas: 86% (51152/59478)
Resolving deltas: 87% (51746/59478)
Resolving deltas: 88% (52341/59478)
Resolving deltas: 89% (52937/59478)
Resolving deltas: 90% (53531/59478)
Resolving deltas: 91% (54125/59478)
Resolving deltas: 92% (54720/59478)
Resolving deltas: 93% (55315/59478)
Resolving deltas: 94% (55910/59478)
Resolving deltas: 95% (56505/59478)
Resolving deltas: 96% (57099/59478)
Resolving deltas: 97% (57696/59478)
Resolving deltas: 98% (58290/59478)
Resolving deltas: 99% (58884/59478)
Resolving deltas: 100% (59478/59478)
Resolving deltas: 100% (59478/59478), done.
11.48 s
Fetching commit 891dec7c25b5d9026c099da021ec7ae3b757dee9 for docs ...
11.48 s
$ /nix/store/bcnisk3ydfgv26v2gw3zlky24g00yww2-git-2.54.0/bin/git fetch origin 891dec7c25b5d9026c099da021ec7ae3b757dee9
11.98 s
From https://github.com/alphal00p/gammaloop
11.98 s
* branch 891dec7c25b5d9026c099da021ec7ae3b757dee9 -> FETCH_HEAD
12.00 s
$ /nix/store/9ypz3flqsrl5xl495mm8h645gadjsxi1-coreutils-9.11/bin/timeout --kill-after=15s 7200s /nix/store/bcnisk3ydfgv26v2gw3zlky24g00yww2-git-2.54.0/bin/git -c advice.detachedHead=false checkout 891dec7c25b5d9026c099da021ec7ae3b757dee9
12.40 s
HEAD is now at 891dec7c2 change photos
12.40 s
$ /nix/store/9ypz3flqsrl5xl495mm8h645gadjsxi1-coreutils-9.11/bin/timeout --kill-after=15s 7200s /nix/store/23zk8sgzamrbmj1fday15szf7f2279s8-nix-2.34.7/bin/nix --extra-experimental-features nix-command --extra-experimental-features flakes --log-format internal-json run .#packages.x86_64-linux.nix-ci-check-gammaloop-nextest-docs --print-build-logs
19.32 s
28.62 s
evaluating derivation 'g
copying '/nix/store/bgss
evaluating derivation 'g
copying '/nix/store/bgss
evaluating derivation 'g
copying '/nix/store/bgss
evaluating derivation 'g
copying '/nix/store/bgss
evaluating derivation 'g
copying '/nix/store/bgss
evaluating derivation 'g
copying '/nix/store/bgss
evaluating derivation 'g
[0 /1 built]
[1 /0 /1 built]
[1 /0 /1 built] building g gammaloop-nextest-docs> Extracting 2 binaries to /build/source
28.70 s
gammaloop-nextest-docs> Extracted 5 files to /build/source in 0.09s
28.72 s
gammaloop-nextest-docs> ------------
28.72 s
gammaloop-nextest-docs> Nextest run ID d79544b5-ac22-4bad-9353-3451cf10a614 with nextest profile: ci_gammaloop
28.72 s
gammaloop-nextest-docs> Starting 129 tests across 2 binaries
65.85 s
gammaloop-nextest-docs> FAIL [ 37.130s] (128/129) alphal00p-docs-builder provenance_tests :: each_build_captures_one_revision_before_rendering
65.85 s
gammaloop-nextest-docs> stdout ---
65.85 s
gammaloop-nextest-docs>
65.85 s
gammaloop-nextest-docs> running 1 test
65.85 s
gammaloop-nextest-docs>
65.85 s
gammaloop-nextest-docs> running 1 test
65.85 s
gammaloop-nextest-docs> test provenance_tests::each_build_captures_one_revision_before_rendering ... FAILED
65.85 s
gammaloop-nextest-docs>
65.85 s
gammaloop-nextest-docs> failures:
65.85 s
gammaloop-nextest-docs>
65.85 s
gammaloop-nextest-docs> failures:
65.85 s
gammaloop-nextest-docs> provenance_tests::each_build_captures_one_revision_before_rendering
65.85 s
gammaloop-nextest-docs>
65.85 s
gammaloop-nextest-docs> test result: FAILED. 0 passed; 1 failed; 0 ignored; 0 measured; 128 filtered out; finished in 37.05s
65.85 s
gammaloop-nextest-docs>
65.85 s
gammaloop-nextest-docs> test provenance_tests::each_build_captures_one_revision_before_rendering ... FAILED
65.85 s
gammaloop-nextest-docs>
65.85 s
gammaloop-nextest-docs> failures:
65.85 s
gammaloop-nextest-docs>
65.85 s
gammaloop-nextest-docs> failures:
65.85 s
gammaloop-nextest-docs> provenance_tests::each_build_captures_one_revision_before_rendering
65.85 s
gammaloop-nextest-docs>
65.85 s
gammaloop-nextest-docs> test result: FAILED. 0 passed; 1 failed; 0 ignored; 0 measured; 128 filtered out; finished in 37.12s
65.85 s
gammaloop-nextest-docs>
65.85 s
gammaloop-nextest-docs> stderr ---
65.85 s
gammaloop-nextest-docs> warning: bundle export is experimental
65.85 s
gammaloop-nextest-docs> = hint: its behaviour may change at any time
65.85 s
gammaloop-nextest-docs> = hint: do not rely on this feature for production use cases
65.85 s
gammaloop-nextest-docs>
65.85 s
gammaloop-nextest-docs> warning: unknown font family: roboto
65.85 s
gammaloop-nextest-docs> ┌─ crates/linnest/typst/docs/manual.typ:11:28
65.85 s
gammaloop-nextest-docs> │
65.85 s
gammaloop-nextest-docs> 11 │ #set text(size: 10pt, font: "Roboto")
65.85 s
gammaloop-nextest-docs> │ ^^^^^^^^
65.85 s
gammaloop-nextest-docs>
65.85 s
gammaloop-nextest-docs> warning: unknown font family: roboto
65.85 s
gammaloop-nextest-docs> ┌─ crates/linnest/typst/docs/manual.typ:14:29
65.85 s
gammaloop-nextest-docs> │
65.85 s
gammaloop-nextest-docs> 14 │ #set text(size: 3em, font: "Roboto")
65.85 s
gammaloop-nextest-docs> │ ^^^^^^^^
65.85 s
gammaloop-nextest-docs>
65.85 s
gammaloop-nextest-docs> warning: unknown font family: roboto
65.85 s
gammaloop-nextest-docs> ┌─ crates/linnest/typst/docs/manual.typ:16:31
65.85 s
gammaloop-nextest-docs> │
65.85 s
gammaloop-nextest-docs> 16 │ #set text(size: 0.3em, font: "Roboto")
65.85 s
gammaloop-nextest-docs> │ ^^^^^^^^
65.85 s
gammaloop-nextest-docs>
65.85 s
gammaloop-nextest-docs> warning: overline was ignored during MathML export
65.85 s
gammaloop-nextest-docs> ┌─ crates/linnest/typst/docs/manual.typ:949:55
65.85 s
gammaloop-nextest-docs> │
65.85 s
gammaloop-nextest-docs> 949 │ + sum_("dangling" e) c_("dangling-centroid") / (d(e, overline(v)) + epsilon)
65.85 s
gammaloop-nextest-docs> │ ^^^^^^^^^^^
65.85 s
gammaloop-nextest-docs>
65.85 s
gammaloop-nextest-docs> warning: overline was ignored during MathML export
65.85 s
gammaloop-nextest-docs> ┌─ crates/linnest/typst/docs/manual.typ:953:8
65.85 s
gammaloop-nextest-docs> │
65.85 s
gammaloop-nextest-docs> 953 │ Here $overline(v)$ is the mean node position. The centroid term pushes every
65.85 s
gammaloop-nextest-docs> │ ^^^^^^^^^^^
65.85 s
gammaloop-nextest-docs>
65.85 s
gammaloop-nextest-docs>
65.85 s
gammaloop-nextest-docs> thread 'provenance_tests::each_build_captures_one_revision_before_rendering' (231) panicked at crates/alphal00p-docs-builder/src/provenance_tests.rs:297:14:
65.85 s
gammaloop-nextest-docs> called `Result::unwrap()` on an `Err` value: generated site has broken links:
65.85 s
gammaloop-nextest-docs> products/linnet/latest/reference/interfaces/index.html -> https://github.com/alphal00p/gammaloop/blob/1111111111111111111111111111111111111111/crates/linnet-py/examples/physics_render_settings.py (missing repository source file crates/linnet-py/examples/physics_render_settings.py)
65.85 s
gammaloop-nextest-docs> products/linnet/latest/reference/interfaces/index.html -> https://github.com/alphal00p/gammaloop/blob/1111111111111111111111111111111111111111/crates/linnet-py/examples/layout_stream.py (missing repository source file crates/linnet-py/examples/layout_stream.py)
65.85 s
gammaloop-nextest-docs> products/linnet/latest/playground/index.html -> https://github.com/alphal00p/gammaloop/blob/1111111111111111111111111111111111111111/crates/linnet-py/examples/layout_stream.py (missing repository source file crates/linnet-py/examples/layout_stream.py)
65.85 s
gammaloop-nextest-docs> products/linnet/latest/guides/python-rendering/index.html -> https://github.com/alphal00p/gammaloop/blob/1111111111111111111111111111111111111111/crates/linnet-py/examples/rendering_api.py (missing repository source file crates/linnet-py/examples/rendering_api.py)
65.85 s
gammaloop-nextest-docs>
65.85 s
gammaloop-nextest-docs> Location:
65.85 s
gammaloop-nextest-docs> crates/alphal00p-docs-builder/src/lib.rs:4940:9
65.85 s
gammaloop-nextest-docs> stack backtrace:
65.85 s
gammaloop-nextest-docs> 0: __rustc::rust_begin_unwind
65.85 s
gammaloop-nextest-docs> 1: core::panicking::panic_fmt
65.85 s
gammaloop-nextest-docs> 2: core::result::unwrap_failed
65.85 s
gammaloop-nextest-docs> 3: alphal00p_docs_builder::provenance_tests::each_build_captures_one_revision_before_rendering
65.85 s
gammaloop-nextest-docs> 4: <alphal00p_docs_builder::provenance_tests::each_build_captures_one_revision_before_rendering::{closure#0} as core::ops::function::FnOnce<()>>::call_once
65.85 s
gammaloop-nextest-docs> note: Some details are omitted, run with `RUST_BACKTRACE=full` for a verbose backtrace.
65.85 s
gammaloop-nextest-docs>
65.85 s
gammaloop-nextest-docs> thread 'provenance_tests::each_build_captures_one_revision_before_rendering' (191) panicked at crates/alphal00p-docs-builder/src/provenance_tests.rs:274:9:
65.85 s
gammaloop-nextest-docs> assertion failed: command.status().unwrap().success()
65.85 s
gammaloop-nextest-docs> stack backtrace:
65.85 s
gammaloop-nextest-docs> 0: __rustc::rust_begin_unwind
65.85 s
gammaloop-nextest-docs> 1: core::panicking::panic_fmt
65.85 s
gammaloop-nextest-docs> 2: core::panicking::panic
65.85 s
gammaloop-nextest-docs> 3: alphal00p_docs_builder::provenance_tests::each_build_captures_one_revision_before_rendering
65.85 s
gammaloop-nextest-docs> 4: <alphal00p_docs_builder::provenance_tests::each_build_captures_one_revision_before_rendering::{closure#0} as core::ops::function::FnOnce<()>>::call_once
65.85 s
gammaloop-nextest-docs> note: Some details are omitted, run with `RUST_BACKTRACE=full` for a verbose backtrace.
65.85 s
gammaloop-nextest-docs>
72.69 s
gammaloop-nextest-docs> ------------
72.69 s
gammaloop-nextest-docs> Summary [ 43.971s] 129 tests run: 128 passed , 1 failed , 0 skipped
72.69 s
gammaloop-nextest-docs> FAIL [ 37.130s] (128/129) alphal00p-docs-builder provenance_tests :: each_build_captures_one_revision_before_rendering
72.69 s
gammaloop-nextest-docs> stdout ---
72.69 s
gammaloop-nextest-docs>
72.69 s
gammaloop-nextest-docs> running 1 test
72.69 s
gammaloop-nextest-docs>
72.69 s
gammaloop-nextest-docs> running 1 test
72.69 s
gammaloop-nextest-docs> test provenance_tests::each_build_captures_one_revision_before_rendering ... FAILED
72.69 s
gammaloop-nextest-docs>
72.69 s
gammaloop-nextest-docs> failures:
72.69 s
gammaloop-nextest-docs>
72.69 s
gammaloop-nextest-docs> failures:
72.69 s
gammaloop-nextest-docs> provenance_tests::each_build_captures_one_revision_before_rendering
72.69 s
gammaloop-nextest-docs>
72.69 s
gammaloop-nextest-docs> test result: FAILED. 0 passed; 1 failed; 0 ignored; 0 measured; 128 filtered out; finished in 37.05s
72.69 s
gammaloop-nextest-docs>
72.69 s
gammaloop-nextest-docs> test provenance_tests::each_build_captures_one_revision_before_rendering ... FAILED
72.69 s
gammaloop-nextest-docs>
72.69 s
gammaloop-nextest-docs> failures:
72.69 s
gammaloop-nextest-docs>
72.69 s
gammaloop-nextest-docs> failures:
72.69 s
gammaloop-nextest-docs> provenance_tests::each_build_captures_one_revision_before_rendering
72.69 s
gammaloop-nextest-docs>
72.69 s
gammaloop-nextest-docs> test result: FAILED. 0 passed; 1 failed; 0 ignored; 0 measured; 128 filtered out; finished in 37.12s
72.69 s
gammaloop-nextest-docs>
72.69 s
gammaloop-nextest-docs> stderr ---
72.69 s
gammaloop-nextest-docs> warning: bundle export is experimental
72.69 s
gammaloop-nextest-docs> = hint: its behaviour may change at any time
72.69 s
gammaloop-nextest-docs> = hint: do not rely on this feature for production use cases
72.69 s
gammaloop-nextest-docs>
72.69 s
gammaloop-nextest-docs> warning: unknown font family: roboto
72.69 s
gammaloop-nextest-docs> ┌─ crates/linnest/typst/docs/manual.typ:11:28
72.69 s
gammaloop-nextest-docs> │
72.69 s
gammaloop-nextest-docs> 11 │ #set text(size: 10pt, font: "Roboto")
72.69 s
gammaloop-nextest-docs> │ ^^^^^^^^
72.69 s
gammaloop-nextest-docs>
72.69 s
gammaloop-nextest-docs> warning: unknown font family: roboto
72.69 s
gammaloop-nextest-docs> ┌─ crates/linnest/typst/docs/manual.typ:14:29
72.69 s
gammaloop-nextest-docs> │
72.69 s
gammaloop-nextest-docs> 14 │ #set text(size: 3em, font: "Roboto")
72.69 s
gammaloop-nextest-docs> │ ^^^^^^^^
72.69 s
gammaloop-nextest-docs>
72.69 s
gammaloop-nextest-docs> warning: unknown font family: roboto
72.69 s
gammaloop-nextest-docs> ┌─ crates/linnest/typst/docs/manual.typ:16:31
72.69 s
gammaloop-nextest-docs> │
72.69 s
gammaloop-nextest-docs> 16 │ #set text(size: 0.3em, font: "Roboto")
72.69 s
gammaloop-nextest-docs> │ ^^^^^^^^
72.69 s
gammaloop-nextest-docs>
72.69 s
gammaloop-nextest-docs> warning: overline was ignored during MathML export
72.69 s
gammaloop-nextest-docs> ┌─ crates/linnest/typst/docs/manual.typ:949:55
72.69 s
gammaloop-nextest-docs> │
72.69 s
gammaloop-nextest-docs> 949 │ + sum_("dangling" e) c_("dangling-centroid") / (d(e, overline(v)) + epsilon)
72.69 s
gammaloop-nextest-docs> │ ^^^^^^^^^^^
72.69 s
gammaloop-nextest-docs>
72.69 s
gammaloop-nextest-docs> warning: overline was ignored during MathML export
72.69 s
gammaloop-nextest-docs> ┌─ crates/linnest/typst/docs/manual.typ:953:8
72.69 s
gammaloop-nextest-docs> │
72.69 s
gammaloop-nextest-docs> 953 │ Here $overline(v)$ is the mean node position. The centroid term pushes every
72.69 s
gammaloop-nextest-docs> │ ^^^^^^^^^^^
72.69 s
gammaloop-nextest-docs>
72.69 s
gammaloop-nextest-docs>
72.69 s
gammaloop-nextest-docs> thread 'provenance_tests::each_build_captures_one_revision_before_rendering' (231) panicked at crates/alphal00p-docs-builder/src/provenance_tests.rs:297:14:
72.69 s
gammaloop-nextest-docs> called `Result::unwrap()` on an `Err` value: generated site has broken links:
72.69 s
gammaloop-nextest-docs> products/linnet/latest/reference/interfaces/index.html -> https://github.com/alphal00p/gammaloop/blob/1111111111111111111111111111111111111111/crates/linnet-py/examples/physics_render_settings.py (missing repository source file crates/linnet-py/examples/physics_render_settings.py)
72.69 s
gammaloop-nextest-docs> products/linnet/latest/reference/interfaces/index.html -> https://github.com/alphal00p/gammaloop/blob/1111111111111111111111111111111111111111/crates/linnet-py/examples/layout_stream.py (missing repository source file crates/linnet-py/examples/layout_stream.py)
72.69 s
gammaloop-nextest-docs> products/linnet/latest/playground/index.html -> https://github.com/alphal00p/gammaloop/blob/1111111111111111111111111111111111111111/crates/linnet-py/examples/layout_stream.py (missing repository source file crates/linnet-py/examples/layout_stream.py)
72.69 s
gammaloop-nextest-docs> products/linnet/latest/guides/python-rendering/index.html -> https://github.com/alphal00p/gammaloop/blob/1111111111111111111111111111111111111111/crates/linnet-py/examples/rendering_api.py (missing repository source file crates/linnet-py/examples/rendering_api.py)
72.69 s
gammaloop-nextest-docs>
72.69 s
gammaloop-nextest-docs> Location:
72.69 s
gammaloop-nextest-docs> crates/alphal00p-docs-builder/src/lib.rs:4940:9
72.69 s
gammaloop-nextest-docs> stack backtrace:
72.69 s
gammaloop-nextest-docs> 0: __rustc::rust_begin_unwind
72.69 s
gammaloop-nextest-docs> 1: core::panicking::panic_fmt
72.69 s
gammaloop-nextest-docs> 2: core::result::unwrap_failed
72.69 s
gammaloop-nextest-docs> 3: alphal00p_docs_builder::provenance_tests::each_build_captures_one_revision_before_rendering
72.69 s
gammaloop-nextest-docs> 4: <alphal00p_docs_builder::provenance_tests::each_build_captures_one_revision_before_rendering::{closure#0} as core::ops::function::FnOnce<()>>::call_once
72.69 s
gammaloop-nextest-docs> note: Some details are omitted, run with `RUST_BACKTRACE=full` for a verbose backtrace.
72.69 s
gammaloop-nextest-docs>
72.69 s
gammaloop-nextest-docs> thread 'provenance_tests::each_build_captures_one_revision_before_rendering' (191) panicked at crates/alphal00p-docs-builder/src/provenance_tests.rs:274:9:
72.69 s
gammaloop-nextest-docs> assertion failed: command.status().unwrap().success()
72.69 s
gammaloop-nextest-docs> stack backtrace:
72.69 s
gammaloop-nextest-docs> 0: __rustc::rust_begin_unwind
72.69 s
gammaloop-nextest-docs> 1: core::panicking::panic_fmt
72.69 s
gammaloop-nextest-docs> 2: core::panicking::panic
72.69 s
gammaloop-nextest-docs> 3: alphal00p_docs_builder::provenance_tests::each_build_captures_one_revision_before_rendering
72.69 s
gammaloop-nextest-docs> 4: <alphal00p_docs_builder::provenance_tests::each_build_captures_one_revision_before_rendering::{closure#0} as core::ops::function::FnOnce<()>>::call_once
72.69 s
gammaloop-nextest-docs> note: Some details are omitted, run with `RUST_BACKTRACE=full` for a verbose backtrace.
72.69 s
gammaloop-nextest-docs>
72.69 s
gammaloop-nextest-docs> error : test run failed
72.72 s
gammaloop-nextest-docs>
72.72 s
gammaloop-nextest-docs> ========== nextest test summary ==========
72.72 s
gammaloop-nextest-docs> report: target/nextest/ci_gammaloop/junit.xml
72.72 s
gammaloop-nextest-docs> tests: 129, failures: 1, errors: 0
72.72 s
gammaloop-nextest-docs>
72.72 s
gammaloop-nextest-docs> 1. alphal00p-docs-builder::provenance_tests::each_build_captures_one_revision_before_rendering
72.72 s
gammaloop-nextest-docs> failure: test failure with exit code 101
72.72 s
gammaloop-nextest-docs> thread 'provenance_tests::each_build_captures_one_revision_before_rendering' (191) panicked at crates/alphal00p-docs-builder/src/provenance_tests.rs:274:9:
72.72 s
gammaloop-nextest-docs> assertion failed: command.status().unwrap().success()
72.72 s
gammaloop-nextest-docs> stack backtrace:
72.72 s
gammaloop-nextest-docs> 0: __rustc::rust_begin_unwind
72.72 s
gammaloop-nextest-docs> 1: core::panicking::panic_fmt
72.72 s
gammaloop-nextest-docs> 2: core::panicking::panic
72.72 s
gammaloop-nextest-docs> 3: alphal00p_docs_builder::provenance_tests::each_build_captures_one_revision_before_rendering
72.72 s
gammaloop-nextest-docs> 4: <alphal00p_docs_builder::provenance_tests::each_build_captures_one_revision_before_rendering::{closure#0} as core::ops::function::FnOnce<()>>::call_once
72.72 s
gammaloop-nextest-docs> note: Some details are omitted, run with `RUST_BACKTRACE=full` for a verbose backtrace.
72.72 s
gammaloop-nextest-docs> system-out
72.72 s
gammaloop-nextest-docs> running 1 test
72.72 s
gammaloop-nextest-docs>
72.72 s
gammaloop-nextest-docs> running 1 test
72.72 s
gammaloop-nextest-docs> test provenance_tests::each_build_captures_one_revision_before_rendering ... FAILED
72.72 s
gammaloop-nextest-docs>
72.72 s
gammaloop-nextest-docs> failures:
72.72 s
gammaloop-nextest-docs>
72.72 s
gammaloop-nextest-docs> failures:
72.72 s
gammaloop-nextest-docs> provenance_tests::each_build_captures_one_revision_before_rendering
72.72 s
gammaloop-nextest-docs>
72.72 s
gammaloop-nextest-docs> test result: FAILED. 0 passed; 1 failed; 0 ignored; 0 measured; 128 filtered out; finished in 37.05s
72.72 s
gammaloop-nextest-docs>
72.72 s
gammaloop-nextest-docs> test provenance_tests::each_build_captures_one_revision_before_rendering ... FAILED
72.72 s
gammaloop-nextest-docs>
72.72 s
gammaloop-nextest-docs> failures:
72.72 s
gammaloop-nextest-docs>
72.72 s
gammaloop-nextest-docs> failures:
72.72 s
gammaloop-nextest-docs> provenance_tests::each_build_captures_one_revision_before_rendering
72.72 s
gammaloop-nextest-docs>
72.72 s
gammaloop-nextest-docs> test result: FAILED. 0 passed; 1 failed; 0 ignored; 0 measured; 128 filtered out; finished in 37.12s
72.72 s
gammaloop-nextest-docs> system-err
72.72 s
gammaloop-nextest-docs> warning: bundle export is experimental
72.72 s
gammaloop-nextest-docs> = hint: its behaviour may change at any time
72.72 s
gammaloop-nextest-docs> = hint: do not rely on this feature for production use cases
72.72 s
gammaloop-nextest-docs>
72.72 s
gammaloop-nextest-docs> warning: unknown font family: roboto
72.72 s
gammaloop-nextest-docs> ┌─ crates/linnest/typst/docs/manual.typ:11:28
72.72 s
gammaloop-nextest-docs> │
72.72 s
gammaloop-nextest-docs> 11 │ #set text(size: 10pt, font: "Roboto")
72.72 s
gammaloop-nextest-docs> │ ^^^^^^^^
72.72 s
gammaloop-nextest-docs>
72.72 s
gammaloop-nextest-docs> warning: unknown font family: roboto
72.72 s
gammaloop-nextest-docs> ┌─ crates/linnest/typst/docs/manual.typ:14:29
72.72 s
gammaloop-nextest-docs> │
72.72 s
gammaloop-nextest-docs> 14 │ #set text(size: 3em, font: "Roboto")
72.72 s
gammaloop-nextest-docs> │ ^^^^^^^^
72.72 s
gammaloop-nextest-docs>
72.72 s
gammaloop-nextest-docs> warning: unknown font family: roboto
72.72 s
gammaloop-nextest-docs> ┌─ crates/linnest/typst/docs/manual.typ:16:31
72.72 s
gammaloop-nextest-docs> │
72.72 s
gammaloop-nextest-docs> 16 │ #set text(size: 0.3em, font: "Roboto")
72.72 s
gammaloop-nextest-docs> │ ^^^^^^^^
72.72 s
gammaloop-nextest-docs>
72.72 s
gammaloop-nextest-docs> warning: overline was ignored during MathML export
72.72 s
gammaloop-nextest-docs> ┌─ crates/linnest/typst/docs/manual.typ:949:55
72.72 s
gammaloop-nextest-docs> │
72.72 s
gammaloop-nextest-docs> 949 │ + sum_("dangling" e) c_("dangling-centroid") / (d(e, overline(v)) + epsilon)
72.72 s
gammaloop-nextest-docs> │ ^^^^^^^^^^^
72.72 s
gammaloop-nextest-docs>
72.72 s
gammaloop-nextest-docs> warning: overline was ignored during MathML export
72.72 s
gammaloop-nextest-docs> ┌─ crates/linnest/typst/docs/manual.typ:953:8
72.72 s
gammaloop-nextest-docs> │
72.72 s
gammaloop-nextest-docs> 953 │ Here $overline(v)$ is the mean node position. The centroid term pushes every
72.72 s
gammaloop-nextest-docs> │ ^^^^^^^^^^^
72.72 s
gammaloop-nextest-docs>
72.72 s
gammaloop-nextest-docs>
72.72 s
gammaloop-nextest-docs> thread 'provenance_tests::each_build_captures_one_revision_before_rendering' (231) panicked at crates/alphal00p-docs-builder/src/provenance_tests.rs:297:14:
72.72 s
gammaloop-nextest-docs> called `Result::unwrap()` on an `Err` value: generated site has broken links:
72.72 s
gammaloop-nextest-docs> products/linnet/latest/reference/interfaces/index.html -> https://github.com/alphal00p/gammaloop/blob/1111111111111111111111111111111111111111/crates/linnet-py/examples/physics_render_settings.py (missing repository source file crates/linnet-py/examples/physics_render_settings.py)
72.73 s
gammaloop-nextest-docs> products/linnet/latest/reference/interfaces/index.html -> https://github.com/alphal00p/gammaloop/blob/1111111111111111111111111111111111111111/crates/linnet-py/examples/layout_stream.py (missing repository source file crates/linnet-py/examples/layout_stream.py)
72.73 s
gammaloop-nextest-docs> products/linnet/latest/playground/index.html -> https://github.com/alphal00p/gammaloop/blob/1111111111111111111111111111111111111111/crates/linnet-py/examples/layout_stream.py (missing repository source file crates/linnet-py/examples/layout_stream.py)
72.73 s
gammaloop-nextest-docs> products/linnet/latest/guides/python-rendering/index.html -> https://github.com/alphal00p/gammaloop/blob/1111111111111111111111111111111111111111/crates/linnet-py/examples/rendering_api.py (missing repository source file crates/linnet-py/examples/rendering_api.py)
72.73 s
gammaloop-nextest-docs>
72.73 s
gammaloop-nextest-docs> Location:
72.73 s
gammaloop-nextest-docs> crates/alphal00p-docs-builder/src/lib.rs:4940:9
72.73 s
gammaloop-nextest-docs> stack backtrace:
72.73 s
gammaloop-nextest-docs> 0: __rustc::rust_begin_unwind
72.73 s
gammaloop-nextest-docs> 1: core::panicking::panic_fmt
72.73 s
gammaloop-nextest-docs> 2: core::result::unwrap_failed
72.73 s
gammaloop-nextest-docs> 3: alphal00p_docs_builder::provenance_tests::each_build_captures_one_revision_before_rendering
72.73 s
gammaloop-nextest-docs> 4: <alphal00p_docs_builder::provenance_tests::each_build_captures_one_revision_before_rendering::{closure#0} as core::ops::function::FnOnce<()>>::call_once
72.73 s
gammaloop-nextest-docs> note: Some details are omitted, run with `RUST_BACKTRACE=full` for a verbose backtrace.
72.73 s
gammaloop-nextest-docs>
72.73 s
gammaloop-nextest-docs> thread 'provenance_tests::each_build_captures_one_revision_before_rendering' (191) panicked at crates/alphal00p-docs-builder/src/provenance_tests.rs:274:9:
72.73 s
gammaloop-nextest-docs> assertion failed: command.status().unwrap().success()
72.73 s
gammaloop-nextest-docs> stack backtrace:
72.73 s
gammaloop-nextest-docs> 0: __rustc::rust_begin_unwind
72.73 s
gammaloop-nextest-docs> 1: core::panicking::panic_fmt
72.73 s
gammaloop-nextest-docs> 2: core::panicking::panic
72.73 s
gammaloop-nextest-docs> 3: alphal00p_docs_builder::provenance_tests::each_build_captures_one_revision_before_rendering
72.73 s
gammaloop-nextest-docs> 4: <alphal00p_docs_builder::provenance_tests::each_build_captures_one_revision_before_rendering::{closure#0} as core::ops::function::FnOnce<()>>::call_once
72.73 s
gammaloop-nextest-docs> note: Some details are omitted, run with `RUST_BACKTRACE=full` for a verbose backtrace.
72.73 s
gammaloop-nextest-docs> =========================================
72.74 s
gammaloop-nextest-docs> Extracting 2 binaries to /build/source
72.78 s
gammaloop-nextest-docs> Extracted 5 files to /build/source in 0.04s
72.79 s
gammaloop-nextest-docs> ------------
72.79 s
gammaloop-nextest-docs> Nextest run ID 914177fb-bf7e-4474-8ad6-3e4e5dedec49 with nextest profile: ci_gammaloop
72.79 s
gammaloop-nextest-docs> Starting 22 tests across 2 binaries
72.81 s
gammaloop-nextest-docs> ------------
72.81 s
gammaloop-nextest-docs> Summary [ 0.018s] 22 tests run: 22 passed , 0 skipped
72.85 s
gammaloop-nextest-docs>
72.85 s
gammaloop-nextest-docs> ========== nextest test summary ==========
72.85 s
gammaloop-nextest-docs> report: target/nextest/ci_gammaloop/junit.xml
72.85 s
gammaloop-nextest-docs> tests: 22, failures: 0, errors: 0
72.85 s
gammaloop-nextest-docs> No failing testcases found.
72.85 s
gammaloop-nextest-docs> =========================================
72.87 s
gammaloop-nextest-docs> Extracting 3 binaries (including 2 non-test binaries), 1 build script output directory, and 2 linked paths to /build/source
73.15 s
gammaloop-nextest-docs> Extracted 22 files to /build/source in 0.28s
73.16 s
gammaloop-nextest-docs> ------------
73.16 s
gammaloop-nextest-docs> Nextest run ID 26be5934-c657-482d-a987-5ba714b6b925 with nextest profile: ci_gammaloop
73.16 s
gammaloop-nextest-docs> Starting 89 tests across 1 binary
73.20 s
gammaloop-nextest-docs> ------------
73.20 s
gammaloop-nextest-docs> Summary [ 0.041s] 89 tests run: 89 passed , 0 skipped
73.23 s
gammaloop-nextest-docs>
73.23 s
gammaloop-nextest-docs> ========== nextest test summary ==========
73.23 s
gammaloop-nextest-docs> report: target/nextest/ci_gammaloop/junit.xml
73.23 s
gammaloop-nextest-docs> tests: 89, failures: 0, errors: 0
73.23 s
gammaloop-nextest-docs> No failing testcases found.
73.23 s
gammaloop-nextest-docs> =========================================
73.25 s
gammaloop-nextest-docs> Extracting 2 binaries to /build/source
73.29 s
gammaloop-nextest-docs> Extracted 5 files to /build/source in 0.05s
73.30 s
gammaloop-nextest-docs> ------------
73.30 s
gammaloop-nextest-docs> Nextest run ID 938aabdb-ba51-4988-b34a-221516f60b0c with nextest profile: ci_gammaloop
73.30 s
gammaloop-nextest-docs> Starting 10 tests across 2 binaries
87.17 s
gammaloop-nextest-docs> ------------
87.17 s
gammaloop-nextest-docs> Summary [ 13.869s] 10 tests run: 10 passed , 0 skipped
87.20 s
gammaloop-nextest-docs>
87.20 s
gammaloop-nextest-docs> ========== nextest test summary ==========
87.20 s
gammaloop-nextest-docs> report: target/nextest/ci_gammaloop/junit.xml
87.20 s
gammaloop-nextest-docs> tests: 10, failures: 0, errors: 0
87.20 s
gammaloop-nextest-docs> No failing testcases found.
87.20 s
gammaloop-nextest-docs> =========================================
87.21 s
gammaloop-nextest-docs> Extracting 1 binary to /build/source
87.25 s
gammaloop-nextest-docs> Extracted 4 files to /build/source in 0.04s
87.26 s
gammaloop-nextest-docs> ------------
87.26 s
gammaloop-nextest-docs> Nextest run ID 15453a0e-968a-47d0-9371-4f77dc8e9777 with nextest profile: ci_gammaloop
87.26 s
gammaloop-nextest-docs> Starting 0 tests across 1 binary
87.26 s
gammaloop-nextest-docs> ------------
87.26 s
gammaloop-nextest-docs> Summary [ 0.000s] 0 tests run: 0 passed , 0 skipped
87.29 s
gammaloop-nextest-docs>
87.29 s
gammaloop-nextest-docs> ========== nextest test summary ==========
87.29 s
gammaloop-nextest-docs> report: target/nextest/ci_gammaloop/junit.xml
87.29 s
gammaloop-nextest-docs> tests: 0, failures: 0, errors: 0
87.29 s
gammaloop-nextest-docs> No failing testcases found.
87.29 s
gammaloop-nextest-docs> =========================================
87.30 s
gammaloop-nextest-docs> Extracting 1 binary to /build/source
87.33 s
gammaloop-nextest-docs> Extracted 4 files to /build/source in 0.04s
87.34 s
gammaloop-nextest-docs> ------------
87.34 s
gammaloop-nextest-docs> Nextest run ID a88f4f5e-327e-4b6f-92b7-2a3ce444dbb8 with nextest profile: ci_gammaloop
87.34 s
gammaloop-nextest-docs> Starting 5 tests across 1 binary
87.35 s
gammaloop-nextest-docs> ------------
87.35 s
gammaloop-nextest-docs> Summary [ 0.006s] 5 tests run: 5 passed , 0 skipped
87.38 s
gammaloop-nextest-docs>
87.38 s
gammaloop-nextest-docs> ========== nextest test summary ==========
87.38 s
gammaloop-nextest-docs> report: target/nextest/ci_gammaloop/junit.xml
87.38 s
gammaloop-nextest-docs> tests: 5, failures: 0, errors: 0
87.38 s
gammaloop-nextest-docs> No failing testcases found.
87.38 s
gammaloop-nextest-docs> =========================================
87.59 s
error: Cannot build '/nix/store/9rs74w2crrwhaq7f0dxdi11wd515i6dj-gammaloop-nextest-docs.drv '.
87.59 s
Reason: builder failed with exit code 100 .
87.59 s
Output paths:
87.59 s
/nix/store/1jyipvscqlj4v0h7qjznydlgdlc4bjy7-gammaloop-nextest-docs
87.59 s
Last 347 log lines:
87.59 s
> Extracting 2 binaries to /build/source
87.59 s
> Extracted 5 files to /build/source in 0.09s
87.59 s
> ------------
87.59 s
> Nextest run ID d79544b5-ac22-4bad-9353-3451cf10a614 with nextest profile: ci_gammaloop
87.59 s
> Starting 129 tests across 2 binaries
87.59 s
> FAIL [ 37.130s] (128/129) alphal00p-docs-builder provenance_tests :: each_build_captures_one_revision_before_rendering
87.59 s
> stdout ---
87.59 s
>
87.59 s
> running 1 test
87.59 s
>
87.59 s
> running 1 test
87.59 s
> test provenance_tests::each_build_captures_one_revision_before_rendering ... FAILED
87.59 s
>
87.59 s
> failures:
87.59 s
>
87.59 s
> failures:
87.59 s
> provenance_tests::each_build_captures_one_revision_before_rendering
87.59 s
>
87.59 s
> test result: FAILED. 0 passed; 1 failed; 0 ignored; 0 measured; 128 filtered out; finished in 37.05s
87.59 s
>
87.59 s
> test provenance_tests::each_build_captures_one_revision_before_rendering ... FAILED
87.59 s
>
87.59 s
> failures:
87.59 s
>
87.59 s
> failures:
87.59 s
> provenance_tests::each_build_captures_one_revision_before_rendering
87.59 s
>
87.59 s
> test result: FAILED. 0 passed; 1 failed; 0 ignored; 0 measured; 128 filtered out; finished in 37.12s
87.59 s
>
87.59 s
> stderr ---
87.59 s
> warning: bundle export is experimental
87.59 s
> = hint: its behaviour may change at any time
87.59 s
> = hint: do not rely on this feature for production use cases
87.59 s
>
87.59 s
> warning: unknown font family: roboto
87.59 s
> ┌─ crates/linnest/typst/docs/manual.typ:11:28
87.59 s
> │
87.59 s
> 11 │ #set text(size: 10pt, font: "Roboto")
87.59 s
> │ ^^^^^^^^
87.59 s
>
87.59 s
> warning: unknown font family: roboto
87.59 s
> ┌─ crates/linnest/typst/docs/manual.typ:14:29
87.59 s
> │
87.59 s
> 14 │ #set text(size: 3em, font: "Roboto")
87.59 s
> │ ^^^^^^^^
87.59 s
>
87.59 s
> warning: unknown font family: roboto
87.59 s
> ┌─ crates/linnest/typst/docs/manual.typ:16:31
87.59 s
> │
87.59 s
> 16 │ #set text(size: 0.3em, font: "Roboto")
87.59 s
> │ ^^^^^^^^
87.59 s
>
87.59 s
> warning: overline was ignored during MathML export
87.59 s
> ┌─ crates/linnest/typst/docs/manual.typ:949:55
87.59 s
> │
87.59 s
> 949 │ + sum_("dangling" e) c_("dangling-centroid") / (d(e, overline(v)) + epsilon)
87.59 s
> │ ^^^^^^^^^^^
87.59 s
>
87.59 s
> warning: overline was ignored during MathML export
87.59 s
> ┌─ crates/linnest/typst/docs/manual.typ:953:8
87.59 s
> │
87.59 s
> 953 │ Here $overline(v)$ is the mean node position. The centroid term pushes every
87.59 s
> │ ^^^^^^^^^^^
87.59 s
>
87.59 s
>
87.59 s
> thread 'provenance_tests::each_build_captures_one_revision_before_rendering' (231) panicked at crates/alphal00p-docs-builder/src/provenance_tests.rs:297:14:
87.59 s
> called `Result::unwrap()` on an `Err` value: generated site has broken links:
87.59 s
> products/linnet/latest/reference/interfaces/index.html -> https://github.com/alphal00p/gammaloop/blob/1111111111111111111111111111111111111111/crates/linnet-py/examples/physics_render_settings.py (missing repository source file crates/linnet-py/examples/physics_render_settings.py)
87.59 s
> products/linnet/latest/reference/interfaces/index.html -> https://github.com/alphal00p/gammaloop/blob/1111111111111111111111111111111111111111/crates/linnet-py/examples/layout_stream.py (missing repository source file crates/linnet-py/examples/layout_stream.py)
87.59 s
> products/linnet/latest/playground/index.html -> https://github.com/alphal00p/gammaloop/blob/1111111111111111111111111111111111111111/crates/linnet-py/examples/layout_stream.py (missing repository source file crates/linnet-py/examples/layout_stream.py)
87.59 s
> products/linnet/latest/guides/python-rendering/index.html -> https://github.com/alphal00p/gammaloop/blob/1111111111111111111111111111111111111111/crates/linnet-py/examples/rendering_api.py (missing repository source file crates/linnet-py/examples/rendering_api.py)
87.59 s
>
87.59 s
> Location:
87.59 s
> crates/alphal00p-docs-builder/src/lib.rs:4940:9
87.59 s
> stack backtrace:
87.59 s
> 0: __rustc::rust_begin_unwind
87.59 s
> 1: core::panicking::panic_fmt
87.59 s
> 2: core::result::unwrap_failed
87.59 s
> 3: alphal00p_docs_builder::provenance_tests::each_build_captures_one_revision_before_rendering
87.59 s
> 4: <alphal00p_docs_builder::provenance_tests::each_build_captures_one_revision_before_rendering::{closure#0} as core::ops::function::FnOnce<()>>::call_once
87.59 s
> note: Some details are omitted, run with `RUST_BACKTRACE=full` for a verbose backtrace.
87.59 s
>
87.59 s
> thread 'provenance_tests::each_build_captures_one_revision_before_rendering' (191) panicked at crates/alphal00p-docs-builder/src/provenance_tests.rs:274:9:
87.59 s
> assertion failed: command.status().unwrap().success()
87.59 s
> stack backtrace:
87.59 s
> 0: __rustc::rust_begin_unwind
87.59 s
> 1: core::panicking::panic_fmt
87.59 s
> 2: core::panicking::panic
87.59 s
> 3: alphal00p_docs_builder::provenance_tests::each_build_captures_one_revision_before_rendering
87.59 s
> 4: <alphal00p_docs_builder::provenance_tests::each_build_captures_one_revision_before_rendering::{closure#0} as core::ops::function::FnOnce<()>>::call_once
87.59 s
> note: Some details are omitted, run with `RUST_BACKTRACE=full` for a verbose backtrace.
87.59 s
>
87.59 s
> ------------
87.59 s
> Summary [ 43.971s] 129 tests run: 128 passed , 1 failed , 0 skipped
87.59 s
> FAIL [ 37.130s] (128/129) alphal00p-docs-builder provenance_tests :: each_build_captures_one_revision_before_rendering
87.59 s
> stdout ---
87.59 s
>
87.59 s
> running 1 test
87.59 s
>
87.59 s
> running 1 test
87.59 s
> test provenance_tests::each_build_captures_one_revision_before_rendering ... FAILED
87.59 s
>
87.59 s
> failures:
87.59 s
>
87.59 s
> failures:
87.59 s
> provenance_tests::each_build_captures_one_revision_before_rendering
87.59 s
>
87.59 s
> test result: FAILED. 0 passed; 1 failed; 0 ignored; 0 measured; 128 filtered out; finished in 37.05s
87.59 s
>
87.59 s
> test provenance_tests::each_build_captures_one_revision_before_rendering ... FAILED
87.59 s
>
87.59 s
> failures:
87.59 s
>
87.59 s
> failures:
87.59 s
> provenance_tests::each_build_captures_one_revision_before_rendering
87.59 s
>
87.59 s
> test result: FAILED. 0 passed; 1 failed; 0 ignored; 0 measured; 128 filtered out; finished in 37.12s
87.59 s
>
87.59 s
> stderr ---
87.59 s
> warning: bundle export is experimental
87.59 s
> = hint: its behaviour may change at any time
87.59 s
> = hint: do not rely on this feature for production use cases
87.59 s
>
87.59 s
> warning: unknown font family: roboto
87.59 s
> ┌─ crates/linnest/typst/docs/manual.typ:11:28
87.59 s
> │
87.59 s
> 11 │ #set text(size: 10pt, font: "Roboto")
87.59 s
> │ ^^^^^^^^
87.59 s
>
87.59 s
> warning: unknown font family: roboto
87.59 s
> ┌─ crates/linnest/typst/docs/manual.typ:14:29
87.59 s
> │
87.59 s
> 14 │ #set text(size: 3em, font: "Roboto")
87.59 s
> │ ^^^^^^^^
87.59 s
>
87.59 s
> warning: unknown font family: roboto
87.59 s
> ┌─ crates/linnest/typst/docs/manual.typ:16:31
87.59 s
> │
87.59 s
> 16 │ #set text(size: 0.3em, font: "Roboto")
87.59 s
> │ ^^^^^^^^
87.59 s
>
87.59 s
> warning: overline was ignored during MathML export
87.59 s
> ┌─ crates/linnest/typst/docs/manual.typ:949:55
87.59 s
> │
87.59 s
> 949 │ + sum_("dangling" e) c_("dangling-centroid") / (d(e, overline(v)) + epsilon)
87.59 s
> │ ^^^^^^^^^^^
87.59 s
>
87.59 s
> warning: overline was ignored during MathML export
87.59 s
> ┌─ crates/linnest/typst/docs/manual.typ:953:8
87.59 s
> │
87.59 s
> 953 │ Here $overline(v)$ is the mean node position. The centroid term pushes every
87.59 s
> │ ^^^^^^^^^^^
87.59 s
>
87.59 s
>
87.59 s
> thread 'provenance_tests::each_build_captures_one_revision_before_rendering' (231) panicked at crates/alphal00p-docs-builder/src/provenance_tests.rs:297:14:
87.59 s
> called `Result::unwrap()` on an `Err` value: generated site has broken links:
87.59 s
> products/linnet/latest/reference/interfaces/index.html -> https://github.com/alphal00p/gammaloop/blob/1111111111111111111111111111111111111111/crates/linnet-py/examples/physics_render_settings.py (missing repository source file crates/linnet-py/examples/physics_render_settings.py)
87.59 s
> products/linnet/latest/reference/interfaces/index.html -> https://github.com/alphal00p/gammaloop/blob/1111111111111111111111111111111111111111/crates/linnet-py/examples/layout_stream.py (missing repository source file crates/linnet-py/examples/layout_stream.py)
87.59 s
> products/linnet/latest/playground/index.html -> https://github.com/alphal00p/gammaloop/blob/1111111111111111111111111111111111111111/crates/linnet-py/examples/layout_stream.py (missing repository source file crates/linnet-py/examples/layout_stream.py)
87.59 s
> products/linnet/latest/guides/python-rendering/index.html -> https://github.com/alphal00p/gammaloop/blob/1111111111111111111111111111111111111111/crates/linnet-py/examples/rendering_api.py (missing repository source file crates/linnet-py/examples/rendering_api.py)
87.59 s
>
87.59 s
> Location:
87.59 s
> crates/alphal00p-docs-builder/src/lib.rs:4940:9
87.59 s
> stack backtrace:
87.59 s
> 0: __rustc::rust_begin_unwind
87.59 s
> 1: core::panicking::panic_fmt
87.59 s
> 2: core::result::unwrap_failed
87.59 s
> 3: alphal00p_docs_builder::provenance_tests::each_build_captures_one_revision_before_rendering
87.59 s
> 4: <alphal00p_docs_builder::provenance_tests::each_build_captures_one_revision_before_rendering::{closure#0} as core::ops::function::FnOnce<()>>::call_once
87.59 s
> note: Some details are omitted, run with `RUST_BACKTRACE=full` for a verbose backtrace.
87.59 s
>
87.59 s
> thread 'provenance_tests::each_build_captures_one_revision_before_rendering' (191) panicked at crates/alphal00p-docs-builder/src/provenance_tests.rs:274:9:
87.59 s
> assertion failed: command.status().unwrap().success()
87.59 s
> stack backtrace:
87.59 s
> 0: __rustc::rust_begin_unwind
87.59 s
> 1: core::panicking::panic_fmt
87.59 s
> 2: core::panicking::panic
87.59 s
> 3: alphal00p_docs_builder::provenance_tests::each_build_captures_one_revision_before_rendering
87.59 s
> 4: <alphal00p_docs_builder::provenance_tests::each_build_captures_one_revision_before_rendering::{closure#0} as core::ops::function::FnOnce<()>>::call_once
87.59 s
> note: Some details are omitted, run with `RUST_BACKTRACE=full` for a verbose backtrace.
87.59 s
>
87.59 s
> error : test run failed
87.59 s
>
87.59 s
> ========== nextest test summary ==========
87.59 s
> report: target/nextest/ci_gammaloop/junit.xml
87.59 s
> tests: 129, failures: 1, errors: 0
87.59 s
>
87.59 s
> 1. alphal00p-docs-builder::provenance_tests::each_build_captures_one_revision_before_rendering
87.59 s
> failure: test failure with exit code 101
87.59 s
> thread 'provenance_tests::each_build_captures_one_revision_before_rendering' (191) panicked at crates/alphal00p-docs-builder/src/provenance_tests.rs:274:9:
87.59 s
> assertion failed: command.status().unwrap().success()
87.59 s
> stack backtrace:
87.59 s
> 0: __rustc::rust_begin_unwind
87.59 s
> 1: core::panicking::panic_fmt
87.59 s
> 2: core::panicking::panic
87.59 s
> 3: alphal00p_docs_builder::provenance_tests::each_build_captures_one_revision_before_rendering
87.59 s
> 4: <alphal00p_docs_builder::provenance_tests::each_build_captures_one_revision_before_rendering::{closure#0} as core::ops::function::FnOnce<()>>::call_once
87.59 s
> note: Some details are omitted, run with `RUST_BACKTRACE=full` for a verbose backtrace.
87.59 s
> system-out
87.59 s
> running 1 test
87.59 s
>
87.59 s
> running 1 test
87.59 s
> test provenance_tests::each_build_captures_one_revision_before_rendering ... FAILED
87.59 s
>
87.59 s
> failures:
87.59 s
>
87.59 s
> failures:
87.59 s
> provenance_tests::each_build_captures_one_revision_before_rendering
87.59 s
>
87.59 s
> test result: FAILED. 0 passed; 1 failed; 0 ignored; 0 measured; 128 filtered out; finished in 37.05s
87.59 s
>
87.59 s
> test provenance_tests::each_build_captures_one_revision_before_rendering ... FAILED
87.59 s
>
87.59 s
> failures:
87.59 s
>
87.59 s
> failures:
87.59 s
> provenance_tests::each_build_captures_one_revision_before_rendering
87.59 s
>
87.59 s
> test result: FAILED. 0 passed; 1 failed; 0 ignored; 0 measured; 128 filtered out; finished in 37.12s
87.59 s
> system-err
87.59 s
> warning: bundle export is experimental
87.59 s
> = hint: its behaviour may change at any time
87.59 s
> = hint: do not rely on this feature for production use cases
87.59 s
>
87.59 s
> warning: unknown font family: roboto
87.59 s
> ┌─ crates/linnest/typst/docs/manual.typ:11:28
87.59 s
> │
87.59 s
> 11 │ #set text(size: 10pt, font: "Roboto")
87.59 s
> │ ^^^^^^^^
87.59 s
>
87.59 s
> warning: unknown font family: roboto
87.59 s
> ┌─ crates/linnest/typst/docs/manual.typ:14:29
87.59 s
> │
87.59 s
> 14 │ #set text(size: 3em, font: "Roboto")
87.59 s
> │ ^^^^^^^^
87.59 s
>
87.59 s
> warning: unknown font family: roboto
87.59 s
> ┌─ crates/linnest/typst/docs/manual.typ:16:31
87.59 s
> │
87.59 s
> 16 │ #set text(size: 0.3em, font: "Roboto")
87.59 s
> │ ^^^^^^^^
87.59 s
>
87.59 s
> warning: overline was ignored during MathML export
87.59 s
> ┌─ crates/linnest/typst/docs/manual.typ:949:55
87.59 s
> │
87.59 s
> 949 │ + sum_("dangling" e) c_("dangling-centroid") / (d(e, overline(v)) + epsilon)
87.59 s
> │ ^^^^^^^^^^^
87.59 s
>
87.59 s
> warning: overline was ignored during MathML export
87.59 s
> ┌─ crates/linnest/typst/docs/manual.typ:953:8
87.59 s
> │
87.59 s
> 953 │ Here $overline(v)$ is the mean node position. The centroid term pushes every
87.59 s
> │ ^^^^^^^^^^^
87.59 s
>
87.59 s
>
87.59 s
> thread 'provenance_tests::each_build_captures_one_revision_before_rendering' (231) panicked at crates/alphal00p-docs-builder/src/provenance_tests.rs:297:14:
87.59 s
> called `Result::unwrap()` on an `Err` value: generated site has broken links:
87.59 s
> products/linnet/latest/reference/interfaces/index.html -> https://github.com/alphal00p/gammaloop/blob/1111111111111111111111111111111111111111/crates/linnet-py/examples/physics_render_settings.py (missing repository source file crates/linnet-py/examples/physics_render_settings.py)
87.59 s
> products/linnet/latest/reference/interfaces/index.html -> https://github.com/alphal00p/gammaloop/blob/1111111111111111111111111111111111111111/crates/linnet-py/examples/layout_stream.py (missing repository source file crates/linnet-py/examples/layout_stream.py)
87.59 s
> products/linnet/latest/playground/index.html -> https://github.com/alphal00p/gammaloop/blob/1111111111111111111111111111111111111111/crates/linnet-py/examples/layout_stream.py (missing repository source file crates/linnet-py/examples/layout_stream.py)
87.59 s
> products/linnet/latest/guides/python-rendering/index.html -> https://github.com/alphal00p/gammaloop/blob/1111111111111111111111111111111111111111/crates/linnet-py/examples/rendering_api.py (missing repository source file crates/linnet-py/examples/rendering_api.py)
87.59 s
>
87.59 s
> Location:
87.59 s
> crates/alphal00p-docs-builder/src/lib.rs:4940:9
87.59 s
> stack backtrace:
87.59 s
> 0: __rustc::rust_begin_unwind
87.59 s
> 1: core::panicking::panic_fmt
87.59 s
> 2: core::result::unwrap_failed
87.59 s
> 3: alphal00p_docs_builder::provenance_tests::each_build_captures_one_revision_before_rendering
87.59 s
> 4: <alphal00p_docs_builder::provenance_tests::each_build_captures_one_revision_before_rendering::{closure#0} as core::ops::function::FnOnce<()>>::call_once
87.59 s
> note: Some details are omitted, run with `RUST_BACKTRACE=full` for a verbose backtrace.
87.59 s
>
87.59 s
> thread 'provenance_tests::each_build_captures_one_revision_before_rendering' (191) panicked at crates/alphal00p-docs-builder/src/provenance_tests.rs:274:9:
87.59 s
> assertion failed: command.status().unwrap().success()
87.59 s
> stack backtrace:
87.59 s
> 0: __rustc::rust_begin_unwind
87.59 s
> 1: core::panicking::panic_fmt
87.59 s
> 2: core::panicking::panic
87.59 s
> 3: alphal00p_docs_builder::provenance_tests::each_build_captures_one_revision_before_rendering
87.59 s
> 4: <alphal00p_docs_builder::provenance_tests::each_build_captures_one_revision_before_rendering::{closure#0} as core::ops::function::FnOnce<()>>::call_once
87.59 s
> note: Some details are omitted, run with `RUST_BACKTRACE=full` for a verbose backtrace.
87.59 s
> =========================================
87.59 s
> Extracting 2 binaries to /build/source
87.59 s
> Extracted 5 files to /build/source in 0.04s
87.59 s
> ------------
87.59 s
> Nextest run ID 914177fb-bf7e-4474-8ad6-3e4e5dedec49 with nextest profile: ci_gammaloop
87.59 s
> Starting 22 tests across 2 binaries
87.59 s
> ------------
87.59 s
> Summary [ 0.018s] 22 tests run: 22 passed , 0 skipped
87.59 s
>
87.59 s
> ========== nextest test summary ==========
87.59 s
> report: target/nextest/ci_gammaloop/junit.xml
87.59 s
> tests: 22, failures: 0, errors: 0
87.59 s
> No failing testcases found.
87.59 s
> =========================================
87.59 s
> Extracting 3 binaries (including 2 non-test binaries), 1 build script output directory, and 2 linked paths to /build/source
87.59 s
> Extracted 22 files to /build/source in 0.28s
87.59 s
> ------------
87.59 s
> Nextest run ID 26be5934-c657-482d-a987-5ba714b6b925 with nextest profile: ci_gammaloop
87.59 s
> Starting 89 tests across 1 binary
87.59 s
> ------------
87.59 s
> Summary [ 0.041s] 89 tests run: 89 passed , 0 skipped
87.59 s
>
87.59 s
> ========== nextest test summary ==========
87.59 s
> report: target/nextest/ci_gammaloop/junit.xml
87.59 s
> tests: 89, failures: 0, errors: 0
87.59 s
> No failing testcases found.
87.59 s
> =========================================
87.59 s
> Extracting 2 binaries to /build/source
87.59 s
> Extracted 5 files to /build/source in 0.05s
87.59 s
> ------------
87.59 s
> Nextest run ID 938aabdb-ba51-4988-b34a-221516f60b0c with nextest profile: ci_gammaloop
87.59 s
> Starting 10 tests across 2 binaries
87.59 s
> ------------
87.59 s
> Summary [ 13.869s] 10 tests run: 10 passed , 0 skipped
87.59 s
>
87.59 s
> ========== nextest test summary ==========
87.59 s
> report: target/nextest/ci_gammaloop/junit.xml
87.59 s
> tests: 10, failures: 0, errors: 0
87.59 s
> No failing testcases found.
87.59 s
> =========================================
87.59 s
> Extracting 1 binary to /build/source
87.59 s
> Extracted 4 files to /build/source in 0.04s
87.59 s
> ------------
87.59 s
> Nextest run ID 15453a0e-968a-47d0-9371-4f77dc8e9777 with nextest profile: ci_gammaloop
87.59 s
> Starting 0 tests across 1 binary
87.59 s
> ------------
87.59 s
> Summary [ 0.000s] 0 tests run: 0 passed , 0 skipped
87.59 s
>
87.59 s
> ========== nextest test summary ==========
87.59 s
> report: target/nextest/ci_gammaloop/junit.xml
87.59 s
> tests: 0, failures: 0, errors: 0
87.59 s
> No failing testcases found.
87.59 s
> =========================================
87.59 s
> Extracting 1 binary to /build/source
87.59 s
> Extracted 4 files to /build/source in 0.04s
87.59 s
> ------------
87.59 s
> Nextest run ID a88f4f5e-327e-4b6f-92b7-2a3ce444dbb8 with nextest profile: ci_gammaloop
87.59 s
> Starting 5 tests across 1 binary
87.59 s
> ------------
87.59 s
> Summary [ 0.006s] 5 tests run: 5 passed , 0 skipped
87.59 s
>
87.59 s
> ========== nextest test summary ==========
87.59 s
> report: target/nextest/ci_gammaloop/junit.xml
87.59 s
> tests: 5, failures: 0, errors: 0
87.59 s
> No failing testcases found.
87.59 s
> =========================================
87.59 s
For full logs, run:
87.59 s
nix log /nix/store/9rs74w2crrwhaq7f0dxdi11wd515i6dj-gammaloop-nextest-docs.drv
87.74 s
[0 built (1 failed )]Run failed.