test packages.x86_64-linux.nix-ci-check-gammaloop-nextest-linnet

Reproduce this run
Original Run
  1. 0.01 s $ /nix/store/9ypz3flqsrl5xl495mm8h645gadjsxi1-coreutils-9.11/bin/timeout --kill-after=15s 7200s /nix/store/23zk8sgzamrbmj1fday15szf7f2279s8-nix-2.34.7/bin/nix --extra-experimental-features nix-command --extra-experimental-features flakes flake clone git+https://github.com/alphal00p/gammaloop --dest /tmp/nix-ci-worker/stable-pwd/repo/
  2. 0.15 s Cloning into '/tmp/nix-ci-worker/stable-pwd/repo'...
  3. 1.08 s remote: Enumerating objects: 87907, done.
  4. 1.20 s remote: Counting objects: 0% (1/10505) remote: Counting objects: 1% (106/10505) remote: Counting objects: 2% (211/10505) remote: Counting objects: 3% (316/10505) remote: Counting objects: 4% (421/10505) remote: Counting objects: 5% (526/10505) remote: Counting objects: 6% (631/10505) remote: Counting objects: 7% (736/10505) remote: Counting objects: 8% (841/10505) remote: Counting objects: 9% (946/10505) remote: Counting objects: 10% (1051/10505) remote: Counting objects: 11% (1156/10505) remote: Counting objects: 12% (1261/10505) remote: Counting objects: 13% (1366/10505) remote: Counting objects: 14% (1471/10505) remote: Counting objects: 15% (1576/10505) remote: Counting objects: 16% (1681/10505) remote: Counting objects: 17% (1786/10505) remote: Counting objects: 18% (1891/10505) remote: Counting objects: 19% (1996/10505) remote: Counting objects: 20% (2101/10505) remote: Counting objects: 21% (2207/10505) remote: Counting objects: 22% (2312/10505) remote: Counting objects: 23% (2417/10505) remote: Counting objects: 24% (2522/10505) remote: Counting objects: 25% (2627/10505) remote: Counting objects: 26% (2732/10505) remote: Counting objects: 27% (2837/10505) remote: Counting objects: 28% (2942/10505) remote: Counting objects: 29% (3047/10505) remote: Counting objects: 30% (3152/10505) remote: Counting objects: 31% (3257/10505) remote: Counting objects: 32% (3362/10505) remote: Counting objects: 33% (3467/10505) remote: Counting objects: 34% (3572/10505) remote: Counting objects: 35% (3677/10505) remote: Counting objects: 36% (3782/10505) remote: Counting objects: 37% (3887/10505) remote: Counting objects: 38% (3992/10505) remote: Counting objects: 39% (4097/10505) remote: Counting objects: 40% (4202/10505) remote: Counting objects: 41% (4308/10505) remote: Counting objects: 42% (4413/10505) remote: Counting objects: 43% (4518/10505) remote: Counting objects: 44% (4623/10505) remote: Counting objects: 45% (4728/10505) remote: Counting objects: 46% (4833/10505) remote: Counting objects: 47% (4938/10505) remote: Counting objects: 48% (5043/10505) remote: Counting objects: 49% (5148/10505) remote: Counting objects: 50% (5253/10505) remote: Counting objects: 51% (5358/10505) remote: Counting objects: 52% (5463/10505) remote: Counting objects: 53% (5568/10505) remote: Counting objects: 54% (5673/10505) remote: Counting objects: 55% (5778/10505) remote: Counting objects: 56% (5883/10505) remote: Counting objects: 57% (5988/10505) remote: Counting objects: 58% (6093/10505) remote: Counting objects: 59% (6198/10505) remote: Counting objects: 60% (6303/10505) remote: Counting objects: 61% (6409/10505) remote: Counting objects: 62% (6514/10505) remote: Counting objects: 63% (6619/10505) remote: Counting objects: 64% (6724/10505) remote: Counting objects: 65% (6829/10505) remote: Counting objects: 66% (6934/10505) remote: Counting objects: 67% (7039/10505) remote: Counting objects: 68% (7144/10505) remote: Counting objects: 69% (7249/10505) remote: Counting objects: 70% (7354/10505) remote: Counting objects: 71% (7459/10505) remote: Counting objects: 72% (7564/10505) remote: Counting objects: 73% (7669/10505) remote: Counting objects: 74% (7774/10505) remote: Counting objects: 75% (7879/10505) remote: Counting objects: 76% (7984/10505) remote: Counting objects: 77% (8089/10505) remote: Counting objects: 78% (8194/10505) remote: Counting objects: 79% (8299/10505) remote: Counting objects: 80% (8404/10505) remote: Counting objects: 81% (8510/10505) remote: Counting objects: 82% (8615/10505) remote: Counting objects: 83% (8720/10505) remote: Counting objects: 84% (8825/10505) remote: Counting objects: 85% (8930/10505) remote: Counting objects: 86% (9035/10505) remote: Counting objects: 87% (9140/10505) remote: Counting objects: 88% (9245/10505) remote: Counting objects: 89% (9350/10505) remote: Counting objects: 90% (9455/10505) remote: Counting objects: 91% (9560/10505) remote: Counting objects: 92% (9665/10505) remote: Counting objects: 93% (9770/10505) remote: Counting objects: 94% (9875/10505) remote: Counting objects: 95% (9980/10505) remote: Counting objects: 96% (10085/10505) remote: Counting objects: 97% (10190/10505) remote: Counting objects: 98% (10295/10505) remote: Counting objects: 99% (10400/10505) remote: Counting objects: 100% (10505/10505) remote: Counting objects: 100% (10505/10505), done.
  5. 4.07 s remote: Compressing objects: 0% (1/2927) remote: Compressing objects: 1% (30/2927) remote: Compressing objects: 2% (59/2927) remote: Compressing objects: 3% (88/2927) remote: Compressing objects: 4% (118/2927) remote: Compressing objects: 5% (147/2927) remote: Compressing objects: 6% (176/2927) remote: Compressing objects: 7% (205/2927) remote: Compressing objects: 8% (235/2927) remote: Compressing objects: 9% (264/2927) remote: Compressing objects: 10% (293/2927) remote: Compressing objects: 11% (322/2927) remote: Compressing objects: 12% (352/2927) remote: Compressing objects: 13% (381/2927) remote: Compressing objects: 14% (410/2927) remote: Compressing objects: 15% (440/2927) remote: Compressing objects: 15% (444/2927) remote: Compressing objects: 16% (469/2927) remote: Compressing objects: 17% (498/2927) remote: Compressing objects: 18% (527/2927) remote: Compressing objects: 19% (557/2927) remote: Compressing objects: 20% (586/2927) remote: Compressing objects: 21% (615/2927) remote: Compressing objects: 22% (644/2927) remote: Compressing objects: 23% (674/2927) remote: Compressing objects: 24% (703/2927) remote: Compressing objects: 25% (732/2927) remote: Compressing objects: 25% (758/2927) remote: Compressing objects: 26% (762/2927) remote: Compressing objects: 27% (791/2927) remote: Compressing objects: 28% (820/2927) remote: Compressing objects: 29% (849/2927) remote: Compressing objects: 30% (879/2927) remote: Compressing objects: 31% (908/2927) remote: Compressing objects: 32% (937/2927) remote: Compressing objects: 33% (966/2927) remote: Compressing objects: 34% (996/2927) remote: Compressing objects: 35% (1025/2927) remote: Compressing objects: 36% (1054/2927) remote: Compressing objects: 37% (1083/2927) remote: Compressing objects: 38% (1113/2927) remote: Compressing objects: 39% (1142/2927) remote: Compressing objects: 40% (1171/2927) remote: Compressing objects: 41% (1201/2927) remote: Compressing objects: 42% (1230/2927) remote: Compressing objects: 43% (1259/2927) remote: Compressing objects: 44% (1288/2927) remote: Compressing objects: 45% (1318/2927) remote: Compressing objects: 46% (1347/2927) remote: Compressing objects: 47% (1376/2927) remote: Compressing objects: 48% (1405/2927) remote: Compressing objects: 49% (1435/2927) remote: Compressing objects: 50% (1464/2927) remote: Compressing objects: 51% (1493/2927) remote: Compressing objects: 52% (1523/2927) remote: Compressing objects: 53% (1552/2927) remote: Compressing objects: 54% (1581/2927) remote: Compressing objects: 55% (1610/2927) remote: Compressing objects: 56% (1640/2927) remote: Compressing objects: 57% (1669/2927) remote: Compressing objects: 58% (1698/2927) remote: Compressing objects: 59% (1727/2927) remote: Compressing objects: 60% (1757/2927) remote: Compressing objects: 61% (1786/2927) remote: Compressing objects: 62% (1815/2927) remote: Compressing objects: 63% (1845/2927) remote: Compressing objects: 64% (1874/2927) remote: Compressing objects: 65% (1903/2927) remote: Compressing objects: 66% (1932/2927) remote: Compressing objects: 67% (1962/2927) remote: Compressing objects: 68% (1991/2927) remote: Compressing objects: 69% (2020/2927) remote: Compressing objects: 70% (2049/2927) remote: Compressing objects: 71% (2079/2927) remote: Compressing objects: 72% (2108/2927) remote: Compressing objects: 73% (2137/2927) remote: Compressing objects: 74% (2166/2927) remote: Compressing objects: 75% (2196/2927) remote: Compressing objects: 76% (2225/2927) remote: Compressing objects: 77% (2254/2927) remote: Compressing objects: 78% (2284/2927) remote: Compressing objects: 79% (2313/2927) remote: Compressing objects: 80% (2342/2927) remote: Compressing objects: 81% (2371/2927) remote: Compressing objects: 82% (2401/2927) remote: Compressing objects: 83% (2430/2927) remote: Compressing objects: 84% (2459/2927) remote: Compressing objects: 85% (2488/2927) remote: Compressing objects: 86% (2518/2927) remote: Compressing objects: 87% (2547/2927) remote: Compressing objects: 88% (2576/2927) remote: Compressing objects: 89% (2606/2927) remote: Compressing objects: 90% (2635/2927) remote: Compressing objects: 91% (2664/2927) remote: Compressing objects: 92% (2693/2927) remote: Compressing objects: 93% (2723/2927) remote: Compressing objects: 94% (2752/2927) remote: Compressing objects: 95% (2781/2927) remote: Compressing objects: 96% (2810/2927) remote: Compressing objects: 97% (2840/2927) remote: Compressing objects: 98% (2869/2927) remote: Compressing objects: 99% (2898/2927) remote: Compressing objects: 100% (2927/2927) remote: Compressing objects: 100% (2927/2927), done.
  6. 9.85 s Receiving objects: 0% (1/87907) Receiving objects: 1% (880/87907) Receiving objects: 2% (1759/87907) Receiving objects: 3% (2638/87907) Receiving objects: 4% (3517/87907) Receiving objects: 5% (4396/87907) Receiving objects: 6% (5275/87907), 8.96 MiB | 17.90 MiB/s Receiving objects: 7% (6154/87907), 8.96 MiB | 17.90 MiB/s Receiving objects: 8% (7033/87907), 8.96 MiB | 17.90 MiB/s Receiving objects: 9% (7912/87907), 8.96 MiB | 17.90 MiB/s Receiving objects: 10% (8791/87907), 8.96 MiB | 17.90 MiB/s Receiving objects: 11% (9670/87907), 8.96 MiB | 17.90 MiB/s Receiving objects: 12% (10549/87907), 8.96 MiB | 17.90 MiB/s Receiving objects: 13% (11428/87907), 8.96 MiB | 17.90 MiB/s Receiving objects: 14% (12307/87907), 8.96 MiB | 17.90 MiB/s Receiving objects: 15% (13187/87907), 8.96 MiB | 17.90 MiB/s Receiving objects: 16% (14066/87907), 8.96 MiB | 17.90 MiB/s Receiving objects: 17% (14945/87907), 8.96 MiB | 17.90 MiB/s Receiving objects: 18% (15824/87907), 8.96 MiB | 17.90 MiB/s Receiving objects: 19% (16703/87907), 8.96 MiB | 17.90 MiB/s Receiving objects: 20% (17582/87907), 8.96 MiB | 17.90 MiB/s Receiving objects: 21% (18461/87907), 8.96 MiB | 17.90 MiB/s Receiving objects: 22% (19340/87907), 8.96 MiB | 17.90 MiB/s Receiving objects: 23% (20219/87907), 8.96 MiB | 17.90 MiB/s Receiving objects: 24% (21098/87907), 8.96 MiB | 17.90 MiB/s Receiving objects: 25% (21977/87907), 8.96 MiB | 17.90 MiB/s Receiving objects: 25% (22542/87907), 8.96 MiB | 17.90 MiB/s Receiving objects: 26% (22856/87907), 23.46 MiB | 23.46 MiB/s Receiving objects: 27% (23735/87907), 23.46 MiB | 23.46 MiB/s Receiving objects: 28% (24614/87907), 23.46 MiB | 23.46 MiB/s Receiving objects: 29% (25494/87907), 23.46 MiB | 23.46 MiB/s Receiving objects: 30% (26373/87907), 23.46 MiB | 23.46 MiB/s Receiving objects: 31% (27252/87907), 23.46 MiB | 23.46 MiB/s Receiving objects: 32% (28131/87907), 23.46 MiB | 23.46 MiB/s Receiving objects: 33% (29010/87907), 23.46 MiB | 23.46 MiB/s Receiving objects: 34% (29889/87907), 23.46 MiB | 23.46 MiB/s Receiving objects: 35% (30768/87907), 23.46 MiB | 23.46 MiB/s Receiving objects: 36% (31647/87907), 23.46 MiB | 23.46 MiB/s Receiving objects: 37% (32526/87907), 23.46 MiB | 23.46 MiB/s Receiving objects: 38% (33405/87907), 23.46 MiB | 23.46 MiB/s Receiving objects: 39% (34284/87907), 23.46 MiB | 23.46 MiB/s Receiving objects: 40% (35163/87907), 23.46 MiB | 23.46 MiB/s Receiving objects: 41% (36042/87907), 23.46 MiB | 23.46 MiB/s Receiving objects: 42% (36921/87907), 23.46 MiB | 23.46 MiB/s Receiving objects: 43% (37801/87907), 42.24 MiB | 28.04 MiB/s Receiving objects: 44% (38680/87907), 42.24 MiB | 28.04 MiB/s Receiving objects: 45% (39559/87907), 42.24 MiB | 28.04 MiB/s Receiving objects: 46% (40438/87907), 42.24 MiB | 28.04 MiB/s Receiving objects: 47% (41317/87907), 42.24 MiB | 28.04 MiB/s Receiving objects: 48% (42196/87907), 42.24 MiB | 28.04 MiB/s Receiving objects: 49% (43075/87907), 42.24 MiB | 28.04 MiB/s Receiving objects: 50% (43954/87907), 42.24 MiB | 28.04 MiB/s Receiving objects: 51% (44833/87907), 42.24 MiB | 28.04 MiB/s Receiving objects: 52% (45712/87907), 42.24 MiB | 28.04 MiB/s Receiving objects: 52% (46361/87907), 42.24 MiB | 28.04 MiB/s Receiving objects: 53% (46591/87907), 56.71 MiB | 28.28 MiB/s Receiving objects: 54% (47470/87907), 56.71 MiB | 28.28 MiB/s Receiving objects: 55% (48349/87907), 56.71 MiB | 28.28 MiB/s Receiving objects: 56% (49228/87907), 56.71 MiB | 28.28 MiB/s Receiving objects: 57% (50107/87907), 56.71 MiB | 28.28 MiB/s Receiving objects: 58% (50987/87907), 71.30 MiB | 28.45 MiB/s Receiving objects: 59% (51866/87907), 71.30 MiB | 28.45 MiB/s Receiving objects: 60% (52745/87907), 71.30 MiB | 28.45 MiB/s Receiving objects: 61% (53624/87907), 71.30 MiB | 28.45 MiB/s Receiving objects: 62% (54503/87907), 71.30 MiB | 28.45 MiB/s Receiving objects: 63% (55382/87907), 71.30 MiB | 28.45 MiB/s Receiving objects: 64% (56261/87907), 71.30 MiB | 28.45 MiB/s Receiving objects: 65% (57140/87907), 71.30 MiB | 28.45 MiB/s Receiving objects: 65% (57319/87907), 87.36 MiB | 29.04 MiB/s Receiving objects: 66% (58019/87907), 102.85 MiB | 29.32 MiB/s Receiving objects: 67% (58898/87907), 102.85 MiB | 29.32 MiB/s Receiving objects: 68% (59777/87907), 102.85 MiB | 29.32 MiB/s Receiving objects: 69% (60656/87907), 102.85 MiB | 29.32 MiB/s Receiving objects: 70% (61535/87907), 102.85 MiB | 29.32 MiB/s Receiving objects: 71% (62414/87907), 102.85 MiB | 29.32 MiB/s Receiving objects: 71% (63191/87907), 119.38 MiB | 29.78 MiB/s Receiving objects: 72% (63294/87907), 119.38 MiB | 29.78 MiB/s Receiving objects: 73% (64173/87907), 119.38 MiB | 29.78 MiB/s Receiving objects: 74% (65052/87907), 119.38 MiB | 29.78 MiB/s Receiving objects: 75% (65931/87907), 119.38 MiB | 29.78 MiB/s Receiving objects: 76% (66810/87907), 119.38 MiB | 29.78 MiB/s Receiving objects: 77% (67689/87907), 119.38 MiB | 29.78 MiB/s Receiving objects: 78% (68568/87907), 119.38 MiB | 29.78 MiB/s Receiving objects: 79% (69447/87907), 134.89 MiB | 29.89 MiB/s Receiving objects: 80% (70326/87907), 134.89 MiB | 29.89 MiB/s Receiving objects: 81% (71205/87907), 134.89 MiB | 29.89 MiB/s Receiving objects: 82% (72084/87907), 134.89 MiB | 29.89 MiB/s Receiving objects: 83% (72963/87907), 134.89 MiB | 29.89 MiB/s Receiving objects: 84% (73842/87907), 134.89 MiB | 29.89 MiB/s Receiving objects: 85% (74721/87907), 134.89 MiB | 29.89 MiB/s Receiving objects: 86% (75601/87907), 134.89 MiB | 29.89 MiB/s Receiving objects: 87% (76480/87907), 134.89 MiB | 29.89 MiB/s Receiving objects: 87% (77334/87907), 134.89 MiB | 29.89 MiB/s Receiving objects: 88% (77359/87907), 134.89 MiB | 29.89 MiB/s Receiving objects: 89% (78238/87907), 134.89 MiB | 29.89 MiB/s Receiving objects: 90% (79117/87907), 134.89 MiB | 29.89 MiB/s Receiving objects: 91% (79996/87907), 134.89 MiB | 29.89 MiB/s Receiving objects: 92% (80875/87907), 134.89 MiB | 29.89 MiB/s Receiving objects: 93% (81754/87907), 150.56 MiB | 31.36 MiB/s Receiving objects: 94% (82633/87907), 150.56 MiB | 31.36 MiB/s Receiving objects: 95% (83512/87907), 150.56 MiB | 31.36 MiB/s Receiving objects: 96% (84391/87907), 150.56 MiB | 31.36 MiB/s Receiving objects: 97% (85270/87907), 150.56 MiB | 31.36 MiB/s Receiving objects: 98% (86149/87907), 150.56 MiB | 31.36 MiB/s Receiving objects: 99% (87028/87907), 167.14 MiB | 31.82 MiB/s remote: Total 87907 (delta 8595), reused 8322 (delta 7552), pack-reused 77402 (from 3)
  7. 9.85 s Receiving objects: 100% (87907/87907), 167.14 MiB | 31.82 MiB/s Receiving objects: 100% (87907/87907), 175.78 MiB | 30.39 MiB/s, done.
  8. 11.40 s Resolving deltas: 0% (0/59460) Resolving deltas: 1% (595/59460) Resolving deltas: 2% (1190/59460) Resolving deltas: 3% (1788/59460) Resolving deltas: 4% (2379/59460) Resolving deltas: 5% (2973/59460) Resolving deltas: 6% (3568/59460) Resolving deltas: 7% (4163/59460) Resolving deltas: 8% (4757/59460) Resolving deltas: 9% (5352/59460) Resolving deltas: 10% (5946/59460) Resolving deltas: 11% (6541/59460) Resolving deltas: 12% (7137/59460) Resolving deltas: 13% (7731/59460) Resolving deltas: 14% (8325/59460) Resolving deltas: 15% (8919/59460) Resolving deltas: 16% (9515/59460) Resolving deltas: 17% (10109/59460) Resolving deltas: 18% (10704/59460) Resolving deltas: 19% (11298/59460) Resolving deltas: 20% (11892/59460) Resolving deltas: 21% (12487/59460) Resolving deltas: 22% (13082/59460) Resolving deltas: 23% (13676/59460) Resolving deltas: 24% (14271/59460) Resolving deltas: 25% (14866/59460) Resolving deltas: 26% (15460/59460) Resolving deltas: 27% (16056/59460) Resolving deltas: 28% (16649/59460) Resolving deltas: 29% (17247/59460) Resolving deltas: 30% (17838/59460) Resolving deltas: 31% (18433/59460) Resolving deltas: 32% (19028/59460) Resolving deltas: 33% (19622/59460) Resolving deltas: 34% (20217/59460) Resolving deltas: 35% (20811/59460) Resolving deltas: 36% (21407/59460) Resolving deltas: 37% (22001/59460) Resolving deltas: 38% (22596/59460) Resolving deltas: 39% (23190/59460) Resolving deltas: 40% (23784/59460) Resolving deltas: 41% (24379/59460) Resolving deltas: 42% (24978/59460) Resolving deltas: 43% (25570/59460) Resolving deltas: 44% (26164/59460) Resolving deltas: 45% (26757/59460) Resolving deltas: 46% (27352/59460) Resolving deltas: 47% (27948/59460) Resolving deltas: 48% (28541/59460) Resolving deltas: 49% (29136/59460) Resolving deltas: 50% (29730/59460) Resolving deltas: 51% (30325/59460) Resolving deltas: 52% (30920/59460) Resolving deltas: 53% (31514/59460) Resolving deltas: 54% (32109/59460) Resolving deltas: 55% (32703/59460) Resolving deltas: 56% (33298/59460) Resolving deltas: 57% (33893/59460) Resolving deltas: 58% (34488/59460) Resolving deltas: 59% (35083/59460) Resolving deltas: 60% (35676/59460) Resolving deltas: 61% (36271/59460) Resolving deltas: 62% (36866/59460) Resolving deltas: 63% (37460/59460) Resolving deltas: 64% (38055/59460) Resolving deltas: 65% (38649/59460) Resolving deltas: 65% (39228/59460) Resolving deltas: 66% (39244/59460) Resolving deltas: 67% (39840/59460) Resolving deltas: 68% (40433/59460) Resolving deltas: 69% (41028/59460) Resolving deltas: 70% (41623/59460) Resolving deltas: 71% (42218/59460) Resolving deltas: 72% (42812/59460) Resolving deltas: 73% (43406/59460) Resolving deltas: 74% (44001/59460) Resolving deltas: 75% (44595/59460) Resolving deltas: 76% (45190/59460) Resolving deltas: 77% (45785/59460) Resolving deltas: 78% (46379/59460) Resolving deltas: 79% (46974/59460) Resolving deltas: 80% (47568/59460) Resolving deltas: 81% (48163/59460) Resolving deltas: 82% (48758/59460) Resolving deltas: 83% (49353/59460) Resolving deltas: 84% (49947/59460) Resolving deltas: 85% (50541/59460) Resolving deltas: 86% (51136/59460) Resolving deltas: 87% (51731/59460) Resolving deltas: 88% (52325/59460) Resolving deltas: 89% (52920/59460) Resolving deltas: 90% (53514/59460) Resolving deltas: 91% (54109/59460) Resolving deltas: 92% (54704/59460) Resolving deltas: 93% (55301/59460) Resolving deltas: 94% (55893/59460) Resolving deltas: 95% (56488/59460) Resolving deltas: 96% (57082/59460) Resolving deltas: 97% (57677/59460) Resolving deltas: 98% (58271/59460) Resolving deltas: 99% (58867/59460) Resolving deltas: 100% (59460/59460) Resolving deltas: 100% (59460/59460), done.
  9. 12.28 s Fetching commit 891dec7c25b5d9026c099da021ec7ae3b757dee9 for docs ...
  10. 12.28 s $ /nix/store/bcnisk3ydfgv26v2gw3zlky24g00yww2-git-2.54.0/bin/git fetch origin 891dec7c25b5d9026c099da021ec7ae3b757dee9
  11. 12.90 s From https://github.com/alphal00p/gammaloop
  12. 12.90 s * branch 891dec7c25b5d9026c099da021ec7ae3b757dee9 -> FETCH_HEAD
  13. 12.98 s $ /nix/store/9ypz3flqsrl5xl495mm8h645gadjsxi1-coreutils-9.11/bin/timeout --kill-after=15s 7200s /nix/store/bcnisk3ydfgv26v2gw3zlky24g00yww2-git-2.54.0/bin/git -c advice.detachedHead=false checkout 891dec7c25b5d9026c099da021ec7ae3b757dee9
  14. 13.40 s HEAD is now at 891dec7c2 change photos
  15. 13.40 s $ /nix/store/9ypz3flqsrl5xl495mm8h645gadjsxi1-coreutils-9.11/bin/timeout --kill-after=15s 7200s /nix/store/23zk8sgzamrbmj1fday15szf7f2279s8-nix-2.34.7/bin/nix --extra-experimental-features nix-command --extra-experimental-features flakes --log-format internal-json run .#packages.x86_64-linux.nix-ci-check-gammaloop-nextest-linnet --print-build-logs
  16. 20.79 s
  17. 29.20 s evaluating derivation 'g copying '/nix/store/bgss evaluating derivation 'g copying '/nix/store/bgss evaluating derivation 'g copying '/nix/store/bgss evaluating derivation 'g [0/1 built] [1/0/1 built] building ggammaloop-nextest-linnet> Extracting 2 binaries (including 1 non-test binary) to /build/source
  18. 29.28 s gammaloop-nextest-linnet> Extracted 6 files to /build/source in 0.08s
  19. 29.31 s gammaloop-nextest-linnet> ------------
  20. 29.31 s gammaloop-nextest-linnet> Nextest run ID 00e473e4-9b52-497e-9274-ea65e5a61181 with nextest profile: ci_gammaloop
  21. 29.31 s gammaloop-nextest-linnet> Starting 24 tests across 1 binary
  22. 29.38 s gammaloop-nextest-linnet> ------------
  23. 29.38 s gammaloop-nextest-linnet> Summary [ 0.066s] 24 tests run: 24 passed, 0 skipped
  24. 29.47 s gammaloop-nextest-linnet>
  25. 29.47 s gammaloop-nextest-linnet> ========== nextest test summary ==========
  26. 29.47 s gammaloop-nextest-linnet> report: target/nextest/ci_gammaloop/junit.xml
  27. 29.47 s gammaloop-nextest-linnet> tests: 24, failures: 0, errors: 0
  28. 29.47 s gammaloop-nextest-linnet> No failing testcases found.
  29. 29.47 s gammaloop-nextest-linnet> =========================================
  30. 29.52 s gammaloop-nextest-linnet> Extracting 2 binaries (including 1 non-test binary) and 1 linked path to /build/source
  31. 29.76 s gammaloop-nextest-linnet> Extracted 9 files to /build/source in 0.25s
  32. 29.79 s gammaloop-nextest-linnet> ------------
  33. 29.79 s gammaloop-nextest-linnet> Nextest run ID 653538a0-967e-4448-afb9-51364e6dda60 with nextest profile: ci_gammaloop
  34. 29.79 s gammaloop-nextest-linnet> Starting 183 tests across 1 binary
  35. 30.21 s gammaloop-nextest-linnet> ------------
  36. 30.21 s gammaloop-nextest-linnet> Summary [ 0.425s] 183 tests run: 183 passed, 0 skipped
  37. 30.28 s gammaloop-nextest-linnet>
  38. 30.29 s gammaloop-nextest-linnet> ========== nextest test summary ==========
  39. 30.29 s gammaloop-nextest-linnet> report: target/nextest/ci_gammaloop/junit.xml
  40. 30.29 s gammaloop-nextest-linnet> tests: 183, failures: 0, errors: 0
  41. 30.29 s gammaloop-nextest-linnet> No failing testcases found.
  42. 30.29 s gammaloop-nextest-linnet> =========================================
  43. 30.32 s gammaloop-nextest-linnet> Extracting 4 binaries (including 3 non-test binaries), 1 build script output directory, and 1 linked path to /build/source
  44. 30.75 s gammaloop-nextest-linnet> Extracted 13 files to /build/source in 0.43s
  45. 30.80 s gammaloop-nextest-linnet> ------------
  46. 30.80 s gammaloop-nextest-linnet> Nextest run ID 72bc01dc-cd71-4bb7-8beb-53268d12e43f with nextest profile: ci_gammaloop
  47. 30.80 s gammaloop-nextest-linnet> Starting 0 tests across 1 binary
  48. 30.80 s gammaloop-nextest-linnet> ------------
  49. 30.80 s gammaloop-nextest-linnet> Summary [ 0.003s] 0 tests run: 0 passed, 0 skipped
  50. 30.90 s gammaloop-nextest-linnet>
  51. 30.90 s gammaloop-nextest-linnet> ========== nextest test summary ==========
  52. 30.90 s gammaloop-nextest-linnet> report: target/nextest/ci_gammaloop/junit.xml
  53. 30.90 s gammaloop-nextest-linnet> tests: 0, failures: 0, errors: 0
  54. 30.90 s gammaloop-nextest-linnet> No failing testcases found.
  55. 30.90 s gammaloop-nextest-linnet> =========================================
  56. 30.95 s gammaloop-nextest-linnet> Extracting 2 binaries (including 1 non-test binary) and 1 linked path to /build/source
  57. 31.10 s gammaloop-nextest-linnet> Extracted 9 files to /build/source in 0.15s
  58. 31.13 s gammaloop-nextest-linnet> ------------
  59. 31.13 s gammaloop-nextest-linnet> Nextest run ID 6faa0f6f-54b8-4179-90d0-fc4ffda4dc1b with nextest profile: ci_gammaloop
  60. 31.13 s gammaloop-nextest-linnet> Starting 128 tests across 1 binary
  61. 31.32 s gammaloop-nextest-linnet> FAIL [ 0.035s] (116/128) linnest tests::test_graph_structural_axis_merge_preserves_edge_positions_and_constraints
  62. 31.32 s gammaloop-nextest-linnet> stdout ---
  63. 31.32 s gammaloop-nextest-linnet>
  64. 31.32 s gammaloop-nextest-linnet> running 1 test
  65. 31.32 s gammaloop-nextest-linnet> test tests::test_graph_structural_axis_merge_preserves_edge_positions_and_constraints ... FAILED
  66. 31.32 s gammaloop-nextest-linnet>
  67. 31.32 s gammaloop-nextest-linnet> failures:
  68. 31.32 s gammaloop-nextest-linnet>
  69. 31.32 s gammaloop-nextest-linnet> failures:
  70. 31.32 s gammaloop-nextest-linnet> tests::test_graph_structural_axis_merge_preserves_edge_positions_and_constraints
  71. 31.32 s gammaloop-nextest-linnet>
  72. 31.32 s gammaloop-nextest-linnet> test result: FAILED. 0 passed; 1 failed; 0 ignored; 0 measured; 127 filtered out; finished in 0.01s
  73. 31.32 s gammaloop-nextest-linnet>
  74. 31.32 s gammaloop-nextest-linnet> stderr ---
  75. 31.32 s gammaloop-nextest-linnet>
  76. 31.32 s gammaloop-nextest-linnet> thread 'tests::test_graph_structural_axis_merge_preserves_edge_positions_and_constraints' (940) panicked at crates/linnest/src/tests.rs:1721:32:
  77. 31.32 s gammaloop-nextest-linnet> no entry found for key
  78. 31.32 s gammaloop-nextest-linnet> stack backtrace:
  79. 31.32 s gammaloop-nextest-linnet> 0: __rustc::rust_begin_unwind
  80. 31.32 s gammaloop-nextest-linnet> 1: core::panicking::panic_fmt
  81. 31.32 s gammaloop-nextest-linnet> 2: core::option::expect_failed
  82. 31.32 s gammaloop-nextest-linnet> 3: linnest::tests::test_graph_structural_axis_merge_preserves_edge_positions_and_constraints
  83. 31.32 s gammaloop-nextest-linnet> 4: <linnest::tests::test_graph_structural_axis_merge_preserves_edge_positions_and_constraints::{closure#0} as core::ops::function::FnOnce<()>>::call_once
  84. 31.32 s gammaloop-nextest-linnet> note: Some details are omitted, run with `RUST_BACKTRACE=full` for a verbose backtrace.
  85. 31.32 s gammaloop-nextest-linnet>
  86. 31.34 s gammaloop-nextest-linnet> ------------
  87. 31.34 s gammaloop-nextest-linnet> Summary [ 0.208s] 128 tests run: 127 passed, 1 failed, 0 skipped
  88. 31.34 s gammaloop-nextest-linnet> FAIL [ 0.035s] (116/128) linnest tests::test_graph_structural_axis_merge_preserves_edge_positions_and_constraints
  89. 31.34 s gammaloop-nextest-linnet> stdout ---
  90. 31.34 s gammaloop-nextest-linnet>
  91. 31.34 s gammaloop-nextest-linnet> running 1 test
  92. 31.34 s gammaloop-nextest-linnet> test tests::test_graph_structural_axis_merge_preserves_edge_positions_and_constraints ... FAILED
  93. 31.34 s gammaloop-nextest-linnet>
  94. 31.34 s gammaloop-nextest-linnet> failures:
  95. 31.34 s gammaloop-nextest-linnet>
  96. 31.34 s gammaloop-nextest-linnet> failures:
  97. 31.34 s gammaloop-nextest-linnet> tests::test_graph_structural_axis_merge_preserves_edge_positions_and_constraints
  98. 31.34 s gammaloop-nextest-linnet>
  99. 31.34 s gammaloop-nextest-linnet> test result: FAILED. 0 passed; 1 failed; 0 ignored; 0 measured; 127 filtered out; finished in 0.01s
  100. 31.34 s gammaloop-nextest-linnet>
  101. 31.34 s gammaloop-nextest-linnet> stderr ---
  102. 31.34 s gammaloop-nextest-linnet>
  103. 31.34 s gammaloop-nextest-linnet> thread 'tests::test_graph_structural_axis_merge_preserves_edge_positions_and_constraints' (940) panicked at crates/linnest/src/tests.rs:1721:32:
  104. 31.34 s gammaloop-nextest-linnet> no entry found for key
  105. 31.34 s gammaloop-nextest-linnet> stack backtrace:
  106. 31.34 s gammaloop-nextest-linnet> 0: __rustc::rust_begin_unwind
  107. 31.34 s gammaloop-nextest-linnet> 1: core::panicking::panic_fmt
  108. 31.34 s gammaloop-nextest-linnet> 2: core::option::expect_failed
  109. 31.34 s gammaloop-nextest-linnet> 3: linnest::tests::test_graph_structural_axis_merge_preserves_edge_positions_and_constraints
  110. 31.34 s gammaloop-nextest-linnet> 4: <linnest::tests::test_graph_structural_axis_merge_preserves_edge_positions_and_constraints::{closure#0} as core::ops::function::FnOnce<()>>::call_once
  111. 31.34 s gammaloop-nextest-linnet> note: Some details are omitted, run with `RUST_BACKTRACE=full` for a verbose backtrace.
  112. 31.34 s gammaloop-nextest-linnet>
  113. 31.36 s gammaloop-nextest-linnet> error: test run failed
  114. 31.43 s gammaloop-nextest-linnet>
  115. 31.43 s gammaloop-nextest-linnet> ========== nextest test summary ==========
  116. 31.43 s gammaloop-nextest-linnet> report: target/nextest/ci_gammaloop/junit.xml
  117. 31.43 s gammaloop-nextest-linnet> tests: 128, failures: 1, errors: 0
  118. 31.43 s gammaloop-nextest-linnet>
  119. 31.43 s gammaloop-nextest-linnet> 1. linnest::tests::test_graph_structural_axis_merge_preserves_edge_positions_and_constraints
  120. 31.43 s gammaloop-nextest-linnet> failure: test failure with exit code 101
  121. 31.43 s gammaloop-nextest-linnet> thread 'tests::test_graph_structural_axis_merge_preserves_edge_positions_and_constraints' (940) panicked at crates/linnest/src/tests.rs:1721:32:
  122. 31.43 s gammaloop-nextest-linnet> no entry found for key
  123. 31.43 s gammaloop-nextest-linnet> stack backtrace:
  124. 31.43 s gammaloop-nextest-linnet> 0: __rustc::rust_begin_unwind
  125. 31.43 s gammaloop-nextest-linnet> 1: core::panicking::panic_fmt
  126. 31.43 s gammaloop-nextest-linnet> 2: core::option::expect_failed
  127. 31.43 s gammaloop-nextest-linnet> 3: linnest::tests::test_graph_structural_axis_merge_preserves_edge_positions_and_constraints
  128. 31.43 s gammaloop-nextest-linnet> 4: <linnest::tests::test_graph_structural_axis_merge_preserves_edge_positions_and_constraints::{closure#0} as core::ops::function::FnOnce<()>>::call_once
  129. 31.43 s gammaloop-nextest-linnet> note: Some details are omitted, run with `RUST_BACKTRACE=full` for a verbose backtrace.
  130. 31.43 s gammaloop-nextest-linnet> system-out
  131. 31.43 s gammaloop-nextest-linnet> running 1 test
  132. 31.43 s gammaloop-nextest-linnet> test tests::test_graph_structural_axis_merge_preserves_edge_positions_and_constraints ... FAILED
  133. 31.43 s gammaloop-nextest-linnet>
  134. 31.43 s gammaloop-nextest-linnet> failures:
  135. 31.43 s gammaloop-nextest-linnet>
  136. 31.43 s gammaloop-nextest-linnet> failures:
  137. 31.43 s gammaloop-nextest-linnet> tests::test_graph_structural_axis_merge_preserves_edge_positions_and_constraints
  138. 31.43 s gammaloop-nextest-linnet>
  139. 31.43 s gammaloop-nextest-linnet> test result: FAILED. 0 passed; 1 failed; 0 ignored; 0 measured; 127 filtered out; finished in 0.01s
  140. 31.43 s gammaloop-nextest-linnet> system-err
  141. 31.43 s gammaloop-nextest-linnet> thread 'tests::test_graph_structural_axis_merge_preserves_edge_positions_and_constraints' (940) panicked at crates/linnest/src/tests.rs:1721:32:
  142. 31.43 s gammaloop-nextest-linnet> no entry found for key
  143. 31.43 s gammaloop-nextest-linnet> stack backtrace:
  144. 31.43 s gammaloop-nextest-linnet> 0: __rustc::rust_begin_unwind
  145. 31.43 s gammaloop-nextest-linnet> 1: core::panicking::panic_fmt
  146. 31.43 s gammaloop-nextest-linnet> 2: core::option::expect_failed
  147. 31.43 s gammaloop-nextest-linnet> 3: linnest::tests::test_graph_structural_axis_merge_preserves_edge_positions_and_constraints
  148. 31.43 s gammaloop-nextest-linnet> 4: <linnest::tests::test_graph_structural_axis_merge_preserves_edge_positions_and_constraints::{closure#0} as core::ops::function::FnOnce<()>>::call_once
  149. 31.43 s gammaloop-nextest-linnet> note: Some details are omitted, run with `RUST_BACKTRACE=full` for a verbose backtrace.
  150. 31.43 s gammaloop-nextest-linnet> =========================================
  151. 31.61 s error: Cannot build '/nix/store/3a6s86hhbf2g1hgbkmcq3zdrmaha78qr-gammaloop-nextest-linnet.drv'.
  152. 31.61 s Reason: builder failed with exit code 100.
  153. 31.61 s Output paths:
  154. 31.61 s /nix/store/v4cbh6ql60kq7xlziivk5va382nw7f4v-gammaloop-nextest-linnet
  155. 31.61 s Last 134 log lines:
  156. 31.61 s > Extracting 2 binaries (including 1 non-test binary) to /build/source
  157. 31.61 s > Extracted 6 files to /build/source in 0.08s
  158. 31.61 s > ------------
  159. 31.61 s > Nextest run ID 00e473e4-9b52-497e-9274-ea65e5a61181 with nextest profile: ci_gammaloop
  160. 31.61 s > Starting 24 tests across 1 binary
  161. 31.61 s > ------------
  162. 31.61 s > Summary [ 0.066s] 24 tests run: 24 passed, 0 skipped
  163. 31.61 s >
  164. 31.61 s > ========== nextest test summary ==========
  165. 31.61 s > report: target/nextest/ci_gammaloop/junit.xml
  166. 31.61 s > tests: 24, failures: 0, errors: 0
  167. 31.61 s > No failing testcases found.
  168. 31.61 s > =========================================
  169. 31.61 s > Extracting 2 binaries (including 1 non-test binary) and 1 linked path to /build/source
  170. 31.61 s > Extracted 9 files to /build/source in 0.25s
  171. 31.61 s > ------------
  172. 31.61 s > Nextest run ID 653538a0-967e-4448-afb9-51364e6dda60 with nextest profile: ci_gammaloop
  173. 31.61 s > Starting 183 tests across 1 binary
  174. 31.61 s > ------------
  175. 31.61 s > Summary [ 0.425s] 183 tests run: 183 passed, 0 skipped
  176. 31.61 s >
  177. 31.61 s > ========== nextest test summary ==========
  178. 31.61 s > report: target/nextest/ci_gammaloop/junit.xml
  179. 31.61 s > tests: 183, failures: 0, errors: 0
  180. 31.61 s > No failing testcases found.
  181. 31.61 s > =========================================
  182. 31.61 s > Extracting 4 binaries (including 3 non-test binaries), 1 build script output directory, and 1 linked path to /build/source
  183. 31.61 s > Extracted 13 files to /build/source in 0.43s
  184. 31.61 s > ------------
  185. 31.61 s > Nextest run ID 72bc01dc-cd71-4bb7-8beb-53268d12e43f with nextest profile: ci_gammaloop
  186. 31.61 s > Starting 0 tests across 1 binary
  187. 31.61 s > ------------
  188. 31.61 s > Summary [ 0.003s] 0 tests run: 0 passed, 0 skipped
  189. 31.61 s >
  190. 31.61 s > ========== nextest test summary ==========
  191. 31.61 s > report: target/nextest/ci_gammaloop/junit.xml
  192. 31.61 s > tests: 0, failures: 0, errors: 0
  193. 31.61 s > No failing testcases found.
  194. 31.61 s > =========================================
  195. 31.61 s > Extracting 2 binaries (including 1 non-test binary) and 1 linked path to /build/source
  196. 31.61 s > Extracted 9 files to /build/source in 0.15s
  197. 31.61 s > ------------
  198. 31.61 s > Nextest run ID 6faa0f6f-54b8-4179-90d0-fc4ffda4dc1b with nextest profile: ci_gammaloop
  199. 31.61 s > Starting 128 tests across 1 binary
  200. 31.61 s > FAIL [ 0.035s] (116/128) linnest tests::test_graph_structural_axis_merge_preserves_edge_positions_and_constraints
  201. 31.61 s > stdout ---
  202. 31.61 s >
  203. 31.61 s > running 1 test
  204. 31.61 s > test tests::test_graph_structural_axis_merge_preserves_edge_positions_and_constraints ... FAILED
  205. 31.61 s >
  206. 31.61 s > failures:
  207. 31.61 s >
  208. 31.61 s > failures:
  209. 31.61 s > tests::test_graph_structural_axis_merge_preserves_edge_positions_and_constraints
  210. 31.61 s >
  211. 31.61 s > test result: FAILED. 0 passed; 1 failed; 0 ignored; 0 measured; 127 filtered out; finished in 0.01s
  212. 31.61 s >
  213. 31.61 s > stderr ---
  214. 31.61 s >
  215. 31.61 s > thread 'tests::test_graph_structural_axis_merge_preserves_edge_positions_and_constraints' (940) panicked at crates/linnest/src/tests.rs:1721:32:
  216. 31.61 s > no entry found for key
  217. 31.61 s > stack backtrace:
  218. 31.61 s > 0: __rustc::rust_begin_unwind
  219. 31.61 s > 1: core::panicking::panic_fmt
  220. 31.61 s > 2: core::option::expect_failed
  221. 31.61 s > 3: linnest::tests::test_graph_structural_axis_merge_preserves_edge_positions_and_constraints
  222. 31.61 s > 4: <linnest::tests::test_graph_structural_axis_merge_preserves_edge_positions_and_constraints::{closure#0} as core::ops::function::FnOnce<()>>::call_once
  223. 31.61 s > note: Some details are omitted, run with `RUST_BACKTRACE=full` for a verbose backtrace.
  224. 31.61 s >
  225. 31.61 s > ------------
  226. 31.61 s > Summary [ 0.208s] 128 tests run: 127 passed, 1 failed, 0 skipped
  227. 31.61 s > FAIL [ 0.035s] (116/128) linnest tests::test_graph_structural_axis_merge_preserves_edge_positions_and_constraints
  228. 31.61 s > stdout ---
  229. 31.61 s >
  230. 31.61 s > running 1 test
  231. 31.61 s > test tests::test_graph_structural_axis_merge_preserves_edge_positions_and_constraints ... FAILED
  232. 31.61 s >
  233. 31.61 s > failures:
  234. 31.61 s >
  235. 31.61 s > failures:
  236. 31.61 s > tests::test_graph_structural_axis_merge_preserves_edge_positions_and_constraints
  237. 31.61 s >
  238. 31.61 s > test result: FAILED. 0 passed; 1 failed; 0 ignored; 0 measured; 127 filtered out; finished in 0.01s
  239. 31.61 s >
  240. 31.61 s > stderr ---
  241. 31.61 s >
  242. 31.61 s > thread 'tests::test_graph_structural_axis_merge_preserves_edge_positions_and_constraints' (940) panicked at crates/linnest/src/tests.rs:1721:32:
  243. 31.61 s > no entry found for key
  244. 31.61 s > stack backtrace:
  245. 31.61 s > 0: __rustc::rust_begin_unwind
  246. 31.61 s > 1: core::panicking::panic_fmt
  247. 31.61 s > 2: core::option::expect_failed
  248. 31.61 s > 3: linnest::tests::test_graph_structural_axis_merge_preserves_edge_positions_and_constraints
  249. 31.61 s > 4: <linnest::tests::test_graph_structural_axis_merge_preserves_edge_positions_and_constraints::{closure#0} as core::ops::function::FnOnce<()>>::call_once
  250. 31.61 s > note: Some details are omitted, run with `RUST_BACKTRACE=full` for a verbose backtrace.
  251. 31.61 s >
  252. 31.61 s > error: test run failed
  253. 31.61 s >
  254. 31.61 s > ========== nextest test summary ==========
  255. 31.61 s > report: target/nextest/ci_gammaloop/junit.xml
  256. 31.61 s > tests: 128, failures: 1, errors: 0
  257. 31.61 s >
  258. 31.61 s > 1. linnest::tests::test_graph_structural_axis_merge_preserves_edge_positions_and_constraints
  259. 31.61 s > failure: test failure with exit code 101
  260. 31.61 s > thread 'tests::test_graph_structural_axis_merge_preserves_edge_positions_and_constraints' (940) panicked at crates/linnest/src/tests.rs:1721:32:
  261. 31.61 s > no entry found for key
  262. 31.61 s > stack backtrace:
  263. 31.61 s > 0: __rustc::rust_begin_unwind
  264. 31.61 s > 1: core::panicking::panic_fmt
  265. 31.61 s > 2: core::option::expect_failed
  266. 31.61 s > 3: linnest::tests::test_graph_structural_axis_merge_preserves_edge_positions_and_constraints
  267. 31.61 s > 4: <linnest::tests::test_graph_structural_axis_merge_preserves_edge_positions_and_constraints::{closure#0} as core::ops::function::FnOnce<()>>::call_once
  268. 31.61 s > note: Some details are omitted, run with `RUST_BACKTRACE=full` for a verbose backtrace.
  269. 31.61 s > system-out
  270. 31.61 s > running 1 test
  271. 31.61 s > test tests::test_graph_structural_axis_merge_preserves_edge_positions_and_constraints ... FAILED
  272. 31.61 s >
  273. 31.61 s > failures:
  274. 31.61 s >
  275. 31.61 s > failures:
  276. 31.61 s > tests::test_graph_structural_axis_merge_preserves_edge_positions_and_constraints
  277. 31.61 s >
  278. 31.61 s > test result: FAILED. 0 passed; 1 failed; 0 ignored; 0 measured; 127 filtered out; finished in 0.01s
  279. 31.61 s > system-err
  280. 31.61 s > thread 'tests::test_graph_structural_axis_merge_preserves_edge_positions_and_constraints' (940) panicked at crates/linnest/src/tests.rs:1721:32:
  281. 31.61 s > no entry found for key
  282. 31.61 s > stack backtrace:
  283. 31.61 s > 0: __rustc::rust_begin_unwind
  284. 31.61 s > 1: core::panicking::panic_fmt
  285. 31.61 s > 2: core::option::expect_failed
  286. 31.61 s > 3: linnest::tests::test_graph_structural_axis_merge_preserves_edge_positions_and_constraints
  287. 31.61 s > 4: <linnest::tests::test_graph_structural_axis_merge_preserves_edge_positions_and_constraints::{closure#0} as core::ops::function::FnOnce<()>>::call_once
  288. 31.61 s > note: Some details are omitted, run with `RUST_BACKTRACE=full` for a verbose backtrace.
  289. 31.61 s > =========================================
  290. 31.61 s For full logs, run:
  291. 31.61 s nix log /nix/store/3a6s86hhbf2g1hgbkmcq3zdrmaha78qr-gammaloop-nextest-linnet.drv
  292. 31.84 s [0 built (1 failed)]Run failed.