test packages.x86_64-linux.nix-ci-check-gammaloop-nextest-linnet

Reproduce this run
Retry Run
  1. 0.08 s $ /nix/store/9ypz3flqsrl5xl495mm8h645gadjsxi1-coreutils-9.11/bin/timeout --kill-after=15s 7200s /nix/store/23zk8sgzamrbmj1fday15szf7f2279s8-nix-2.34.7/bin/nix --extra-experimental-features nix-command --extra-experimental-features flakes flake clone git+https://github.com/alphal00p/gammaloop --dest /tmp/nix-ci-worker/stable-pwd/repo/
  2. 0.27 s Cloning into '/tmp/nix-ci-worker/stable-pwd/repo'...
  3. 1.34 s remote: Enumerating objects: 87907, done.
  4. 1.59 s remote: Counting objects: 0% (1/10475) remote: Counting objects: 1% (105/10475) remote: Counting objects: 2% (210/10475) remote: Counting objects: 3% (315/10475) remote: Counting objects: 4% (419/10475) remote: Counting objects: 5% (524/10475) remote: Counting objects: 6% (629/10475) remote: Counting objects: 7% (734/10475) remote: Counting objects: 8% (838/10475) remote: Counting objects: 9% (943/10475) remote: Counting objects: 10% (1048/10475) remote: Counting objects: 11% (1153/10475) remote: Counting objects: 12% (1257/10475) remote: Counting objects: 13% (1362/10475) remote: Counting objects: 14% (1467/10475) remote: Counting objects: 15% (1572/10475) remote: Counting objects: 16% (1676/10475) remote: Counting objects: 17% (1781/10475) remote: Counting objects: 18% (1886/10475) remote: Counting objects: 19% (1991/10475) remote: Counting objects: 20% (2095/10475) remote: Counting objects: 21% (2200/10475) remote: Counting objects: 22% (2305/10475) remote: Counting objects: 23% (2410/10475) remote: Counting objects: 24% (2514/10475) remote: Counting objects: 25% (2619/10475) remote: Counting objects: 26% (2724/10475) remote: Counting objects: 27% (2829/10475) remote: Counting objects: 28% (2933/10475) remote: Counting objects: 29% (3038/10475) remote: Counting objects: 30% (3143/10475) remote: Counting objects: 31% (3248/10475) remote: Counting objects: 32% (3352/10475) remote: Counting objects: 33% (3457/10475) remote: Counting objects: 34% (3562/10475) remote: Counting objects: 35% (3667/10475) remote: Counting objects: 36% (3771/10475) remote: Counting objects: 37% (3876/10475) remote: Counting objects: 38% (3981/10475) remote: Counting objects: 39% (4086/10475) remote: Counting objects: 40% (4190/10475) remote: Counting objects: 41% (4295/10475) remote: Counting objects: 42% (4400/10475) remote: Counting objects: 43% (4505/10475) remote: Counting objects: 44% (4609/10475) remote: Counting objects: 45% (4714/10475) remote: Counting objects: 46% (4819/10475) remote: Counting objects: 47% (4924/10475) remote: Counting objects: 48% (5028/10475) remote: Counting objects: 49% (5133/10475) remote: Counting objects: 50% (5238/10475) remote: Counting objects: 51% (5343/10475) remote: Counting objects: 52% (5447/10475) remote: Counting objects: 53% (5552/10475) remote: Counting objects: 54% (5657/10475) remote: Counting objects: 55% (5762/10475) remote: Counting objects: 56% (5866/10475) remote: Counting objects: 57% (5971/10475) remote: Counting objects: 58% (6076/10475) remote: Counting objects: 59% (6181/10475) remote: Counting objects: 60% (6285/10475) remote: Counting objects: 61% (6390/10475) remote: Counting objects: 62% (6495/10475) remote: Counting objects: 63% (6600/10475) remote: Counting objects: 64% (6704/10475) remote: Counting objects: 65% (6809/10475) remote: Counting objects: 66% (6914/10475) remote: Counting objects: 67% (7019/10475) remote: Counting objects: 68% (7123/10475) remote: Counting objects: 69% (7228/10475) remote: Counting objects: 70% (7333/10475) remote: Counting objects: 71% (7438/10475) remote: Counting objects: 72% (7542/10475) remote: Counting objects: 73% (7647/10475) remote: Counting objects: 74% (7752/10475) remote: Counting objects: 75% (7857/10475) remote: Counting objects: 76% (7961/10475) remote: Counting objects: 77% (8066/10475) remote: Counting objects: 78% (8171/10475) remote: Counting objects: 79% (8276/10475) remote: Counting objects: 80% (8380/10475) remote: Counting objects: 81% (8485/10475) remote: Counting objects: 82% (8590/10475) remote: Counting objects: 83% (8695/10475) remote: Counting objects: 84% (8799/10475) remote: Counting objects: 85% (8904/10475) remote: Counting objects: 86% (9009/10475) remote: Counting objects: 87% (9114/10475) remote: Counting objects: 88% (9218/10475) remote: Counting objects: 89% (9323/10475) remote: Counting objects: 90% (9428/10475) remote: Counting objects: 91% (9533/10475) remote: Counting objects: 92% (9637/10475) remote: Counting objects: 93% (9742/10475) remote: Counting objects: 94% (9847/10475) remote: Counting objects: 95% (9952/10475) remote: Counting objects: 96% (10056/10475) remote: Counting objects: 97% (10161/10475) remote: Counting objects: 98% (10266/10475) remote: Counting objects: 99% (10371/10475) remote: Counting objects: 100% (10475/10475) remote: Counting objects: 100% (10475/10475), done.
  5. 4.77 s remote: Compressing objects: 0% (1/2923) remote: Compressing objects: 1% (30/2923) remote: Compressing objects: 2% (59/2923) remote: Compressing objects: 3% (88/2923) remote: Compressing objects: 4% (117/2923) remote: Compressing objects: 5% (147/2923) remote: Compressing objects: 6% (176/2923) remote: Compressing objects: 7% (205/2923) remote: Compressing objects: 8% (234/2923) remote: Compressing objects: 9% (264/2923) remote: Compressing objects: 10% (293/2923) remote: Compressing objects: 11% (322/2923) remote: Compressing objects: 12% (351/2923) remote: Compressing objects: 13% (380/2923) remote: Compressing objects: 14% (410/2923) remote: Compressing objects: 14% (427/2923) remote: Compressing objects: 15% (439/2923) remote: Compressing objects: 16% (468/2923) remote: Compressing objects: 17% (497/2923) remote: Compressing objects: 18% (527/2923) remote: Compressing objects: 19% (556/2923) remote: Compressing objects: 20% (585/2923) remote: Compressing objects: 21% (614/2923) remote: Compressing objects: 22% (644/2923) remote: Compressing objects: 23% (673/2923) remote: Compressing objects: 24% (702/2923) remote: Compressing objects: 25% (731/2923) remote: Compressing objects: 25% (738/2923) remote: Compressing objects: 26% (760/2923) remote: Compressing objects: 27% (790/2923) remote: Compressing objects: 28% (819/2923) remote: Compressing objects: 29% (848/2923) remote: Compressing objects: 30% (877/2923) remote: Compressing objects: 31% (907/2923) remote: Compressing objects: 32% (936/2923) remote: Compressing objects: 32% (940/2923) remote: Compressing objects: 33% (965/2923) remote: Compressing objects: 34% (994/2923) remote: Compressing objects: 35% (1024/2923) remote: Compressing objects: 36% (1053/2923) remote: Compressing objects: 37% (1082/2923) remote: Compressing objects: 38% (1111/2923) remote: Compressing objects: 39% (1140/2923) remote: Compressing objects: 40% (1170/2923) remote: Compressing objects: 41% (1199/2923) remote: Compressing objects: 42% (1228/2923) remote: Compressing objects: 43% (1257/2923) remote: Compressing objects: 44% (1287/2923) remote: Compressing objects: 45% (1316/2923) remote: Compressing objects: 46% (1345/2923) remote: Compressing objects: 47% (1374/2923) remote: Compressing objects: 48% (1404/2923) remote: Compressing objects: 49% (1433/2923) remote: Compressing objects: 50% (1462/2923) remote: Compressing objects: 51% (1491/2923) remote: Compressing objects: 52% (1520/2923) remote: Compressing objects: 53% (1550/2923) remote: Compressing objects: 54% (1579/2923) remote: Compressing objects: 55% (1608/2923) remote: Compressing objects: 56% (1637/2923) remote: Compressing objects: 57% (1667/2923) remote: Compressing objects: 58% (1696/2923) remote: Compressing objects: 59% (1725/2923) remote: Compressing objects: 60% (1754/2923) remote: Compressing objects: 61% (1784/2923) remote: Compressing objects: 62% (1813/2923) remote: Compressing objects: 63% (1842/2923) remote: Compressing objects: 64% (1871/2923) remote: Compressing objects: 65% (1900/2923) remote: Compressing objects: 66% (1930/2923) remote: Compressing objects: 67% (1959/2923) remote: Compressing objects: 68% (1988/2923) remote: Compressing objects: 69% (2017/2923) remote: Compressing objects: 70% (2047/2923) remote: Compressing objects: 71% (2076/2923) remote: Compressing objects: 72% (2105/2923) remote: Compressing objects: 73% (2134/2923) remote: Compressing objects: 74% (2164/2923) remote: Compressing objects: 75% (2193/2923) remote: Compressing objects: 76% (2222/2923) remote: Compressing objects: 77% (2251/2923) remote: Compressing objects: 78% (2280/2923) remote: Compressing objects: 79% (2310/2923) remote: Compressing objects: 80% (2339/2923) remote: Compressing objects: 81% (2368/2923) remote: Compressing objects: 82% (2397/2923) remote: Compressing objects: 83% (2427/2923) remote: Compressing objects: 84% (2456/2923) remote: Compressing objects: 85% (2485/2923) remote: Compressing objects: 86% (2514/2923) remote: Compressing objects: 87% (2544/2923) remote: Compressing objects: 88% (2573/2923) remote: Compressing objects: 89% (2602/2923) remote: Compressing objects: 90% (2631/2923) remote: Compressing objects: 91% (2660/2923) remote: Compressing objects: 92% (2690/2923) remote: Compressing objects: 93% (2719/2923) remote: Compressing objects: 94% (2748/2923) remote: Compressing objects: 95% (2777/2923) remote: Compressing objects: 96% (2807/2923) remote: Compressing objects: 97% (2836/2923) remote: Compressing objects: 98% (2865/2923) remote: Compressing objects: 99% (2894/2923) remote: Compressing objects: 100% (2923/2923) remote: Compressing objects: 100% (2923/2923), done.
  6. 10.89 s Receiving objects: 0% (1/87907) Receiving objects: 1% (880/87907) Receiving objects: 2% (1759/87907) Receiving objects: 3% (2638/87907) Receiving objects: 4% (3517/87907) Receiving objects: 5% (4396/87907) Receiving objects: 6% (5275/87907), 9.36 MiB | 18.70 MiB/s Receiving objects: 7% (6154/87907), 9.36 MiB | 18.70 MiB/s Receiving objects: 8% (7033/87907), 9.36 MiB | 18.70 MiB/s Receiving objects: 9% (7912/87907), 9.36 MiB | 18.70 MiB/s Receiving objects: 10% (8791/87907), 9.36 MiB | 18.70 MiB/s Receiving objects: 11% (9670/87907), 9.36 MiB | 18.70 MiB/s Receiving objects: 12% (10549/87907), 9.36 MiB | 18.70 MiB/s Receiving objects: 13% (11428/87907), 9.36 MiB | 18.70 MiB/s Receiving objects: 14% (12307/87907), 9.36 MiB | 18.70 MiB/s Receiving objects: 15% (13187/87907), 9.36 MiB | 18.70 MiB/s Receiving objects: 16% (14066/87907), 9.36 MiB | 18.70 MiB/s Receiving objects: 17% (14945/87907), 9.36 MiB | 18.70 MiB/s Receiving objects: 18% (15824/87907), 9.36 MiB | 18.70 MiB/s Receiving objects: 19% (16703/87907), 9.36 MiB | 18.70 MiB/s Receiving objects: 20% (17582/87907), 9.36 MiB | 18.70 MiB/s Receiving objects: 21% (18461/87907), 9.36 MiB | 18.70 MiB/s Receiving objects: 22% (19340/87907), 9.36 MiB | 18.70 MiB/s Receiving objects: 23% (20219/87907), 9.36 MiB | 18.70 MiB/s Receiving objects: 24% (21098/87907), 9.36 MiB | 18.70 MiB/s Receiving objects: 25% (21977/87907), 9.36 MiB | 18.70 MiB/s Receiving objects: 26% (22856/87907), 9.36 MiB | 18.70 MiB/s Receiving objects: 27% (23735/87907), 9.36 MiB | 18.70 MiB/s Receiving objects: 28% (24614/87907), 9.36 MiB | 18.70 MiB/s Receiving objects: 29% (25494/87907), 9.36 MiB | 18.70 MiB/s Receiving objects: 29% (25573/87907), 9.36 MiB | 18.70 MiB/s Receiving objects: 30% (26373/87907), 26.34 MiB | 26.35 MiB/s Receiving objects: 31% (27252/87907), 26.34 MiB | 26.35 MiB/s Receiving objects: 32% (28131/87907), 26.34 MiB | 26.35 MiB/s Receiving objects: 33% (29010/87907), 26.34 MiB | 26.35 MiB/s Receiving objects: 34% (29889/87907), 26.34 MiB | 26.35 MiB/s Receiving objects: 35% (30768/87907), 26.34 MiB | 26.35 MiB/s Receiving objects: 36% (31647/87907), 26.34 MiB | 26.35 MiB/s Receiving objects: 37% (32526/87907), 26.34 MiB | 26.35 MiB/s Receiving objects: 38% (33405/87907), 26.34 MiB | 26.35 MiB/s Receiving objects: 39% (34284/87907), 26.34 MiB | 26.35 MiB/s Receiving objects: 40% (35163/87907), 26.34 MiB | 26.35 MiB/s Receiving objects: 41% (36042/87907), 26.34 MiB | 26.35 MiB/s Receiving objects: 42% (36921/87907), 26.34 MiB | 26.35 MiB/s Receiving objects: 43% (37801/87907), 40.14 MiB | 26.77 MiB/s Receiving objects: 44% (38680/87907), 40.14 MiB | 26.77 MiB/s Receiving objects: 45% (39559/87907), 40.14 MiB | 26.77 MiB/s Receiving objects: 46% (40438/87907), 40.14 MiB | 26.77 MiB/s Receiving objects: 47% (41317/87907), 40.14 MiB | 26.77 MiB/s Receiving objects: 48% (42196/87907), 40.14 MiB | 26.77 MiB/s Receiving objects: 49% (43075/87907), 40.14 MiB | 26.77 MiB/s Receiving objects: 50% (43954/87907), 40.14 MiB | 26.77 MiB/s Receiving objects: 51% (44833/87907), 40.14 MiB | 26.77 MiB/s Receiving objects: 51% (45083/87907), 40.14 MiB | 26.77 MiB/s Receiving objects: 52% (45712/87907), 54.44 MiB | 27.23 MiB/s Receiving objects: 53% (46591/87907), 54.44 MiB | 27.23 MiB/s Receiving objects: 54% (47470/87907), 54.44 MiB | 27.23 MiB/s Receiving objects: 55% (48349/87907), 54.44 MiB | 27.23 MiB/s Receiving objects: 56% (49228/87907), 54.44 MiB | 27.23 MiB/s Receiving objects: 57% (50107/87907), 69.04 MiB | 27.62 MiB/s Receiving objects: 58% (50987/87907), 69.04 MiB | 27.62 MiB/s Receiving objects: 59% (51866/87907), 69.04 MiB | 27.62 MiB/s Receiving objects: 60% (52745/87907), 69.04 MiB | 27.62 MiB/s Receiving objects: 61% (53624/87907), 69.04 MiB | 27.62 MiB/s Receiving objects: 62% (54503/87907), 69.04 MiB | 27.62 MiB/s Receiving objects: 63% (55382/87907), 69.04 MiB | 27.62 MiB/s Receiving objects: 64% (56261/87907), 69.04 MiB | 27.62 MiB/s Receiving objects: 65% (57140/87907), 69.04 MiB | 27.62 MiB/s Receiving objects: 65% (57356/87907), 83.86 MiB | 27.92 MiB/s Receiving objects: 66% (58019/87907), 99.34 MiB | 28.31 MiB/s Receiving objects: 67% (58898/87907), 99.34 MiB | 28.31 MiB/s Receiving objects: 68% (59777/87907), 99.34 MiB | 28.31 MiB/s Receiving objects: 69% (60656/87907), 99.34 MiB | 28.31 MiB/s Receiving objects: 69% (61414/87907), 99.34 MiB | 28.31 MiB/s Receiving objects: 70% (61535/87907), 99.34 MiB | 28.31 MiB/s Receiving objects: 71% (62414/87907), 113.83 MiB | 28.39 MiB/s Receiving objects: 72% (63294/87907), 113.83 MiB | 28.39 MiB/s Receiving objects: 73% (64173/87907), 113.83 MiB | 28.39 MiB/s Receiving objects: 74% (65052/87907), 128.18 MiB | 28.43 MiB/s Receiving objects: 75% (65931/87907), 128.18 MiB | 28.43 MiB/s Receiving objects: 76% (66810/87907), 128.18 MiB | 28.43 MiB/s Receiving objects: 77% (67689/87907), 128.18 MiB | 28.43 MiB/s Receiving objects: 78% (68568/87907), 128.18 MiB | 28.43 MiB/s Receiving objects: 79% (69447/87907), 128.18 MiB | 28.43 MiB/s Receiving objects: 80% (70326/87907), 128.18 MiB | 28.43 MiB/s Receiving objects: 81% (71205/87907), 128.18 MiB | 28.43 MiB/s Receiving objects: 82% (72084/87907), 128.18 MiB | 28.43 MiB/s Receiving objects: 83% (72963/87907), 128.18 MiB | 28.43 MiB/s Receiving objects: 84% (73842/87907), 128.18 MiB | 28.43 MiB/s Receiving objects: 84% (74081/87907), 143.37 MiB | 29.72 MiB/s Receiving objects: 85% (74721/87907), 143.37 MiB | 29.72 MiB/s Receiving objects: 86% (75601/87907), 143.37 MiB | 29.72 MiB/s Receiving objects: 87% (76480/87907), 143.37 MiB | 29.72 MiB/s Receiving objects: 88% (77359/87907), 143.37 MiB | 29.72 MiB/s Receiving objects: 89% (78238/87907), 143.37 MiB | 29.72 MiB/s Receiving objects: 90% (79117/87907), 143.37 MiB | 29.72 MiB/s Receiving objects: 91% (79996/87907), 143.37 MiB | 29.72 MiB/s Receiving objects: 92% (80875/87907), 143.37 MiB | 29.72 MiB/s Receiving objects: 93% (81754/87907), 143.37 MiB | 29.72 MiB/s Receiving objects: 94% (82633/87907), 143.37 MiB | 29.72 MiB/s Receiving objects: 95% (83512/87907), 143.37 MiB | 29.72 MiB/s Receiving objects: 96% (84391/87907), 143.37 MiB | 29.72 MiB/s Receiving objects: 97% (85270/87907), 143.37 MiB | 29.72 MiB/s Receiving objects: 98% (86149/87907), 143.37 MiB | 29.72 MiB/s Receiving objects: 98% (86682/87907), 173.75 MiB | 29.63 MiB/s Receiving objects: 99% (87028/87907), 173.75 MiB | 29.63 MiB/s remote: Total 87907 (delta 8564), reused 8296 (delta 7526), pack-reused 77432 (from 3)
  7. 10.89 s Receiving objects: 100% (87907/87907), 173.75 MiB | 29.63 MiB/s Receiving objects: 100% (87907/87907), 175.78 MiB | 28.87 MiB/s, done.
  8. 12.36 s Resolving deltas: 0% (0/59459) Resolving deltas: 1% (595/59459) Resolving deltas: 2% (1190/59459) Resolving deltas: 3% (1784/59459) Resolving deltas: 4% (2382/59459) Resolving deltas: 5% (2973/59459) Resolving deltas: 6% (3569/59459) Resolving deltas: 7% (4163/59459) Resolving deltas: 8% (4757/59459) Resolving deltas: 9% (5353/59459) Resolving deltas: 10% (5946/59459) Resolving deltas: 11% (6541/59459) Resolving deltas: 12% (7136/59459) Resolving deltas: 13% (7730/59459) Resolving deltas: 14% (8327/59459) Resolving deltas: 15% (8919/59459) Resolving deltas: 16% (9514/59459) Resolving deltas: 17% (10109/59459) Resolving deltas: 18% (10703/59459) Resolving deltas: 19% (11298/59459) Resolving deltas: 20% (11892/59459) Resolving deltas: 21% (12487/59459) Resolving deltas: 22% (13081/59459) Resolving deltas: 23% (13676/59459) Resolving deltas: 24% (14271/59459) Resolving deltas: 25% (14865/59459) Resolving deltas: 26% (15460/59459) Resolving deltas: 27% (16054/59459) Resolving deltas: 28% (16649/59459) Resolving deltas: 29% (17244/59459) Resolving deltas: 30% (17838/59459) Resolving deltas: 31% (18433/59459) Resolving deltas: 32% (19027/59459) Resolving deltas: 33% (19622/59459) Resolving deltas: 34% (20217/59459) Resolving deltas: 35% (20811/59459) Resolving deltas: 36% (21407/59459) Resolving deltas: 37% (22001/59459) Resolving deltas: 38% (22595/59459) Resolving deltas: 39% (23191/59459) Resolving deltas: 40% (23784/59459) Resolving deltas: 41% (24379/59459) Resolving deltas: 42% (24974/59459) Resolving deltas: 43% (25568/59459) Resolving deltas: 44% (26162/59459) Resolving deltas: 45% (26757/59459) Resolving deltas: 46% (27352/59459) Resolving deltas: 47% (27946/59459) Resolving deltas: 48% (28541/59459) Resolving deltas: 49% (29136/59459) Resolving deltas: 50% (29731/59459) Resolving deltas: 51% (30325/59459) Resolving deltas: 52% (30919/59459) Resolving deltas: 53% (31514/59459) Resolving deltas: 54% (32108/59459) Resolving deltas: 55% (32703/59459) Resolving deltas: 56% (33298/59459) Resolving deltas: 57% (33892/59459) Resolving deltas: 58% (34487/59459) Resolving deltas: 59% (35081/59459) Resolving deltas: 60% (35676/59459) Resolving deltas: 61% (36270/59459) Resolving deltas: 62% (36865/59459) Resolving deltas: 63% (37461/59459) Resolving deltas: 64% (38054/59459) Resolving deltas: 65% (38649/59459) Resolving deltas: 66% (39243/59459) Resolving deltas: 66% (39699/59459) Resolving deltas: 67% (39838/59459) Resolving deltas: 68% (40433/59459) Resolving deltas: 69% (41027/59459) Resolving deltas: 70% (41623/59459) Resolving deltas: 71% (42216/59459) Resolving deltas: 72% (42811/59459) Resolving deltas: 73% (43407/59459) Resolving deltas: 74% (44004/59459) Resolving deltas: 75% (44595/59459) Resolving deltas: 76% (45193/59459) Resolving deltas: 77% (45784/59459) Resolving deltas: 78% (46379/59459) Resolving deltas: 79% (46973/59459) Resolving deltas: 80% (47568/59459) Resolving deltas: 81% (48163/59459) Resolving deltas: 82% (48757/59459) Resolving deltas: 83% (49351/59459) Resolving deltas: 84% (49946/59459) Resolving deltas: 85% (50541/59459) Resolving deltas: 86% (51135/59459) Resolving deltas: 87% (51730/59459) Resolving deltas: 88% (52324/59459) Resolving deltas: 89% (52919/59459) Resolving deltas: 90% (53514/59459) Resolving deltas: 91% (54108/59459) Resolving deltas: 92% (54703/59459) Resolving deltas: 93% (55297/59459) Resolving deltas: 94% (55892/59459) Resolving deltas: 95% (56489/59459) Resolving deltas: 96% (57081/59459) Resolving deltas: 97% (57676/59459) Resolving deltas: 98% (58270/59459) Resolving deltas: 99% (58866/59459) Resolving deltas: 100% (59459/59459) Resolving deltas: 100% (59459/59459), done.
  9. 12.84 s Fetching commit 891dec7c25b5d9026c099da021ec7ae3b757dee9 for docs ...
  10. 12.84 s $ /nix/store/bcnisk3ydfgv26v2gw3zlky24g00yww2-git-2.54.0/bin/git fetch origin 891dec7c25b5d9026c099da021ec7ae3b757dee9
  11. 13.34 s From https://github.com/alphal00p/gammaloop
  12. 13.34 s * branch 891dec7c25b5d9026c099da021ec7ae3b757dee9 -> FETCH_HEAD
  13. 13.36 s $ /nix/store/9ypz3flqsrl5xl495mm8h645gadjsxi1-coreutils-9.11/bin/timeout --kill-after=15s 7200s /nix/store/bcnisk3ydfgv26v2gw3zlky24g00yww2-git-2.54.0/bin/git -c advice.detachedHead=false checkout 891dec7c25b5d9026c099da021ec7ae3b757dee9
  14. 13.50 s HEAD is now at 891dec7c2 change photos
  15. 13.50 s $ /nix/store/9ypz3flqsrl5xl495mm8h645gadjsxi1-coreutils-9.11/bin/timeout --kill-after=15s 7200s /nix/store/23zk8sgzamrbmj1fday15szf7f2279s8-nix-2.34.7/bin/nix --extra-experimental-features nix-command --extra-experimental-features flakes --log-format internal-json run .#packages.x86_64-linux.nix-ci-check-gammaloop-nextest-linnet --print-build-logs
  16. 18.02 s
  17. 28.30 s evaluating derivation 'g copying '/nix/store/bgss evaluating derivation 'g copying '/nix/store/bgss evaluating derivation 'g copying '/nix/store/bgss evaluating derivation 'g querying gammaloop-nexte [0.0 KiB DL] querying in [0.0 KiB DL] querying ne [0/2 built, 1/0/1 copied [0/1 built, 1 copied (4. [1/0/1 built, 1 copied (gammaloop-nextest-linnet> Extracting 2 binaries (including 1 non-test binary) to /build/source
  18. 28.41 s gammaloop-nextest-linnet> Extracted 6 files to /build/source in 0.13s
  19. 28.45 s gammaloop-nextest-linnet> ------------
  20. 28.45 s gammaloop-nextest-linnet> Nextest run ID 0fe37843-9b05-4c55-bc17-877c742a85cf with nextest profile: ci_gammaloop
  21. 28.45 s gammaloop-nextest-linnet> Starting 24 tests across 1 binary
  22. 28.51 s gammaloop-nextest-linnet> ------------
  23. 28.51 s gammaloop-nextest-linnet> Summary [ 0.057s] 24 tests run: 24 passed, 0 skipped
  24. 28.70 s gammaloop-nextest-linnet>
  25. 28.70 s gammaloop-nextest-linnet> ========== nextest test summary ==========
  26. 28.70 s gammaloop-nextest-linnet> report: target/nextest/ci_gammaloop/junit.xml
  27. 28.70 s gammaloop-nextest-linnet> tests: 24, failures: 0, errors: 0
  28. 28.70 s gammaloop-nextest-linnet> No failing testcases found.
  29. 28.70 s gammaloop-nextest-linnet> =========================================
  30. 28.74 s gammaloop-nextest-linnet> Extracting 2 binaries (including 1 non-test binary) and 1 linked path to /build/source
  31. 28.99 s gammaloop-nextest-linnet> Extracted 9 files to /build/source in 0.26s
  32. 29.04 s gammaloop-nextest-linnet> ------------
  33. 29.04 s gammaloop-nextest-linnet> Nextest run ID c6f3759c-9338-4ad7-9782-93fc6d7e8114 with nextest profile: ci_gammaloop
  34. 29.04 s gammaloop-nextest-linnet> Starting 183 tests across 1 binary
  35. 29.41 s gammaloop-nextest-linnet> ------------
  36. 29.41 s gammaloop-nextest-linnet> Summary [ 0.368s] 183 tests run: 183 passed, 0 skipped
  37. 29.50 s gammaloop-nextest-linnet>
  38. 29.50 s gammaloop-nextest-linnet> ========== nextest test summary ==========
  39. 29.50 s gammaloop-nextest-linnet> report: target/nextest/ci_gammaloop/junit.xml
  40. 29.50 s gammaloop-nextest-linnet> tests: 183, failures: 0, errors: 0
  41. 29.50 s gammaloop-nextest-linnet> No failing testcases found.
  42. 29.50 s gammaloop-nextest-linnet> =========================================
  43. 29.55 s gammaloop-nextest-linnet> Extracting 4 binaries (including 3 non-test binaries), 1 build script output directory, and 1 linked path to /build/source
  44. 30.02 s gammaloop-nextest-linnet> Extracted 13 files to /build/source in 0.48s
  45. 30.06 s gammaloop-nextest-linnet> ------------
  46. 30.06 s gammaloop-nextest-linnet> Nextest run ID e90e387b-5e58-4b80-b40c-f974627bbbe4 with nextest profile: ci_gammaloop
  47. 30.06 s gammaloop-nextest-linnet> Starting 0 tests across 1 binary
  48. 30.06 s gammaloop-nextest-linnet> ------------
  49. 30.06 s gammaloop-nextest-linnet> Summary [ 0.000s] 0 tests run: 0 passed, 0 skipped
  50. 30.16 s gammaloop-nextest-linnet>
  51. 30.16 s gammaloop-nextest-linnet> ========== nextest test summary ==========
  52. 30.16 s gammaloop-nextest-linnet> report: target/nextest/ci_gammaloop/junit.xml
  53. 30.16 s gammaloop-nextest-linnet> tests: 0, failures: 0, errors: 0
  54. 30.16 s gammaloop-nextest-linnet> No failing testcases found.
  55. 30.16 s gammaloop-nextest-linnet> =========================================
  56. 30.20 s gammaloop-nextest-linnet> Extracting 2 binaries (including 1 non-test binary) and 1 linked path to /build/source
  57. 30.37 s gammaloop-nextest-linnet> Extracted 9 files to /build/source in 0.18s
  58. 30.40 s gammaloop-nextest-linnet> ------------
  59. 30.40 s gammaloop-nextest-linnet> Nextest run ID 77801df4-84dc-4e8f-b469-ea952aae46b2 with nextest profile: ci_gammaloop
  60. 30.40 s gammaloop-nextest-linnet> Starting 128 tests across 1 binary
  61. 30.58 s gammaloop-nextest-linnet> FAIL [ 0.029s] (106/128) linnest tests::test_graph_structural_axis_merge_preserves_edge_positions_and_constraints
  62. 30.58 s gammaloop-nextest-linnet> stdout ---
  63. 30.58 s gammaloop-nextest-linnet>
  64. 30.58 s gammaloop-nextest-linnet> running 1 test
  65. 30.58 s gammaloop-nextest-linnet> test tests::test_graph_structural_axis_merge_preserves_edge_positions_and_constraints ... FAILED
  66. 30.58 s gammaloop-nextest-linnet>
  67. 30.58 s gammaloop-nextest-linnet> failures:
  68. 30.58 s gammaloop-nextest-linnet>
  69. 30.58 s gammaloop-nextest-linnet> failures:
  70. 30.58 s gammaloop-nextest-linnet> tests::test_graph_structural_axis_merge_preserves_edge_positions_and_constraints
  71. 30.58 s gammaloop-nextest-linnet>
  72. 30.58 s gammaloop-nextest-linnet> test result: FAILED. 0 passed; 1 failed; 0 ignored; 0 measured; 127 filtered out; finished in 0.01s
  73. 30.58 s gammaloop-nextest-linnet>
  74. 30.58 s gammaloop-nextest-linnet> stderr ---
  75. 30.58 s gammaloop-nextest-linnet>
  76. 30.58 s gammaloop-nextest-linnet> thread 'tests::test_graph_structural_axis_merge_preserves_edge_positions_and_constraints' (927) panicked at crates/linnest/src/tests.rs:1721:32:
  77. 30.58 s gammaloop-nextest-linnet> no entry found for key
  78. 30.58 s gammaloop-nextest-linnet> stack backtrace:
  79. 30.58 s gammaloop-nextest-linnet> 0: __rustc::rust_begin_unwind
  80. 30.58 s gammaloop-nextest-linnet> 1: core::panicking::panic_fmt
  81. 30.58 s gammaloop-nextest-linnet> 2: core::option::expect_failed
  82. 30.58 s gammaloop-nextest-linnet> 3: linnest::tests::test_graph_structural_axis_merge_preserves_edge_positions_and_constraints
  83. 30.58 s gammaloop-nextest-linnet> 4: <linnest::tests::test_graph_structural_axis_merge_preserves_edge_positions_and_constraints::{closure#0} as core::ops::function::FnOnce<()>>::call_once
  84. 30.58 s gammaloop-nextest-linnet> note: Some details are omitted, run with `RUST_BACKTRACE=full` for a verbose backtrace.
  85. 30.58 s gammaloop-nextest-linnet>
  86. 30.61 s gammaloop-nextest-linnet> ------------
  87. 30.61 s gammaloop-nextest-linnet> Summary [ 0.206s] 128 tests run: 127 passed, 1 failed, 0 skipped
  88. 30.61 s gammaloop-nextest-linnet> FAIL [ 0.029s] (106/128) linnest tests::test_graph_structural_axis_merge_preserves_edge_positions_and_constraints
  89. 30.61 s gammaloop-nextest-linnet> stdout ---
  90. 30.61 s gammaloop-nextest-linnet>
  91. 30.61 s gammaloop-nextest-linnet> running 1 test
  92. 30.61 s gammaloop-nextest-linnet> test tests::test_graph_structural_axis_merge_preserves_edge_positions_and_constraints ... FAILED
  93. 30.61 s gammaloop-nextest-linnet>
  94. 30.61 s gammaloop-nextest-linnet> failures:
  95. 30.61 s gammaloop-nextest-linnet>
  96. 30.61 s gammaloop-nextest-linnet> failures:
  97. 30.61 s gammaloop-nextest-linnet> tests::test_graph_structural_axis_merge_preserves_edge_positions_and_constraints
  98. 30.61 s gammaloop-nextest-linnet>
  99. 30.61 s gammaloop-nextest-linnet> test result: FAILED. 0 passed; 1 failed; 0 ignored; 0 measured; 127 filtered out; finished in 0.01s
  100. 30.61 s gammaloop-nextest-linnet>
  101. 30.61 s gammaloop-nextest-linnet> stderr ---
  102. 30.61 s gammaloop-nextest-linnet>
  103. 30.61 s gammaloop-nextest-linnet> thread 'tests::test_graph_structural_axis_merge_preserves_edge_positions_and_constraints' (927) panicked at crates/linnest/src/tests.rs:1721:32:
  104. 30.61 s gammaloop-nextest-linnet> no entry found for key
  105. 30.61 s gammaloop-nextest-linnet> stack backtrace:
  106. 30.61 s gammaloop-nextest-linnet> 0: __rustc::rust_begin_unwind
  107. 30.61 s gammaloop-nextest-linnet> 1: core::panicking::panic_fmt
  108. 30.61 s gammaloop-nextest-linnet> 2: core::option::expect_failed
  109. 30.61 s gammaloop-nextest-linnet> 3: linnest::tests::test_graph_structural_axis_merge_preserves_edge_positions_and_constraints
  110. 30.61 s gammaloop-nextest-linnet> 4: <linnest::tests::test_graph_structural_axis_merge_preserves_edge_positions_and_constraints::{closure#0} as core::ops::function::FnOnce<()>>::call_once
  111. 30.61 s gammaloop-nextest-linnet> note: Some details are omitted, run with `RUST_BACKTRACE=full` for a verbose backtrace.
  112. 30.61 s gammaloop-nextest-linnet>
  113. 30.62 s gammaloop-nextest-linnet> error: test run failed
  114. 30.69 s gammaloop-nextest-linnet>
  115. 30.69 s gammaloop-nextest-linnet> ========== nextest test summary ==========
  116. 30.69 s gammaloop-nextest-linnet> report: target/nextest/ci_gammaloop/junit.xml
  117. 30.69 s gammaloop-nextest-linnet> tests: 128, failures: 1, errors: 0
  118. 30.69 s gammaloop-nextest-linnet>
  119. 30.69 s gammaloop-nextest-linnet> 1. linnest::tests::test_graph_structural_axis_merge_preserves_edge_positions_and_constraints
  120. 30.69 s gammaloop-nextest-linnet> failure: test failure with exit code 101
  121. 30.69 s gammaloop-nextest-linnet> thread 'tests::test_graph_structural_axis_merge_preserves_edge_positions_and_constraints' (927) panicked at crates/linnest/src/tests.rs:1721:32:
  122. 30.69 s gammaloop-nextest-linnet> no entry found for key
  123. 30.69 s gammaloop-nextest-linnet> stack backtrace:
  124. 30.69 s gammaloop-nextest-linnet> 0: __rustc::rust_begin_unwind
  125. 30.69 s gammaloop-nextest-linnet> 1: core::panicking::panic_fmt
  126. 30.69 s gammaloop-nextest-linnet> 2: core::option::expect_failed
  127. 30.69 s gammaloop-nextest-linnet> 3: linnest::tests::test_graph_structural_axis_merge_preserves_edge_positions_and_constraints
  128. 30.69 s gammaloop-nextest-linnet> 4: <linnest::tests::test_graph_structural_axis_merge_preserves_edge_positions_and_constraints::{closure#0} as core::ops::function::FnOnce<()>>::call_once
  129. 30.70 s gammaloop-nextest-linnet> note: Some details are omitted, run with `RUST_BACKTRACE=full` for a verbose backtrace.
  130. 30.70 s gammaloop-nextest-linnet> system-out
  131. 30.70 s gammaloop-nextest-linnet> running 1 test
  132. 30.70 s gammaloop-nextest-linnet> test tests::test_graph_structural_axis_merge_preserves_edge_positions_and_constraints ... FAILED
  133. 30.70 s gammaloop-nextest-linnet>
  134. 30.70 s gammaloop-nextest-linnet> failures:
  135. 30.70 s gammaloop-nextest-linnet>
  136. 30.70 s gammaloop-nextest-linnet> failures:
  137. 30.70 s gammaloop-nextest-linnet> tests::test_graph_structural_axis_merge_preserves_edge_positions_and_constraints
  138. 30.70 s gammaloop-nextest-linnet>
  139. 30.70 s gammaloop-nextest-linnet> test result: FAILED. 0 passed; 1 failed; 0 ignored; 0 measured; 127 filtered out; finished in 0.01s
  140. 30.70 s gammaloop-nextest-linnet> system-err
  141. 30.70 s gammaloop-nextest-linnet> thread 'tests::test_graph_structural_axis_merge_preserves_edge_positions_and_constraints' (927) panicked at crates/linnest/src/tests.rs:1721:32:
  142. 30.70 s gammaloop-nextest-linnet> no entry found for key
  143. 30.70 s gammaloop-nextest-linnet> stack backtrace:
  144. 30.70 s gammaloop-nextest-linnet> 0: __rustc::rust_begin_unwind
  145. 30.70 s gammaloop-nextest-linnet> 1: core::panicking::panic_fmt
  146. 30.70 s gammaloop-nextest-linnet> 2: core::option::expect_failed
  147. 30.70 s gammaloop-nextest-linnet> 3: linnest::tests::test_graph_structural_axis_merge_preserves_edge_positions_and_constraints
  148. 30.70 s gammaloop-nextest-linnet> 4: <linnest::tests::test_graph_structural_axis_merge_preserves_edge_positions_and_constraints::{closure#0} as core::ops::function::FnOnce<()>>::call_once
  149. 30.70 s gammaloop-nextest-linnet> note: Some details are omitted, run with `RUST_BACKTRACE=full` for a verbose backtrace.
  150. 30.70 s gammaloop-nextest-linnet> =========================================
  151. 30.86 s [0 built (1 failed), 1 cerror: Cannot build '/nix/store/3a6s86hhbf2g1hgbkmcq3zdrmaha78qr-gammaloop-nextest-linnet.drv'.
  152. 30.86 s Reason: builder failed with exit code 100.
  153. 30.86 s Output paths:
  154. 30.86 s /nix/store/v4cbh6ql60kq7xlziivk5va382nw7f4v-gammaloop-nextest-linnet
  155. 30.86 s Last 134 log lines:
  156. 30.86 s > Extracting 2 binaries (including 1 non-test binary) to /build/source
  157. 30.86 s > Extracted 6 files to /build/source in 0.13s
  158. 30.86 s > ------------
  159. 30.86 s > Nextest run ID 0fe37843-9b05-4c55-bc17-877c742a85cf with nextest profile: ci_gammaloop
  160. 30.86 s > Starting 24 tests across 1 binary
  161. 30.86 s > ------------
  162. 30.86 s > Summary [ 0.057s] 24 tests run: 24 passed, 0 skipped
  163. 30.86 s >
  164. 30.86 s > ========== nextest test summary ==========
  165. 30.86 s > report: target/nextest/ci_gammaloop/junit.xml
  166. 30.86 s > tests: 24, failures: 0, errors: 0
  167. 30.86 s > No failing testcases found.
  168. 30.86 s > =========================================
  169. 30.86 s > Extracting 2 binaries (including 1 non-test binary) and 1 linked path to /build/source
  170. 30.86 s > Extracted 9 files to /build/source in 0.26s
  171. 30.86 s > ------------
  172. 30.86 s > Nextest run ID c6f3759c-9338-4ad7-9782-93fc6d7e8114 with nextest profile: ci_gammaloop
  173. 30.86 s > Starting 183 tests across 1 binary
  174. 30.86 s > ------------
  175. 30.86 s > Summary [ 0.368s] 183 tests run: 183 passed, 0 skipped
  176. 30.86 s >
  177. 30.86 s > ========== nextest test summary ==========
  178. 30.86 s > report: target/nextest/ci_gammaloop/junit.xml
  179. 30.86 s > tests: 183, failures: 0, errors: 0
  180. 30.86 s > No failing testcases found.
  181. 30.86 s > =========================================
  182. 30.86 s > Extracting 4 binaries (including 3 non-test binaries), 1 build script output directory, and 1 linked path to /build/source
  183. 30.86 s > Extracted 13 files to /build/source in 0.48s
  184. 30.86 s > ------------
  185. 30.86 s > Nextest run ID e90e387b-5e58-4b80-b40c-f974627bbbe4 with nextest profile: ci_gammaloop
  186. 30.86 s > Starting 0 tests across 1 binary
  187. 30.86 s > ------------
  188. 30.86 s > Summary [ 0.000s] 0 tests run: 0 passed, 0 skipped
  189. 30.86 s >
  190. 30.86 s > ========== nextest test summary ==========
  191. 30.86 s > report: target/nextest/ci_gammaloop/junit.xml
  192. 30.86 s > tests: 0, failures: 0, errors: 0
  193. 30.86 s > No failing testcases found.
  194. 30.86 s > =========================================
  195. 30.86 s > Extracting 2 binaries (including 1 non-test binary) and 1 linked path to /build/source
  196. 30.86 s > Extracted 9 files to /build/source in 0.18s
  197. 30.86 s > ------------
  198. 30.86 s > Nextest run ID 77801df4-84dc-4e8f-b469-ea952aae46b2 with nextest profile: ci_gammaloop
  199. 30.86 s > Starting 128 tests across 1 binary
  200. 30.86 s > FAIL [ 0.029s] (106/128) linnest tests::test_graph_structural_axis_merge_preserves_edge_positions_and_constraints
  201. 30.86 s > stdout ---
  202. 30.86 s >
  203. 30.86 s > running 1 test
  204. 30.86 s > test tests::test_graph_structural_axis_merge_preserves_edge_positions_and_constraints ... FAILED
  205. 30.86 s >
  206. 30.86 s > failures:
  207. 30.86 s >
  208. 30.86 s > failures:
  209. 30.86 s > tests::test_graph_structural_axis_merge_preserves_edge_positions_and_constraints
  210. 30.86 s >
  211. 30.86 s > test result: FAILED. 0 passed; 1 failed; 0 ignored; 0 measured; 127 filtered out; finished in 0.01s
  212. 30.86 s >
  213. 30.86 s > stderr ---
  214. 30.86 s >
  215. 30.86 s > thread 'tests::test_graph_structural_axis_merge_preserves_edge_positions_and_constraints' (927) panicked at crates/linnest/src/tests.rs:1721:32:
  216. 30.86 s > no entry found for key
  217. 30.86 s > stack backtrace:
  218. 30.86 s > 0: __rustc::rust_begin_unwind
  219. 30.86 s > 1: core::panicking::panic_fmt
  220. 30.86 s > 2: core::option::expect_failed
  221. 30.86 s > 3: linnest::tests::test_graph_structural_axis_merge_preserves_edge_positions_and_constraints
  222. 30.86 s > 4: <linnest::tests::test_graph_structural_axis_merge_preserves_edge_positions_and_constraints::{closure#0} as core::ops::function::FnOnce<()>>::call_once
  223. 30.86 s > note: Some details are omitted, run with `RUST_BACKTRACE=full` for a verbose backtrace.
  224. 30.86 s >
  225. 30.86 s > ------------
  226. 30.86 s > Summary [ 0.206s] 128 tests run: 127 passed, 1 failed, 0 skipped
  227. 30.86 s > FAIL [ 0.029s] (106/128) linnest tests::test_graph_structural_axis_merge_preserves_edge_positions_and_constraints
  228. 30.86 s > stdout ---
  229. 30.86 s >
  230. 30.86 s > running 1 test
  231. 30.86 s > test tests::test_graph_structural_axis_merge_preserves_edge_positions_and_constraints ... FAILED
  232. 30.86 s >
  233. 30.86 s > failures:
  234. 30.86 s >
  235. 30.86 s > failures:
  236. 30.86 s > tests::test_graph_structural_axis_merge_preserves_edge_positions_and_constraints
  237. 30.86 s >
  238. 30.86 s > test result: FAILED. 0 passed; 1 failed; 0 ignored; 0 measured; 127 filtered out; finished in 0.01s
  239. 30.86 s >
  240. 30.86 s > stderr ---
  241. 30.86 s >
  242. 30.86 s > thread 'tests::test_graph_structural_axis_merge_preserves_edge_positions_and_constraints' (927) panicked at crates/linnest/src/tests.rs:1721:32:
  243. 30.86 s > no entry found for key
  244. 30.86 s > stack backtrace:
  245. 30.86 s > 0: __rustc::rust_begin_unwind
  246. 30.86 s > 1: core::panicking::panic_fmt
  247. 30.86 s > 2: core::option::expect_failed
  248. 30.86 s > 3: linnest::tests::test_graph_structural_axis_merge_preserves_edge_positions_and_constraints
  249. 30.86 s > 4: <linnest::tests::test_graph_structural_axis_merge_preserves_edge_positions_and_constraints::{closure#0} as core::ops::function::FnOnce<()>>::call_once
  250. 30.86 s > note: Some details are omitted, run with `RUST_BACKTRACE=full` for a verbose backtrace.
  251. 30.86 s >
  252. 30.86 s > error: test run failed
  253. 30.86 s >
  254. 30.86 s > ========== nextest test summary ==========
  255. 30.86 s > report: target/nextest/ci_gammaloop/junit.xml
  256. 30.86 s > tests: 128, failures: 1, errors: 0
  257. 30.86 s >
  258. 30.86 s > 1. linnest::tests::test_graph_structural_axis_merge_preserves_edge_positions_and_constraints
  259. 30.86 s > failure: test failure with exit code 101
  260. 30.86 s > thread 'tests::test_graph_structural_axis_merge_preserves_edge_positions_and_constraints' (927) panicked at crates/linnest/src/tests.rs:1721:32:
  261. 30.86 s > no entry found for key
  262. 30.86 s > stack backtrace:
  263. 30.86 s > 0: __rustc::rust_begin_unwind
  264. 30.86 s > 1: core::panicking::panic_fmt
  265. 30.86 s > 2: core::option::expect_failed
  266. 30.86 s > 3: linnest::tests::test_graph_structural_axis_merge_preserves_edge_positions_and_constraints
  267. 30.86 s > 4: <linnest::tests::test_graph_structural_axis_merge_preserves_edge_positions_and_constraints::{closure#0} as core::ops::function::FnOnce<()>>::call_once
  268. 30.86 s > note: Some details are omitted, run with `RUST_BACKTRACE=full` for a verbose backtrace.
  269. 30.86 s > system-out
  270. 30.86 s > running 1 test
  271. 30.86 s > test tests::test_graph_structural_axis_merge_preserves_edge_positions_and_constraints ... FAILED
  272. 30.86 s >
  273. 30.86 s > failures:
  274. 30.86 s >
  275. 30.86 s > failures:
  276. 30.86 s > tests::test_graph_structural_axis_merge_preserves_edge_positions_and_constraints
  277. 30.86 s >
  278. 30.86 s > test result: FAILED. 0 passed; 1 failed; 0 ignored; 0 measured; 127 filtered out; finished in 0.01s
  279. 30.86 s > system-err
  280. 30.86 s > thread 'tests::test_graph_structural_axis_merge_preserves_edge_positions_and_constraints' (927) panicked at crates/linnest/src/tests.rs:1721:32:
  281. 30.86 s > no entry found for key
  282. 30.86 s > stack backtrace:
  283. 30.86 s > 0: __rustc::rust_begin_unwind
  284. 30.86 s > 1: core::panicking::panic_fmt
  285. 30.86 s > 2: core::option::expect_failed
  286. 30.86 s > 3: linnest::tests::test_graph_structural_axis_merge_preserves_edge_positions_and_constraints
  287. 30.86 s > 4: <linnest::tests::test_graph_structural_axis_merge_preserves_edge_positions_and_constraints::{closure#0} as core::ops::function::FnOnce<()>>::call_once
  288. 30.86 s > note: Some details are omitted, run with `RUST_BACKTRACE=full` for a verbose backtrace.
  289. 30.86 s > =========================================
  290. 30.86 s For full logs, run:
  291. 30.86 s nix log /nix/store/3a6s86hhbf2g1hgbkmcq3zdrmaha78qr-gammaloop-nextest-linnet.drv
  292. 31.10 s Run failed.