test packages.x86_64-linux.nix-ci-check-gammaloop-doctest

Reproduce this run
Retry Run
  1. 0.13 s $ /nix/store/9ypz3flqsrl5xl495mm8h645gadjsxi1-coreutils-9.11/bin/timeout --kill-after=15s 7200s /nix/store/23zk8sgzamrbmj1fday15szf7f2279s8-nix-2.34.7/bin/nix --extra-experimental-features nix-command --extra-experimental-features flakes flake clone git+https://github.com/alphal00p/gammaloop --dest /tmp/nix-ci-worker/stable-pwd/repo/
  2. 0.14 s Cloning into '/tmp/nix-ci-worker/stable-pwd/repo'...
  3. 1.91 s remote: Enumerating objects: 57328 remote: Enumerating objects: 66329, done.
  4. 2.02 s remote: Counting objects: 0% (1/9001) remote: Counting objects: 1% (91/9001) remote: Counting objects: 2% (181/9001) remote: Counting objects: 3% (271/9001) remote: Counting objects: 4% (361/9001) remote: Counting objects: 5% (451/9001) remote: Counting objects: 6% (541/9001) remote: Counting objects: 7% (631/9001) remote: Counting objects: 8% (721/9001) remote: Counting objects: 9% (811/9001) remote: Counting objects: 10% (901/9001) remote: Counting objects: 11% (991/9001) remote: Counting objects: 12% (1081/9001) remote: Counting objects: 13% (1171/9001) remote: Counting objects: 14% (1261/9001) remote: Counting objects: 15% (1351/9001) remote: Counting objects: 16% (1441/9001) remote: Counting objects: 17% (1531/9001) remote: Counting objects: 18% (1621/9001) remote: Counting objects: 19% (1711/9001) remote: Counting objects: 20% (1801/9001) remote: Counting objects: 21% (1891/9001) remote: Counting objects: 22% (1981/9001) remote: Counting objects: 23% (2071/9001) remote: Counting objects: 24% (2161/9001) remote: Counting objects: 25% (2251/9001) remote: Counting objects: 26% (2341/9001) remote: Counting objects: 27% (2431/9001) remote: Counting objects: 28% (2521/9001) remote: Counting objects: 29% (2611/9001) remote: Counting objects: 30% (2701/9001) remote: Counting objects: 31% (2791/9001) remote: Counting objects: 32% (2881/9001) remote: Counting objects: 33% (2971/9001) remote: Counting objects: 34% (3061/9001) remote: Counting objects: 35% (3151/9001) remote: Counting objects: 36% (3241/9001) remote: Counting objects: 37% (3331/9001) remote: Counting objects: 38% (3421/9001) remote: Counting objects: 39% (3511/9001) remote: Counting objects: 40% (3601/9001) remote: Counting objects: 41% (3691/9001) remote: Counting objects: 42% (3781/9001) remote: Counting objects: 43% (3871/9001) remote: Counting objects: 44% (3961/9001) remote: Counting objects: 45% (4051/9001) remote: Counting objects: 46% (4141/9001) remote: Counting objects: 47% (4231/9001) remote: Counting objects: 48% (4321/9001) remote: Counting objects: 49% (4411/9001) remote: Counting objects: 50% (4501/9001) remote: Counting objects: 51% (4591/9001) remote: Counting objects: 52% (4681/9001) remote: Counting objects: 53% (4771/9001) remote: Counting objects: 54% (4861/9001) remote: Counting objects: 55% (4951/9001) remote: Counting objects: 56% (5041/9001) remote: Counting objects: 57% (5131/9001) remote: Counting objects: 58% (5221/9001) remote: Counting objects: 59% (5311/9001) remote: Counting objects: 60% (5401/9001) remote: Counting objects: 61% (5491/9001) remote: Counting objects: 62% (5581/9001) remote: Counting objects: 63% (5671/9001) remote: Counting objects: 64% (5761/9001) remote: Counting objects: 65% (5851/9001) remote: Counting objects: 66% (5941/9001) remote: Counting objects: 67% (6031/9001) remote: Counting objects: 68% (6121/9001) remote: Counting objects: 69% (6211/9001) remote: Counting objects: 70% (6301/9001) remote: Counting objects: 71% (6391/9001) remote: Counting objects: 72% (6481/9001) remote: Counting objects: 73% (6571/9001) remote: Counting objects: 74% (6661/9001) remote: Counting objects: 75% (6751/9001) remote: Counting objects: 76% (6841/9001) remote: Counting objects: 77% (6931/9001) remote: Counting objects: 78% (7021/9001) remote: Counting objects: 79% (7111/9001) remote: Counting objects: 80% (7201/9001) remote: Counting objects: 81% (7291/9001) remote: Counting objects: 82% (7381/9001) remote: Counting objects: 83% (7471/9001) remote: Counting objects: 84% (7561/9001) remote: Counting objects: 85% (7651/9001) remote: Counting objects: 86% (7741/9001) remote: Counting objects: 87% (7831/9001) remote: Counting objects: 88% (7921/9001) remote: Counting objects: 89% (8011/9001) remote: Counting objects: 90% (8101/9001) remote: Counting objects: 91% (8191/9001) remote: Counting objects: 92% (8281/9001) remote: Counting objects: 93% (8371/9001) remote: Counting objects: 94% (8461/9001) remote: Counting objects: 95% (8551/9001) remote: Counting objects: 96% (8641/9001) remote: Counting objects: 97% (8731/9001) remote: Counting objects: 98% (8821/9001) remote: Counting objects: 99% (8911/9001) remote: Counting objects: 100% (9001/9001) remote: Counting objects: 100% (9001/9001), done.
  5. 4.44 s remote: Compressing objects: 0% (1/2111) remote: Compressing objects: 1% (22/2111) remote: Compressing objects: 2% (43/2111) remote: Compressing objects: 3% (64/2111) remote: Compressing objects: 4% (85/2111) remote: Compressing objects: 5% (106/2111) remote: Compressing objects: 6% (127/2111) remote: Compressing objects: 7% (148/2111) remote: Compressing objects: 8% (169/2111) remote: Compressing objects: 9% (190/2111) remote: Compressing objects: 10% (212/2111) remote: Compressing objects: 11% (233/2111) remote: Compressing objects: 12% (254/2111) remote: Compressing objects: 13% (275/2111) remote: Compressing objects: 14% (296/2111) remote: Compressing objects: 15% (317/2111) remote: Compressing objects: 16% (338/2111) remote: Compressing objects: 17% (359/2111) remote: Compressing objects: 18% (380/2111) remote: Compressing objects: 19% (402/2111) remote: Compressing objects: 20% (423/2111) remote: Compressing objects: 20% (437/2111) remote: Compressing objects: 21% (444/2111) remote: Compressing objects: 22% (465/2111) remote: Compressing objects: 23% (486/2111) remote: Compressing objects: 24% (507/2111) remote: Compressing objects: 25% (528/2111) remote: Compressing objects: 26% (549/2111) remote: Compressing objects: 27% (570/2111) remote: Compressing objects: 28% (592/2111) remote: Compressing objects: 28% (605/2111) remote: Compressing objects: 29% (613/2111) remote: Compressing objects: 30% (634/2111) remote: Compressing objects: 31% (655/2111) remote: Compressing objects: 32% (676/2111) remote: Compressing objects: 33% (697/2111) remote: Compressing objects: 34% (718/2111) remote: Compressing objects: 35% (739/2111) remote: Compressing objects: 36% (760/2111) remote: Compressing objects: 37% (782/2111) remote: Compressing objects: 38% (803/2111) remote: Compressing objects: 39% (824/2111) remote: Compressing objects: 40% (845/2111) remote: Compressing objects: 41% (866/2111) remote: Compressing objects: 42% (887/2111) remote: Compressing objects: 43% (908/2111) remote: Compressing objects: 44% (929/2111) remote: Compressing objects: 45% (950/2111) remote: Compressing objects: 46% (972/2111) remote: Compressing objects: 47% (993/2111) remote: Compressing objects: 48% (1014/2111) remote: Compressing objects: 49% (1035/2111) remote: Compressing objects: 50% (1056/2111) remote: Compressing objects: 51% (1077/2111) remote: Compressing objects: 52% (1098/2111) remote: Compressing objects: 53% (1119/2111) remote: Compressing objects: 54% (1140/2111) remote: Compressing objects: 55% (1162/2111) remote: Compressing objects: 56% (1183/2111) remote: Compressing objects: 57% (1204/2111) remote: Compressing objects: 58% (1225/2111) remote: Compressing objects: 59% (1246/2111) remote: Compressing objects: 60% (1267/2111) remote: Compressing objects: 61% (1288/2111) remote: Compressing objects: 62% (1309/2111) remote: Compressing objects: 63% (1330/2111) remote: Compressing objects: 64% (1352/2111) remote: Compressing objects: 65% (1373/2111) remote: Compressing objects: 66% (1394/2111) remote: Compressing objects: 67% (1415/2111) remote: Compressing objects: 68% (1436/2111) remote: Compressing objects: 69% (1457/2111) remote: Compressing objects: 70% (1478/2111) remote: Compressing objects: 71% (1499/2111) remote: Compressing objects: 72% (1520/2111) remote: Compressing objects: 73% (1542/2111) remote: Compressing objects: 74% (1563/2111) remote: Compressing objects: 75% (1584/2111) remote: Compressing objects: 76% (1605/2111) remote: Compressing objects: 77% (1626/2111) remote: Compressing objects: 78% (1647/2111) remote: Compressing objects: 79% (1668/2111) remote: Compressing objects: 80% (1689/2111) remote: Compressing objects: 81% (1710/2111) remote: Compressing objects: 82% (1732/2111) remote: Compressing objects: 83% (1753/2111) remote: Compressing objects: 84% (1774/2111) remote: Compressing objects: 85% (1795/2111) remote: Compressing objects: 86% (1816/2111) remote: Compressing objects: 87% (1837/2111) remote: Compressing objects: 88% (1858/2111) remote: Compressing objects: 89% (1879/2111) remote: Compressing objects: 90% (1900/2111) remote: Compressing objects: 91% (1922/2111) remote: Compressing objects: 92% (1943/2111) remote: Compressing objects: 93% (1964/2111) remote: Compressing objects: 94% (1985/2111) remote: Compressing objects: 95% (2006/2111) remote: Compressing objects: 96% (2027/2111) remote: Compressing objects: 97% (2048/2111) remote: Compressing objects: 98% (2069/2111) remote: Compressing objects: 99% (2090/2111) remote: Compressing objects: 100% (2111/2111) remote: Compressing objects: 100% (2111/2111), done.
  6. 8.31 s Receiving objects: 0% (1/66329) Receiving objects: 1% (664/66329) Receiving objects: 2% (1327/66329) Receiving objects: 3% (1990/66329) Receiving objects: 4% (2654/66329) Receiving objects: 5% (3317/66329) Receiving objects: 6% (3980/66329) Receiving objects: 7% (4644/66329) Receiving objects: 8% (5307/66329), 8.78 MiB | 17.55 MiB/s Receiving objects: 9% (5970/66329), 8.78 MiB | 17.55 MiB/s Receiving objects: 10% (6633/66329), 8.78 MiB | 17.55 MiB/s Receiving objects: 11% (7297/66329), 8.78 MiB | 17.55 MiB/s Receiving objects: 11% (7389/66329), 16.51 MiB | 16.50 MiB/s Receiving objects: 12% (7960/66329), 16.51 MiB | 16.50 MiB/s Receiving objects: 13% (8623/66329), 16.51 MiB | 16.50 MiB/s Receiving objects: 14% (9287/66329), 16.51 MiB | 16.50 MiB/s Receiving objects: 15% (9950/66329), 16.51 MiB | 16.50 MiB/s Receiving objects: 16% (10613/66329), 16.51 MiB | 16.50 MiB/s Receiving objects: 17% (11276/66329), 16.51 MiB | 16.50 MiB/s Receiving objects: 18% (11940/66329), 16.51 MiB | 16.50 MiB/s Receiving objects: 19% (12603/66329), 16.51 MiB | 16.50 MiB/s Receiving objects: 20% (13266/66329), 16.51 MiB | 16.50 MiB/s Receiving objects: 21% (13930/66329), 16.51 MiB | 16.50 MiB/s Receiving objects: 22% (14593/66329), 16.51 MiB | 16.50 MiB/s Receiving objects: 23% (15256/66329), 16.51 MiB | 16.50 MiB/s Receiving objects: 24% (15919/66329), 16.51 MiB | 16.50 MiB/s Receiving objects: 25% (16583/66329), 16.51 MiB | 16.50 MiB/s Receiving objects: 26% (17246/66329), 16.51 MiB | 16.50 MiB/s Receiving objects: 27% (17909/66329), 16.51 MiB | 16.50 MiB/s Receiving objects: 28% (18573/66329), 16.51 MiB | 16.50 MiB/s Receiving objects: 29% (19236/66329), 16.51 MiB | 16.50 MiB/s Receiving objects: 30% (19899/66329), 16.51 MiB | 16.50 MiB/s Receiving objects: 31% (20562/66329), 16.51 MiB | 16.50 MiB/s Receiving objects: 32% (21226/66329), 16.51 MiB | 16.50 MiB/s Receiving objects: 33% (21889/66329), 16.51 MiB | 16.50 MiB/s Receiving objects: 34% (22552/66329), 16.51 MiB | 16.50 MiB/s Receiving objects: 35% (23216/66329), 25.21 MiB | 16.80 MiB/s Receiving objects: 36% (23879/66329), 25.21 MiB | 16.80 MiB/s Receiving objects: 37% (24542/66329), 25.21 MiB | 16.80 MiB/s Receiving objects: 38% (25206/66329), 25.21 MiB | 16.80 MiB/s Receiving objects: 39% (25869/66329), 25.21 MiB | 16.80 MiB/s Receiving objects: 40% (26532/66329), 25.21 MiB | 16.80 MiB/s Receiving objects: 41% (27195/66329), 25.21 MiB | 16.80 MiB/s Receiving objects: 42% (27859/66329), 25.21 MiB | 16.80 MiB/s Receiving objects: 43% (28522/66329), 25.21 MiB | 16.80 MiB/s Receiving objects: 44% (29185/66329), 25.21 MiB | 16.80 MiB/s Receiving objects: 45% (29849/66329), 25.21 MiB | 16.80 MiB/s Receiving objects: 46% (30512/66329), 25.21 MiB | 16.80 MiB/s Receiving objects: 47% (31175/66329), 25.21 MiB | 16.80 MiB/s Receiving objects: 48% (31838/66329), 25.21 MiB | 16.80 MiB/s Receiving objects: 49% (32502/66329), 25.21 MiB | 16.80 MiB/s Receiving objects: 50% (33165/66329), 25.21 MiB | 16.80 MiB/s Receiving objects: 51% (33828/66329), 25.21 MiB | 16.80 MiB/s Receiving objects: 52% (34492/66329), 25.21 MiB | 16.80 MiB/s Receiving objects: 53% (35155/66329), 25.21 MiB | 16.80 MiB/s Receiving objects: 54% (35818/66329), 25.21 MiB | 16.80 MiB/s Receiving objects: 55% (36481/66329), 25.21 MiB | 16.80 MiB/s Receiving objects: 56% (37145/66329), 25.21 MiB | 16.80 MiB/s Receiving objects: 56% (37521/66329), 25.21 MiB | 16.80 MiB/s Receiving objects: 57% (37808/66329), 40.08 MiB | 20.04 MiB/s Receiving objects: 58% (38471/66329), 40.08 MiB | 20.04 MiB/s Receiving objects: 59% (39135/66329), 40.08 MiB | 20.04 MiB/s Receiving objects: 60% (39798/66329), 40.08 MiB | 20.04 MiB/s Receiving objects: 61% (40461/66329), 40.08 MiB | 20.04 MiB/s Receiving objects: 62% (41124/66329), 40.08 MiB | 20.04 MiB/s Receiving objects: 63% (41788/66329), 40.08 MiB | 20.04 MiB/s Receiving objects: 64% (42451/66329), 40.08 MiB | 20.04 MiB/s Receiving objects: 65% (43114/66329), 40.08 MiB | 20.04 MiB/s Receiving objects: 66% (43778/66329), 40.08 MiB | 20.04 MiB/s Receiving objects: 67% (44441/66329), 40.08 MiB | 20.04 MiB/s Receiving objects: 68% (45104/66329), 40.08 MiB | 20.04 MiB/s Receiving objects: 69% (45768/66329), 40.08 MiB | 20.04 MiB/s Receiving objects: 70% (46431/66329), 40.08 MiB | 20.04 MiB/s Receiving objects: 71% (47094/66329), 40.08 MiB | 20.04 MiB/s Receiving objects: 72% (47757/66329), 59.74 MiB | 23.89 MiB/s Receiving objects: 73% (48421/66329), 59.74 MiB | 23.89 MiB/s Receiving objects: 74% (49084/66329), 59.74 MiB | 23.89 MiB/s Receiving objects: 75% (49747/66329), 59.74 MiB | 23.89 MiB/s Receiving objects: 76% (50411/66329), 59.74 MiB | 23.89 MiB/s Receiving objects: 77% (51074/66329), 59.74 MiB | 23.89 MiB/s Receiving objects: 78% (51737/66329), 59.74 MiB | 23.89 MiB/s Receiving objects: 79% (52400/66329), 59.74 MiB | 23.89 MiB/s Receiving objects: 79% (52605/66329), 59.74 MiB | 23.89 MiB/s Receiving objects: 80% (53064/66329), 75.97 MiB | 25.32 MiB/s Receiving objects: 81% (53727/66329), 75.97 MiB | 25.32 MiB/s Receiving objects: 82% (54390/66329), 75.97 MiB | 25.32 MiB/s Receiving objects: 83% (55054/66329), 75.97 MiB | 25.32 MiB/s Receiving objects: 84% (55717/66329), 75.97 MiB | 25.32 MiB/s Receiving objects: 85% (56380/66329), 75.97 MiB | 25.32 MiB/s Receiving objects: 86% (57043/66329), 75.97 MiB | 25.32 MiB/s Receiving objects: 87% (57707/66329), 75.97 MiB | 25.32 MiB/s Receiving objects: 88% (58370/66329), 75.97 MiB | 25.32 MiB/s Receiving objects: 89% (59033/66329), 75.97 MiB | 25.32 MiB/s Receiving objects: 90% (59697/66329), 75.97 MiB | 25.32 MiB/s Receiving objects: 91% (60360/66329), 75.97 MiB | 25.32 MiB/s Receiving objects: 92% (61023/66329), 75.97 MiB | 25.32 MiB/s Receiving objects: 93% (61686/66329), 75.97 MiB | 25.32 MiB/s Receiving objects: 94% (62350/66329), 75.97 MiB | 25.32 MiB/s Receiving objects: 95% (63013/66329), 75.97 MiB | 25.32 MiB/s Receiving objects: 96% (63676/66329), 75.97 MiB | 25.32 MiB/s Receiving objects: 97% (64340/66329), 75.97 MiB | 25.32 MiB/s Receiving objects: 98% (65003/66329), 75.97 MiB | 25.32 MiB/s Receiving objects: 99% (65666/66329), 88.18 MiB | 25.19 MiB/s remote: Total 66329 (delta 7283), reused 7248 (delta 6605), pack-reused 57328 (from 1)
  7. 8.33 s Receiving objects: 100% (66329/66329), 88.18 MiB | 25.19 MiB/s Receiving objects: 100% (66329/66329), 98.63 MiB | 25.43 MiB/s, done.
  8. 11.07 s Resolving deltas: 0% (0/46380) Resolving deltas: 1% (464/46380) Resolving deltas: 2% (928/46380) Resolving deltas: 3% (1392/46380) Resolving deltas: 4% (1857/46380) Resolving deltas: 5% (2319/46380) Resolving deltas: 6% (2783/46380) Resolving deltas: 7% (3247/46380) Resolving deltas: 8% (3711/46380) Resolving deltas: 9% (4175/46380) Resolving deltas: 10% (4638/46380) Resolving deltas: 11% (5102/46380) Resolving deltas: 12% (5566/46380) Resolving deltas: 13% (6031/46380) Resolving deltas: 14% (6494/46380) Resolving deltas: 15% (6957/46380) Resolving deltas: 16% (7421/46380) Resolving deltas: 17% (7885/46380) Resolving deltas: 18% (8349/46380) Resolving deltas: 19% (8813/46380) Resolving deltas: 20% (9276/46380) Resolving deltas: 21% (9740/46380) Resolving deltas: 22% (10204/46380) Resolving deltas: 23% (10668/46380) Resolving deltas: 24% (11132/46380) Resolving deltas: 25% (11595/46380) Resolving deltas: 26% (12059/46380) Resolving deltas: 27% (12523/46380) Resolving deltas: 28% (12987/46380) Resolving deltas: 29% (13451/46380) Resolving deltas: 30% (13914/46380) Resolving deltas: 31% (14379/46380) Resolving deltas: 32% (14843/46380) Resolving deltas: 33% (15306/46380) Resolving deltas: 34% (15770/46380) Resolving deltas: 35% (16233/46380) Resolving deltas: 36% (16697/46380) Resolving deltas: 37% (17161/46380) Resolving deltas: 38% (17625/46380) Resolving deltas: 39% (18089/46380) Resolving deltas: 40% (18552/46380) Resolving deltas: 41% (19016/46380) Resolving deltas: 42% (19480/46380) Resolving deltas: 43% (19944/46380) Resolving deltas: 44% (20408/46380) Resolving deltas: 45% (20871/46380) Resolving deltas: 46% (21335/46380) Resolving deltas: 47% (21799/46380) Resolving deltas: 48% (22263/46380) Resolving deltas: 49% (22727/46380) Resolving deltas: 50% (23191/46380) Resolving deltas: 51% (23654/46380) Resolving deltas: 51% (24113/46380) Resolving deltas: 52% (24118/46380) Resolving deltas: 53% (24586/46380) Resolving deltas: 54% (25046/46380) Resolving deltas: 55% (25509/46380) Resolving deltas: 56% (25973/46380) Resolving deltas: 57% (26437/46380) Resolving deltas: 58% (26902/46380) Resolving deltas: 59% (27365/46380) Resolving deltas: 60% (27828/46380) Resolving deltas: 61% (28292/46380) Resolving deltas: 62% (28757/46380) Resolving deltas: 63% (29221/46380) Resolving deltas: 64% (29684/46380) Resolving deltas: 65% (30147/46380) Resolving deltas: 66% (30611/46380) Resolving deltas: 67% (31075/46380) Resolving deltas: 68% (31539/46380) Resolving deltas: 69% (32007/46380) Resolving deltas: 70% (32466/46380) Resolving deltas: 71% (32930/46380) Resolving deltas: 72% (33394/46380) Resolving deltas: 73% (33858/46380) Resolving deltas: 74% (34322/46380) Resolving deltas: 75% (34786/46380) Resolving deltas: 75% (34968/46380) Resolving deltas: 76% (35249/46380) Resolving deltas: 77% (35713/46380) Resolving deltas: 78% (36177/46380) Resolving deltas: 79% (36641/46380) Resolving deltas: 80% (37104/46380) Resolving deltas: 81% (37568/46380) Resolving deltas: 82% (38032/46380) Resolving deltas: 83% (38496/46380) Resolving deltas: 84% (38960/46380) Resolving deltas: 85% (39423/46380) Resolving deltas: 86% (39887/46380) Resolving deltas: 87% (40351/46380) Resolving deltas: 88% (40815/46380) Resolving deltas: 89% (41279/46380) Resolving deltas: 90% (41742/46380) Resolving deltas: 91% (42206/46380) Resolving deltas: 92% (42670/46380) Resolving deltas: 93% (43134/46380) Resolving deltas: 94% (43598/46380) Resolving deltas: 95% (44061/46380) Resolving deltas: 96% (44525/46380) Resolving deltas: 97% (44989/46380) Resolving deltas: 98% (45454/46380) Resolving deltas: 99% (45917/46380) Resolving deltas: 100% (46380/46380) Resolving deltas: 100% (46380/46380), done.
  9. 12.70 s Fetching commit b66a9536b21e6c9319a846e70836b6ae01b1e337 for docs ...
  10. 12.70 s $ /nix/store/bcnisk3ydfgv26v2gw3zlky24g00yww2-git-2.54.0/bin/git fetch origin b66a9536b21e6c9319a846e70836b6ae01b1e337
  11. 13.48 s From https://github.com/alphal00p/gammaloop
  12. 13.48 s * branch b66a9536b21e6c9319a846e70836b6ae01b1e337 -> FETCH_HEAD
  13. 13.60 s $ /nix/store/9ypz3flqsrl5xl495mm8h645gadjsxi1-coreutils-9.11/bin/timeout --kill-after=15s 7200s /nix/store/bcnisk3ydfgv26v2gw3zlky24g00yww2-git-2.54.0/bin/git -c advice.detachedHead=false checkout b66a9536b21e6c9319a846e70836b6ae01b1e337
  14. 14.22 s HEAD is now at b66a9536b avoid Rustdoc rebuilds for prose-only documentation edits
  15. 14.26 s $ /nix/store/9ypz3flqsrl5xl495mm8h645gadjsxi1-coreutils-9.11/bin/timeout --kill-after=15s 7200s /nix/store/23zk8sgzamrbmj1fday15szf7f2279s8-nix-2.34.7/bin/nix --extra-experimental-features nix-command --extra-experimental-features flakes --log-format internal-json run .#packages.x86_64-linux.nix-ci-check-gammaloop-doctest --print-build-logs
  16. 21.85 s
  17. 23.36 s Building /nix/store/v2cgyi00i3qlx7w694lawhvc0ik6bqbi-nix-ci-check-gammaloop-doctest.drv
  18. 23.80 s [nix-ci-check-gammaloop-doctest:post-build] Uploading to the NixCI cache: /nix/store/8r71z0446l2zwhzz3q6mmxqxgi0jr438-nix-ci-check-gammaloop-doctest
  19. 24.34 s [nix-ci-check-gammaloop-doctest:post-build] warning: 'warn-short-path-literals' is deprecated, use 'lint-short-path-literals = ignore' instead
  20. 24.49 s [nix-ci-check-gammaloop-doctest:post-build] copying 1 paths...
  21. 24.49 s [nix-ci-check-gammaloop-doctest:post-build] copying path '/nix/store/8r71z0446l2zwhzz3q6mmxqxgi0jr438-nix-ci-check-gammaloop-doctest' to 'https://cache.nix-ci.com'...
  22. 25.53 s [nix-ci-check-gammaloop-doctest:post-build] warning: 'warn-short-path-literals' is deprecated, use 'lint-short-path-literals = ignore' instead
  23. 29.74 s [nix-ci-check-gammaloop-doctest:post-build] copying 1 paths...
  24. 29.75 s [nix-ci-check-gammaloop-doctest:post-build] copying path '/nix/store/v2cgyi00i3qlx7w694lawhvc0ik6bqbi-nix-ci-check-gammaloop-doctest.drv' to 'https://cache.nix-ci.com'...
  25. 30.32 s Uploaded nix-ci-check-gammaloop-doctest in 6.6s
  26. 30.32 s Progress: 1 of 2 built
  27. 30.32 s Built nix-ci-check-gammaloop-doctest in 6.9s
  28. 30.32 s Progress: 2 of 2 built
  29. 39.27 s evaluating derivation 'g copying '/nix/store/913l evaluating derivation 'g querying gammaloop-works querying info about miss querying gammaloop-works [0.0 KiB DL] [0/1 built, 0.0 KiB DL] [1/0/1 built, 0.0 KiB DLgammaloop-workspace-doctest> Running phase: unpackPhase
  30. 39.30 s gammaloop-workspace-doctest> unpacking source archive /nix/store/5afz06g4vsphrihpxicbxvm3sk5psnll-source
  31. 39.52 s gammaloop-workspace-doctest> source root is source
  32. 39.58 s gammaloop-workspace-doctest> Running phase: patchPhase
  33. 39.59 s gammaloop-workspace-doctest> Executing configureCargoCommonVars
  34. 39.61 s gammaloop-workspace-doctest> decompressing cargo artifacts from /nix/store/9q03j4h8yyxwgigikinn0j17963s9lwf-gammaloop-workspace-deps-deps-0.1.0/target.tar.zst to target
  35. 45.74 s gammaloop-workspace-doctest> Running phase: updateAutotoolsGnuConfigScriptsPhase
  36. 45.83 s gammaloop-workspace-doctest> Running phase: configurePhase
  37. 45.83 s gammaloop-workspace-doctest> will append /build/source/.cargo-home/config.toml with contents of /nix/store/4vj0f29myggx0gdynf7fwm2wfzgqnk61-vendor-cargo-deps/config.toml
  38. 45.83 s gammaloop-workspace-doctest> default configurePhase, nothing to do
  39. 45.84 s gammaloop-workspace-doctest> Running phase: buildPhase
  40. 45.84 s gammaloop-workspace-doctest> +++ command cargo --version
  41. 45.85 s gammaloop-workspace-doctest> cargo 1.97.0 (c980f4866 2026-06-30)
  42. 45.93 s gammaloop-workspace-doctest> +++ command cargo test --profile ci-optim --doc --locked --workspace --features gammaloop-api/cli,gammaloop-tracing-filter/clap,gammaloop-tracing-filter/symbolica,idenso/bincode,idenso/reference-cases,linnet/bincode,linnet/drawing,linnet/nodestore-vec,linnet/rkyv,linnet/serde,linnet/symbolica,spenso-macros/shadowing,spenso/shadowing,symbolica/tracing_max_level_info
  43. 47.45 s gammaloop-workspace-doctest> Compiling target-lexicon v0.13.5
  44. 47.47 s gammaloop-workspace-doctest> Compiling symbolica v2.2.0 (https://github.com/symbolica-dev/symbolica?branch=dev#0441bd7a)
  45. 47.47 s gammaloop-workspace-doctest> Compiling maplit v1.0.2
  46. 47.51 s gammaloop-workspace-doctest> Compiling gammaloop-tracing-filter-macros v0.1.0 (/build/source/crates/gammaloop-tracing-filter-macros)
  47. 47.53 s gammaloop-workspace-doctest> Compiling vakint v0.1.2 (/build/source/crates/vakint)
  48. 47.54 s gammaloop-workspace-doctest> Compiling gammalooprs v0.3.4 (/build/source/crates/gammalooprs)
  49. 47.57 s gammaloop-workspace-doctest> Compiling alphal00p-docs-macros v0.1.0 (/build/source/crates/alphal00p-docs-macros)
  50. 47.57 s gammaloop-workspace-doctest> Compiling alphal00p-docs-schema v0.1.0 (/build/source/crates/alphal00p-docs-schema)
  51. 47.57 s gammaloop-workspace-doctest> Compiling rustc_version v0.4.1
  52. 47.62 s gammaloop-workspace-doctest> Compiling bincode v1.3.3
  53. 47.62 s gammaloop-workspace-doctest> Compiling gungraun-runner v0.18.2
  54. 47.62 s gammaloop-workspace-doctest> Compiling target-triple v1.0.1
  55. 47.62 s gammaloop-workspace-doctest> Compiling iai-callgrind-runner v0.14.2
  56. 47.64 s gammaloop-workspace-doctest> Compiling gammaloop-integration-tests v0.1.0 (/build/source/tests)
  57. 47.67 s gammaloop-workspace-doctest> Compiling wait-timeout v0.2.1
  58. 48.45 s gammaloop-workspace-doctest> Compiling test-log-core v0.2.20
  59. 48.46 s gammaloop-workspace-doctest> Compiling quick-error v1.2.3
  60. 48.54 s gammaloop-workspace-doctest> Compiling bit-vec v0.8.0
  61. 48.69 s gammaloop-workspace-doctest> Compiling iai-callgrind v0.14.2
  62. 49.72 s gammaloop-workspace-doctest> Compiling bit-set v0.8.0
  63. 49.77 s gammaloop-workspace-doctest> Compiling rusty-fork v0.3.1
  64. 49.80 s gammaloop-workspace-doctest> Compiling iai-callgrind-macros v0.5.1
  65. 49.86 s gammaloop-workspace-doctest> Compiling rand_xorshift v0.4.0
  66. 50.07 s gammaloop-workspace-doctest> Compiling console v0.15.11
  67. 50.07 s gammaloop-workspace-doctest> Compiling glob v0.3.4
  68. 50.35 s gammaloop-workspace-doctest> Compiling termcolor v1.4.1
  69. 50.63 s gammaloop-workspace-doctest> Compiling gungraun-macros v0.8.0
  70. 51.29 s gammaloop-workspace-doctest> Compiling unarray v0.1.4
  71. 51.55 s gammaloop-workspace-doctest> Compiling base64 v0.21.7
  72. 51.81 s gammaloop-workspace-doctest> Compiling similar-asserts v1.7.0
  73. 52.39 s gammaloop-workspace-doctest> Compiling ron v0.8.1
  74. 52.54 s gammaloop-workspace-doctest> Compiling proptest v1.11.0
  75. 53.16 s gammaloop-workspace-doctest> Compiling trybuild v1.0.120
  76. 53.36 s gammaloop-workspace-doctest> Compiling kurvst v0.1.0 (/build/source/crates/kurvst)
  77. 54.23 s gammaloop-workspace-doctest> Compiling pyo3-build-config v0.28.3
  78. 57.04 s gammaloop-workspace-doctest> Compiling alphal00p-docs-catalogs v0.1.0 (/build/source/crates/alphal00p-docs-catalogs)
  79. 58.95 s gammaloop-workspace-doctest> Compiling alphal00p-docs-builder v0.1.0 (/build/source/crates/alphal00p-docs-builder)
  80. 59.98 s gammaloop-workspace-doctest> Compiling test-log-macros v0.2.20
  81. 66.20 s gammaloop-workspace-doctest> Compiling test-log v0.2.20
  82. 68.34 s gammaloop-workspace-doctest> Compiling alphal00p-docs-examples v0.1.0 (/build/source/crates/alphal00p-docs-examples)
  83. 69.05 s gammaloop-workspace-doctest> Compiling pyo3-ffi v0.28.3
  84. 69.58 s gammaloop-workspace-doctest> Compiling pyo3-macros-backend v0.28.3
  85. 70.49 s gammaloop-workspace-doctest> Compiling pyo3 v0.28.3
  86. 71.23 s gammaloop-workspace-doctest> Compiling numpy v0.28.0
  87. 71.73 s gammaloop-workspace-doctest> Compiling gammaloop-api v0.1.0 (/build/source/crates/gammaloop-api)
  88. 72.70 s gammaloop-workspace-doctest> Compiling gungraun v0.18.2
  89. 106.63 s gammaloop-workspace-doctest> Compiling pyo3-macros v0.28.3
  90. 117.67 s gammaloop-workspace-doctest> Compiling pyo3-stub-gen v0.17.2
  91. 119.46 s gammaloop-workspace-doctest> Compiling numerica v2.2.0 (https://github.com/symbolica-dev/symbolica?branch=dev#0441bd7a)
  92. 124.35 s gammaloop-workspace-doctest> Compiling graphica v2.1.0 (https://github.com/symbolica-dev/symbolica?branch=dev#0441bd7a)
  93. 132.82 s gammaloop-workspace-doctest> Compiling symbolica-utils v0.1.0 (/build/source/crates/symbolica-utils)
  94. 470.69 s gammaloop-workspace-doctest> Compiling gammaloop-workspace-hack v0.1.0 (/build/source/crates/gammaloop-workspace-hack)
  95. 470.70 s gammaloop-workspace-doctest> Compiling spenso-macros v0.3.2 (/build/source/crates/spenso-macros)
  96. 470.98 s gammaloop-workspace-doctest> Compiling linnet v0.17.0 (/build/source/crates/linnet)
  97. 475.62 s gammaloop-workspace-doctest> Compiling spenso v0.6.0 (/build/source/crates/spenso)
  98. 487.44 s gammaloop-workspace-doctest> Compiling idenso v0.3.0 (/build/source/crates/idenso)
  99. 487.45 s gammaloop-workspace-doctest> Compiling gammaloop-tracing-filter v0.1.0 (/build/source/crates/gammaloop-tracing-filter)
  100. 495.08 s gammaloop-workspace-doctest> Compiling spenso-hep-lib v0.1.7 (/build/source/crates/spenso-hep-lib)
  101. 495.40 s gammaloop-workspace-doctest> Compiling spynso3 v0.1.2 (/build/source/crates/spynso3)
  102. 591.36 s gammaloop-workspace-doctest> Compiling linnest v0.1.0 (/build/source/crates/linnest)
  103. 591.38 s gammaloop-workspace-doctest> Compiling linnet-py v0.1.0 (/build/source/crates/linnet-py)
  104. 1034.89 s gammaloop-workspace-doctest> Finished `ci-optim` profile [optimized] target(s) in 16m 28s
  105. 1035.25 s gammaloop-workspace-doctest> warning: the following packages contain code that will be rejected by a future version of Rust: proc-macro-error2 v2.0.1
  106. 1035.25 s gammaloop-workspace-doctest> note: to see what the problems were, use the option `--future-incompat-report`, or run `cargo report future-incompatibilities --id 1`
  107. 1035.35 s gammaloop-workspace-doctest> Doc-tests alphal00p_docs_builder
  108. 1035.87 s gammaloop-workspace-doctest>
  109. 1035.87 s gammaloop-workspace-doctest> running 0 tests
  110. 1035.87 s gammaloop-workspace-doctest>
  111. 1035.87 s gammaloop-workspace-doctest> test result: ok. 0 passed; 0 failed; 0 ignored; 0 measured; 0 filtered out; finished in 0.00s
  112. 1035.87 s gammaloop-workspace-doctest>
  113. 1035.88 s gammaloop-workspace-doctest> Doc-tests alphal00p_docs_catalogs
  114. 1038.83 s gammaloop-workspace-doctest>
  115. 1038.83 s gammaloop-workspace-doctest> running 0 tests
  116. 1038.83 s gammaloop-workspace-doctest>
  117. 1038.83 s gammaloop-workspace-doctest> test result: ok. 0 passed; 0 failed; 0 ignored; 0 measured; 0 filtered out; finished in 0.00s
  118. 1038.83 s gammaloop-workspace-doctest>
  119. 1038.84 s gammaloop-workspace-doctest> Doc-tests alphal00p_docs_examples
  120. 1038.87 s gammaloop-workspace-doctest>
  121. 1038.87 s gammaloop-workspace-doctest> running 0 tests
  122. 1038.87 s gammaloop-workspace-doctest>
  123. 1038.87 s gammaloop-workspace-doctest> test result: ok. 0 passed; 0 failed; 0 ignored; 0 measured; 0 filtered out; finished in 0.00s
  124. 1038.87 s gammaloop-workspace-doctest>
  125. 1038.88 s gammaloop-workspace-doctest> Doc-tests alphal00p_docs
  126. 1039.04 s gammaloop-workspace-doctest>
  127. 1039.04 s gammaloop-workspace-doctest> running 0 tests
  128. 1039.04 s gammaloop-workspace-doctest>
  129. 1039.04 s gammaloop-workspace-doctest> test result: ok. 0 passed; 0 failed; 0 ignored; 0 measured; 0 filtered out; finished in 0.00s
  130. 1039.04 s gammaloop-workspace-doctest>
  131. 1039.04 s gammaloop-workspace-doctest> Doc-tests alphal00p_docs_schema
  132. 1039.21 s gammaloop-workspace-doctest>
  133. 1039.21 s gammaloop-workspace-doctest> running 0 tests
  134. 1039.21 s gammaloop-workspace-doctest>
  135. 1039.21 s gammaloop-workspace-doctest> test result: ok. 0 passed; 0 failed; 0 ignored; 0 measured; 0 filtered out; finished in 0.00s
  136. 1039.21 s gammaloop-workspace-doctest>
  137. 1039.22 s gammaloop-workspace-doctest> Doc-tests gammaloop_api
  138. 1041.97 s gammaloop-workspace-doctest>
  139. 1041.97 s gammaloop-workspace-doctest> running 16 tests
  140. 1042.06 s gammaloop-workspace-doctest> test crates/gammaloop-api/src/python.rs - python::GammaLoopAPI::get_integrand_info (line 3585) ... FAILED
  141. 1042.07 s gammaloop-workspace-doctest> test crates/gammaloop-api/src/python.rs - python::GammaLoopAPI::evaluate_sample (line 2967) ... FAILED
  142. 1042.11 s gammaloop-workspace-doctest> test crates/gammaloop-api/src/python.rs - python::GammaLoopAPI::get_integrand_settings (line 3647) ... FAILED
  143. 1042.11 s gammaloop-workspace-doctest> test crates/gammaloop-api/src/python.rs - python::PyHistogramAccumulator (line 871) ... FAILED
  144. 1042.12 s gammaloop-workspace-doctest> test crates/gammaloop-api/src/python.rs - python::GammaLoopAPI::get_default_runtime_settings (line 3796) ... FAILED
  145. 1042.17 s gammaloop-workspace-doctest> test crates/gammaloop-api/src/python.rs - python::GammaLoopAPI::evaluate_samples (line 3108) ... FAILED
  146. 1042.18 s gammaloop-workspace-doctest> test crates/gammaloop-api/src/python.rs - python::GammaLoopAPI::get_active_command_blocks (line 3760) ... FAILED
  147. 1042.63 s gammaloop-workspace-doctest> test crates/gammaloop-api/src/lib.rs - (line 18) - compile ... ok
  148. 1042.77 s gammaloop-workspace-doctest> test crates/gammaloop-api/src/python.rs - python::evaluate_graph_overall_factor (line 95) ... FAILED
  149. 1042.97 s gammaloop-workspace-doctest> test crates/gammaloop-api/src/python.rs - python::GammaLoopAPI::run_command (line 3901) ... FAILED
  150. 1042.98 s gammaloop-workspace-doctest> test crates/gammaloop-api/src/python.rs - python::atom_to_dots (line 157) ... FAILED
  151. 1042.98 s gammaloop-workspace-doctest> test crates/gammaloop-api/src/python.rs - python::GammaLoopAPI::new_python (line 2834) ... FAILED
  152. 1042.99 s gammaloop-workspace-doctest> test crates/gammaloop-api/src/python.rs - python::GammaLoopAPI::get_global_settings (line 3739) ... FAILED
  153. 1043.00 s gammaloop-workspace-doctest> test crates/gammaloop-api/src/python.rs - python::GammaLoopAPI::get_run_history (line 3711) ... FAILED
  154. 1043.04 s gammaloop-workspace-doctest> test crates/gammaloop-api/src/python.rs - python::atom_to_canonical_string (line 128) ... FAILED
  155. 1050.12 s gammaloop-workspace-doctest> test crates/gammaloop-api/src/commands/evaluate_samples.rs - commands::evaluate_samples::EvaluateSamples (line 50) ... ok
  156. 1050.13 s gammaloop-workspace-doctest>
  157. 1050.13 s gammaloop-workspace-doctest> failures:
  158. 1050.13 s gammaloop-workspace-doctest>
  159. 1050.13 s gammaloop-workspace-doctest> ---- crates/gammaloop-api/src/python.rs - python::GammaLoopAPI::get_integrand_info (line 3585) stdout ----
  160. 1050.13 s gammaloop-workspace-doctest> error: expected one of `!` or `::`, found `pathlib`
  161. 1050.13 s gammaloop-workspace-doctest> --> crates/gammaloop-api/src/python.rs:3586:6
  162. 1050.13 s gammaloop-workspace-doctest> |
  163. 1050.13 s gammaloop-workspace-doctest> 3586 | from pathlib import Path
  164. 1050.13 s gammaloop-workspace-doctest> | ^^^^^^^ expected one of `!` or `::`
  165. 1050.13 s gammaloop-workspace-doctest>
  166. 1050.13 s gammaloop-workspace-doctest> error: aborting due to 1 previous error
  167. 1050.13 s gammaloop-workspace-doctest>
  168. 1050.13 s gammaloop-workspace-doctest> Couldn't compile the test.
  169. 1050.13 s gammaloop-workspace-doctest> ---- crates/gammaloop-api/src/python.rs - python::GammaLoopAPI::evaluate_sample (line 2967) stdout ----
  170. 1050.13 s gammaloop-workspace-doctest> error: expected one of `!` or `::`, found `pathlib`
  171. 1050.13 s gammaloop-workspace-doctest> --> crates/gammaloop-api/src/python.rs:2968:6
  172. 1050.13 s gammaloop-workspace-doctest> |
  173. 1050.13 s gammaloop-workspace-doctest> 2968 | from pathlib import Path
  174. 1050.13 s gammaloop-workspace-doctest> | ^^^^^^^ expected one of `!` or `::`
  175. 1050.13 s gammaloop-workspace-doctest>
  176. 1050.13 s gammaloop-workspace-doctest> error: aborting due to 1 previous error
  177. 1050.13 s gammaloop-workspace-doctest>
  178. 1050.13 s gammaloop-workspace-doctest> Couldn't compile the test.
  179. 1050.13 s gammaloop-workspace-doctest> ---- crates/gammaloop-api/src/python.rs - python::GammaLoopAPI::get_integrand_settings (line 3647) stdout ----
  180. 1050.13 s gammaloop-workspace-doctest> error: expected one of `!` or `::`, found `=`
  181. 1050.13 s gammaloop-workspace-doctest> --> crates/gammaloop-api/src/python.rs:3648:10
  182. 1050.13 s gammaloop-workspace-doctest> |
  183. 1050.13 s gammaloop-workspace-doctest> 3648 | settings = api.get_integrand_settings(process_id=0)
  184. 1050.13 s gammaloop-workspace-doctest> | ^ expected one of `!` or `::`
  185. 1050.13 s gammaloop-workspace-doctest>
  186. 1050.13 s gammaloop-workspace-doctest> error: aborting due to 1 previous error
  187. 1050.13 s gammaloop-workspace-doctest>
  188. 1050.13 s gammaloop-workspace-doctest> Couldn't compile the test.
  189. 1050.13 s gammaloop-workspace-doctest> ---- crates/gammaloop-api/src/python.rs - python::PyHistogramAccumulator (line 871) stdout ----
  190. 1050.13 s gammaloop-workspace-doctest> error: expected one of `!` or `::`, found `gammaloop`
  191. 1050.13 s gammaloop-workspace-doctest> --> crates/gammaloop-api/src/python.rs:872:6
  192. 1050.13 s gammaloop-workspace-doctest> |
  193. 1050.13 s gammaloop-workspace-doctest> 872 | from gammaloop import HistogramAccumulator
  194. 1050.13 s gammaloop-workspace-doctest> | ^^^^^^^^^ expected one of `!` or `::`
  195. 1050.13 s gammaloop-workspace-doctest>
  196. 1050.13 s gammaloop-workspace-doctest> error: aborting due to 1 previous error
  197. 1050.13 s gammaloop-workspace-doctest>
  198. 1050.13 s gammaloop-workspace-doctest> Couldn't compile the test.
  199. 1050.13 s gammaloop-workspace-doctest> ---- crates/gammaloop-api/src/python.rs - python::GammaLoopAPI::get_default_runtime_settings (line 3796) stdout ----
  200. 1050.13 s gammaloop-workspace-doctest> error: expected one of `!` or `::`, found `=`
  201. 1050.13 s gammaloop-workspace-doctest> --> crates/gammaloop-api/src/python.rs:3797:9
  202. 1050.13 s gammaloop-workspace-doctest> |
  203. 1050.13 s gammaloop-workspace-doctest> 3797 | runtime = api.get_default_runtime_settings()
  204. 1050.13 s gammaloop-workspace-doctest> | ^ expected one of `!` or `::`
  205. 1050.13 s gammaloop-workspace-doctest>
  206. 1050.13 s gammaloop-workspace-doctest> error: aborting due to 1 previous error
  207. 1050.13 s gammaloop-workspace-doctest>
  208. 1050.13 s gammaloop-workspace-doctest> Couldn't compile the test.
  209. 1050.13 s gammaloop-workspace-doctest> ---- crates/gammaloop-api/src/python.rs - python::GammaLoopAPI::evaluate_samples (line 3108) stdout ----
  210. 1050.13 s gammaloop-workspace-doctest> error: expected one of `!` or `::`, found `pathlib`
  211. 1050.13 s gammaloop-workspace-doctest> --> crates/gammaloop-api/src/python.rs:3109:6
  212. 1050.13 s gammaloop-workspace-doctest> |
  213. 1050.13 s gammaloop-workspace-doctest> 3109 | from pathlib import Path
  214. 1050.13 s gammaloop-workspace-doctest> | ^^^^^^^ expected one of `!` or `::`
  215. 1050.13 s gammaloop-workspace-doctest>
  216. 1050.13 s gammaloop-workspace-doctest> error: aborting due to 1 previous error
  217. 1050.13 s gammaloop-workspace-doctest>
  218. 1050.13 s gammaloop-workspace-doctest> Couldn't compile the test.
  219. 1050.13 s gammaloop-workspace-doctest> ---- crates/gammaloop-api/src/python.rs - python::GammaLoopAPI::get_active_command_blocks (line 3760) stdout ----
  220. 1050.13 s gammaloop-workspace-doctest> error: expected item, found keyword `for`
  221. 1050.13 s gammaloop-workspace-doctest> --> crates/gammaloop-api/src/python.rs:3761:1
  222. 1050.13 s gammaloop-workspace-doctest> |
  223. 1050.13 s gammaloop-workspace-doctest> 3761 | for name, commands in api.get_active_command_blocks().items():
  224. 1050.13 s gammaloop-workspace-doctest> | ^^^ expected item
  225. 1050.13 s gammaloop-workspace-doctest> |
  226. 1050.13 s gammaloop-workspace-doctest> = note: for a full list of items that can appear in modules, see <https://doc.rust-lang.org/reference/items.html>
  227. 1050.13 s gammaloop-workspace-doctest>
  228. 1050.13 s gammaloop-workspace-doctest> error: aborting due to 1 previous error
  229. 1050.13 s gammaloop-workspace-doctest>
  230. 1050.13 s gammaloop-workspace-doctest> Couldn't compile the test.
  231. 1050.13 s gammaloop-workspace-doctest> ---- crates/gammaloop-api/src/python.rs - python::evaluate_graph_overall_factor (line 95) stdout ----
  232. 1050.13 s gammaloop-workspace-doctest> error[E0425]: cannot find function `evaluate_graph_overall_factor` in this scope
  233. 1050.13 s gammaloop-workspace-doctest> --> crates/gammaloop-api/src/python.rs:96:1
  234. 1050.13 s gammaloop-workspace-doctest> |
  235. 1050.13 s gammaloop-workspace-doctest> 96 | evaluate_graph_overall_factor(
  236. 1050.13 s gammaloop-workspace-doctest> | ^^^^^^^^^^^^^^^^^^^^^^^^^^^^^ not found in this scope
  237. 1050.13 s gammaloop-workspace-doctest>
  238. 1050.13 s gammaloop-workspace-doctest> error: aborting due to 1 previous error
  239. 1050.13 s gammaloop-workspace-doctest>
  240. 1050.13 s gammaloop-workspace-doctest> For more information about this error, try `rustc --explain E0425`.
  241. 1050.13 s gammaloop-workspace-doctest> Couldn't compile the test.
  242. 1050.13 s gammaloop-workspace-doctest> ---- crates/gammaloop-api/src/python.rs - python::GammaLoopAPI::run_command (line 3901) stdout ----
  243. 1050.13 s gammaloop-workspace-doctest> error[E0425]: cannot find value `api` in this scope
  244. 1050.13 s gammaloop-workspace-doctest> --> crates/gammaloop-api/src/python.rs:3902:1
  245. 1050.13 s gammaloop-workspace-doctest> |
  246. 1050.13 s gammaloop-workspace-doctest> 3902 | api.run("display processes")
  247. 1050.13 s gammaloop-workspace-doctest> | ^^^ not found in this scope
  248. 1050.13 s gammaloop-workspace-doctest>
  249. 1050.13 s gammaloop-workspace-doctest> error: aborting due to 1 previous error
  250. 1050.13 s gammaloop-workspace-doctest>
  251. 1050.13 s gammaloop-workspace-doctest> For more information about this error, try `rustc --explain E0425`.
  252. 1050.13 s gammaloop-workspace-doctest> Couldn't compile the test.
  253. 1050.13 s gammaloop-workspace-doctest> ---- crates/gammaloop-api/src/python.rs - python::atom_to_dots (line 157) stdout ----
  254. 1050.13 s gammaloop-workspace-doctest> error[E0425]: cannot find function `to_dots` in this scope
  255. 1050.13 s gammaloop-workspace-doctest> --> crates/gammaloop-api/src/python.rs:158:1
  256. 1050.13 s gammaloop-workspace-doctest> |
  257. 1050.13 s gammaloop-workspace-doctest> 158 | to_dots("p(mu) * q(mu)")
  258. 1050.13 s gammaloop-workspace-doctest> | ^^^^^^^ not found in this scope
  259. 1050.13 s gammaloop-workspace-doctest>
  260. 1050.13 s gammaloop-workspace-doctest> error: aborting due to 1 previous error
  261. 1050.13 s gammaloop-workspace-doctest>
  262. 1050.13 s gammaloop-workspace-doctest> For more information about this error, try `rustc --explain E0425`.
  263. 1050.13 s gammaloop-workspace-doctest> Couldn't compile the test.
  264. 1050.13 s gammaloop-workspace-doctest> ---- crates/gammaloop-api/src/python.rs - python::GammaLoopAPI::new_python (line 2834) stdout ----
  265. 1050.13 s gammaloop-workspace-doctest> error[E0425]: cannot find value `api` in this scope
  266. 1050.13 s gammaloop-workspace-doctest> --> crates/gammaloop-api/src/python.rs:2835:1
  267. 1050.13 s gammaloop-workspace-doctest> |
  268. 1050.13 s gammaloop-workspace-doctest> 2835 | api = GammaLoopAPI(state_folder="./state", read_only_state=True)
  269. 1050.13 s gammaloop-workspace-doctest> | ^^^
  270. 1050.13 s gammaloop-workspace-doctest> |
  271. 1050.13 s gammaloop-workspace-doctest> help: you might have meant to introduce a new binding
  272. 1050.13 s gammaloop-workspace-doctest> |
  273. 1050.13 s gammaloop-workspace-doctest> 2835 | let api = GammaLoopAPI(state_folder="./state", read_only_state=True)
  274. 1050.13 s gammaloop-workspace-doctest> | +++
  275. 1050.13 s gammaloop-workspace-doctest>
  276. 1050.13 s gammaloop-workspace-doctest> error[E0425]: cannot find value `state_folder` in this scope
  277. 1050.13 s gammaloop-workspace-doctest> --> crates/gammaloop-api/src/python.rs:2835:20
  278. 1050.13 s gammaloop-workspace-doctest> |
  279. 1050.13 s gammaloop-workspace-doctest> 2835 | api = GammaLoopAPI(state_folder="./state", read_only_state=True)
  280. 1050.13 s gammaloop-workspace-doctest> | ^^^^^^^^^^^^ not found in this scope
  281. 1050.13 s gammaloop-workspace-doctest>
  282. 1050.13 s gammaloop-workspace-doctest> error[E0425]: cannot find value `read_only_state` in this scope
  283. 1050.13 s gammaloop-workspace-doctest> --> crates/gammaloop-api/src/python.rs:2835:44
  284. 1050.13 s gammaloop-workspace-doctest> |
  285. 1050.13 s gammaloop-workspace-doctest> 2835 | api = GammaLoopAPI(state_folder="./state", read_only_state=True)
  286. 1050.13 s gammaloop-workspace-doctest> | ^^^^^^^^^^^^^^^ not found in this scope
  287. 1050.13 s gammaloop-workspace-doctest>
  288. 1050.13 s gammaloop-workspace-doctest> error[E0425]: cannot find value `True` in this scope
  289. 1050.13 s gammaloop-workspace-doctest> --> crates/gammaloop-api/src/python.rs:2835:60
  290. 1050.13 s gammaloop-workspace-doctest> |
  291. 1050.13 s gammaloop-workspace-doctest> 2835 | api = GammaLoopAPI(state_folder="./state", read_only_state=True)
  292. 1050.13 s gammaloop-workspace-doctest> | ^^^^ not found in this scope
  293. 1050.13 s gammaloop-workspace-doctest> |
  294. 1050.13 s gammaloop-workspace-doctest> help: you may want to use a bool value instead
  295. 1050.13 s gammaloop-workspace-doctest> |
  296. 1050.13 s gammaloop-workspace-doctest> 2835 - api = GammaLoopAPI(state_folder="./state", read_only_state=True)
  297. 1050.13 s gammaloop-workspace-doctest> 2835 + api = GammaLoopAPI(state_folder="./state", read_only_state=true)
  298. 1050.13 s gammaloop-workspace-doctest> |
  299. 1050.13 s gammaloop-workspace-doctest>
  300. 1050.13 s gammaloop-workspace-doctest> error[E0425]: cannot find function, tuple struct or tuple variant `GammaLoopAPI` in this scope
  301. 1050.13 s gammaloop-workspace-doctest> --> crates/gammaloop-api/src/python.rs:2835:7
  302. 1050.13 s gammaloop-workspace-doctest> |
  303. 1050.13 s gammaloop-workspace-doctest> 2835 | api = GammaLoopAPI(state_folder="./state", read_only_state=True)
  304. 1050.13 s gammaloop-workspace-doctest> | ^^^^^^^^^^^^ not found in this scope
  305. 1050.13 s gammaloop-workspace-doctest>
  306. 1050.13 s gammaloop-workspace-doctest> error: aborting due to 5 previous errors
  307. 1050.13 s gammaloop-workspace-doctest>
  308. 1050.13 s gammaloop-workspace-doctest> For more information about this error, try `rustc --explain E0425`.
  309. 1050.13 s gammaloop-workspace-doctest> Couldn't compile the test.
  310. 1050.13 s gammaloop-workspace-doctest> ---- crates/gammaloop-api/src/python.rs - python::GammaLoopAPI::get_global_settings (line 3739) stdout ----
  311. 1050.13 s gammaloop-workspace-doctest> error[E0425]: cannot find value `settings_toml` in this scope
  312. 1050.13 s gammaloop-workspace-doctest> --> crates/gammaloop-api/src/python.rs:3740:1
  313. 1050.13 s gammaloop-workspace-doctest> |
  314. 1050.13 s gammaloop-workspace-doctest> 3740 | settings_toml = api.get_global_settings()
  315. 1050.13 s gammaloop-workspace-doctest> | ^^^^^^^^^^^^^
  316. 1050.13 s gammaloop-workspace-doctest> |
  317. 1050.13 s gammaloop-workspace-doctest> help: you might have meant to introduce a new binding
  318. 1050.13 s gammaloop-workspace-doctest> |
  319. 1050.13 s gammaloop-workspace-doctest> 3740 | let settings_toml = api.get_global_settings()
  320. 1050.13 s gammaloop-workspace-doctest> | +++
  321. 1050.13 s gammaloop-workspace-doctest>
  322. 1050.13 s gammaloop-workspace-doctest> error[E0425]: cannot find value `api` in this scope
  323. 1050.13 s gammaloop-workspace-doctest> --> crates/gammaloop-api/src/python.rs:3740:17
  324. 1050.13 s gammaloop-workspace-doctest> |
  325. 1050.13 s gammaloop-workspace-doctest> 3740 | settings_toml = api.get_global_settings()
  326. 1050.13 s gammaloop-workspace-doctest> | ^^^ not found in this scope
  327. 1050.13 s gammaloop-workspace-doctest>
  328. 1050.13 s gammaloop-workspace-doctest> error: aborting due to 2 previous errors
  329. 1050.13 s gammaloop-workspace-doctest>
  330. 1050.13 s gammaloop-workspace-doctest> For more information about this error, try `rustc --explain E0425`.
  331. 1050.13 s gammaloop-workspace-doctest> Couldn't compile the test.
  332. 1050.13 s gammaloop-workspace-doctest> ---- crates/gammaloop-api/src/python.rs - python::GammaLoopAPI::get_run_history (line 3711) stdout ----
  333. 1050.13 s gammaloop-workspace-doctest> error[E0425]: cannot find value `run_card_toml` in this scope
  334. 1050.13 s gammaloop-workspace-doctest> --> crates/gammaloop-api/src/python.rs:3712:1
  335. 1050.13 s gammaloop-workspace-doctest> |
  336. 1050.13 s gammaloop-workspace-doctest> 3712 | run_card_toml = api.get_run_history()
  337. 1050.13 s gammaloop-workspace-doctest> | ^^^^^^^^^^^^^
  338. 1050.13 s gammaloop-workspace-doctest> |
  339. 1050.13 s gammaloop-workspace-doctest> help: you might have meant to introduce a new binding
  340. 1050.13 s gammaloop-workspace-doctest> |
  341. 1050.13 s gammaloop-workspace-doctest> 3712 | let run_card_toml = api.get_run_history()
  342. 1050.13 s gammaloop-workspace-doctest> | +++
  343. 1050.13 s gammaloop-workspace-doctest>
  344. 1050.13 s gammaloop-workspace-doctest> error[E0425]: cannot find value `api` in this scope
  345. 1050.13 s gammaloop-workspace-doctest> --> crates/gammaloop-api/src/python.rs:3712:17
  346. 1050.13 s gammaloop-workspace-doctest> |
  347. 1050.13 s gammaloop-workspace-doctest> 3712 | run_card_toml = api.get_run_history()
  348. 1050.13 s gammaloop-workspace-doctest> | ^^^ not found in this scope
  349. 1050.13 s gammaloop-workspace-doctest>
  350. 1050.13 s gammaloop-workspace-doctest> error: aborting due to 2 previous errors
  351. 1050.13 s gammaloop-workspace-doctest>
  352. 1050.13 s gammaloop-workspace-doctest> For more information about this error, try `rustc --explain E0425`.
  353. 1050.13 s gammaloop-workspace-doctest> Couldn't compile the test.
  354. 1050.13 s gammaloop-workspace-doctest> ---- crates/gammaloop-api/src/python.rs - python::atom_to_canonical_string (line 128) stdout ----
  355. 1050.13 s gammaloop-workspace-doctest> error[E0425]: cannot find function `atom_to_canonical_string` in this scope
  356. 1050.13 s gammaloop-workspace-doctest> --> crates/gammaloop-api/src/python.rs:129:1
  357. 1050.13 s gammaloop-workspace-doctest> |
  358. 1050.13 s gammaloop-workspace-doctest> 129 | atom_to_canonical_string("x + x")
  359. 1050.13 s gammaloop-workspace-doctest> | ^^^^^^^^^^^^^^^^^^^^^^^^ not found in this scope
  360. 1050.13 s gammaloop-workspace-doctest>
  361. 1050.13 s gammaloop-workspace-doctest> error: aborting due to 1 previous error
  362. 1050.13 s gammaloop-workspace-doctest>
  363. 1050.13 s gammaloop-workspace-doctest> For more information about this error, try `rustc --explain E0425`.
  364. 1050.13 s gammaloop-workspace-doctest> Couldn't compile the test.
  365. 1050.13 s gammaloop-workspace-doctest>
  366. 1050.13 s gammaloop-workspace-doctest> failures:
  367. 1050.13 s gammaloop-workspace-doctest> crates/gammaloop-api/src/python.rs - python::GammaLoopAPI::evaluate_sample (line 2967)
  368. 1050.13 s gammaloop-workspace-doctest> crates/gammaloop-api/src/python.rs - python::GammaLoopAPI::evaluate_samples (line 3108)
  369. 1050.13 s gammaloop-workspace-doctest> crates/gammaloop-api/src/python.rs - python::GammaLoopAPI::get_active_command_blocks (line 3760)
  370. 1050.13 s gammaloop-workspace-doctest> crates/gammaloop-api/src/python.rs - python::GammaLoopAPI::get_default_runtime_settings (line 3796)
  371. 1050.13 s gammaloop-workspace-doctest> crates/gammaloop-api/src/python.rs - python::GammaLoopAPI::get_global_settings (line 3739)
  372. 1050.13 s gammaloop-workspace-doctest> crates/gammaloop-api/src/python.rs - python::GammaLoopAPI::get_integrand_info (line 3585)
  373. 1050.13 s gammaloop-workspace-doctest> crates/gammaloop-api/src/python.rs - python::GammaLoopAPI::get_integrand_settings (line 3647)
  374. 1050.13 s gammaloop-workspace-doctest> crates/gammaloop-api/src/python.rs - python::GammaLoopAPI::get_run_history (line 3711)
  375. 1050.13 s gammaloop-workspace-doctest> crates/gammaloop-api/src/python.rs - python::GammaLoopAPI::new_python (line 2834)
  376. 1050.13 s gammaloop-workspace-doctest> crates/gammaloop-api/src/python.rs - python::GammaLoopAPI::run_command (line 3901)
  377. 1050.13 s gammaloop-workspace-doctest> crates/gammaloop-api/src/python.rs - python::PyHistogramAccumulator (line 871)
  378. 1050.13 s gammaloop-workspace-doctest> crates/gammaloop-api/src/python.rs - python::atom_to_canonical_string (line 128)
  379. 1050.13 s gammaloop-workspace-doctest> crates/gammaloop-api/src/python.rs - python::atom_to_dots (line 157)
  380. 1050.13 s gammaloop-workspace-doctest> crates/gammaloop-api/src/python.rs - python::evaluate_graph_overall_factor (line 95)
  381. 1050.13 s gammaloop-workspace-doctest>
  382. 1050.13 s gammaloop-workspace-doctest> test result: FAILED. 2 passed; 14 failed; 0 ignored; 0 measured; 0 filtered out; finished in 8.14s
  383. 1050.13 s gammaloop-workspace-doctest>
  384. 1050.13 s gammaloop-workspace-doctest> error: doctest failed, to rerun pass `-p gammaloop-api --doc`
  385. 1051.58 s error: Cannot build '/nix/store/gfqf16jiri54v362qzgvkmdlmf27gab4-gammaloop-workspace-doctest-0.1.0.drv'.
  386. 1051.58 s Reason: builder failed with exit code 101.
  387. 1051.58 s Output paths:
  388. 1051.58 s /nix/store/2ap3qnbflc67an3cixg5kwcmqkvrk4iw-gammaloop-workspace-doctest-0.1.0
  389. 1051.58 s Last 356 log lines:
  390. 1051.58 s > Running phase: unpackPhase
  391. 1051.58 s > unpacking source archive /nix/store/5afz06g4vsphrihpxicbxvm3sk5psnll-source
  392. 1051.58 s > source root is source
  393. 1051.58 s > Running phase: patchPhase
  394. 1051.58 s > Executing configureCargoCommonVars
  395. 1051.58 s > decompressing cargo artifacts from /nix/store/9q03j4h8yyxwgigikinn0j17963s9lwf-gammaloop-workspace-deps-deps-0.1.0/target.tar.zst to target
  396. 1051.58 s > Running phase: updateAutotoolsGnuConfigScriptsPhase
  397. 1051.58 s > Running phase: configurePhase
  398. 1051.58 s > will append /build/source/.cargo-home/config.toml with contents of /nix/store/4vj0f29myggx0gdynf7fwm2wfzgqnk61-vendor-cargo-deps/config.toml
  399. 1051.58 s > default configurePhase, nothing to do
  400. 1051.58 s > Running phase: buildPhase
  401. 1051.58 s > +++ command cargo --version
  402. 1051.58 s > cargo 1.97.0 (c980f4866 2026-06-30)
  403. 1051.58 s > +++ command cargo test --profile ci-optim --doc --locked --workspace --features gammaloop-api/cli,gammaloop-tracing-filter/clap,gammaloop-tracing-filter/symbolica,idenso/bincode,idenso/reference-cases,linnet/bincode,linnet/drawing,linnet/nodestore-vec,linnet/rkyv,linnet/serde,linnet/symbolica,spenso-macros/shadowing,spenso/shadowing,symbolica/tracing_max_level_info
  404. 1051.58 s > Compiling target-lexicon v0.13.5
  405. 1051.58 s > Compiling symbolica v2.2.0 (https://github.com/symbolica-dev/symbolica?branch=dev#0441bd7a)
  406. 1051.58 s > Compiling maplit v1.0.2
  407. 1051.58 s > Compiling gammaloop-tracing-filter-macros v0.1.0 (/build/source/crates/gammaloop-tracing-filter-macros)
  408. 1051.58 s > Compiling vakint v0.1.2 (/build/source/crates/vakint)
  409. 1051.58 s > Compiling gammalooprs v0.3.4 (/build/source/crates/gammalooprs)
  410. 1051.58 s > Compiling alphal00p-docs-macros v0.1.0 (/build/source/crates/alphal00p-docs-macros)
  411. 1051.58 s > Compiling alphal00p-docs-schema v0.1.0 (/build/source/crates/alphal00p-docs-schema)
  412. 1051.58 s > Compiling rustc_version v0.4.1
  413. 1051.58 s > Compiling bincode v1.3.3
  414. 1051.58 s > Compiling gungraun-runner v0.18.2
  415. 1051.58 s > Compiling target-triple v1.0.1
  416. 1051.58 s > Compiling iai-callgrind-runner v0.14.2
  417. 1051.58 s > Compiling gammaloop-integration-tests v0.1.0 (/build/source/tests)
  418. 1051.58 s > Compiling wait-timeout v0.2.1
  419. 1051.58 s > Compiling test-log-core v0.2.20
  420. 1051.58 s > Compiling quick-error v1.2.3
  421. 1051.58 s > Compiling bit-vec v0.8.0
  422. 1051.58 s > Compiling iai-callgrind v0.14.2
  423. 1051.58 s > Compiling bit-set v0.8.0
  424. 1051.58 s > Compiling rusty-fork v0.3.1
  425. 1051.58 s > Compiling iai-callgrind-macros v0.5.1
  426. 1051.58 s > Compiling rand_xorshift v0.4.0
  427. 1051.58 s > Compiling console v0.15.11
  428. 1051.58 s > Compiling glob v0.3.4
  429. 1051.58 s > Compiling termcolor v1.4.1
  430. 1051.58 s > Compiling gungraun-macros v0.8.0
  431. 1051.58 s > Compiling unarray v0.1.4
  432. 1051.58 s > Compiling base64 v0.21.7
  433. 1051.58 s > Compiling similar-asserts v1.7.0
  434. 1051.58 s > Compiling ron v0.8.1
  435. 1051.58 s > Compiling proptest v1.11.0
  436. 1051.58 s > Compiling trybuild v1.0.120
  437. 1051.58 s > Compiling kurvst v0.1.0 (/build/source/crates/kurvst)
  438. 1051.58 s > Compiling pyo3-build-config v0.28.3
  439. 1051.58 s > Compiling alphal00p-docs-catalogs v0.1.0 (/build/source/crates/alphal00p-docs-catalogs)
  440. 1051.58 s > Compiling alphal00p-docs-builder v0.1.0 (/build/source/crates/alphal00p-docs-builder)
  441. 1051.58 s > Compiling test-log-macros v0.2.20
  442. 1051.58 s > Compiling test-log v0.2.20
  443. 1051.58 s > Compiling alphal00p-docs-examples v0.1.0 (/build/source/crates/alphal00p-docs-examples)
  444. 1051.58 s > Compiling pyo3-ffi v0.28.3
  445. 1051.58 s > Compiling pyo3-macros-backend v0.28.3
  446. 1051.58 s > Compiling pyo3 v0.28.3
  447. 1051.58 s > Compiling numpy v0.28.0
  448. 1051.58 s > Compiling gammaloop-api v0.1.0 (/build/source/crates/gammaloop-api)
  449. 1051.58 s > Compiling gungraun v0.18.2
  450. 1051.58 s > Compiling pyo3-macros v0.28.3
  451. 1051.58 s > Compiling pyo3-stub-gen v0.17.2
  452. 1051.58 s > Compiling numerica v2.2.0 (https://github.com/symbolica-dev/symbolica?branch=dev#0441bd7a)
  453. 1051.58 s > Compiling graphica v2.1.0 (https://github.com/symbolica-dev/symbolica?branch=dev#0441bd7a)
  454. 1051.58 s > Compiling symbolica-utils v0.1.0 (/build/source/crates/symbolica-utils)
  455. 1051.58 s > Compiling gammaloop-workspace-hack v0.1.0 (/build/source/crates/gammaloop-workspace-hack)
  456. 1051.58 s > Compiling spenso-macros v0.3.2 (/build/source/crates/spenso-macros)
  457. 1051.58 s > Compiling linnet v0.17.0 (/build/source/crates/linnet)
  458. 1051.58 s > Compiling spenso v0.6.0 (/build/source/crates/spenso)
  459. 1051.58 s > Compiling idenso v0.3.0 (/build/source/crates/idenso)
  460. 1051.58 s > Compiling gammaloop-tracing-filter v0.1.0 (/build/source/crates/gammaloop-tracing-filter)
  461. 1051.58 s > Compiling spenso-hep-lib v0.1.7 (/build/source/crates/spenso-hep-lib)
  462. 1051.58 s > Compiling spynso3 v0.1.2 (/build/source/crates/spynso3)
  463. 1051.58 s > Compiling linnest v0.1.0 (/build/source/crates/linnest)
  464. 1051.58 s > Compiling linnet-py v0.1.0 (/build/source/crates/linnet-py)
  465. 1051.58 s > Finished `ci-optim` profile [optimized] target(s) in 16m 28s
  466. 1051.58 s > warning: the following packages contain code that will be rejected by a future version of Rust: proc-macro-error2 v2.0.1
  467. 1051.58 s > note: to see what the problems were, use the option `--future-incompat-report`, or run `cargo report future-incompatibilities --id 1`
  468. 1051.58 s > Doc-tests alphal00p_docs_builder
  469. 1051.58 s >
  470. 1051.58 s > running 0 tests
  471. 1051.58 s >
  472. 1051.58 s > test result: ok. 0 passed; 0 failed; 0 ignored; 0 measured; 0 filtered out; finished in 0.00s
  473. 1051.58 s >
  474. 1051.58 s > Doc-tests alphal00p_docs_catalogs
  475. 1051.58 s >
  476. 1051.58 s > running 0 tests
  477. 1051.58 s >
  478. 1051.58 s > test result: ok. 0 passed; 0 failed; 0 ignored; 0 measured; 0 filtered out; finished in 0.00s
  479. 1051.58 s >
  480. 1051.58 s > Doc-tests alphal00p_docs_examples
  481. 1051.58 s >
  482. 1051.58 s > running 0 tests
  483. 1051.58 s >
  484. 1051.58 s > test result: ok. 0 passed; 0 failed; 0 ignored; 0 measured; 0 filtered out; finished in 0.00s
  485. 1051.58 s >
  486. 1051.58 s > Doc-tests alphal00p_docs
  487. 1051.58 s >
  488. 1051.58 s > running 0 tests
  489. 1051.58 s >
  490. 1051.58 s > test result: ok. 0 passed; 0 failed; 0 ignored; 0 measured; 0 filtered out; finished in 0.00s
  491. 1051.58 s >
  492. 1051.58 s > Doc-tests alphal00p_docs_schema
  493. 1051.58 s >
  494. 1051.58 s > running 0 tests
  495. 1051.58 s >
  496. 1051.58 s > test result: ok. 0 passed; 0 failed; 0 ignored; 0 measured; 0 filtered out; finished in 0.00s
  497. 1051.58 s >
  498. 1051.58 s > Doc-tests gammaloop_api
  499. 1051.58 s >
  500. 1051.58 s > running 16 tests
  501. 1051.58 s > test crates/gammaloop-api/src/python.rs - python::GammaLoopAPI::get_integrand_info (line 3585) ... FAILED
  502. 1051.58 s > test crates/gammaloop-api/src/python.rs - python::GammaLoopAPI::evaluate_sample (line 2967) ... FAILED
  503. 1051.58 s > test crates/gammaloop-api/src/python.rs - python::GammaLoopAPI::get_integrand_settings (line 3647) ... FAILED
  504. 1051.58 s > test crates/gammaloop-api/src/python.rs - python::PyHistogramAccumulator (line 871) ... FAILED
  505. 1051.58 s > test crates/gammaloop-api/src/python.rs - python::GammaLoopAPI::get_default_runtime_settings (line 3796) ... FAILED
  506. 1051.58 s > test crates/gammaloop-api/src/python.rs - python::GammaLoopAPI::evaluate_samples (line 3108) ... FAILED
  507. 1051.58 s > test crates/gammaloop-api/src/python.rs - python::GammaLoopAPI::get_active_command_blocks (line 3760) ... FAILED
  508. 1051.58 s > test crates/gammaloop-api/src/lib.rs - (line 18) - compile ... ok
  509. 1051.58 s > test crates/gammaloop-api/src/python.rs - python::evaluate_graph_overall_factor (line 95) ... FAILED
  510. 1051.58 s > test crates/gammaloop-api/src/python.rs - python::GammaLoopAPI::run_command (line 3901) ... FAILED
  511. 1051.58 s > test crates/gammaloop-api/src/python.rs - python::atom_to_dots (line 157) ... FAILED
  512. 1051.58 s > test crates/gammaloop-api/src/python.rs - python::GammaLoopAPI::new_python (line 2834) ... FAILED
  513. 1051.58 s > test crates/gammaloop-api/src/python.rs - python::GammaLoopAPI::get_global_settings (line 3739) ... FAILED
  514. 1051.58 s > test crates/gammaloop-api/src/python.rs - python::GammaLoopAPI::get_run_history (line 3711) ... FAILED
  515. 1051.59 s > test crates/gammaloop-api/src/python.rs - python::atom_to_canonical_string (line 128) ... FAILED
  516. 1051.59 s > test crates/gammaloop-api/src/commands/evaluate_samples.rs - commands::evaluate_samples::EvaluateSamples (line 50) ... ok
  517. 1051.59 s >
  518. 1051.59 s > failures:
  519. 1051.59 s >
  520. 1051.59 s > ---- crates/gammaloop-api/src/python.rs - python::GammaLoopAPI::get_integrand_info (line 3585) stdout ----
  521. 1051.59 s > error: expected one of `!` or `::`, found `pathlib`
  522. 1051.59 s > --> crates/gammaloop-api/src/python.rs:3586:6
  523. 1051.59 s > |
  524. 1051.59 s > 3586 | from pathlib import Path
  525. 1051.59 s > | ^^^^^^^ expected one of `!` or `::`
  526. 1051.59 s >
  527. 1051.59 s > error: aborting due to 1 previous error
  528. 1051.59 s >
  529. 1051.59 s > Couldn't compile the test.
  530. 1051.59 s > ---- crates/gammaloop-api/src/python.rs - python::GammaLoopAPI::evaluate_sample (line 2967) stdout ----
  531. 1051.59 s > error: expected one of `!` or `::`, found `pathlib`
  532. 1051.59 s > --> crates/gammaloop-api/src/python.rs:2968:6
  533. 1051.59 s > |
  534. 1051.59 s > 2968 | from pathlib import Path
  535. 1051.59 s > | ^^^^^^^ expected one of `!` or `::`
  536. 1051.59 s >
  537. 1051.59 s > error: aborting due to 1 previous error
  538. 1051.59 s >
  539. 1051.59 s > Couldn't compile the test.
  540. 1051.59 s > ---- crates/gammaloop-api/src/python.rs - python::GammaLoopAPI::get_integrand_settings (line 3647) stdout ----
  541. 1051.59 s > error: expected one of `!` or `::`, found `=`
  542. 1051.59 s > --> crates/gammaloop-api/src/python.rs:3648:10
  543. 1051.59 s > |
  544. 1051.59 s > 3648 | settings = api.get_integrand_settings(process_id=0)
  545. 1051.59 s > | ^ expected one of `!` or `::`
  546. 1051.59 s >
  547. 1051.59 s > error: aborting due to 1 previous error
  548. 1051.59 s >
  549. 1051.59 s > Couldn't compile the test.
  550. 1051.59 s > ---- crates/gammaloop-api/src/python.rs - python::PyHistogramAccumulator (line 871) stdout ----
  551. 1051.59 s > error: expected one of `!` or `::`, found `gammaloop`
  552. 1051.59 s > --> crates/gammaloop-api/src/python.rs:872:6
  553. 1051.59 s > |
  554. 1051.59 s > 872 | from gammaloop import HistogramAccumulator
  555. 1051.59 s > | ^^^^^^^^^ expected one of `!` or `::`
  556. 1051.59 s >
  557. 1051.59 s > error: aborting due to 1 previous error
  558. 1051.59 s >
  559. 1051.59 s > Couldn't compile the test.
  560. 1051.59 s > ---- crates/gammaloop-api/src/python.rs - python::GammaLoopAPI::get_default_runtime_settings (line 3796) stdout ----
  561. 1051.59 s > error: expected one of `!` or `::`, found `=`
  562. 1051.59 s > --> crates/gammaloop-api/src/python.rs:3797:9
  563. 1051.59 s > |
  564. 1051.59 s > 3797 | runtime = api.get_default_runtime_settings()
  565. 1051.59 s > | ^ expected one of `!` or `::`
  566. 1051.59 s >
  567. 1051.59 s > error: aborting due to 1 previous error
  568. 1051.59 s >
  569. 1051.59 s > Couldn't compile the test.
  570. 1051.59 s > ---- crates/gammaloop-api/src/python.rs - python::GammaLoopAPI::evaluate_samples (line 3108) stdout ----
  571. 1051.59 s > error: expected one of `!` or `::`, found `pathlib`
  572. 1051.59 s > --> crates/gammaloop-api/src/python.rs:3109:6
  573. 1051.59 s > |
  574. 1051.59 s > 3109 | from pathlib import Path
  575. 1051.59 s > | ^^^^^^^ expected one of `!` or `::`
  576. 1051.59 s >
  577. 1051.59 s > error: aborting due to 1 previous error
  578. 1051.59 s >
  579. 1051.59 s > Couldn't compile the test.
  580. 1051.59 s > ---- crates/gammaloop-api/src/python.rs - python::GammaLoopAPI::get_active_command_blocks (line 3760) stdout ----
  581. 1051.59 s > error: expected item, found keyword `for`
  582. 1051.59 s > --> crates/gammaloop-api/src/python.rs:3761:1
  583. 1051.59 s > |
  584. 1051.59 s > 3761 | for name, commands in api.get_active_command_blocks().items():
  585. 1051.59 s > | ^^^ expected item
  586. 1051.59 s > |
  587. 1051.59 s > = note: for a full list of items that can appear in modules, see <https://doc.rust-lang.org/reference/items.html>
  588. 1051.59 s >
  589. 1051.59 s > error: aborting due to 1 previous error
  590. 1051.59 s >
  591. 1051.59 s > Couldn't compile the test.
  592. 1051.59 s > ---- crates/gammaloop-api/src/python.rs - python::evaluate_graph_overall_factor (line 95) stdout ----
  593. 1051.59 s > error[E0425]: cannot find function `evaluate_graph_overall_factor` in this scope
  594. 1051.59 s > --> crates/gammaloop-api/src/python.rs:96:1
  595. 1051.59 s > |
  596. 1051.59 s > 96 | evaluate_graph_overall_factor(
  597. 1051.59 s > | ^^^^^^^^^^^^^^^^^^^^^^^^^^^^^ not found in this scope
  598. 1051.59 s >
  599. 1051.59 s > error: aborting due to 1 previous error
  600. 1051.59 s >
  601. 1051.59 s > For more information about this error, try `rustc --explain E0425`.
  602. 1051.59 s > Couldn't compile the test.
  603. 1051.59 s > ---- crates/gammaloop-api/src/python.rs - python::GammaLoopAPI::run_command (line 3901) stdout ----
  604. 1051.59 s > error[E0425]: cannot find value `api` in this scope
  605. 1051.59 s > --> crates/gammaloop-api/src/python.rs:3902:1
  606. 1051.59 s > |
  607. 1051.59 s > 3902 | api.run("display processes")
  608. 1051.59 s > | ^^^ not found in this scope
  609. 1051.59 s >
  610. 1051.59 s > error: aborting due to 1 previous error
  611. 1051.59 s >
  612. 1051.59 s > For more information about this error, try `rustc --explain E0425`.
  613. 1051.59 s > Couldn't compile the test.
  614. 1051.59 s > ---- crates/gammaloop-api/src/python.rs - python::atom_to_dots (line 157) stdout ----
  615. 1051.59 s > error[E0425]: cannot find function `to_dots` in this scope
  616. 1051.59 s > --> crates/gammaloop-api/src/python.rs:158:1
  617. 1051.59 s > |
  618. 1051.59 s > 158 | to_dots("p(mu) * q(mu)")
  619. 1051.59 s > | ^^^^^^^ not found in this scope
  620. 1051.59 s >
  621. 1051.59 s > error: aborting due to 1 previous error
  622. 1051.59 s >
  623. 1051.59 s > For more information about this error, try `rustc --explain E0425`.
  624. 1051.59 s > Couldn't compile the test.
  625. 1051.59 s > ---- crates/gammaloop-api/src/python.rs - python::GammaLoopAPI::new_python (line 2834) stdout ----
  626. 1051.59 s > error[E0425]: cannot find value `api` in this scope
  627. 1051.59 s > --> crates/gammaloop-api/src/python.rs:2835:1
  628. 1051.59 s > |
  629. 1051.59 s > 2835 | api = GammaLoopAPI(state_folder="./state", read_only_state=True)
  630. 1051.59 s > | ^^^
  631. 1051.59 s > |
  632. 1051.59 s > help: you might have meant to introduce a new binding
  633. 1051.59 s > |
  634. 1051.59 s > 2835 | let api = GammaLoopAPI(state_folder="./state", read_only_state=True)
  635. 1051.59 s > | +++
  636. 1051.59 s >
  637. 1051.59 s > error[E0425]: cannot find value `state_folder` in this scope
  638. 1051.59 s > --> crates/gammaloop-api/src/python.rs:2835:20
  639. 1051.59 s > |
  640. 1051.59 s > 2835 | api = GammaLoopAPI(state_folder="./state", read_only_state=True)
  641. 1051.59 s > | ^^^^^^^^^^^^ not found in this scope
  642. 1051.59 s >
  643. 1051.59 s > error[E0425]: cannot find value `read_only_state` in this scope
  644. 1051.59 s > --> crates/gammaloop-api/src/python.rs:2835:44
  645. 1051.59 s > |
  646. 1051.59 s > 2835 | api = GammaLoopAPI(state_folder="./state", read_only_state=True)
  647. 1051.59 s > | ^^^^^^^^^^^^^^^ not found in this scope
  648. 1051.59 s >
  649. 1051.59 s > error[E0425]: cannot find value `True` in this scope
  650. 1051.59 s > --> crates/gammaloop-api/src/python.rs:2835:60
  651. 1051.59 s > |
  652. 1051.59 s > 2835 | api = GammaLoopAPI(state_folder="./state", read_only_state=True)
  653. 1051.59 s > | ^^^^ not found in this scope
  654. 1051.59 s > |
  655. 1051.59 s > help: you may want to use a bool value instead
  656. 1051.59 s > |
  657. 1051.59 s > 2835 - api = GammaLoopAPI(state_folder="./state", read_only_state=True)
  658. 1051.59 s > 2835 + api = GammaLoopAPI(state_folder="./state", read_only_state=true)
  659. 1051.59 s > |
  660. 1051.59 s >
  661. 1051.59 s > error[E0425]: cannot find function, tuple struct or tuple variant `GammaLoopAPI` in this scope
  662. 1051.59 s > --> crates/gammaloop-api/src/python.rs:2835:7
  663. 1051.59 s > |
  664. 1051.59 s > 2835 | api = GammaLoopAPI(state_folder="./state", read_only_state=True)
  665. 1051.59 s > | ^^^^^^^^^^^^ not found in this scope
  666. 1051.59 s >
  667. 1051.59 s > error: aborting due to 5 previous errors
  668. 1051.59 s >
  669. 1051.59 s > For more information about this error, try `rustc --explain E0425`.
  670. 1051.59 s > Couldn't compile the test.
  671. 1051.59 s > ---- crates/gammaloop-api/src/python.rs - python::GammaLoopAPI::get_global_settings (line 3739) stdout ----
  672. 1051.59 s > error[E0425]: cannot find value `settings_toml` in this scope
  673. 1051.59 s > --> crates/gammaloop-api/src/python.rs:3740:1
  674. 1051.59 s > |
  675. 1051.59 s > 3740 | settings_toml = api.get_global_settings()
  676. 1051.59 s > | ^^^^^^^^^^^^^
  677. 1051.59 s > |
  678. 1051.59 s > help: you might have meant to introduce a new binding
  679. 1051.59 s > |
  680. 1051.59 s > 3740 | let settings_toml = api.get_global_settings()
  681. 1051.59 s > | +++
  682. 1051.59 s >
  683. 1051.59 s > error[E0425]: cannot find value `api` in this scope
  684. 1051.59 s > --> crates/gammaloop-api/src/python.rs:3740:17
  685. 1051.59 s > |
  686. 1051.59 s > 3740 | settings_toml = api.get_global_settings()
  687. 1051.59 s > | ^^^ not found in this scope
  688. 1051.59 s >
  689. 1051.59 s > error: aborting due to 2 previous errors
  690. 1051.59 s >
  691. 1051.59 s > For more information about this error, try `rustc --explain E0425`.
  692. 1051.59 s > Couldn't compile the test.
  693. 1051.59 s > ---- crates/gammaloop-api/src/python.rs - python::GammaLoopAPI::get_run_history (line 3711) stdout ----
  694. 1051.59 s > error[E0425]: cannot find value `run_card_toml` in this scope
  695. 1051.59 s > --> crates/gammaloop-api/src/python.rs:3712:1
  696. 1051.59 s > |
  697. 1051.59 s > 3712 | run_card_toml = api.get_run_history()
  698. 1051.59 s > | ^^^^^^^^^^^^^
  699. 1051.59 s > |
  700. 1051.59 s > help: you might have meant to introduce a new binding
  701. 1051.59 s > |
  702. 1051.59 s > 3712 | let run_card_toml = api.get_run_history()
  703. 1051.59 s > | +++
  704. 1051.59 s >
  705. 1051.59 s > error[E0425]: cannot find value `api` in this scope
  706. 1051.59 s > --> crates/gammaloop-api/src/python.rs:3712:17
  707. 1051.59 s > |
  708. 1051.59 s > 3712 | run_card_toml = api.get_run_history()
  709. 1051.59 s > | ^^^ not found in this scope
  710. 1051.59 s >
  711. 1051.59 s > error: aborting due to 2 previous errors
  712. 1051.59 s >
  713. 1051.59 s > For more information about this error, try `rustc --explain E0425`.
  714. 1051.59 s > Couldn't compile the test.
  715. 1051.59 s > ---- crates/gammaloop-api/src/python.rs - python::atom_to_canonical_string (line 128) stdout ----
  716. 1051.59 s > error[E0425]: cannot find function `atom_to_canonical_string` in this scope
  717. 1051.59 s > --> crates/gammaloop-api/src/python.rs:129:1
  718. 1051.59 s > |
  719. 1051.59 s > 129 | atom_to_canonical_string("x + x")
  720. 1051.59 s > | ^^^^^^^^^^^^^^^^^^^^^^^^ not found in this scope
  721. 1051.59 s >
  722. 1051.59 s > error: aborting due to 1 previous error
  723. 1051.59 s >
  724. 1051.59 s > For more information about this error, try `rustc --explain E0425`.
  725. 1051.59 s > Couldn't compile the test.
  726. 1051.59 s >
  727. 1051.59 s > failures:
  728. 1051.59 s > crates/gammaloop-api/src/python.rs - python::GammaLoopAPI::evaluate_sample (line 2967)
  729. 1051.59 s > crates/gammaloop-api/src/python.rs - python::GammaLoopAPI::evaluate_samples (line 3108)
  730. 1051.59 s > crates/gammaloop-api/src/python.rs - python::GammaLoopAPI::get_active_command_blocks (line 3760)
  731. 1051.59 s > crates/gammaloop-api/src/python.rs - python::GammaLoopAPI::get_default_runtime_settings (line 3796)
  732. 1051.59 s > crates/gammaloop-api/src/python.rs - python::GammaLoopAPI::get_global_settings (line 3739)
  733. 1051.59 s > crates/gammaloop-api/src/python.rs - python::GammaLoopAPI::get_integrand_info (line 3585)
  734. 1051.59 s > crates/gammaloop-api/src/python.rs - python::GammaLoopAPI::get_integrand_settings (line 3647)
  735. 1051.59 s > crates/gammaloop-api/src/python.rs - python::GammaLoopAPI::get_run_history (line 3711)
  736. 1051.59 s > crates/gammaloop-api/src/python.rs - python::GammaLoopAPI::new_python (line 2834)
  737. 1051.59 s > crates/gammaloop-api/src/python.rs - python::GammaLoopAPI::run_command (line 3901)
  738. 1051.59 s > crates/gammaloop-api/src/python.rs - python::PyHistogramAccumulator (line 871)
  739. 1051.59 s > crates/gammaloop-api/src/python.rs - python::atom_to_canonical_string (line 128)
  740. 1051.59 s > crates/gammaloop-api/src/python.rs - python::atom_to_dots (line 157)
  741. 1051.59 s > crates/gammaloop-api/src/python.rs - python::evaluate_graph_overall_factor (line 95)
  742. 1051.59 s >
  743. 1051.59 s > test result: FAILED. 2 passed; 14 failed; 0 ignored; 0 measured; 0 filtered out; finished in 8.14s
  744. 1051.59 s >
  745. 1051.59 s > error: doctest failed, to rerun pass `-p gammaloop-api --doc`
  746. 1051.59 s For full logs, run:
  747. 1051.59 s nix log /nix/store/gfqf16jiri54v362qzgvkmdlmf27gab4-gammaloop-workspace-doctest-0.1.0.drv
  748. 1051.75 s [0 built (1 failed), 0.0Run failed.