0.13 s
$ /nix/store/9ypz3flqsrl5xl495mm8h645gadjsxi1-coreutils-9.11/bin/timeout --kill-after=15s 7200s /nix/store/23zk8sgzamrbmj1fday15szf7f2279s8-nix-2.34.7/bin/nix --extra-experimental-features nix-command --extra-experimental-features flakes flake clone git+https://github.com/alphal00p/gammaloop --dest /tmp/nix-ci-worker/stable-pwd/repo/
0.14 s
Cloning into '/tmp/nix-ci-worker/stable-pwd/repo'...
1.91 s
remote: Enumerating objects: 57328
remote: Enumerating objects: 66329, done.
2.02 s
remote: Counting objects: 0% (1/9001)
remote: Counting objects: 1% (91/9001)
remote: Counting objects: 2% (181/9001)
remote: Counting objects: 3% (271/9001)
remote: Counting objects: 4% (361/9001)
remote: Counting objects: 5% (451/9001)
remote: Counting objects: 6% (541/9001)
remote: Counting objects: 7% (631/9001)
remote: Counting objects: 8% (721/9001)
remote: Counting objects: 9% (811/9001)
remote: Counting objects: 10% (901/9001)
remote: Counting objects: 11% (991/9001)
remote: Counting objects: 12% (1081/9001)
remote: Counting objects: 13% (1171/9001)
remote: Counting objects: 14% (1261/9001)
remote: Counting objects: 15% (1351/9001)
remote: Counting objects: 16% (1441/9001)
remote: Counting objects: 17% (1531/9001)
remote: Counting objects: 18% (1621/9001)
remote: Counting objects: 19% (1711/9001)
remote: Counting objects: 20% (1801/9001)
remote: Counting objects: 21% (1891/9001)
remote: Counting objects: 22% (1981/9001)
remote: Counting objects: 23% (2071/9001)
remote: Counting objects: 24% (2161/9001)
remote: Counting objects: 25% (2251/9001)
remote: Counting objects: 26% (2341/9001)
remote: Counting objects: 27% (2431/9001)
remote: Counting objects: 28% (2521/9001)
remote: Counting objects: 29% (2611/9001)
remote: Counting objects: 30% (2701/9001)
remote: Counting objects: 31% (2791/9001)
remote: Counting objects: 32% (2881/9001)
remote: Counting objects: 33% (2971/9001)
remote: Counting objects: 34% (3061/9001)
remote: Counting objects: 35% (3151/9001)
remote: Counting objects: 36% (3241/9001)
remote: Counting objects: 37% (3331/9001)
remote: Counting objects: 38% (3421/9001)
remote: Counting objects: 39% (3511/9001)
remote: Counting objects: 40% (3601/9001)
remote: Counting objects: 41% (3691/9001)
remote: Counting objects: 42% (3781/9001)
remote: Counting objects: 43% (3871/9001)
remote: Counting objects: 44% (3961/9001)
remote: Counting objects: 45% (4051/9001)
remote: Counting objects: 46% (4141/9001)
remote: Counting objects: 47% (4231/9001)
remote: Counting objects: 48% (4321/9001)
remote: Counting objects: 49% (4411/9001)
remote: Counting objects: 50% (4501/9001)
remote: Counting objects: 51% (4591/9001)
remote: Counting objects: 52% (4681/9001)
remote: Counting objects: 53% (4771/9001)
remote: Counting objects: 54% (4861/9001)
remote: Counting objects: 55% (4951/9001)
remote: Counting objects: 56% (5041/9001)
remote: Counting objects: 57% (5131/9001)
remote: Counting objects: 58% (5221/9001)
remote: Counting objects: 59% (5311/9001)
remote: Counting objects: 60% (5401/9001)
remote: Counting objects: 61% (5491/9001)
remote: Counting objects: 62% (5581/9001)
remote: Counting objects: 63% (5671/9001)
remote: Counting objects: 64% (5761/9001)
remote: Counting objects: 65% (5851/9001)
remote: Counting objects: 66% (5941/9001)
remote: Counting objects: 67% (6031/9001)
remote: Counting objects: 68% (6121/9001)
remote: Counting objects: 69% (6211/9001)
remote: Counting objects: 70% (6301/9001)
remote: Counting objects: 71% (6391/9001)
remote: Counting objects: 72% (6481/9001)
remote: Counting objects: 73% (6571/9001)
remote: Counting objects: 74% (6661/9001)
remote: Counting objects: 75% (6751/9001)
remote: Counting objects: 76% (6841/9001)
remote: Counting objects: 77% (6931/9001)
remote: Counting objects: 78% (7021/9001)
remote: Counting objects: 79% (7111/9001)
remote: Counting objects: 80% (7201/9001)
remote: Counting objects: 81% (7291/9001)
remote: Counting objects: 82% (7381/9001)
remote: Counting objects: 83% (7471/9001)
remote: Counting objects: 84% (7561/9001)
remote: Counting objects: 85% (7651/9001)
remote: Counting objects: 86% (7741/9001)
remote: Counting objects: 87% (7831/9001)
remote: Counting objects: 88% (7921/9001)
remote: Counting objects: 89% (8011/9001)
remote: Counting objects: 90% (8101/9001)
remote: Counting objects: 91% (8191/9001)
remote: Counting objects: 92% (8281/9001)
remote: Counting objects: 93% (8371/9001)
remote: Counting objects: 94% (8461/9001)
remote: Counting objects: 95% (8551/9001)
remote: Counting objects: 96% (8641/9001)
remote: Counting objects: 97% (8731/9001)
remote: Counting objects: 98% (8821/9001)
remote: Counting objects: 99% (8911/9001)
remote: Counting objects: 100% (9001/9001)
remote: Counting objects: 100% (9001/9001), done.
4.44 s
remote: Compressing objects: 0% (1/2111)
remote: Compressing objects: 1% (22/2111)
remote: Compressing objects: 2% (43/2111)
remote: Compressing objects: 3% (64/2111)
remote: Compressing objects: 4% (85/2111)
remote: Compressing objects: 5% (106/2111)
remote: Compressing objects: 6% (127/2111)
remote: Compressing objects: 7% (148/2111)
remote: Compressing objects: 8% (169/2111)
remote: Compressing objects: 9% (190/2111)
remote: Compressing objects: 10% (212/2111)
remote: Compressing objects: 11% (233/2111)
remote: Compressing objects: 12% (254/2111)
remote: Compressing objects: 13% (275/2111)
remote: Compressing objects: 14% (296/2111)
remote: Compressing objects: 15% (317/2111)
remote: Compressing objects: 16% (338/2111)
remote: Compressing objects: 17% (359/2111)
remote: Compressing objects: 18% (380/2111)
remote: Compressing objects: 19% (402/2111)
remote: Compressing objects: 20% (423/2111)
remote: Compressing objects: 20% (437/2111)
remote: Compressing objects: 21% (444/2111)
remote: Compressing objects: 22% (465/2111)
remote: Compressing objects: 23% (486/2111)
remote: Compressing objects: 24% (507/2111)
remote: Compressing objects: 25% (528/2111)
remote: Compressing objects: 26% (549/2111)
remote: Compressing objects: 27% (570/2111)
remote: Compressing objects: 28% (592/2111)
remote: Compressing objects: 28% (605/2111)
remote: Compressing objects: 29% (613/2111)
remote: Compressing objects: 30% (634/2111)
remote: Compressing objects: 31% (655/2111)
remote: Compressing objects: 32% (676/2111)
remote: Compressing objects: 33% (697/2111)
remote: Compressing objects: 34% (718/2111)
remote: Compressing objects: 35% (739/2111)
remote: Compressing objects: 36% (760/2111)
remote: Compressing objects: 37% (782/2111)
remote: Compressing objects: 38% (803/2111)
remote: Compressing objects: 39% (824/2111)
remote: Compressing objects: 40% (845/2111)
remote: Compressing objects: 41% (866/2111)
remote: Compressing objects: 42% (887/2111)
remote: Compressing objects: 43% (908/2111)
remote: Compressing objects: 44% (929/2111)
remote: Compressing objects: 45% (950/2111)
remote: Compressing objects: 46% (972/2111)
remote: Compressing objects: 47% (993/2111)
remote: Compressing objects: 48% (1014/2111)
remote: Compressing objects: 49% (1035/2111)
remote: Compressing objects: 50% (1056/2111)
remote: Compressing objects: 51% (1077/2111)
remote: Compressing objects: 52% (1098/2111)
remote: Compressing objects: 53% (1119/2111)
remote: Compressing objects: 54% (1140/2111)
remote: Compressing objects: 55% (1162/2111)
remote: Compressing objects: 56% (1183/2111)
remote: Compressing objects: 57% (1204/2111)
remote: Compressing objects: 58% (1225/2111)
remote: Compressing objects: 59% (1246/2111)
remote: Compressing objects: 60% (1267/2111)
remote: Compressing objects: 61% (1288/2111)
remote: Compressing objects: 62% (1309/2111)
remote: Compressing objects: 63% (1330/2111)
remote: Compressing objects: 64% (1352/2111)
remote: Compressing objects: 65% (1373/2111)
remote: Compressing objects: 66% (1394/2111)
remote: Compressing objects: 67% (1415/2111)
remote: Compressing objects: 68% (1436/2111)
remote: Compressing objects: 69% (1457/2111)
remote: Compressing objects: 70% (1478/2111)
remote: Compressing objects: 71% (1499/2111)
remote: Compressing objects: 72% (1520/2111)
remote: Compressing objects: 73% (1542/2111)
remote: Compressing objects: 74% (1563/2111)
remote: Compressing objects: 75% (1584/2111)
remote: Compressing objects: 76% (1605/2111)
remote: Compressing objects: 77% (1626/2111)
remote: Compressing objects: 78% (1647/2111)
remote: Compressing objects: 79% (1668/2111)
remote: Compressing objects: 80% (1689/2111)
remote: Compressing objects: 81% (1710/2111)
remote: Compressing objects: 82% (1732/2111)
remote: Compressing objects: 83% (1753/2111)
remote: Compressing objects: 84% (1774/2111)
remote: Compressing objects: 85% (1795/2111)
remote: Compressing objects: 86% (1816/2111)
remote: Compressing objects: 87% (1837/2111)
remote: Compressing objects: 88% (1858/2111)
remote: Compressing objects: 89% (1879/2111)
remote: Compressing objects: 90% (1900/2111)
remote: Compressing objects: 91% (1922/2111)
remote: Compressing objects: 92% (1943/2111)
remote: Compressing objects: 93% (1964/2111)
remote: Compressing objects: 94% (1985/2111)
remote: Compressing objects: 95% (2006/2111)
remote: Compressing objects: 96% (2027/2111)
remote: Compressing objects: 97% (2048/2111)
remote: Compressing objects: 98% (2069/2111)
remote: Compressing objects: 99% (2090/2111)
remote: Compressing objects: 100% (2111/2111)
remote: Compressing objects: 100% (2111/2111), done.
8.31 s
Receiving objects: 0% (1/66329)
Receiving objects: 1% (664/66329)
Receiving objects: 2% (1327/66329)
Receiving objects: 3% (1990/66329)
Receiving objects: 4% (2654/66329)
Receiving objects: 5% (3317/66329)
Receiving objects: 6% (3980/66329)
Receiving objects: 7% (4644/66329)
Receiving objects: 8% (5307/66329), 8.78 MiB | 17.55 MiB/s
Receiving objects: 9% (5970/66329), 8.78 MiB | 17.55 MiB/s
Receiving objects: 10% (6633/66329), 8.78 MiB | 17.55 MiB/s
Receiving objects: 11% (7297/66329), 8.78 MiB | 17.55 MiB/s
Receiving objects: 11% (7389/66329), 16.51 MiB | 16.50 MiB/s
Receiving objects: 12% (7960/66329), 16.51 MiB | 16.50 MiB/s
Receiving objects: 13% (8623/66329), 16.51 MiB | 16.50 MiB/s
Receiving objects: 14% (9287/66329), 16.51 MiB | 16.50 MiB/s
Receiving objects: 15% (9950/66329), 16.51 MiB | 16.50 MiB/s
Receiving objects: 16% (10613/66329), 16.51 MiB | 16.50 MiB/s
Receiving objects: 17% (11276/66329), 16.51 MiB | 16.50 MiB/s
Receiving objects: 18% (11940/66329), 16.51 MiB | 16.50 MiB/s
Receiving objects: 19% (12603/66329), 16.51 MiB | 16.50 MiB/s
Receiving objects: 20% (13266/66329), 16.51 MiB | 16.50 MiB/s
Receiving objects: 21% (13930/66329), 16.51 MiB | 16.50 MiB/s
Receiving objects: 22% (14593/66329), 16.51 MiB | 16.50 MiB/s
Receiving objects: 23% (15256/66329), 16.51 MiB | 16.50 MiB/s
Receiving objects: 24% (15919/66329), 16.51 MiB | 16.50 MiB/s
Receiving objects: 25% (16583/66329), 16.51 MiB | 16.50 MiB/s
Receiving objects: 26% (17246/66329), 16.51 MiB | 16.50 MiB/s
Receiving objects: 27% (17909/66329), 16.51 MiB | 16.50 MiB/s
Receiving objects: 28% (18573/66329), 16.51 MiB | 16.50 MiB/s
Receiving objects: 29% (19236/66329), 16.51 MiB | 16.50 MiB/s
Receiving objects: 30% (19899/66329), 16.51 MiB | 16.50 MiB/s
Receiving objects: 31% (20562/66329), 16.51 MiB | 16.50 MiB/s
Receiving objects: 32% (21226/66329), 16.51 MiB | 16.50 MiB/s
Receiving objects: 33% (21889/66329), 16.51 MiB | 16.50 MiB/s
Receiving objects: 34% (22552/66329), 16.51 MiB | 16.50 MiB/s
Receiving objects: 35% (23216/66329), 25.21 MiB | 16.80 MiB/s
Receiving objects: 36% (23879/66329), 25.21 MiB | 16.80 MiB/s
Receiving objects: 37% (24542/66329), 25.21 MiB | 16.80 MiB/s
Receiving objects: 38% (25206/66329), 25.21 MiB | 16.80 MiB/s
Receiving objects: 39% (25869/66329), 25.21 MiB | 16.80 MiB/s
Receiving objects: 40% (26532/66329), 25.21 MiB | 16.80 MiB/s
Receiving objects: 41% (27195/66329), 25.21 MiB | 16.80 MiB/s
Receiving objects: 42% (27859/66329), 25.21 MiB | 16.80 MiB/s
Receiving objects: 43% (28522/66329), 25.21 MiB | 16.80 MiB/s
Receiving objects: 44% (29185/66329), 25.21 MiB | 16.80 MiB/s
Receiving objects: 45% (29849/66329), 25.21 MiB | 16.80 MiB/s
Receiving objects: 46% (30512/66329), 25.21 MiB | 16.80 MiB/s
Receiving objects: 47% (31175/66329), 25.21 MiB | 16.80 MiB/s
Receiving objects: 48% (31838/66329), 25.21 MiB | 16.80 MiB/s
Receiving objects: 49% (32502/66329), 25.21 MiB | 16.80 MiB/s
Receiving objects: 50% (33165/66329), 25.21 MiB | 16.80 MiB/s
Receiving objects: 51% (33828/66329), 25.21 MiB | 16.80 MiB/s
Receiving objects: 52% (34492/66329), 25.21 MiB | 16.80 MiB/s
Receiving objects: 53% (35155/66329), 25.21 MiB | 16.80 MiB/s
Receiving objects: 54% (35818/66329), 25.21 MiB | 16.80 MiB/s
Receiving objects: 55% (36481/66329), 25.21 MiB | 16.80 MiB/s
Receiving objects: 56% (37145/66329), 25.21 MiB | 16.80 MiB/s
Receiving objects: 56% (37521/66329), 25.21 MiB | 16.80 MiB/s
Receiving objects: 57% (37808/66329), 40.08 MiB | 20.04 MiB/s
Receiving objects: 58% (38471/66329), 40.08 MiB | 20.04 MiB/s
Receiving objects: 59% (39135/66329), 40.08 MiB | 20.04 MiB/s
Receiving objects: 60% (39798/66329), 40.08 MiB | 20.04 MiB/s
Receiving objects: 61% (40461/66329), 40.08 MiB | 20.04 MiB/s
Receiving objects: 62% (41124/66329), 40.08 MiB | 20.04 MiB/s
Receiving objects: 63% (41788/66329), 40.08 MiB | 20.04 MiB/s
Receiving objects: 64% (42451/66329), 40.08 MiB | 20.04 MiB/s
Receiving objects: 65% (43114/66329), 40.08 MiB | 20.04 MiB/s
Receiving objects: 66% (43778/66329), 40.08 MiB | 20.04 MiB/s
Receiving objects: 67% (44441/66329), 40.08 MiB | 20.04 MiB/s
Receiving objects: 68% (45104/66329), 40.08 MiB | 20.04 MiB/s
Receiving objects: 69% (45768/66329), 40.08 MiB | 20.04 MiB/s
Receiving objects: 70% (46431/66329), 40.08 MiB | 20.04 MiB/s
Receiving objects: 71% (47094/66329), 40.08 MiB | 20.04 MiB/s
Receiving objects: 72% (47757/66329), 59.74 MiB | 23.89 MiB/s
Receiving objects: 73% (48421/66329), 59.74 MiB | 23.89 MiB/s
Receiving objects: 74% (49084/66329), 59.74 MiB | 23.89 MiB/s
Receiving objects: 75% (49747/66329), 59.74 MiB | 23.89 MiB/s
Receiving objects: 76% (50411/66329), 59.74 MiB | 23.89 MiB/s
Receiving objects: 77% (51074/66329), 59.74 MiB | 23.89 MiB/s
Receiving objects: 78% (51737/66329), 59.74 MiB | 23.89 MiB/s
Receiving objects: 79% (52400/66329), 59.74 MiB | 23.89 MiB/s
Receiving objects: 79% (52605/66329), 59.74 MiB | 23.89 MiB/s
Receiving objects: 80% (53064/66329), 75.97 MiB | 25.32 MiB/s
Receiving objects: 81% (53727/66329), 75.97 MiB | 25.32 MiB/s
Receiving objects: 82% (54390/66329), 75.97 MiB | 25.32 MiB/s
Receiving objects: 83% (55054/66329), 75.97 MiB | 25.32 MiB/s
Receiving objects: 84% (55717/66329), 75.97 MiB | 25.32 MiB/s
Receiving objects: 85% (56380/66329), 75.97 MiB | 25.32 MiB/s
Receiving objects: 86% (57043/66329), 75.97 MiB | 25.32 MiB/s
Receiving objects: 87% (57707/66329), 75.97 MiB | 25.32 MiB/s
Receiving objects: 88% (58370/66329), 75.97 MiB | 25.32 MiB/s
Receiving objects: 89% (59033/66329), 75.97 MiB | 25.32 MiB/s
Receiving objects: 90% (59697/66329), 75.97 MiB | 25.32 MiB/s
Receiving objects: 91% (60360/66329), 75.97 MiB | 25.32 MiB/s
Receiving objects: 92% (61023/66329), 75.97 MiB | 25.32 MiB/s
Receiving objects: 93% (61686/66329), 75.97 MiB | 25.32 MiB/s
Receiving objects: 94% (62350/66329), 75.97 MiB | 25.32 MiB/s
Receiving objects: 95% (63013/66329), 75.97 MiB | 25.32 MiB/s
Receiving objects: 96% (63676/66329), 75.97 MiB | 25.32 MiB/s
Receiving objects: 97% (64340/66329), 75.97 MiB | 25.32 MiB/s
Receiving objects: 98% (65003/66329), 75.97 MiB | 25.32 MiB/s
Receiving objects: 99% (65666/66329), 88.18 MiB | 25.19 MiB/s
remote: Total 66329 (delta 7283), reused 7248 (delta 6605), pack-reused 57328 (from 1)
8.33 s
Receiving objects: 100% (66329/66329), 88.18 MiB | 25.19 MiB/s
Receiving objects: 100% (66329/66329), 98.63 MiB | 25.43 MiB/s, done.
11.07 s
Resolving deltas: 0% (0/46380)
Resolving deltas: 1% (464/46380)
Resolving deltas: 2% (928/46380)
Resolving deltas: 3% (1392/46380)
Resolving deltas: 4% (1857/46380)
Resolving deltas: 5% (2319/46380)
Resolving deltas: 6% (2783/46380)
Resolving deltas: 7% (3247/46380)
Resolving deltas: 8% (3711/46380)
Resolving deltas: 9% (4175/46380)
Resolving deltas: 10% (4638/46380)
Resolving deltas: 11% (5102/46380)
Resolving deltas: 12% (5566/46380)
Resolving deltas: 13% (6031/46380)
Resolving deltas: 14% (6494/46380)
Resolving deltas: 15% (6957/46380)
Resolving deltas: 16% (7421/46380)
Resolving deltas: 17% (7885/46380)
Resolving deltas: 18% (8349/46380)
Resolving deltas: 19% (8813/46380)
Resolving deltas: 20% (9276/46380)
Resolving deltas: 21% (9740/46380)
Resolving deltas: 22% (10204/46380)
Resolving deltas: 23% (10668/46380)
Resolving deltas: 24% (11132/46380)
Resolving deltas: 25% (11595/46380)
Resolving deltas: 26% (12059/46380)
Resolving deltas: 27% (12523/46380)
Resolving deltas: 28% (12987/46380)
Resolving deltas: 29% (13451/46380)
Resolving deltas: 30% (13914/46380)
Resolving deltas: 31% (14379/46380)
Resolving deltas: 32% (14843/46380)
Resolving deltas: 33% (15306/46380)
Resolving deltas: 34% (15770/46380)
Resolving deltas: 35% (16233/46380)
Resolving deltas: 36% (16697/46380)
Resolving deltas: 37% (17161/46380)
Resolving deltas: 38% (17625/46380)
Resolving deltas: 39% (18089/46380)
Resolving deltas: 40% (18552/46380)
Resolving deltas: 41% (19016/46380)
Resolving deltas: 42% (19480/46380)
Resolving deltas: 43% (19944/46380)
Resolving deltas: 44% (20408/46380)
Resolving deltas: 45% (20871/46380)
Resolving deltas: 46% (21335/46380)
Resolving deltas: 47% (21799/46380)
Resolving deltas: 48% (22263/46380)
Resolving deltas: 49% (22727/46380)
Resolving deltas: 50% (23191/46380)
Resolving deltas: 51% (23654/46380)
Resolving deltas: 51% (24113/46380)
Resolving deltas: 52% (24118/46380)
Resolving deltas: 53% (24586/46380)
Resolving deltas: 54% (25046/46380)
Resolving deltas: 55% (25509/46380)
Resolving deltas: 56% (25973/46380)
Resolving deltas: 57% (26437/46380)
Resolving deltas: 58% (26902/46380)
Resolving deltas: 59% (27365/46380)
Resolving deltas: 60% (27828/46380)
Resolving deltas: 61% (28292/46380)
Resolving deltas: 62% (28757/46380)
Resolving deltas: 63% (29221/46380)
Resolving deltas: 64% (29684/46380)
Resolving deltas: 65% (30147/46380)
Resolving deltas: 66% (30611/46380)
Resolving deltas: 67% (31075/46380)
Resolving deltas: 68% (31539/46380)
Resolving deltas: 69% (32007/46380)
Resolving deltas: 70% (32466/46380)
Resolving deltas: 71% (32930/46380)
Resolving deltas: 72% (33394/46380)
Resolving deltas: 73% (33858/46380)
Resolving deltas: 74% (34322/46380)
Resolving deltas: 75% (34786/46380)
Resolving deltas: 75% (34968/46380)
Resolving deltas: 76% (35249/46380)
Resolving deltas: 77% (35713/46380)
Resolving deltas: 78% (36177/46380)
Resolving deltas: 79% (36641/46380)
Resolving deltas: 80% (37104/46380)
Resolving deltas: 81% (37568/46380)
Resolving deltas: 82% (38032/46380)
Resolving deltas: 83% (38496/46380)
Resolving deltas: 84% (38960/46380)
Resolving deltas: 85% (39423/46380)
Resolving deltas: 86% (39887/46380)
Resolving deltas: 87% (40351/46380)
Resolving deltas: 88% (40815/46380)
Resolving deltas: 89% (41279/46380)
Resolving deltas: 90% (41742/46380)
Resolving deltas: 91% (42206/46380)
Resolving deltas: 92% (42670/46380)
Resolving deltas: 93% (43134/46380)
Resolving deltas: 94% (43598/46380)
Resolving deltas: 95% (44061/46380)
Resolving deltas: 96% (44525/46380)
Resolving deltas: 97% (44989/46380)
Resolving deltas: 98% (45454/46380)
Resolving deltas: 99% (45917/46380)
Resolving deltas: 100% (46380/46380)
Resolving deltas: 100% (46380/46380), done.
12.70 s
Fetching commit b66a9536b21e6c9319a846e70836b6ae01b1e337 for docs ...
12.70 s
$ /nix/store/bcnisk3ydfgv26v2gw3zlky24g00yww2-git-2.54.0/bin/git fetch origin b66a9536b21e6c9319a846e70836b6ae01b1e337
13.48 s
From https://github.com/alphal00p/gammaloop
13.48 s
* branch b66a9536b21e6c9319a846e70836b6ae01b1e337 -> FETCH_HEAD
13.60 s
$ /nix/store/9ypz3flqsrl5xl495mm8h645gadjsxi1-coreutils-9.11/bin/timeout --kill-after=15s 7200s /nix/store/bcnisk3ydfgv26v2gw3zlky24g00yww2-git-2.54.0/bin/git -c advice.detachedHead=false checkout b66a9536b21e6c9319a846e70836b6ae01b1e337
14.22 s
HEAD is now at b66a9536b avoid Rustdoc rebuilds for prose-only documentation edits
14.26 s
$ /nix/store/9ypz3flqsrl5xl495mm8h645gadjsxi1-coreutils-9.11/bin/timeout --kill-after=15s 7200s /nix/store/23zk8sgzamrbmj1fday15szf7f2279s8-nix-2.34.7/bin/nix --extra-experimental-features nix-command --extra-experimental-features flakes --log-format internal-json run .#packages.x86_64-linux.nix-ci-check-gammaloop-doctest --print-build-logs
21.85 s
23.36 s
Building /nix/store/v2cgyi00i3qlx7w694lawhvc0ik6bqbi-nix-ci-check-gammaloop-doctest.drv
23.80 s
[nix-ci-check-gammaloop-doctest:post-build] Uploading to the NixCI cache: /nix/store/8r71z0446l2zwhzz3q6mmxqxgi0jr438-nix-ci-check-gammaloop-doctest
24.34 s
[nix-ci-check-gammaloop-doctest:post-build] warning: 'warn-short-path-literals' is deprecated, use 'lint-short-path-literals = ignore' instead
24.49 s
[nix-ci-check-gammaloop-doctest:post-build] copying 1 paths...
24.49 s
[nix-ci-check-gammaloop-doctest:post-build] copying path '/nix/store/8r71z0446l2zwhzz3q6mmxqxgi0jr438-nix-ci-check-gammaloop-doctest' to 'https://cache.nix-ci.com'...
25.53 s
[nix-ci-check-gammaloop-doctest:post-build] warning: 'warn-short-path-literals' is deprecated, use 'lint-short-path-literals = ignore' instead
29.74 s
[nix-ci-check-gammaloop-doctest:post-build] copying 1 paths...
29.75 s
[nix-ci-check-gammaloop-doctest:post-build] copying path '/nix/store/v2cgyi00i3qlx7w694lawhvc0ik6bqbi-nix-ci-check-gammaloop-doctest.drv' to 'https://cache.nix-ci.com'...
30.32 s
Uploaded nix-ci-check-gammaloop-doctest in 6.6s
30.32 s
Progress: 1 of 2 built
30.32 s
Built nix-ci-check-gammaloop-doctest in 6.9s
30.32 s
Progress: 2 of 2 built
39.27 s
evaluating derivation 'g
copying '/nix/store/913l
evaluating derivation 'g
querying gammaloop-works
querying info about miss
querying gammaloop-works
[0.0 KiB DL]
[0 /1 built, 0.0 KiB DL]
[1 /0 /1 built, 0.0 KiB DLgammaloop-workspace-doctest> Running phase: unpackPhase
39.30 s
gammaloop-workspace-doctest> unpacking source archive /nix/store/5afz06g4vsphrihpxicbxvm3sk5psnll-source
39.52 s
gammaloop-workspace-doctest> source root is source
39.58 s
gammaloop-workspace-doctest> Running phase: patchPhase
39.59 s
gammaloop-workspace-doctest> Executing configureCargoCommonVars
39.61 s
gammaloop-workspace-doctest> decompressing cargo artifacts from /nix/store/9q03j4h8yyxwgigikinn0j17963s9lwf-gammaloop-workspace-deps-deps-0.1.0/target.tar.zst to target
45.74 s
gammaloop-workspace-doctest> Running phase: updateAutotoolsGnuConfigScriptsPhase
45.83 s
gammaloop-workspace-doctest> Running phase: configurePhase
45.83 s
gammaloop-workspace-doctest> will append /build/source/.cargo-home/config.toml with contents of /nix/store/4vj0f29myggx0gdynf7fwm2wfzgqnk61-vendor-cargo-deps/config.toml
45.83 s
gammaloop-workspace-doctest> default configurePhase, nothing to do
45.84 s
gammaloop-workspace-doctest> Running phase: buildPhase
45.84 s
gammaloop-workspace-doctest> +++ command cargo --version
45.85 s
gammaloop-workspace-doctest> cargo 1.97.0 (c980f4866 2026-06-30)
45.93 s
gammaloop-workspace-doctest> +++ command cargo test --profile ci-optim --doc --locked --workspace --features gammaloop-api/cli,gammaloop-tracing-filter/clap,gammaloop-tracing-filter/symbolica,idenso/bincode,idenso/reference-cases,linnet/bincode,linnet/drawing,linnet/nodestore-vec,linnet/rkyv,linnet/serde,linnet/symbolica,spenso-macros/shadowing,spenso/shadowing,symbolica/tracing_max_level_info
47.45 s
gammaloop-workspace-doctest> Compiling target-lexicon v0.13.5
47.47 s
gammaloop-workspace-doctest> Compiling symbolica v2.2.0 (https://github.com/symbolica-dev/symbolica?branch=dev#0441bd7a)
47.47 s
gammaloop-workspace-doctest> Compiling maplit v1.0.2
47.51 s
gammaloop-workspace-doctest> Compiling gammaloop-tracing-filter-macros v0.1.0 (/build/source/crates/gammaloop-tracing-filter-macros)
47.53 s
gammaloop-workspace-doctest> Compiling vakint v0.1.2 (/build/source/crates/vakint)
47.54 s
gammaloop-workspace-doctest> Compiling gammalooprs v0.3.4 (/build/source/crates/gammalooprs)
47.57 s
gammaloop-workspace-doctest> Compiling alphal00p-docs-macros v0.1.0 (/build/source/crates/alphal00p-docs-macros)
47.57 s
gammaloop-workspace-doctest> Compiling alphal00p-docs-schema v0.1.0 (/build/source/crates/alphal00p-docs-schema)
47.57 s
gammaloop-workspace-doctest> Compiling rustc_version v0.4.1
47.62 s
gammaloop-workspace-doctest> Compiling bincode v1.3.3
47.62 s
gammaloop-workspace-doctest> Compiling gungraun-runner v0.18.2
47.62 s
gammaloop-workspace-doctest> Compiling target-triple v1.0.1
47.62 s
gammaloop-workspace-doctest> Compiling iai-callgrind-runner v0.14.2
47.64 s
gammaloop-workspace-doctest> Compiling gammaloop-integration-tests v0.1.0 (/build/source/tests)
47.67 s
gammaloop-workspace-doctest> Compiling wait-timeout v0.2.1
48.45 s
gammaloop-workspace-doctest> Compiling test-log-core v0.2.20
48.46 s
gammaloop-workspace-doctest> Compiling quick-error v1.2.3
48.54 s
gammaloop-workspace-doctest> Compiling bit-vec v0.8.0
48.69 s
gammaloop-workspace-doctest> Compiling iai-callgrind v0.14.2
49.72 s
gammaloop-workspace-doctest> Compiling bit-set v0.8.0
49.77 s
gammaloop-workspace-doctest> Compiling rusty-fork v0.3.1
49.80 s
gammaloop-workspace-doctest> Compiling iai-callgrind-macros v0.5.1
49.86 s
gammaloop-workspace-doctest> Compiling rand_xorshift v0.4.0
50.07 s
gammaloop-workspace-doctest> Compiling console v0.15.11
50.07 s
gammaloop-workspace-doctest> Compiling glob v0.3.4
50.35 s
gammaloop-workspace-doctest> Compiling termcolor v1.4.1
50.63 s
gammaloop-workspace-doctest> Compiling gungraun-macros v0.8.0
51.29 s
gammaloop-workspace-doctest> Compiling unarray v0.1.4
51.55 s
gammaloop-workspace-doctest> Compiling base64 v0.21.7
51.81 s
gammaloop-workspace-doctest> Compiling similar-asserts v1.7.0
52.39 s
gammaloop-workspace-doctest> Compiling ron v0.8.1
52.54 s
gammaloop-workspace-doctest> Compiling proptest v1.11.0
53.16 s
gammaloop-workspace-doctest> Compiling trybuild v1.0.120
53.36 s
gammaloop-workspace-doctest> Compiling kurvst v0.1.0 (/build/source/crates/kurvst)
54.23 s
gammaloop-workspace-doctest> Compiling pyo3-build-config v0.28.3
57.04 s
gammaloop-workspace-doctest> Compiling alphal00p-docs-catalogs v0.1.0 (/build/source/crates/alphal00p-docs-catalogs)
58.95 s
gammaloop-workspace-doctest> Compiling alphal00p-docs-builder v0.1.0 (/build/source/crates/alphal00p-docs-builder)
59.98 s
gammaloop-workspace-doctest> Compiling test-log-macros v0.2.20
66.20 s
gammaloop-workspace-doctest> Compiling test-log v0.2.20
68.34 s
gammaloop-workspace-doctest> Compiling alphal00p-docs-examples v0.1.0 (/build/source/crates/alphal00p-docs-examples)
69.05 s
gammaloop-workspace-doctest> Compiling pyo3-ffi v0.28.3
69.58 s
gammaloop-workspace-doctest> Compiling pyo3-macros-backend v0.28.3
70.49 s
gammaloop-workspace-doctest> Compiling pyo3 v0.28.3
71.23 s
gammaloop-workspace-doctest> Compiling numpy v0.28.0
71.73 s
gammaloop-workspace-doctest> Compiling gammaloop-api v0.1.0 (/build/source/crates/gammaloop-api)
72.70 s
gammaloop-workspace-doctest> Compiling gungraun v0.18.2
106.63 s
gammaloop-workspace-doctest> Compiling pyo3-macros v0.28.3
117.67 s
gammaloop-workspace-doctest> Compiling pyo3-stub-gen v0.17.2
119.46 s
gammaloop-workspace-doctest> Compiling numerica v2.2.0 (https://github.com/symbolica-dev/symbolica?branch=dev#0441bd7a)
124.35 s
gammaloop-workspace-doctest> Compiling graphica v2.1.0 (https://github.com/symbolica-dev/symbolica?branch=dev#0441bd7a)
132.82 s
gammaloop-workspace-doctest> Compiling symbolica-utils v0.1.0 (/build/source/crates/symbolica-utils)
470.69 s
gammaloop-workspace-doctest> Compiling gammaloop-workspace-hack v0.1.0 (/build/source/crates/gammaloop-workspace-hack)
470.70 s
gammaloop-workspace-doctest> Compiling spenso-macros v0.3.2 (/build/source/crates/spenso-macros)
470.98 s
gammaloop-workspace-doctest> Compiling linnet v0.17.0 (/build/source/crates/linnet)
475.62 s
gammaloop-workspace-doctest> Compiling spenso v0.6.0 (/build/source/crates/spenso)
487.44 s
gammaloop-workspace-doctest> Compiling idenso v0.3.0 (/build/source/crates/idenso)
487.45 s
gammaloop-workspace-doctest> Compiling gammaloop-tracing-filter v0.1.0 (/build/source/crates/gammaloop-tracing-filter)
495.08 s
gammaloop-workspace-doctest> Compiling spenso-hep-lib v0.1.7 (/build/source/crates/spenso-hep-lib)
495.40 s
gammaloop-workspace-doctest> Compiling spynso3 v0.1.2 (/build/source/crates/spynso3)
591.36 s
gammaloop-workspace-doctest> Compiling linnest v0.1.0 (/build/source/crates/linnest)
591.38 s
gammaloop-workspace-doctest> Compiling linnet-py v0.1.0 (/build/source/crates/linnet-py)
1034.89 s
gammaloop-workspace-doctest> Finished `ci-optim` profile [optimized] target(s) in 16m 28s
1035.25 s
gammaloop-workspace-doctest> warning : the following packages contain code that will be rejected by a future version of Rust: proc-macro-error2 v2.0.1
1035.25 s
gammaloop-workspace-doctest> note : to see what the problems were, use the option `--future-incompat-report`, or run `cargo report future-incompatibilities --id 1`
1035.35 s
gammaloop-workspace-doctest> Doc-tests alphal00p_docs_builder
1035.87 s
gammaloop-workspace-doctest>
1035.87 s
gammaloop-workspace-doctest> running 0 tests
1035.87 s
gammaloop-workspace-doctest>
1035.87 s
gammaloop-workspace-doctest> test result: ok. 0 passed; 0 failed; 0 ignored; 0 measured; 0 filtered out; finished in 0.00s
1035.87 s
gammaloop-workspace-doctest>
1035.88 s
gammaloop-workspace-doctest> Doc-tests alphal00p_docs_catalogs
1038.83 s
gammaloop-workspace-doctest>
1038.83 s
gammaloop-workspace-doctest> running 0 tests
1038.83 s
gammaloop-workspace-doctest>
1038.83 s
gammaloop-workspace-doctest> test result: ok. 0 passed; 0 failed; 0 ignored; 0 measured; 0 filtered out; finished in 0.00s
1038.83 s
gammaloop-workspace-doctest>
1038.84 s
gammaloop-workspace-doctest> Doc-tests alphal00p_docs_examples
1038.87 s
gammaloop-workspace-doctest>
1038.87 s
gammaloop-workspace-doctest> running 0 tests
1038.87 s
gammaloop-workspace-doctest>
1038.87 s
gammaloop-workspace-doctest> test result: ok. 0 passed; 0 failed; 0 ignored; 0 measured; 0 filtered out; finished in 0.00s
1038.87 s
gammaloop-workspace-doctest>
1038.88 s
gammaloop-workspace-doctest> Doc-tests alphal00p_docs
1039.04 s
gammaloop-workspace-doctest>
1039.04 s
gammaloop-workspace-doctest> running 0 tests
1039.04 s
gammaloop-workspace-doctest>
1039.04 s
gammaloop-workspace-doctest> test result: ok. 0 passed; 0 failed; 0 ignored; 0 measured; 0 filtered out; finished in 0.00s
1039.04 s
gammaloop-workspace-doctest>
1039.04 s
gammaloop-workspace-doctest> Doc-tests alphal00p_docs_schema
1039.21 s
gammaloop-workspace-doctest>
1039.21 s
gammaloop-workspace-doctest> running 0 tests
1039.21 s
gammaloop-workspace-doctest>
1039.21 s
gammaloop-workspace-doctest> test result: ok. 0 passed; 0 failed; 0 ignored; 0 measured; 0 filtered out; finished in 0.00s
1039.21 s
gammaloop-workspace-doctest>
1039.22 s
gammaloop-workspace-doctest> Doc-tests gammaloop_api
1041.97 s
gammaloop-workspace-doctest>
1041.97 s
gammaloop-workspace-doctest> running 16 tests
1042.06 s
gammaloop-workspace-doctest> test crates/gammaloop-api/src/python.rs - python::GammaLoopAPI::get_integrand_info (line 3585) ... FAILED
1042.07 s
gammaloop-workspace-doctest> test crates/gammaloop-api/src/python.rs - python::GammaLoopAPI::evaluate_sample (line 2967) ... FAILED
1042.11 s
gammaloop-workspace-doctest> test crates/gammaloop-api/src/python.rs - python::GammaLoopAPI::get_integrand_settings (line 3647) ... FAILED
1042.11 s
gammaloop-workspace-doctest> test crates/gammaloop-api/src/python.rs - python::PyHistogramAccumulator (line 871) ... FAILED
1042.12 s
gammaloop-workspace-doctest> test crates/gammaloop-api/src/python.rs - python::GammaLoopAPI::get_default_runtime_settings (line 3796) ... FAILED
1042.17 s
gammaloop-workspace-doctest> test crates/gammaloop-api/src/python.rs - python::GammaLoopAPI::evaluate_samples (line 3108) ... FAILED
1042.18 s
gammaloop-workspace-doctest> test crates/gammaloop-api/src/python.rs - python::GammaLoopAPI::get_active_command_blocks (line 3760) ... FAILED
1042.63 s
gammaloop-workspace-doctest> test crates/gammaloop-api/src/lib.rs - (line 18) - compile ... ok
1042.77 s
gammaloop-workspace-doctest> test crates/gammaloop-api/src/python.rs - python::evaluate_graph_overall_factor (line 95) ... FAILED
1042.97 s
gammaloop-workspace-doctest> test crates/gammaloop-api/src/python.rs - python::GammaLoopAPI::run_command (line 3901) ... FAILED
1042.98 s
gammaloop-workspace-doctest> test crates/gammaloop-api/src/python.rs - python::atom_to_dots (line 157) ... FAILED
1042.98 s
gammaloop-workspace-doctest> test crates/gammaloop-api/src/python.rs - python::GammaLoopAPI::new_python (line 2834) ... FAILED
1042.99 s
gammaloop-workspace-doctest> test crates/gammaloop-api/src/python.rs - python::GammaLoopAPI::get_global_settings (line 3739) ... FAILED
1043.00 s
gammaloop-workspace-doctest> test crates/gammaloop-api/src/python.rs - python::GammaLoopAPI::get_run_history (line 3711) ... FAILED
1043.04 s
gammaloop-workspace-doctest> test crates/gammaloop-api/src/python.rs - python::atom_to_canonical_string (line 128) ... FAILED
1050.12 s
gammaloop-workspace-doctest> test crates/gammaloop-api/src/commands/evaluate_samples.rs - commands::evaluate_samples::EvaluateSamples (line 50) ... ok
1050.13 s
gammaloop-workspace-doctest>
1050.13 s
gammaloop-workspace-doctest> failures:
1050.13 s
gammaloop-workspace-doctest>
1050.13 s
gammaloop-workspace-doctest> ---- crates/gammaloop-api/src/python.rs - python::GammaLoopAPI::get_integrand_info (line 3585) stdout ----
1050.13 s
gammaloop-workspace-doctest> error: expected one of `!` or `::`, found `pathlib`
1050.13 s
gammaloop-workspace-doctest> --> crates/gammaloop-api/src/python.rs:3586:6
1050.13 s
gammaloop-workspace-doctest> |
1050.13 s
gammaloop-workspace-doctest> 3586 | from pathlib import Path
1050.13 s
gammaloop-workspace-doctest> | ^^^^^^^ expected one of `!` or `::`
1050.13 s
gammaloop-workspace-doctest>
1050.13 s
gammaloop-workspace-doctest> error: aborting due to 1 previous error
1050.13 s
gammaloop-workspace-doctest>
1050.13 s
gammaloop-workspace-doctest> Couldn't compile the test.
1050.13 s
gammaloop-workspace-doctest> ---- crates/gammaloop-api/src/python.rs - python::GammaLoopAPI::evaluate_sample (line 2967) stdout ----
1050.13 s
gammaloop-workspace-doctest> error: expected one of `!` or `::`, found `pathlib`
1050.13 s
gammaloop-workspace-doctest> --> crates/gammaloop-api/src/python.rs:2968:6
1050.13 s
gammaloop-workspace-doctest> |
1050.13 s
gammaloop-workspace-doctest> 2968 | from pathlib import Path
1050.13 s
gammaloop-workspace-doctest> | ^^^^^^^ expected one of `!` or `::`
1050.13 s
gammaloop-workspace-doctest>
1050.13 s
gammaloop-workspace-doctest> error: aborting due to 1 previous error
1050.13 s
gammaloop-workspace-doctest>
1050.13 s
gammaloop-workspace-doctest> Couldn't compile the test.
1050.13 s
gammaloop-workspace-doctest> ---- crates/gammaloop-api/src/python.rs - python::GammaLoopAPI::get_integrand_settings (line 3647) stdout ----
1050.13 s
gammaloop-workspace-doctest> error: expected one of `!` or `::`, found `=`
1050.13 s
gammaloop-workspace-doctest> --> crates/gammaloop-api/src/python.rs:3648:10
1050.13 s
gammaloop-workspace-doctest> |
1050.13 s
gammaloop-workspace-doctest> 3648 | settings = api.get_integrand_settings(process_id=0)
1050.13 s
gammaloop-workspace-doctest> | ^ expected one of `!` or `::`
1050.13 s
gammaloop-workspace-doctest>
1050.13 s
gammaloop-workspace-doctest> error: aborting due to 1 previous error
1050.13 s
gammaloop-workspace-doctest>
1050.13 s
gammaloop-workspace-doctest> Couldn't compile the test.
1050.13 s
gammaloop-workspace-doctest> ---- crates/gammaloop-api/src/python.rs - python::PyHistogramAccumulator (line 871) stdout ----
1050.13 s
gammaloop-workspace-doctest> error: expected one of `!` or `::`, found `gammaloop`
1050.13 s
gammaloop-workspace-doctest> --> crates/gammaloop-api/src/python.rs:872:6
1050.13 s
gammaloop-workspace-doctest> |
1050.13 s
gammaloop-workspace-doctest> 872 | from gammaloop import HistogramAccumulator
1050.13 s
gammaloop-workspace-doctest> | ^^^^^^^^^ expected one of `!` or `::`
1050.13 s
gammaloop-workspace-doctest>
1050.13 s
gammaloop-workspace-doctest> error: aborting due to 1 previous error
1050.13 s
gammaloop-workspace-doctest>
1050.13 s
gammaloop-workspace-doctest> Couldn't compile the test.
1050.13 s
gammaloop-workspace-doctest> ---- crates/gammaloop-api/src/python.rs - python::GammaLoopAPI::get_default_runtime_settings (line 3796) stdout ----
1050.13 s
gammaloop-workspace-doctest> error: expected one of `!` or `::`, found `=`
1050.13 s
gammaloop-workspace-doctest> --> crates/gammaloop-api/src/python.rs:3797:9
1050.13 s
gammaloop-workspace-doctest> |
1050.13 s
gammaloop-workspace-doctest> 3797 | runtime = api.get_default_runtime_settings()
1050.13 s
gammaloop-workspace-doctest> | ^ expected one of `!` or `::`
1050.13 s
gammaloop-workspace-doctest>
1050.13 s
gammaloop-workspace-doctest> error: aborting due to 1 previous error
1050.13 s
gammaloop-workspace-doctest>
1050.13 s
gammaloop-workspace-doctest> Couldn't compile the test.
1050.13 s
gammaloop-workspace-doctest> ---- crates/gammaloop-api/src/python.rs - python::GammaLoopAPI::evaluate_samples (line 3108) stdout ----
1050.13 s
gammaloop-workspace-doctest> error: expected one of `!` or `::`, found `pathlib`
1050.13 s
gammaloop-workspace-doctest> --> crates/gammaloop-api/src/python.rs:3109:6
1050.13 s
gammaloop-workspace-doctest> |
1050.13 s
gammaloop-workspace-doctest> 3109 | from pathlib import Path
1050.13 s
gammaloop-workspace-doctest> | ^^^^^^^ expected one of `!` or `::`
1050.13 s
gammaloop-workspace-doctest>
1050.13 s
gammaloop-workspace-doctest> error: aborting due to 1 previous error
1050.13 s
gammaloop-workspace-doctest>
1050.13 s
gammaloop-workspace-doctest> Couldn't compile the test.
1050.13 s
gammaloop-workspace-doctest> ---- crates/gammaloop-api/src/python.rs - python::GammaLoopAPI::get_active_command_blocks (line 3760) stdout ----
1050.13 s
gammaloop-workspace-doctest> error: expected item, found keyword `for`
1050.13 s
gammaloop-workspace-doctest> --> crates/gammaloop-api/src/python.rs:3761:1
1050.13 s
gammaloop-workspace-doctest> |
1050.13 s
gammaloop-workspace-doctest> 3761 | for name, commands in api.get_active_command_blocks().items():
1050.13 s
gammaloop-workspace-doctest> | ^^^ expected item
1050.13 s
gammaloop-workspace-doctest> |
1050.13 s
gammaloop-workspace-doctest> = note: for a full list of items that can appear in modules, see <https://doc.rust-lang.org/reference/items.html>
1050.13 s
gammaloop-workspace-doctest>
1050.13 s
gammaloop-workspace-doctest> error: aborting due to 1 previous error
1050.13 s
gammaloop-workspace-doctest>
1050.13 s
gammaloop-workspace-doctest> Couldn't compile the test.
1050.13 s
gammaloop-workspace-doctest> ---- crates/gammaloop-api/src/python.rs - python::evaluate_graph_overall_factor (line 95) stdout ----
1050.13 s
gammaloop-workspace-doctest> error[E0425] : cannot find function `evaluate_graph_overall_factor` in this scope
1050.13 s
gammaloop-workspace-doctest> --> crates/gammaloop-api/src/python.rs:96:1
1050.13 s
gammaloop-workspace-doctest> |
1050.13 s
gammaloop-workspace-doctest> 96 | evaluate_graph_overall_factor(
1050.13 s
gammaloop-workspace-doctest> | ^^^^^^^^^^^^^^^^^^^^^^^^^^^^^ not found in this scope
1050.13 s
gammaloop-workspace-doctest>
1050.13 s
gammaloop-workspace-doctest> error : aborting due to 1 previous error
1050.13 s
gammaloop-workspace-doctest>
1050.13 s
gammaloop-workspace-doctest> For more information about this error, try `rustc --explain E0425`.
1050.13 s
gammaloop-workspace-doctest> Couldn't compile the test.
1050.13 s
gammaloop-workspace-doctest> ---- crates/gammaloop-api/src/python.rs - python::GammaLoopAPI::run_command (line 3901) stdout ----
1050.13 s
gammaloop-workspace-doctest> error[E0425] : cannot find value `api` in this scope
1050.13 s
gammaloop-workspace-doctest> --> crates/gammaloop-api/src/python.rs:3902:1
1050.13 s
gammaloop-workspace-doctest> |
1050.13 s
gammaloop-workspace-doctest> 3902 | api.run("display processes")
1050.13 s
gammaloop-workspace-doctest> | ^^^ not found in this scope
1050.13 s
gammaloop-workspace-doctest>
1050.13 s
gammaloop-workspace-doctest> error : aborting due to 1 previous error
1050.13 s
gammaloop-workspace-doctest>
1050.13 s
gammaloop-workspace-doctest> For more information about this error, try `rustc --explain E0425`.
1050.13 s
gammaloop-workspace-doctest> Couldn't compile the test.
1050.13 s
gammaloop-workspace-doctest> ---- crates/gammaloop-api/src/python.rs - python::atom_to_dots (line 157) stdout ----
1050.13 s
gammaloop-workspace-doctest> error[E0425] : cannot find function `to_dots` in this scope
1050.13 s
gammaloop-workspace-doctest> --> crates/gammaloop-api/src/python.rs:158:1
1050.13 s
gammaloop-workspace-doctest> |
1050.13 s
gammaloop-workspace-doctest> 158 | to_dots("p(mu) * q(mu)")
1050.13 s
gammaloop-workspace-doctest> | ^^^^^^^ not found in this scope
1050.13 s
gammaloop-workspace-doctest>
1050.13 s
gammaloop-workspace-doctest> error : aborting due to 1 previous error
1050.13 s
gammaloop-workspace-doctest>
1050.13 s
gammaloop-workspace-doctest> For more information about this error, try `rustc --explain E0425`.
1050.13 s
gammaloop-workspace-doctest> Couldn't compile the test.
1050.13 s
gammaloop-workspace-doctest> ---- crates/gammaloop-api/src/python.rs - python::GammaLoopAPI::new_python (line 2834) stdout ----
1050.13 s
gammaloop-workspace-doctest> error[E0425] : cannot find value `api` in this scope
1050.13 s
gammaloop-workspace-doctest> --> crates/gammaloop-api/src/python.rs:2835:1
1050.13 s
gammaloop-workspace-doctest> |
1050.13 s
gammaloop-workspace-doctest> 2835 | api = GammaLoopAPI(state_folder="./state", read_only_state=True)
1050.13 s
gammaloop-workspace-doctest> | ^^^
1050.13 s
gammaloop-workspace-doctest> |
1050.13 s
gammaloop-workspace-doctest> help : you might have meant to introduce a new binding
1050.13 s
gammaloop-workspace-doctest> |
1050.13 s
gammaloop-workspace-doctest> 2835 | let api = GammaLoopAPI(state_folder="./state", read_only_state=True)
1050.13 s
gammaloop-workspace-doctest> | +++
1050.13 s
gammaloop-workspace-doctest>
1050.13 s
gammaloop-workspace-doctest> error[E0425] : cannot find value `state_folder` in this scope
1050.13 s
gammaloop-workspace-doctest> --> crates/gammaloop-api/src/python.rs:2835:20
1050.13 s
gammaloop-workspace-doctest> |
1050.13 s
gammaloop-workspace-doctest> 2835 | api = GammaLoopAPI(state_folder="./state", read_only_state=True)
1050.13 s
gammaloop-workspace-doctest> | ^^^^^^^^^^^^ not found in this scope
1050.13 s
gammaloop-workspace-doctest>
1050.13 s
gammaloop-workspace-doctest> error[E0425] : cannot find value `read_only_state` in this scope
1050.13 s
gammaloop-workspace-doctest> --> crates/gammaloop-api/src/python.rs:2835:44
1050.13 s
gammaloop-workspace-doctest> |
1050.13 s
gammaloop-workspace-doctest> 2835 | api = GammaLoopAPI(state_folder="./state", read_only_state=True)
1050.13 s
gammaloop-workspace-doctest> | ^^^^^^^^^^^^^^^ not found in this scope
1050.13 s
gammaloop-workspace-doctest>
1050.13 s
gammaloop-workspace-doctest> error[E0425] : cannot find value `True` in this scope
1050.13 s
gammaloop-workspace-doctest> --> crates/gammaloop-api/src/python.rs:2835:60
1050.13 s
gammaloop-workspace-doctest> |
1050.13 s
gammaloop-workspace-doctest> 2835 | api = GammaLoopAPI(state_folder="./state", read_only_state=True)
1050.13 s
gammaloop-workspace-doctest> | ^^^^ not found in this scope
1050.13 s
gammaloop-workspace-doctest> |
1050.13 s
gammaloop-workspace-doctest> help : you may want to use a bool value instead
1050.13 s
gammaloop-workspace-doctest> |
1050.13 s
gammaloop-workspace-doctest> 2835 - api = GammaLoopAPI(state_folder="./state", read_only_state=True )
1050.13 s
gammaloop-workspace-doctest> 2835 + api = GammaLoopAPI(state_folder="./state", read_only_state=true )
1050.13 s
gammaloop-workspace-doctest> |
1050.13 s
gammaloop-workspace-doctest>
1050.13 s
gammaloop-workspace-doctest> error[E0425] : cannot find function, tuple struct or tuple variant `GammaLoopAPI` in this scope
1050.13 s
gammaloop-workspace-doctest> --> crates/gammaloop-api/src/python.rs:2835:7
1050.13 s
gammaloop-workspace-doctest> |
1050.13 s
gammaloop-workspace-doctest> 2835 | api = GammaLoopAPI(state_folder="./state", read_only_state=True)
1050.13 s
gammaloop-workspace-doctest> | ^^^^^^^^^^^^ not found in this scope
1050.13 s
gammaloop-workspace-doctest>
1050.13 s
gammaloop-workspace-doctest> error : aborting due to 5 previous errors
1050.13 s
gammaloop-workspace-doctest>
1050.13 s
gammaloop-workspace-doctest> For more information about this error, try `rustc --explain E0425`.
1050.13 s
gammaloop-workspace-doctest> Couldn't compile the test.
1050.13 s
gammaloop-workspace-doctest> ---- crates/gammaloop-api/src/python.rs - python::GammaLoopAPI::get_global_settings (line 3739) stdout ----
1050.13 s
gammaloop-workspace-doctest> error[E0425] : cannot find value `settings_toml` in this scope
1050.13 s
gammaloop-workspace-doctest> --> crates/gammaloop-api/src/python.rs:3740:1
1050.13 s
gammaloop-workspace-doctest> |
1050.13 s
gammaloop-workspace-doctest> 3740 | settings_toml = api.get_global_settings()
1050.13 s
gammaloop-workspace-doctest> | ^^^^^^^^^^^^^
1050.13 s
gammaloop-workspace-doctest> |
1050.13 s
gammaloop-workspace-doctest> help : you might have meant to introduce a new binding
1050.13 s
gammaloop-workspace-doctest> |
1050.13 s
gammaloop-workspace-doctest> 3740 | let settings_toml = api.get_global_settings()
1050.13 s
gammaloop-workspace-doctest> | +++
1050.13 s
gammaloop-workspace-doctest>
1050.13 s
gammaloop-workspace-doctest> error[E0425] : cannot find value `api` in this scope
1050.13 s
gammaloop-workspace-doctest> --> crates/gammaloop-api/src/python.rs:3740:17
1050.13 s
gammaloop-workspace-doctest> |
1050.13 s
gammaloop-workspace-doctest> 3740 | settings_toml = api.get_global_settings()
1050.13 s
gammaloop-workspace-doctest> | ^^^ not found in this scope
1050.13 s
gammaloop-workspace-doctest>
1050.13 s
gammaloop-workspace-doctest> error : aborting due to 2 previous errors
1050.13 s
gammaloop-workspace-doctest>
1050.13 s
gammaloop-workspace-doctest> For more information about this error, try `rustc --explain E0425`.
1050.13 s
gammaloop-workspace-doctest> Couldn't compile the test.
1050.13 s
gammaloop-workspace-doctest> ---- crates/gammaloop-api/src/python.rs - python::GammaLoopAPI::get_run_history (line 3711) stdout ----
1050.13 s
gammaloop-workspace-doctest> error[E0425] : cannot find value `run_card_toml` in this scope
1050.13 s
gammaloop-workspace-doctest> --> crates/gammaloop-api/src/python.rs:3712:1
1050.13 s
gammaloop-workspace-doctest> |
1050.13 s
gammaloop-workspace-doctest> 3712 | run_card_toml = api.get_run_history()
1050.13 s
gammaloop-workspace-doctest> | ^^^^^^^^^^^^^
1050.13 s
gammaloop-workspace-doctest> |
1050.13 s
gammaloop-workspace-doctest> help : you might have meant to introduce a new binding
1050.13 s
gammaloop-workspace-doctest> |
1050.13 s
gammaloop-workspace-doctest> 3712 | let run_card_toml = api.get_run_history()
1050.13 s
gammaloop-workspace-doctest> | +++
1050.13 s
gammaloop-workspace-doctest>
1050.13 s
gammaloop-workspace-doctest> error[E0425] : cannot find value `api` in this scope
1050.13 s
gammaloop-workspace-doctest> --> crates/gammaloop-api/src/python.rs:3712:17
1050.13 s
gammaloop-workspace-doctest> |
1050.13 s
gammaloop-workspace-doctest> 3712 | run_card_toml = api.get_run_history()
1050.13 s
gammaloop-workspace-doctest> | ^^^ not found in this scope
1050.13 s
gammaloop-workspace-doctest>
1050.13 s
gammaloop-workspace-doctest> error : aborting due to 2 previous errors
1050.13 s
gammaloop-workspace-doctest>
1050.13 s
gammaloop-workspace-doctest> For more information about this error, try `rustc --explain E0425`.
1050.13 s
gammaloop-workspace-doctest> Couldn't compile the test.
1050.13 s
gammaloop-workspace-doctest> ---- crates/gammaloop-api/src/python.rs - python::atom_to_canonical_string (line 128) stdout ----
1050.13 s
gammaloop-workspace-doctest> error[E0425] : cannot find function `atom_to_canonical_string` in this scope
1050.13 s
gammaloop-workspace-doctest> --> crates/gammaloop-api/src/python.rs:129:1
1050.13 s
gammaloop-workspace-doctest> |
1050.13 s
gammaloop-workspace-doctest> 129 | atom_to_canonical_string("x + x")
1050.13 s
gammaloop-workspace-doctest> | ^^^^^^^^^^^^^^^^^^^^^^^^ not found in this scope
1050.13 s
gammaloop-workspace-doctest>
1050.13 s
gammaloop-workspace-doctest> error : aborting due to 1 previous error
1050.13 s
gammaloop-workspace-doctest>
1050.13 s
gammaloop-workspace-doctest> For more information about this error, try `rustc --explain E0425`.
1050.13 s
gammaloop-workspace-doctest> Couldn't compile the test.
1050.13 s
gammaloop-workspace-doctest>
1050.13 s
gammaloop-workspace-doctest> failures:
1050.13 s
gammaloop-workspace-doctest> crates/gammaloop-api/src/python.rs - python::GammaLoopAPI::evaluate_sample (line 2967)
1050.13 s
gammaloop-workspace-doctest> crates/gammaloop-api/src/python.rs - python::GammaLoopAPI::evaluate_samples (line 3108)
1050.13 s
gammaloop-workspace-doctest> crates/gammaloop-api/src/python.rs - python::GammaLoopAPI::get_active_command_blocks (line 3760)
1050.13 s
gammaloop-workspace-doctest> crates/gammaloop-api/src/python.rs - python::GammaLoopAPI::get_default_runtime_settings (line 3796)
1050.13 s
gammaloop-workspace-doctest> crates/gammaloop-api/src/python.rs - python::GammaLoopAPI::get_global_settings (line 3739)
1050.13 s
gammaloop-workspace-doctest> crates/gammaloop-api/src/python.rs - python::GammaLoopAPI::get_integrand_info (line 3585)
1050.13 s
gammaloop-workspace-doctest> crates/gammaloop-api/src/python.rs - python::GammaLoopAPI::get_integrand_settings (line 3647)
1050.13 s
gammaloop-workspace-doctest> crates/gammaloop-api/src/python.rs - python::GammaLoopAPI::get_run_history (line 3711)
1050.13 s
gammaloop-workspace-doctest> crates/gammaloop-api/src/python.rs - python::GammaLoopAPI::new_python (line 2834)
1050.13 s
gammaloop-workspace-doctest> crates/gammaloop-api/src/python.rs - python::GammaLoopAPI::run_command (line 3901)
1050.13 s
gammaloop-workspace-doctest> crates/gammaloop-api/src/python.rs - python::PyHistogramAccumulator (line 871)
1050.13 s
gammaloop-workspace-doctest> crates/gammaloop-api/src/python.rs - python::atom_to_canonical_string (line 128)
1050.13 s
gammaloop-workspace-doctest> crates/gammaloop-api/src/python.rs - python::atom_to_dots (line 157)
1050.13 s
gammaloop-workspace-doctest> crates/gammaloop-api/src/python.rs - python::evaluate_graph_overall_factor (line 95)
1050.13 s
gammaloop-workspace-doctest>
1050.13 s
gammaloop-workspace-doctest> test result: FAILED. 2 passed; 14 failed; 0 ignored; 0 measured; 0 filtered out; finished in 8.14s
1050.13 s
gammaloop-workspace-doctest>
1050.13 s
gammaloop-workspace-doctest> error : doctest failed, to rerun pass `-p gammaloop-api --doc`
1051.58 s
error: Cannot build '/nix/store/gfqf16jiri54v362qzgvkmdlmf27gab4-gammaloop-workspace-doctest-0.1.0.drv '.
1051.58 s
Reason: builder failed with exit code 101 .
1051.58 s
Output paths:
1051.58 s
/nix/store/2ap3qnbflc67an3cixg5kwcmqkvrk4iw-gammaloop-workspace-doctest-0.1.0
1051.58 s
Last 356 log lines:
1051.58 s
> Running phase: unpackPhase
1051.58 s
> unpacking source archive /nix/store/5afz06g4vsphrihpxicbxvm3sk5psnll-source
1051.58 s
> source root is source
1051.58 s
> Running phase: patchPhase
1051.58 s
> Executing configureCargoCommonVars
1051.58 s
> decompressing cargo artifacts from /nix/store/9q03j4h8yyxwgigikinn0j17963s9lwf-gammaloop-workspace-deps-deps-0.1.0/target.tar.zst to target
1051.58 s
> Running phase: updateAutotoolsGnuConfigScriptsPhase
1051.58 s
> Running phase: configurePhase
1051.58 s
> will append /build/source/.cargo-home/config.toml with contents of /nix/store/4vj0f29myggx0gdynf7fwm2wfzgqnk61-vendor-cargo-deps/config.toml
1051.58 s
> default configurePhase, nothing to do
1051.58 s
> Running phase: buildPhase
1051.58 s
> +++ command cargo --version
1051.58 s
> cargo 1.97.0 (c980f4866 2026-06-30)
1051.58 s
> +++ command cargo test --profile ci-optim --doc --locked --workspace --features gammaloop-api/cli,gammaloop-tracing-filter/clap,gammaloop-tracing-filter/symbolica,idenso/bincode,idenso/reference-cases,linnet/bincode,linnet/drawing,linnet/nodestore-vec,linnet/rkyv,linnet/serde,linnet/symbolica,spenso-macros/shadowing,spenso/shadowing,symbolica/tracing_max_level_info
1051.58 s
> Compiling target-lexicon v0.13.5
1051.58 s
> Compiling symbolica v2.2.0 (https://github.com/symbolica-dev/symbolica?branch=dev#0441bd7a)
1051.58 s
> Compiling maplit v1.0.2
1051.58 s
> Compiling gammaloop-tracing-filter-macros v0.1.0 (/build/source/crates/gammaloop-tracing-filter-macros)
1051.58 s
> Compiling vakint v0.1.2 (/build/source/crates/vakint)
1051.58 s
> Compiling gammalooprs v0.3.4 (/build/source/crates/gammalooprs)
1051.58 s
> Compiling alphal00p-docs-macros v0.1.0 (/build/source/crates/alphal00p-docs-macros)
1051.58 s
> Compiling alphal00p-docs-schema v0.1.0 (/build/source/crates/alphal00p-docs-schema)
1051.58 s
> Compiling rustc_version v0.4.1
1051.58 s
> Compiling bincode v1.3.3
1051.58 s
> Compiling gungraun-runner v0.18.2
1051.58 s
> Compiling target-triple v1.0.1
1051.58 s
> Compiling iai-callgrind-runner v0.14.2
1051.58 s
> Compiling gammaloop-integration-tests v0.1.0 (/build/source/tests)
1051.58 s
> Compiling wait-timeout v0.2.1
1051.58 s
> Compiling test-log-core v0.2.20
1051.58 s
> Compiling quick-error v1.2.3
1051.58 s
> Compiling bit-vec v0.8.0
1051.58 s
> Compiling iai-callgrind v0.14.2
1051.58 s
> Compiling bit-set v0.8.0
1051.58 s
> Compiling rusty-fork v0.3.1
1051.58 s
> Compiling iai-callgrind-macros v0.5.1
1051.58 s
> Compiling rand_xorshift v0.4.0
1051.58 s
> Compiling console v0.15.11
1051.58 s
> Compiling glob v0.3.4
1051.58 s
> Compiling termcolor v1.4.1
1051.58 s
> Compiling gungraun-macros v0.8.0
1051.58 s
> Compiling unarray v0.1.4
1051.58 s
> Compiling base64 v0.21.7
1051.58 s
> Compiling similar-asserts v1.7.0
1051.58 s
> Compiling ron v0.8.1
1051.58 s
> Compiling proptest v1.11.0
1051.58 s
> Compiling trybuild v1.0.120
1051.58 s
> Compiling kurvst v0.1.0 (/build/source/crates/kurvst)
1051.58 s
> Compiling pyo3-build-config v0.28.3
1051.58 s
> Compiling alphal00p-docs-catalogs v0.1.0 (/build/source/crates/alphal00p-docs-catalogs)
1051.58 s
> Compiling alphal00p-docs-builder v0.1.0 (/build/source/crates/alphal00p-docs-builder)
1051.58 s
> Compiling test-log-macros v0.2.20
1051.58 s
> Compiling test-log v0.2.20
1051.58 s
> Compiling alphal00p-docs-examples v0.1.0 (/build/source/crates/alphal00p-docs-examples)
1051.58 s
> Compiling pyo3-ffi v0.28.3
1051.58 s
> Compiling pyo3-macros-backend v0.28.3
1051.58 s
> Compiling pyo3 v0.28.3
1051.58 s
> Compiling numpy v0.28.0
1051.58 s
> Compiling gammaloop-api v0.1.0 (/build/source/crates/gammaloop-api)
1051.58 s
> Compiling gungraun v0.18.2
1051.58 s
> Compiling pyo3-macros v0.28.3
1051.58 s
> Compiling pyo3-stub-gen v0.17.2
1051.58 s
> Compiling numerica v2.2.0 (https://github.com/symbolica-dev/symbolica?branch=dev#0441bd7a)
1051.58 s
> Compiling graphica v2.1.0 (https://github.com/symbolica-dev/symbolica?branch=dev#0441bd7a)
1051.58 s
> Compiling symbolica-utils v0.1.0 (/build/source/crates/symbolica-utils)
1051.58 s
> Compiling gammaloop-workspace-hack v0.1.0 (/build/source/crates/gammaloop-workspace-hack)
1051.58 s
> Compiling spenso-macros v0.3.2 (/build/source/crates/spenso-macros)
1051.58 s
> Compiling linnet v0.17.0 (/build/source/crates/linnet)
1051.58 s
> Compiling spenso v0.6.0 (/build/source/crates/spenso)
1051.58 s
> Compiling idenso v0.3.0 (/build/source/crates/idenso)
1051.58 s
> Compiling gammaloop-tracing-filter v0.1.0 (/build/source/crates/gammaloop-tracing-filter)
1051.58 s
> Compiling spenso-hep-lib v0.1.7 (/build/source/crates/spenso-hep-lib)
1051.58 s
> Compiling spynso3 v0.1.2 (/build/source/crates/spynso3)
1051.58 s
> Compiling linnest v0.1.0 (/build/source/crates/linnest)
1051.58 s
> Compiling linnet-py v0.1.0 (/build/source/crates/linnet-py)
1051.58 s
> Finished `ci-optim` profile [optimized] target(s) in 16m 28s
1051.58 s
> warning : the following packages contain code that will be rejected by a future version of Rust: proc-macro-error2 v2.0.1
1051.58 s
> note : to see what the problems were, use the option `--future-incompat-report`, or run `cargo report future-incompatibilities --id 1`
1051.58 s
> Doc-tests alphal00p_docs_builder
1051.58 s
>
1051.58 s
> running 0 tests
1051.58 s
>
1051.58 s
> test result: ok. 0 passed; 0 failed; 0 ignored; 0 measured; 0 filtered out; finished in 0.00s
1051.58 s
>
1051.58 s
> Doc-tests alphal00p_docs_catalogs
1051.58 s
>
1051.58 s
> running 0 tests
1051.58 s
>
1051.58 s
> test result: ok. 0 passed; 0 failed; 0 ignored; 0 measured; 0 filtered out; finished in 0.00s
1051.58 s
>
1051.58 s
> Doc-tests alphal00p_docs_examples
1051.58 s
>
1051.58 s
> running 0 tests
1051.58 s
>
1051.58 s
> test result: ok. 0 passed; 0 failed; 0 ignored; 0 measured; 0 filtered out; finished in 0.00s
1051.58 s
>
1051.58 s
> Doc-tests alphal00p_docs
1051.58 s
>
1051.58 s
> running 0 tests
1051.58 s
>
1051.58 s
> test result: ok. 0 passed; 0 failed; 0 ignored; 0 measured; 0 filtered out; finished in 0.00s
1051.58 s
>
1051.58 s
> Doc-tests alphal00p_docs_schema
1051.58 s
>
1051.58 s
> running 0 tests
1051.58 s
>
1051.58 s
> test result: ok. 0 passed; 0 failed; 0 ignored; 0 measured; 0 filtered out; finished in 0.00s
1051.58 s
>
1051.58 s
> Doc-tests gammaloop_api
1051.58 s
>
1051.58 s
> running 16 tests
1051.58 s
> test crates/gammaloop-api/src/python.rs - python::GammaLoopAPI::get_integrand_info (line 3585) ... FAILED
1051.58 s
> test crates/gammaloop-api/src/python.rs - python::GammaLoopAPI::evaluate_sample (line 2967) ... FAILED
1051.58 s
> test crates/gammaloop-api/src/python.rs - python::GammaLoopAPI::get_integrand_settings (line 3647) ... FAILED
1051.58 s
> test crates/gammaloop-api/src/python.rs - python::PyHistogramAccumulator (line 871) ... FAILED
1051.58 s
> test crates/gammaloop-api/src/python.rs - python::GammaLoopAPI::get_default_runtime_settings (line 3796) ... FAILED
1051.58 s
> test crates/gammaloop-api/src/python.rs - python::GammaLoopAPI::evaluate_samples (line 3108) ... FAILED
1051.58 s
> test crates/gammaloop-api/src/python.rs - python::GammaLoopAPI::get_active_command_blocks (line 3760) ... FAILED
1051.58 s
> test crates/gammaloop-api/src/lib.rs - (line 18) - compile ... ok
1051.58 s
> test crates/gammaloop-api/src/python.rs - python::evaluate_graph_overall_factor (line 95) ... FAILED
1051.58 s
> test crates/gammaloop-api/src/python.rs - python::GammaLoopAPI::run_command (line 3901) ... FAILED
1051.58 s
> test crates/gammaloop-api/src/python.rs - python::atom_to_dots (line 157) ... FAILED
1051.58 s
> test crates/gammaloop-api/src/python.rs - python::GammaLoopAPI::new_python (line 2834) ... FAILED
1051.58 s
> test crates/gammaloop-api/src/python.rs - python::GammaLoopAPI::get_global_settings (line 3739) ... FAILED
1051.58 s
> test crates/gammaloop-api/src/python.rs - python::GammaLoopAPI::get_run_history (line 3711) ... FAILED
1051.59 s
> test crates/gammaloop-api/src/python.rs - python::atom_to_canonical_string (line 128) ... FAILED
1051.59 s
> test crates/gammaloop-api/src/commands/evaluate_samples.rs - commands::evaluate_samples::EvaluateSamples (line 50) ... ok
1051.59 s
>
1051.59 s
> failures:
1051.59 s
>
1051.59 s
> ---- crates/gammaloop-api/src/python.rs - python::GammaLoopAPI::get_integrand_info (line 3585) stdout ----
1051.59 s
> error: expected one of `!` or `::`, found `pathlib`
1051.59 s
> --> crates/gammaloop-api/src/python.rs:3586:6
1051.59 s
> |
1051.59 s
> 3586 | from pathlib import Path
1051.59 s
> | ^^^^^^^ expected one of `!` or `::`
1051.59 s
>
1051.59 s
> error: aborting due to 1 previous error
1051.59 s
>
1051.59 s
> Couldn't compile the test.
1051.59 s
> ---- crates/gammaloop-api/src/python.rs - python::GammaLoopAPI::evaluate_sample (line 2967) stdout ----
1051.59 s
> error: expected one of `!` or `::`, found `pathlib`
1051.59 s
> --> crates/gammaloop-api/src/python.rs:2968:6
1051.59 s
> |
1051.59 s
> 2968 | from pathlib import Path
1051.59 s
> | ^^^^^^^ expected one of `!` or `::`
1051.59 s
>
1051.59 s
> error: aborting due to 1 previous error
1051.59 s
>
1051.59 s
> Couldn't compile the test.
1051.59 s
> ---- crates/gammaloop-api/src/python.rs - python::GammaLoopAPI::get_integrand_settings (line 3647) stdout ----
1051.59 s
> error: expected one of `!` or `::`, found `=`
1051.59 s
> --> crates/gammaloop-api/src/python.rs:3648:10
1051.59 s
> |
1051.59 s
> 3648 | settings = api.get_integrand_settings(process_id=0)
1051.59 s
> | ^ expected one of `!` or `::`
1051.59 s
>
1051.59 s
> error: aborting due to 1 previous error
1051.59 s
>
1051.59 s
> Couldn't compile the test.
1051.59 s
> ---- crates/gammaloop-api/src/python.rs - python::PyHistogramAccumulator (line 871) stdout ----
1051.59 s
> error: expected one of `!` or `::`, found `gammaloop`
1051.59 s
> --> crates/gammaloop-api/src/python.rs:872:6
1051.59 s
> |
1051.59 s
> 872 | from gammaloop import HistogramAccumulator
1051.59 s
> | ^^^^^^^^^ expected one of `!` or `::`
1051.59 s
>
1051.59 s
> error: aborting due to 1 previous error
1051.59 s
>
1051.59 s
> Couldn't compile the test.
1051.59 s
> ---- crates/gammaloop-api/src/python.rs - python::GammaLoopAPI::get_default_runtime_settings (line 3796) stdout ----
1051.59 s
> error: expected one of `!` or `::`, found `=`
1051.59 s
> --> crates/gammaloop-api/src/python.rs:3797:9
1051.59 s
> |
1051.59 s
> 3797 | runtime = api.get_default_runtime_settings()
1051.59 s
> | ^ expected one of `!` or `::`
1051.59 s
>
1051.59 s
> error: aborting due to 1 previous error
1051.59 s
>
1051.59 s
> Couldn't compile the test.
1051.59 s
> ---- crates/gammaloop-api/src/python.rs - python::GammaLoopAPI::evaluate_samples (line 3108) stdout ----
1051.59 s
> error: expected one of `!` or `::`, found `pathlib`
1051.59 s
> --> crates/gammaloop-api/src/python.rs:3109:6
1051.59 s
> |
1051.59 s
> 3109 | from pathlib import Path
1051.59 s
> | ^^^^^^^ expected one of `!` or `::`
1051.59 s
>
1051.59 s
> error: aborting due to 1 previous error
1051.59 s
>
1051.59 s
> Couldn't compile the test.
1051.59 s
> ---- crates/gammaloop-api/src/python.rs - python::GammaLoopAPI::get_active_command_blocks (line 3760) stdout ----
1051.59 s
> error: expected item, found keyword `for`
1051.59 s
> --> crates/gammaloop-api/src/python.rs:3761:1
1051.59 s
> |
1051.59 s
> 3761 | for name, commands in api.get_active_command_blocks().items():
1051.59 s
> | ^^^ expected item
1051.59 s
> |
1051.59 s
> = note: for a full list of items that can appear in modules, see <https://doc.rust-lang.org/reference/items.html>
1051.59 s
>
1051.59 s
> error: aborting due to 1 previous error
1051.59 s
>
1051.59 s
> Couldn't compile the test.
1051.59 s
> ---- crates/gammaloop-api/src/python.rs - python::evaluate_graph_overall_factor (line 95) stdout ----
1051.59 s
> error[E0425] : cannot find function `evaluate_graph_overall_factor` in this scope
1051.59 s
> --> crates/gammaloop-api/src/python.rs:96:1
1051.59 s
> |
1051.59 s
> 96 | evaluate_graph_overall_factor(
1051.59 s
> | ^^^^^^^^^^^^^^^^^^^^^^^^^^^^^ not found in this scope
1051.59 s
>
1051.59 s
> error : aborting due to 1 previous error
1051.59 s
>
1051.59 s
> For more information about this error, try `rustc --explain E0425`.
1051.59 s
> Couldn't compile the test.
1051.59 s
> ---- crates/gammaloop-api/src/python.rs - python::GammaLoopAPI::run_command (line 3901) stdout ----
1051.59 s
> error[E0425] : cannot find value `api` in this scope
1051.59 s
> --> crates/gammaloop-api/src/python.rs:3902:1
1051.59 s
> |
1051.59 s
> 3902 | api.run("display processes")
1051.59 s
> | ^^^ not found in this scope
1051.59 s
>
1051.59 s
> error : aborting due to 1 previous error
1051.59 s
>
1051.59 s
> For more information about this error, try `rustc --explain E0425`.
1051.59 s
> Couldn't compile the test.
1051.59 s
> ---- crates/gammaloop-api/src/python.rs - python::atom_to_dots (line 157) stdout ----
1051.59 s
> error[E0425] : cannot find function `to_dots` in this scope
1051.59 s
> --> crates/gammaloop-api/src/python.rs:158:1
1051.59 s
> |
1051.59 s
> 158 | to_dots("p(mu) * q(mu)")
1051.59 s
> | ^^^^^^^ not found in this scope
1051.59 s
>
1051.59 s
> error : aborting due to 1 previous error
1051.59 s
>
1051.59 s
> For more information about this error, try `rustc --explain E0425`.
1051.59 s
> Couldn't compile the test.
1051.59 s
> ---- crates/gammaloop-api/src/python.rs - python::GammaLoopAPI::new_python (line 2834) stdout ----
1051.59 s
> error[E0425] : cannot find value `api` in this scope
1051.59 s
> --> crates/gammaloop-api/src/python.rs:2835:1
1051.59 s
> |
1051.59 s
> 2835 | api = GammaLoopAPI(state_folder="./state", read_only_state=True)
1051.59 s
> | ^^^
1051.59 s
> |
1051.59 s
> help : you might have meant to introduce a new binding
1051.59 s
> |
1051.59 s
> 2835 | let api = GammaLoopAPI(state_folder="./state", read_only_state=True)
1051.59 s
> | +++
1051.59 s
>
1051.59 s
> error[E0425] : cannot find value `state_folder` in this scope
1051.59 s
> --> crates/gammaloop-api/src/python.rs:2835:20
1051.59 s
> |
1051.59 s
> 2835 | api = GammaLoopAPI(state_folder="./state", read_only_state=True)
1051.59 s
> | ^^^^^^^^^^^^ not found in this scope
1051.59 s
>
1051.59 s
> error[E0425] : cannot find value `read_only_state` in this scope
1051.59 s
> --> crates/gammaloop-api/src/python.rs:2835:44
1051.59 s
> |
1051.59 s
> 2835 | api = GammaLoopAPI(state_folder="./state", read_only_state=True)
1051.59 s
> | ^^^^^^^^^^^^^^^ not found in this scope
1051.59 s
>
1051.59 s
> error[E0425] : cannot find value `True` in this scope
1051.59 s
> --> crates/gammaloop-api/src/python.rs:2835:60
1051.59 s
> |
1051.59 s
> 2835 | api = GammaLoopAPI(state_folder="./state", read_only_state=True)
1051.59 s
> | ^^^^ not found in this scope
1051.59 s
> |
1051.59 s
> help : you may want to use a bool value instead
1051.59 s
> |
1051.59 s
> 2835 - api = GammaLoopAPI(state_folder="./state", read_only_state=True )
1051.59 s
> 2835 + api = GammaLoopAPI(state_folder="./state", read_only_state=true )
1051.59 s
> |
1051.59 s
>
1051.59 s
> error[E0425] : cannot find function, tuple struct or tuple variant `GammaLoopAPI` in this scope
1051.59 s
> --> crates/gammaloop-api/src/python.rs:2835:7
1051.59 s
> |
1051.59 s
> 2835 | api = GammaLoopAPI(state_folder="./state", read_only_state=True)
1051.59 s
> | ^^^^^^^^^^^^ not found in this scope
1051.59 s
>
1051.59 s
> error : aborting due to 5 previous errors
1051.59 s
>
1051.59 s
> For more information about this error, try `rustc --explain E0425`.
1051.59 s
> Couldn't compile the test.
1051.59 s
> ---- crates/gammaloop-api/src/python.rs - python::GammaLoopAPI::get_global_settings (line 3739) stdout ----
1051.59 s
> error[E0425] : cannot find value `settings_toml` in this scope
1051.59 s
> --> crates/gammaloop-api/src/python.rs:3740:1
1051.59 s
> |
1051.59 s
> 3740 | settings_toml = api.get_global_settings()
1051.59 s
> | ^^^^^^^^^^^^^
1051.59 s
> |
1051.59 s
> help : you might have meant to introduce a new binding
1051.59 s
> |
1051.59 s
> 3740 | let settings_toml = api.get_global_settings()
1051.59 s
> | +++
1051.59 s
>
1051.59 s
> error[E0425] : cannot find value `api` in this scope
1051.59 s
> --> crates/gammaloop-api/src/python.rs:3740:17
1051.59 s
> |
1051.59 s
> 3740 | settings_toml = api.get_global_settings()
1051.59 s
> | ^^^ not found in this scope
1051.59 s
>
1051.59 s
> error : aborting due to 2 previous errors
1051.59 s
>
1051.59 s
> For more information about this error, try `rustc --explain E0425`.
1051.59 s
> Couldn't compile the test.
1051.59 s
> ---- crates/gammaloop-api/src/python.rs - python::GammaLoopAPI::get_run_history (line 3711) stdout ----
1051.59 s
> error[E0425] : cannot find value `run_card_toml` in this scope
1051.59 s
> --> crates/gammaloop-api/src/python.rs:3712:1
1051.59 s
> |
1051.59 s
> 3712 | run_card_toml = api.get_run_history()
1051.59 s
> | ^^^^^^^^^^^^^
1051.59 s
> |
1051.59 s
> help : you might have meant to introduce a new binding
1051.59 s
> |
1051.59 s
> 3712 | let run_card_toml = api.get_run_history()
1051.59 s
> | +++
1051.59 s
>
1051.59 s
> error[E0425] : cannot find value `api` in this scope
1051.59 s
> --> crates/gammaloop-api/src/python.rs:3712:17
1051.59 s
> |
1051.59 s
> 3712 | run_card_toml = api.get_run_history()
1051.59 s
> | ^^^ not found in this scope
1051.59 s
>
1051.59 s
> error : aborting due to 2 previous errors
1051.59 s
>
1051.59 s
> For more information about this error, try `rustc --explain E0425`.
1051.59 s
> Couldn't compile the test.
1051.59 s
> ---- crates/gammaloop-api/src/python.rs - python::atom_to_canonical_string (line 128) stdout ----
1051.59 s
> error[E0425] : cannot find function `atom_to_canonical_string` in this scope
1051.59 s
> --> crates/gammaloop-api/src/python.rs:129:1
1051.59 s
> |
1051.59 s
> 129 | atom_to_canonical_string("x + x")
1051.59 s
> | ^^^^^^^^^^^^^^^^^^^^^^^^ not found in this scope
1051.59 s
>
1051.59 s
> error : aborting due to 1 previous error
1051.59 s
>
1051.59 s
> For more information about this error, try `rustc --explain E0425`.
1051.59 s
> Couldn't compile the test.
1051.59 s
>
1051.59 s
> failures:
1051.59 s
> crates/gammaloop-api/src/python.rs - python::GammaLoopAPI::evaluate_sample (line 2967)
1051.59 s
> crates/gammaloop-api/src/python.rs - python::GammaLoopAPI::evaluate_samples (line 3108)
1051.59 s
> crates/gammaloop-api/src/python.rs - python::GammaLoopAPI::get_active_command_blocks (line 3760)
1051.59 s
> crates/gammaloop-api/src/python.rs - python::GammaLoopAPI::get_default_runtime_settings (line 3796)
1051.59 s
> crates/gammaloop-api/src/python.rs - python::GammaLoopAPI::get_global_settings (line 3739)
1051.59 s
> crates/gammaloop-api/src/python.rs - python::GammaLoopAPI::get_integrand_info (line 3585)
1051.59 s
> crates/gammaloop-api/src/python.rs - python::GammaLoopAPI::get_integrand_settings (line 3647)
1051.59 s
> crates/gammaloop-api/src/python.rs - python::GammaLoopAPI::get_run_history (line 3711)
1051.59 s
> crates/gammaloop-api/src/python.rs - python::GammaLoopAPI::new_python (line 2834)
1051.59 s
> crates/gammaloop-api/src/python.rs - python::GammaLoopAPI::run_command (line 3901)
1051.59 s
> crates/gammaloop-api/src/python.rs - python::PyHistogramAccumulator (line 871)
1051.59 s
> crates/gammaloop-api/src/python.rs - python::atom_to_canonical_string (line 128)
1051.59 s
> crates/gammaloop-api/src/python.rs - python::atom_to_dots (line 157)
1051.59 s
> crates/gammaloop-api/src/python.rs - python::evaluate_graph_overall_factor (line 95)
1051.59 s
>
1051.59 s
> test result: FAILED. 2 passed; 14 failed; 0 ignored; 0 measured; 0 filtered out; finished in 8.14s
1051.59 s
>
1051.59 s
> error : doctest failed, to rerun pass `-p gammaloop-api --doc`
1051.59 s
For full logs, run:
1051.59 s
nix log /nix/store/gfqf16jiri54v362qzgvkmdlmf27gab4-gammaloop-workspace-doctest-0.1.0.drv
1051.75 s
[0 built (1 failed ), 0.0 Run failed.