test packages.x86_64-linux.nix-ci-check-gammaloop-nextest-integration

Reproduce this run
Original Run
  1. 146.98 s gammaloop-nextest-integration> | dod2_bubble | rls.integrated | GL0 | pass | 0.0sigma | compatible within 2sigma | - |
  2. 146.98 s gammaloop-nextest-integration> +-------------+-----------------+---------+--------+----------+-----------------------------------------------------------------------------------------------------------------------+-------+
  3. 146.98 s gammaloop-nextest-integration> | dod2_bubble | mu_r.inspect | inspect | pass | - | best inspect relative delta 6.951e-1 >= 1000*accuracy 1.000e-7 (accuracy=1.000e-10, exponent=+0.0, seed=0, probes=10) | - |
  4. 146.98 s gammaloop-nextest-integration> +-------------+-----------------+---------+--------+----------+-----------------------------------------------------------------------------------------------------------------------+-------+
  5. 146.98 s gammaloop-nextest-integration> | dod2_bubble | target | - | pass | - | 2sigma | - |
  6. 146.98 s gammaloop-nextest-integration> +-------------+-----------------+---------+--------+----------+-----------------------------------------------------------------------------------------------------------------------+-------+
  7. 146.98 s gammaloop-nextest-integration> test dod2_bubble_uv ... FAILED
  8. 146.98 s gammaloop-nextest-integration>
  9. 146.98 s gammaloop-nextest-integration> failures:
  10. 146.98 s gammaloop-nextest-integration>
  11. 146.98 s gammaloop-nextest-integration> failures:
  12. 146.98 s gammaloop-nextest-integration> dod2_bubble_uv
  13. 146.98 s gammaloop-nextest-integration>
  14. 146.98 s gammaloop-nextest-integration> test result: FAILED. 0 passed; 1 failed; 0 ignored; 0 measured; 24 filtered out; finished in 50.14s
  15. 146.98 s gammaloop-nextest-integration> system-err
  16. 146.98 s gammaloop-nextest-integration> [2026-08-26 05:42:42.466] @gammaloop_api::se... INFO : Running command run generate
  17. 146.98 s gammaloop-nextest-integration> [2026-08-26 05:42:42.466] @gammaloop_api::se... INFO : Starting command block generate
  18. 146.98 s gammaloop-nextest-integration> [2026-08-26 05:42:42.466] @gammaloop_api::se... INFO : Running command import model scalars-default.json
  19. 146.98 s gammaloop-nextest-integration> [2026-08-26 05:42:42.467] @import::model INFO : Loading built-in JSON model scalars-default
  20. 146.98 s gammaloop-nextest-integration> [2026-08-26 05:42:42.470] @gammalooprs::model INFO : The following 2 external parameters were forced to zero by the restriction card:
  21. 146.98 s gammaloop-nextest-integration> width_scalar_1, width_scalar_2
  22. 146.98 s gammaloop-nextest-integration> [2026-08-26 05:42:42.471] @gammaloop_api::se... INFO : Running command remove processes
  23. 146.98 s gammaloop-nextest-integration> [2026-08-26 05:42:42.471] @gammaloop_api::se... INFO : Running command set global kv global.generation.uv.generate_integrated=true
  24. 146.98 s gammaloop-nextest-integration> [2026-08-26 05:42:42.471] @gammaloop_api::se... INFO : Running command import graphs ./tests/resources/graphs/scalar/dod2_bubble.dot -p bubble_dod2 -i scalar_bubble_below_thres
  25. 146.98 s gammaloop-nextest-integration> [2026-08-26 05:42:42.471] @commands::import INFO : Loading graphs from '/build/source/tests/resources/graphs/scalar/dod2_bubble.dot'
  26. 146.98 s gammaloop-nextest-integration> [2026-08-26 05:42:42.474] @gammaloop_api::se... INFO : Running command generate existing -p bubble_dod2 -i scalar_bubble_below_thres
  27. 146.98 s gammaloop-nextest-integration> [2026-08-26 05:42:42.476] @approx::local_4d [{#uv, #inspect, #integrated}] DEBUG : Rescaled momenta expanded
  28. 146.98 s gammaloop-nextest-integration> field value
  29. 146.98 s gammaloop-nextest-integration> res n-terms: 1, byte size: 3,expr:
  30. 146.98 s gammaloop-nextest-integration> 1
  31. 146.98 s gammaloop-nextest-integration> [2026-08-26 05:42:42.477] @approx::local_4d [{#uv, #inspect, #integrated}] DEBUG : Rescaled momenta expanded
  32. 146.98 s gammaloop-nextest-integration> field value
  33. 146.98 s gammaloop-nextest-integration> res n-terms: 1, byte size: 585,expr:
  34. 146.98 s gammaloop-nextest-integration> -SCALAR_COUPLING²·q₀(αᵉ².¹)·q₀(αᵉ³.¹)·q₂(αᵉ².¹)·q₂(αᵉ³.¹)
  35. 146.98 s gammaloop-nextest-integration> /(t²·denom(3,-q₀-q₂/t,mass_scalar_2²,-mass_scalar_2²+2·(q₀.q₂)/t+(q₂.q₂)/t²+(q₀.q₀))
  36. 146.98 s gammaloop-nextest-integration> ·denom(2,q₂/t,mass_scalar_2²,-mass_scalar_2²+(q₂.q₂)/t²))
  37. 146.98 s gammaloop-nextest-integration> [2026-08-26 05:42:42.478] @approx::final_integrand[{#generation, #profile, #uv, #graph, #summary}] DEBUG : Computed global numerator
  38. 146.98 s gammaloop-nextest-integration> field value
  39. 146.98 s gammaloop-nextest-integration> global_num n-terms: 1, byte size: 4,expr:
  40. 146.98 s gammaloop-nextest-integration> 1/2
  41. 146.98 s gammaloop-nextest-integration> span build_3d{span_context=true graph=GL0 current=subgraph=0, topo_order=0, dod=0}
  42. 146.98 s gammaloop-nextest-integration> [2026-08-26 05:42:42.480] @uv::approx [{#generation, #uv, #fourd}] DEBUG : Computing 4D
  43. 146.98 s gammaloop-nextest-integration> field value
  44. 146.98 s gammaloop-nextest-integration> simple subgraph(S_11,S_y)*Approx(subgraph(S_y,0)) of GL0
  45. 146.98 s gammaloop-nextest-integration> span compute_4d{span_context=true graph=GL0 current=subgraph=y, topo_order=1, dod=2 given=subgraph=0, topo_order=0, dod=0 reduced=SubSet { set: BitVec<usize, bitvec::order::Lsb0> { addr: 0x7fffec027530, head: 000000, bits: 6, capacity: 64 } [0, 0, 1, 1, 1, 1], id: PhantomData<linnet::half_edge::involution::Hedge> }}
  46. 146.98 s gammaloop-nextest-integration> [2026-08-26 05:42:42.481] @approx::local_4d [{#uv, #algebra, #integrated, #start}] DEBUG :
  47. 146.98 s gammaloop-nextest-integration> field value
  48. 146.98 s gammaloop-nextest-integration> integrand n-terms: 1, byte size: 409,expr:
  49. 146.98 s gammaloop-nextest-integration> SCALAR_COUPLING²·(q₀(αᵉ³.¹)+q₃(αᵉ³.¹))·q₀(αᵉ².¹)·q₀(αᵉ³.¹)·q₂(αᵉ².¹)
  50. 146.98 s gammaloop-nextest-integration> /(denom(2,q₂,mass_scalar_2²,-mass_scalar_2²+(q₂.q₂))·denom(3,q₃,mass_scalar_2²,-mass_scalar_2²+(q₃.q₃)))
  51. 146.98 s gammaloop-nextest-integration> reduced y
  52. 146.98 s gammaloop-nextest-integration> span grow{span_context=true current=subgraph=y, topo_order=1, dod=2 given=subgraph=0, topo_order=0, dod=0}
  53. 146.98 s gammaloop-nextest-integration> [2026-08-26 05:42:42.481] @approx::local_4d [{#uv, #inspect, #integrated}] DEBUG : Rescaled momenta expanded
  54. 146.98 s gammaloop-nextest-integration> field value
  55. 146.98 s gammaloop-nextest-integration> res n-terms: 1, byte size: 585,expr:
  56. 146.98 s gammaloop-nextest-integration> -SCALAR_COUPLING²·q₀(αᵉ².¹)·q₀(αᵉ³.¹)·q₂(αᵉ².¹)·q₂(αᵉ³.¹)
  57. 146.98 s gammaloop-nextest-integration> /(t²·denom(3,-q₀-q₂/t,mass_scalar_2²,-mass_scalar_2²+2·(q₀.q₂)/t+(q₂.q₂)/t²+(q₀.q₀))
  58. 146.98 s gammaloop-nextest-integration> ·denom(2,q₂/t,mass_scalar_2²,-mass_scalar_2²+(q₂.q₂)/t²))
  59. 146.98 s gammaloop-nextest-integration> span t{span_context=true current=subgraph=y, topo_order=1, dod=2 given=subgraph=0, topo_order=0, dod=0}
  60. 146.98 s gammaloop-nextest-integration> [2026-08-26 05:42:42.502] @approx::local_4d [{#uv, #integrated, #rescaled}] DEBUG : Rescaled expanded
  61. 146.98 s gammaloop-nextest-integration> field value
  62. 146.98 s gammaloop-nextest-integration> n_loops 1
  63. 146.98 s gammaloop-nextest-integration> res n-terms: 1, byte size: 707,expr:
  64. 146.98 s gammaloop-nextest-integration> -SCALAR_COUPLING²·q₀(αᵉ².¹)·q₀(αᵉ³.¹)·q₂(αᵉ².¹)·q₂(αᵉ³.¹)
  65. 146.98 s gammaloop-nextest-integration> /(t²·denom(3,-q₂,mUVexp²+t²·mass_scalar_2²,-mUV²+t²·(-mass_scalar_2²+2·(q₀.q₂)/t+(q₂.q₂)/t²+(q₀.q₀))+t²·mUVexp²)
  66. 146.98 s gammaloop-nextest-integration> ·denom(2,q₂,mUVexp²+t²·mass_scalar_2²,-mUV²+t²·(-mass_scalar_2²+(q₂.q₂)/t²)+t²·mUVexp²))
  67. 146.98 s gammaloop-nextest-integration> span t{span_context=true current=subgraph=y, topo_order=1, dod=2 given=subgraph=0, topo_order=0, dod=0}
  68. 146.98 s gammaloop-nextest-integration> [2026-08-26 05:42:42.503] @approx::local_4d [{#uv, #integrated, #series}] DEBUG : Series expanded
  69. 146.98 s gammaloop-nextest-integration> field value
  70. 146.98 s gammaloop-nextest-integration> res n-terms: 3, byte size: 1896,expr:
  71. 146.98 s gammaloop-nextest-integration> (1/2·SCALAR_COUPLING²·(2·mUVexp²-2·mass_scalar_2²)/(denom(2,q₂,mUVexp²,-mUV²+(q₂.q₂))²·denom(3,-q₂,mUVexp²,-mUV²+(q₂.q₂)))
  72. 146.98 s gammaloop-nextest-integration> -SCALAR_COUPLING²
  73. 146.98 s gammaloop-nextest-integration> ·(-1/2·(2·mUVexp²-2·mass_scalar_2²+2·(q₀.q₀))/denom(3,-q₂,mUVexp²,-mUV²+(q₂.q₂))
  74. 146.98 s gammaloop-nextest-integration> +4·(q₀.q₂)²/denom(3,-q₂,mUVexp²,-mUV²+(q₂.q₂))²
  75. 146.98 s gammaloop-nextest-integration> )/(denom(2,q₂,mUVexp²,-mUV²+(q₂.q₂))·denom(3,-q₂,mUVexp²,-mUV²+(q₂.q₂)))
  76. 146.98 s gammaloop-nextest-integration> )·q₀(αᵉ².¹)·q₀(αᵉ³.¹)·q₂(αᵉ².¹)·q₂(αᵉ³.¹)
  77. 146.98 s gammaloop-nextest-integration> +2·SCALAR_COUPLING²·(q₀.q₂)·q₀(αᵉ².¹)·q₀(αᵉ³.¹)·q₂(αᵉ².¹)·q₂(αᵉ³.¹)
  78. 146.98 s gammaloop-nextest-integration> /(t·denom(2,q₂,mUVexp²,-mUV²+(q₂.q₂))·denom(3,-q₂,mUVexp²,-mUV²+(q₂.q₂))²)
  79. 146.98 s gammaloop-nextest-integration> -SCALAR_COUPLING²·q₀(αᵉ².¹)·q₀(αᵉ³.¹)·q₂(αᵉ².¹)·q₂(αᵉ³.¹)
  80. 146.98 s gammaloop-nextest-integration> /(t²·denom(2,q₂,mUVexp²,-mUV²+(q₂.q₂))·denom(3,-q₂,mUVexp²,-mUV²+(q₂.q₂)))
  81. 146.98 s gammaloop-nextest-integration> span t{span_context=true current=subgraph=y, topo_order=1, dod=2 given=subgraph=0, topo_order=0, dod=0}
  82. 146.98 s gammaloop-nextest-integration> [2026-08-26 05:42:42.504] @approx::local_4d [{#uv, #integrated, #series}] DEBUG : Evaluated at t = 1
  83. 146.98 s gammaloop-nextest-integration> field value
  84. 146.98 s gammaloop-nextest-integration> res n-terms: 3, byte size: 1880,expr:
  85. 146.98 s gammaloop-nextest-integration> (1/2·SCALAR_COUPLING²·(2·mUVexp²-2·mass_scalar_2²)/(denom(2,q₂,mUVexp²,-mUV²+(q₂.q₂))²·denom(3,-q₂,mUVexp²,-mUV²+(q₂.q₂)))
  86. 146.98 s gammaloop-nextest-integration> -SCALAR_COUPLING²
  87. 146.98 s gammaloop-nextest-integration> ·(-1/2·(2·mUVexp²-2·mass_scalar_2²+2·(q₀.q₀))/denom(3,-q₂,mUVexp²,-mUV²+(q₂.q₂))
  88. 146.98 s gammaloop-nextest-integration> +4·(q₀.q₂)²/denom(3,-q₂,mUVexp²,-mUV²+(q₂.q₂))²
  89. 146.98 s gammaloop-nextest-integration> )/(denom(2,q₂,mUVexp²,-mUV²+(q₂.q₂))·denom(3,-q₂,mUVexp²,-mUV²+(q₂.q₂)))
  90. 146.98 s gammaloop-nextest-integration> )·q₀(αᵉ².¹)·q₀(αᵉ³.¹)·q₂(αᵉ².¹)·q₂(αᵉ³.¹)
  91. 146.98 s gammaloop-nextest-integration> -SCALAR_COUPLING²·q₀(αᵉ².¹)·q₀(αᵉ³.¹)·q₂(αᵉ².¹)·q₂(αᵉ³.¹)
  92. 146.98 s gammaloop-nextest-integration> /(denom(2,q₂,mUVexp²,-mUV²+(q₂.q₂))·denom(3,-q₂,mUVexp²,-mUV²+(q₂.q₂)))
  93. 146.98 s gammaloop-nextest-integration> +2·SCALAR_COUPLING²·(q₀.q₂)·q₀(αᵉ².¹)·q₀(αᵉ³.¹)·q₂(αᵉ².¹)·q₂(αᵉ³.¹)
  94. 146.98 s gammaloop-nextest-integration> /(denom(2,q₂,mUVexp²,-mUV²+(q₂.q₂))·denom(3,-q₂,mUVexp²,-mUV²+(q₂.q₂))²)
  95. 146.98 s gammaloop-nextest-integration> span t{span_context=true current=subgraph=y, topo_order=1, dod=2 given=subgraph=0, topo_order=0, dod=0}
  96. 146.98 s gammaloop-nextest-integration> [2026-08-26 05:42:42.505] @approx::local_4d [{#uv, #collect, #integrated}] DEBUG : After gamma chain collection
  97. 146.98 s gammaloop-nextest-integration> field value
  98. 146.98 s gammaloop-nextest-integration> expr n-terms: 3, byte size: 1880,expr:
  99. 146.98 s gammaloop-nextest-integration> (1/2·SCALAR_COUPLING²·(2·mUVexp²-2·mass_scalar_2²)/(denom(2,q₂,mUVexp²,-mUV²+(q₂.q₂))²·denom(3,-q₂,mUVexp²,-mUV²+(q₂.q₂)))
  100. 146.98 s gammaloop-nextest-integration> -SCALAR_COUPLING²
  101. 146.98 s gammaloop-nextest-integration> ·(-1/2·(2·mUVexp²-2·mass_scalar_2²+2·(q₀.q₀))/denom(3,-q₂,mUVexp²,-mUV²+(q₂.q₂))
  102. 146.98 s gammaloop-nextest-integration> +4·(q₀.q₂)²/denom(3,-q₂,mUVexp²,-mUV²+(q₂.q₂))²
  103. 146.98 s gammaloop-nextest-integration> )/(denom(2,q₂,mUVexp²,-mUV²+(q₂.q₂))·denom(3,-q₂,mUVexp²,-mUV²+(q₂.q₂)))
  104. 146.98 s gammaloop-nextest-integration> )·q₀(αᵉ².¹)·q₀(αᵉ³.¹)·q₂(αᵉ².¹)·q₂(αᵉ³.¹)
  105. 146.98 s gammaloop-nextest-integration> -SCALAR_COUPLING²·q₀(αᵉ².¹)·q₀(αᵉ³.¹)·q₂(αᵉ².¹)·q₂(αᵉ³.¹)
  106. 146.98 s gammaloop-nextest-integration> /(denom(2,q₂,mUVexp²,-mUV²+(q₂.q₂))·denom(3,-q₂,mUVexp²,-mUV²+(q₂.q₂)))
  107. 146.98 s gammaloop-nextest-integration> +2·SCALAR_COUPLING²·(q₀.q₂)·q₀(αᵉ².¹)·q₀(αᵉ³.¹)·q₂(αᵉ².¹)·q₂(αᵉ³.¹)
  108. 146.98 s gammaloop-nextest-integration> /(denom(2,q₂,mUVexp²,-mUV²+(q₂.q₂))·denom(3,-q₂,mUVexp²,-mUV²+(q₂.q₂))²)
  109. 146.98 s gammaloop-nextest-integration> span t{span_context=true current=subgraph=y, topo_order=1, dod=2 given=subgraph=0, topo_order=0, dod=0}
  110. 146.98 s gammaloop-nextest-integration> [2026-08-26 05:42:42.506] @approx::local_4d [{#profile, #uv, #collect, #integrated, #start, #trace}] DEBUG : After gamma schoonschip
  111. 146.98 s gammaloop-nextest-integration> field value
  112. 146.98 s gammaloop-nextest-integration> expr n-terms: 3, byte size: 1631,expr:
  113. 146.98 s gammaloop-nextest-integration> (1/2·SCALAR_COUPLING²·(2·mUVexp²-2·mass_scalar_2²)/(denom(2,q₂,mUVexp²,-mUV²+(q₂.q₂))²·denom(3,-q₂,mUVexp²,-mUV²+(q₂.q₂)))
  114. 146.98 s gammaloop-nextest-integration> -SCALAR_COUPLING²
  115. 146.98 s gammaloop-nextest-integration> ·(-1/2·(2·mUVexp²-2·mass_scalar_2²+2·(q₀.q₀))/denom(3,-q₂,mUVexp²,-mUV²+(q₂.q₂))
  116. 146.98 s gammaloop-nextest-integration> +4·(q₀.q₂)²/denom(3,-q₂,mUVexp²,-mUV²+(q₂.q₂))²
  117. 146.98 s gammaloop-nextest-integration> )/(denom(2,q₂,mUVexp²,-mUV²+(q₂.q₂))·denom(3,-q₂,mUVexp²,-mUV²+(q₂.q₂)))
  118. 146.98 s gammaloop-nextest-integration> )·(q₀.q₂)²
  119. 146.98 s gammaloop-nextest-integration> -SCALAR_COUPLING²·(q₀.q₂)²/(denom(2,q₂,mUVexp²,-mUV²+(q₂.q₂))·denom(3,-q₂,mUVexp²,-mUV²+(q₂.q₂)))
  120. 146.98 s gammaloop-nextest-integration> +2·SCALAR_COUPLING²·(q₀.q₂)·(q₀.q₂)²
  121. 146.98 s gammaloop-nextest-integration> /(denom(2,q₂,mUVexp²,-mUV²+(q₂.q₂))·denom(3,-q₂,mUVexp²,-mUV²+(q₂.q₂))²)
  122. 146.98 s gammaloop-nextest-integration> span t{span_context=true current=subgraph=y, topo_order=1, dod=2 given=subgraph=0, topo_order=0, dod=0}
  123. 146.98 s gammaloop-nextest-integration> [2026-08-26 05:42:42.507] @approx::local_4d [{#profile, #uv, #collect, #integrated, #start, #trace}] DEBUG : After gamma collection
  124. 146.98 s gammaloop-nextest-integration> field value
  125. 146.98 s gammaloop-nextest-integration> expr n-terms: 1, byte size: 1347,expr:
  126. 146.98 s gammaloop-nextest-integration> SCALAR_COUPLING²
  127. 146.98 s gammaloop-nextest-integration> ·(-denom(2,q₂,mUVexp²,-mUV²+(q₂.q₂))·denom(3,-q₂,mUVexp²,-mUV²+(q₂.q₂))²
  128. 146.98 s gammaloop-nextest-integration> +1/2·(2·mUVexp²-2·mass_scalar_2²)·denom(3,-q₂,mUVexp²,-mUV²+(q₂.q₂))²
  129. 146.98 s gammaloop-nextest-integration> -(-1/2·(2·mUVexp²-2·mass_scalar_2²+2·(q₀.q₀))·denom(3,-q₂,mUVexp²,-mUV²+(q₂.q₂))+4·(q₀.q₂)²)
  130. 146.98 s gammaloop-nextest-integration> ·denom(2,q₂,mUVexp²,-mUV²+(q₂.q₂))
  131. 146.98 s gammaloop-nextest-integration> +2·(q₀.q₂)·denom(2,q₂,mUVexp²,-mUV²+(q₂.q₂))·denom(3,-q₂,mUVexp²,-mUV²+(q₂.q₂))
  132. 146.98 s gammaloop-nextest-integration> )·(q₀.q₂)²/(denom(2,q₂,mUVexp²,-mUV²+(q₂.q₂))²·denom(3,-q₂,mUVexp²,-mUV²+(q₂.q₂))³)
  133. 146.98 s gammaloop-nextest-integration> span t{span_context=true current=subgraph=y, topo_order=1, dod=2 given=subgraph=0, topo_order=0, dod=0}
  134. 146.98 s gammaloop-nextest-integration> [2026-08-26 05:42:42.508] @approx::local_4d [{#profile, #uv, #gamma, #integrated, #start, #trace, #vakint}] DEBUG : After gamma simplification
  135. 146.98 s gammaloop-nextest-integration> ... omitted 3263 more lines; see full nextest output above
  136. 146.98 s gammaloop-nextest-integration>
  137. 146.98 s gammaloop-nextest-integration> 8. gammaloop-integration-tests::uv::sunrise_scalar_1_uv
  138. 146.98 s gammaloop-nextest-integration> failure: test failure with exit code 101
  139. 146.98 s gammaloop-nextest-integration> system-out
  140. 146.98 s gammaloop-nextest-integration> running 1 test
  141. 146.98 s gammaloop-nextest-integration> test sunrise_scalar_1_uv has been running for over 60 seconds
  142. 146.98 s gammaloop-nextest-integration> +------------------+------------------------+--------------+--------+----------+----------------------------------------------------------------------------------------------------------------------+-------+
  143. 146.98 s gammaloop-nextest-integration> | case | check | graph | status | sigma | threshold | error |
  144. 146.98 s gammaloop-nextest-integration> +------------------+------------------------+--------------+--------+----------+----------------------------------------------------------------------------------------------------------------------+-------+
  145. 146.98 s gammaloop-nextest-integration> | sunrise_scalar_1 | uv_profile | - | FAIL | - | - | - |
  146. 146.98 s gammaloop-nextest-integration> +------------------+------------------------+--------------+--------+----------+----------------------------------------------------------------------------------------------------------------------+-------+
  147. 146.98 s gammaloop-nextest-integration> | sunrise_scalar_1 | m_uv.inspect | inspect | pass | - | best inspect relative delta 1.624e0 >= 1000*accuracy 1.000e-3 (accuracy=1.000e-6, exponent=+1.0, seed=1, probes=10) | - |
  148. 146.98 s gammaloop-nextest-integration> +------------------+------------------------+--------------+--------+----------+----------------------------------------------------------------------------------------------------------------------+-------+
  149. 146.98 s gammaloop-nextest-integration> | sunrise_scalar_1 | m_uv.integrated | sunrise | pass | 0.1sigma | compatible within 2sigma | - |
  150. 146.98 s gammaloop-nextest-integration> +------------------+------------------------+--------------+--------+----------+----------------------------------------------------------------------------------------------------------------------+-------+
  151. 146.98 s gammaloop-nextest-integration> | sunrise_scalar_1 | rls.inspect | inspect | pass | - | best inspect relative delta 8.682e-1 >= 1000*accuracy 1.000e-3 (accuracy=1.000e-6, exponent=+1.0, seed=1, probes=10) | - |
  152. 146.98 s gammaloop-nextest-integration> +------------------+------------------------+--------------+--------+----------+----------------------------------------------------------------------------------------------------------------------+-------+
  153. 146.98 s gammaloop-nextest-integration> | sunrise_scalar_1 | rls.integrated | sunrise | pass | 0.0sigma | compatible within 2sigma | - |
  154. 146.98 s gammaloop-nextest-integration> +------------------+------------------------+--------------+--------+----------+----------------------------------------------------------------------------------------------------------------------+-------+
  155. 146.98 s gammaloop-nextest-integration> | sunrise_scalar_1 | mu_r.inspect | inspect | pass | - | best inspect relative delta 1.752e0 >= 1000*accuracy 1.000e-3 (accuracy=1.000e-6, exponent=+1.0, seed=1, probes=10) | - |
  156. 146.98 s gammaloop-nextest-integration> +------------------+------------------------+--------------+--------+----------+----------------------------------------------------------------------------------------------------------------------+-------+
  157. 146.98 s gammaloop-nextest-integration> | sunrise_scalar_1 | integrated.relerr | integrated | pass | - | relative error 9.20% <= 10.00% | - |
  158. 146.98 s gammaloop-nextest-integration> +------------------+------------------------+--------------+--------+----------+----------------------------------------------------------------------------------------------------------------------+-------+
  159. 146.98 s gammaloop-nextest-integration> | sunrise_scalar_1 | m_uv.integrated.relerr | m_uv-shifted | pass | - | relative error 5.89% <= 10.00% | - |
  160. 146.98 s gammaloop-nextest-integration> +------------------+------------------------+--------------+--------+----------+----------------------------------------------------------------------------------------------------------------------+-------+
  161. 146.98 s gammaloop-nextest-integration> | sunrise_scalar_1 | target | - | pass | - | 2sigma | - |
  162. 146.98 s gammaloop-nextest-integration> +------------------+------------------------+--------------+--------+----------+----------------------------------------------------------------------------------------------------------------------+-------+
  163. 146.98 s gammaloop-nextest-integration> test sunrise_scalar_1_uv ... FAILED
  164. 146.98 s gammaloop-nextest-integration>
  165. 146.98 s gammaloop-nextest-integration> failures:
  166. 146.98 s gammaloop-nextest-integration>
  167. 146.98 s gammaloop-nextest-integration> failures:
  168. 146.98 s gammaloop-nextest-integration> sunrise_scalar_1_uv
  169. 146.98 s gammaloop-nextest-integration>
  170. 146.98 s gammaloop-nextest-integration> test result: FAILED. 0 passed; 1 failed; 0 ignored; 0 measured; 24 filtered out; finished in 97.64s
  171. 146.98 s gammaloop-nextest-integration> system-err
  172. 146.98 s gammaloop-nextest-integration> [2026-08-26 05:42:55.207] @gammaloop_api::se... INFO : Running command run generate
  173. 146.98 s gammaloop-nextest-integration> [2026-08-26 05:42:55.207] @gammaloop_api::se... INFO : Starting command block generate
  174. 146.98 s gammaloop-nextest-integration> [2026-08-26 05:42:55.207] @gammaloop_api::se... INFO : Running command import model scalars-default.json
  175. 146.98 s gammaloop-nextest-integration> [2026-08-26 05:42:55.210] @import::model INFO : Loading built-in JSON model scalars-default
  176. 146.98 s gammaloop-nextest-integration> [2026-08-26 05:42:55.239] @gammalooprs::model INFO : The following 2 external parameters were forced to zero by the restriction card:
  177. 146.98 s gammaloop-nextest-integration> width_scalar_1, width_scalar_2
  178. 146.98 s gammaloop-nextest-integration> [2026-08-26 05:42:55.249] @gammaloop_api::se... INFO : Running command remove processes
  179. 146.98 s gammaloop-nextest-integration> [2026-08-26 05:42:55.254] @gammaloop_api::se... INFO : Running command set global kv global.generation.uv.generate_integrated=true
  180. 146.98 s gammaloop-nextest-integration> [2026-08-26 05:42:55.257] @gammaloop_api::se... INFO : Running command import graphs ./tests/resources/graphs/scalar_sunrise.dot -p sunrise_scalar_1 -i scalar_sunrise
  181. 146.98 s gammaloop-nextest-integration> [2026-08-26 05:42:55.261] @commands::import INFO : Loading graphs from '/build/source/tests/resources/graphs/scalar_sunrise.dot'
  182. 146.98 s gammaloop-nextest-integration> [2026-08-26 05:42:55.279] @gammaloop_api::se... INFO : Running command generate existing -p sunrise_scalar_1 -i scalar_sunrise
  183. 146.98 s gammaloop-nextest-integration> [2026-08-26 05:42:55.312] @approx::local_4d [{#uv, #inspect, #integrated}] DEBUG : Rescaled momenta expanded
  184. 146.98 s gammaloop-nextest-integration> field value
  185. 146.98 s gammaloop-nextest-integration> res n-terms: 1, byte size: 611,expr:
  186. 146.98 s gammaloop-nextest-integration> 1/(denom(1,q₁/t,mass_scalar_1²,-mass_scalar_1²+(q₁.q₁)/t²)
  187. 146.98 s gammaloop-nextest-integration> ·denom(2,-q₀+q₃-q₁/t,mass_scalar_1²,
  188. 146.98 s gammaloop-nextest-integration> -mass_scalar_1²+2·(q₀.q₁)/t-2·(q₁.q₃)/t+(q₁.q₁)/t²+(q₀.q₀)
  189. 146.98 s gammaloop-nextest-integration> -2·(q₀.q₃)+(q₃.q₃)
  190. 146.98 s gammaloop-nextest-integration> ))
  191. 146.98 s gammaloop-nextest-integration> [2026-08-26 05:42:55.313] @approx::local_4d [{#uv, #inspect, #integrated}] DEBUG : Rescaled momenta expanded
  192. 146.98 s gammaloop-nextest-integration> field value
  193. 146.98 s gammaloop-nextest-integration> res n-terms: 1, byte size: 777,expr:
  194. 146.98 s gammaloop-nextest-integration> 1/(denom(0,q₀/t,mass_scalar_1²,-mass_scalar_1²+(q₀.q₀)/t²)·denom(1,q₁/t,mass_scalar_1²,-mass_scalar_1²+(q₁.q₁)/t²)
  195. 146.98 s gammaloop-nextest-integration> ·denom(2,q₄-q₀/t-q₁/t,mass_scalar_1²,
  196. 146.98 s gammaloop-nextest-integration> -mass_scalar_1²-2·(q₀.q₄)/t-2·(q₁.q₄)/t+(q₀.q₀)/t²+2·(q₀.q₁)/t²
  197. 146.98 s gammaloop-nextest-integration> +(q₁.q₁)/t²+(q₄.q₄)
  198. 146.98 s gammaloop-nextest-integration> ))
  199. 146.98 s gammaloop-nextest-integration> [2026-08-26 05:42:55.319] @approx::local_4d [{#uv, #inspect, #integrated}] DEBUG : Rescaled momenta expanded
  200. 146.98 s gammaloop-nextest-integration> field value
  201. 146.98 s gammaloop-nextest-integration> res n-terms: 1, byte size: 611,expr:
  202. 146.98 s gammaloop-nextest-integration> 1/(denom(0,q₀/t,mass_scalar_1²,-mass_scalar_1²+(q₀.q₀)/t²)
  203. 146.98 s gammaloop-nextest-integration> ·denom(2,-q₁+q₃-q₀/t,mass_scalar_1²,
  204. 146.98 s gammaloop-nextest-integration> -mass_scalar_1²+2·(q₀.q₁)/t-2·(q₀.q₃)/t+(q₀.q₀)/t²+(q₁.q₁)
  205. 146.98 s gammaloop-nextest-integration> -2·(q₁.q₃)+(q₃.q₃)
  206. 146.98 s gammaloop-nextest-integration> ))
  207. 146.98 s gammaloop-nextest-integration> [2026-08-26 05:42:55.320] @approx::local_4d [{#uv, #inspect, #integrated}] DEBUG : Rescaled momenta expanded
  208. 146.98 s gammaloop-nextest-integration> field value
  209. 146.98 s gammaloop-nextest-integration> res n-terms: 1, byte size: 611,expr:
  210. 146.98 s gammaloop-nextest-integration> 1/(denom(0,q₀/t,mass_scalar_1²,-mass_scalar_1²+(q₀.q₀)/t²)
  211. 146.98 s gammaloop-nextest-integration> ·denom(1,-q₂+q₃-q₀/t,mass_scalar_1²,
  212. 146.98 s gammaloop-nextest-integration> -mass_scalar_1²+2·(q₀.q₂)/t-2·(q₀.q₃)/t+(q₀.q₀)/t²+(q₂.q₂)
  213. 146.98 s gammaloop-nextest-integration> -2·(q₂.q₃)+(q₃.q₃)
  214. 146.98 s gammaloop-nextest-integration> ))
  215. 146.98 s gammaloop-nextest-integration> [2026-08-26 05:42:55.323] @approx::local_4d [{#uv, #inspect, #integrated}] DEBUG : Rescaled momenta expanded
  216. 146.98 s gammaloop-nextest-integration> field value
  217. 146.98 s gammaloop-nextest-integration> res n-terms: 1, byte size: 3,expr:
  218. 146.98 s gammaloop-nextest-integration> 1
  219. 146.98 s gammaloop-nextest-integration> [2026-08-26 05:42:55.324] @approx::final_integrand[{#generation, #profile, #uv, #graph, #summary}] DEBUG : Computed global numerator
  220. 146.98 s gammaloop-nextest-integration> field value
  221. 146.98 s gammaloop-nextest-integration> global_num n-terms: 1, byte size: 3,expr:
  222. 146.98 s gammaloop-nextest-integration> 1
  223. 146.98 s gammaloop-nextest-integration> span build_3d{span_context=true graph=sunrise current=subgraph=0, topo_order=0, dod=0}
  224. 146.98 s gammaloop-nextest-integration> [2026-08-26 05:42:55.325] @uv::approx [{#generation, #uv, #fourd}] DEBUG : Computing 4D
  225. 146.98 s gammaloop-nextest-integration> field value
  226. 146.98 s gammaloop-nextest-integration> simple subgraph(S_47,S_3s)*Approx(subgraph(S_3s,0)) of sunrise
  227. 146.98 s gammaloop-nextest-integration> span compute_4d{span_context=true graph=sunrise current=subgraph=3s, topo_order=1, dod=0 given=subgraph=0, topo_order=0, dod=0 reduced=SubSet { set: BitVec<usize, bitvec::order::Lsb0> { addr: 0x7fffb400a8f0, head: 000000, bits: 8, capacity: 64 } [0, 0, 0, 0, 1, 1, 1, 1], id: PhantomData<linnet::half_edge::involution::Hedge> }}
  228. 146.98 s gammaloop-nextest-integration> [2026-08-26 05:42:55.326] @approx::local_4d [{#uv, #algebra, #integrated, #start}] DEBUG :
  229. 146.98 s gammaloop-nextest-integration> field value
  230. 146.98 s gammaloop-nextest-integration> integrand n-terms: 1, byte size: 217,expr:
  231. 146.98 s gammaloop-nextest-integration> 1/(denom(1,q₁,mass_scalar_1²,-mass_scalar_1²+(q₁.q₁))·denom(2,q₂,mass_scalar_1²,-mass_scalar_1²+(q₂.q₂)))
  232. 146.98 s gammaloop-nextest-integration> reduced 3s
  233. 146.98 s gammaloop-nextest-integration> span grow{span_context=true current=subgraph=3s, topo_order=1, dod=0 given=subgraph=0, topo_order=0, dod=0}
  234. 146.98 s gammaloop-nextest-integration> [2026-08-26 05:42:55.326] @approx::local_4d [{#uv, #inspect, #integrated}] DEBUG : Rescaled momenta expanded
  235. 146.98 s gammaloop-nextest-integration> field value
  236. 146.98 s gammaloop-nextest-integration> res n-terms: 1, byte size: 611,expr:
  237. 146.98 s gammaloop-nextest-integration> 1/(denom(1,q₁/t,mass_scalar_1²,-mass_scalar_1²+(q₁.q₁)/t²)
  238. 146.98 s gammaloop-nextest-integration> ·denom(2,-q₀+q₃-q₁/t,mass_scalar_1²,
  239. 146.98 s gammaloop-nextest-integration> -mass_scalar_1²+2·(q₀.q₁)/t-2·(q₁.q₃)/t+(q₁.q₁)/t²+(q₀.q₀)
  240. 146.98 s gammaloop-nextest-integration> -2·(q₀.q₃)+(q₃.q₃)
  241. 146.98 s gammaloop-nextest-integration> ))
  242. 146.98 s gammaloop-nextest-integration> span t{span_context=true current=subgraph=3s, topo_order=1, dod=0 given=subgraph=0, topo_order=0, dod=0}
  243. 146.98 s gammaloop-nextest-integration> [2026-08-26 05:42:55.329] @approx::local_4d [{#uv, #integrated, #rescaled}] DEBUG : Rescaled expanded
  244. 146.98 s gammaloop-nextest-integration> field value
  245. 146.98 s gammaloop-nextest-integration> n_loops 1
  246. 146.98 s gammaloop-nextest-integration> res n-terms: 1, byte size: 723,expr:
  247. 146.98 s gammaloop-nextest-integration> 1/(denom(1,q₁,mUVexp²+t²·mass_scalar_1²,-mUV²+t²·(-mass_scalar_1²+(q₁.q₁)/t²)+t²·mUVexp²)
  248. 146.98 s gammaloop-nextest-integration> ·denom(2,-q₁,mUVexp²+t²·mass_scalar_1²,
  249. 146.98 s gammaloop-nextest-integration> -mUV²
  250. 146.98 s gammaloop-nextest-integration> +t²
  251. 146.98 s gammaloop-nextest-integration> ·(-mass_scalar_1²+2·(q₀.q₁)/t-2·(q₁.q₃)/t+(q₁.q₁)/t²+(q₀.q₀)
  252. 146.98 s gammaloop-nextest-integration> -2·(q₀.q₃)+(q₃.q₃)
  253. 146.98 s gammaloop-nextest-integration> )
  254. 146.98 s gammaloop-nextest-integration> +t²·mUVexp²
  255. 146.98 s gammaloop-nextest-integration> ))
  256. 146.98 s gammaloop-nextest-integration> span t{span_context=true current=subgraph=3s, topo_order=1, dod=0 given=subgraph=0, topo_order=0, dod=0}
  257. 146.98 s gammaloop-nextest-integration> [2026-08-26 05:42:55.330] @approx::local_4d [{#uv, #integrated, #series}] DEBUG : Series expanded
  258. 146.98 s gammaloop-nextest-integration> field value
  259. 146.98 s gammaloop-nextest-integration> res n-terms: 1, byte size: 223,expr:
  260. 146.98 s gammaloop-nextest-integration> 1/(denom(1,q₁,mUVexp²,-mUV²+(q₁.q₁))·denom(2,-q₁,mUVexp²,-mUV²+(q₁.q₁)))
  261. 146.98 s gammaloop-nextest-integration> span t{span_context=true current=subgraph=3s, topo_order=1, dod=0 given=subgraph=0, topo_order=0, dod=0}
  262. 146.98 s gammaloop-nextest-integration> [2026-08-26 05:42:55.330] @approx::local_4d [{#uv, #integrated, #series}] DEBUG : Evaluated at t = 1
  263. 146.98 s gammaloop-nextest-integration> field value
  264. 146.98 s gammaloop-nextest-integration> res n-terms: 1, byte size: 223,expr:
  265. 146.98 s gammaloop-nextest-integration> 1/(denom(1,q₁,mUVexp²,-mUV²+(q₁.q₁))·denom(2,-q₁,mUVexp²,-mUV²+(q₁.q₁)))
  266. 146.98 s gammaloop-nextest-integration> span t{span_context=true current=subgraph=3s, topo_order=1, dod=0 given=subgraph=0, topo_order=0, dod=0}
  267. 146.98 s gammaloop-nextest-integration> [2026-08-26 05:42:55.330] @approx::local_4d [{#uv, #collect, #integrated}] DEBUG : After gamma chain collection
  268. 146.98 s gammaloop-nextest-integration> field value
  269. 146.98 s gammaloop-nextest-integration> expr n-terms: 1, byte size: 223,expr:
  270. 146.98 s gammaloop-nextest-integration> 1/(denom(1,q₁,mUVexp²,-mUV²+(q₁.q₁))·denom(2,-q₁,mUVexp²,-mUV²+(q₁.q₁)))
  271. 146.98 s gammaloop-nextest-integration> span t{span_context=true current=subgraph=3s, topo_order=1, dod=0 given=subgraph=0, topo_order=0, dod=0}
  272. 146.98 s gammaloop-nextest-integration> [2026-08-26 05:42:55.330] @approx::local_4d [{#profile, #uv, #collect, #integrated, #start, #trace}] DEBUG : After gamma schoonschip
  273. 146.98 s gammaloop-nextest-integration> field value
  274. 146.98 s gammaloop-nextest-integration> expr n-terms: 1, byte size: 223,expr:
  275. 146.98 s gammaloop-nextest-integration> 1/(denom(1,q₁,mUVexp²,-mUV²+(q₁.q₁))·denom(2,-q₁,mUVexp²,-mUV²+(q₁.q₁)))
  276. 146.98 s gammaloop-nextest-integration> span t{span_context=true current=subgraph=3s, topo_order=1, dod=0 given=subgraph=0, topo_order=0, dod=0}
  277. 146.98 s gammaloop-nextest-integration> [2026-08-26 05:42:55.330] @approx::local_4d [{#profile, #uv, #collect, #integrated, #start, #trace}] DEBUG : After gamma collection
  278. 146.98 s gammaloop-nextest-integration> field value
  279. 146.98 s gammaloop-nextest-integration> expr n-terms: 1, byte size: 223,expr:
  280. 146.98 s gammaloop-nextest-integration> 1/(denom(1,q₁,mUVexp²,-mUV²+(q₁.q₁))·denom(2,-q₁,mUVexp²,-mUV²+(q₁.q₁)))
  281. 146.98 s gammaloop-nextest-integration> span t{span_context=true current=subgraph=3s, topo_order=1, dod=0 given=subgraph=0, topo_order=0, dod=0}
  282. 146.98 s gammaloop-nextest-integration> [2026-08-26 05:42:55.331] @approx::local_4d [{#profile, #uv, #gamma, #integrated, #start, #trace, #vakint}] DEBUG : After gamma simplification
  283. 146.98 s gammaloop-nextest-integration> field value
  284. 146.98 s gammaloop-nextest-integration> expr n-terms: 1, byte size: 223,expr:
  285. 146.98 s gammaloop-nextest-integration> 1/(denom(1,q₁,mUVexp²,-mUV²+(q₁.q₁))·denom(2,-q₁,mUVexp²,-mUV²+(q₁.q₁)))
  286. 146.98 s gammaloop-nextest-integration> span t{span_context=true current=subgraph=3s, topo_order=1, dod=0 given=subgraph=0, topo_order=0, dod=0}
  287. 146.98 s gammaloop-nextest-integration> [2026-08-26 05:42:55.331] @approx::local_4d [{#profile, #uv, #integrated, #schoonschip, #start, #trace, #vakint}] DEBUG : After Schoonschip net
  288. 146.98 s gammaloop-nextest-integration> field value
  289. 146.98 s gammaloop-nextest-integration> expr n-terms: 1, byte size: 223,expr:
  290. 146.98 s gammaloop-nextest-integration> 1/(denom(1,q₁,mUVexp²,-mUV²+(q₁.q₁))·denom(2,-q₁,mUVexp²,-mUV²+(q₁.q₁)))
  291. 146.98 s gammaloop-nextest-integration> ... omitted 20090 more lines; see full nextest output above
  292. 146.98 s gammaloop-nextest-integration>
  293. 146.98 s gammaloop-nextest-integration> 9. gammaloop-integration-tests::uv::se1l_uv
  294. 146.98 s gammaloop-nextest-integration> failure: test failure with exit code 101
  295. 146.98 s gammaloop-nextest-integration> system-out
  296. 146.98 s gammaloop-nextest-integration> running 1 test
  297. 146.98 s gammaloop-nextest-integration> test se1l_uv has been running for over 60 seconds
  298. 146.98 s gammaloop-nextest-integration> +------+-----------------+---------+--------+----------+-----------------------------------------------------------------------------------------------------------------------+-------+
  299. 146.98 s gammaloop-nextest-integration> | case | check | graph | status | sigma | threshold | error |
  300. 146.98 s gammaloop-nextest-integration> +------+-----------------+---------+--------+----------+-----------------------------------------------------------------------------------------------------------------------+-------+
  301. 146.98 s gammaloop-nextest-integration> | se1l | uv_profile | - | FAIL | - | - | - |
  302. 146.98 s gammaloop-nextest-integration> +------+-----------------+---------+--------+----------+-----------------------------------------------------------------------------------------------------------------------+-------+
  303. 146.98 s gammaloop-nextest-integration> | se1l | m_uv.inspect | inspect | pass | - | best inspect relative delta 1.097e-1 >= 1000*accuracy 1.000e-7 (accuracy=1.000e-10, exponent=+2.0, seed=1, probes=10) | - |
  304. 146.98 s gammaloop-nextest-integration> +------+-----------------+---------+--------+----------+-----------------------------------------------------------------------------------------------------------------------+-------+
  305. 146.98 s gammaloop-nextest-integration> | se1l | m_uv.integrated | se1l | pass | 0.1sigma | compatible within 2sigma | - |
  306. 146.98 s gammaloop-nextest-integration> +------+-----------------+---------+--------+----------+-----------------------------------------------------------------------------------------------------------------------+-------+
  307. 146.98 s gammaloop-nextest-integration> | se1l | rls.inspect | inspect | pass | - | best inspect relative delta 4.499e-2 >= 1000*accuracy 1.000e-7 (accuracy=1.000e-10, exponent=+2.0, seed=1, probes=10) | - |
  308. 146.98 s gammaloop-nextest-integration> +------+-----------------+---------+--------+----------+-----------------------------------------------------------------------------------------------------------------------+-------+
  309. 146.98 s gammaloop-nextest-integration> | se1l | rls.integrated | se1l | pass | 0.0sigma | compatible within 2sigma | - |
  310. 146.98 s gammaloop-nextest-integration> +------+-----------------+---------+--------+----------+-----------------------------------------------------------------------------------------------------------------------+-------+
  311. 146.98 s gammaloop-nextest-integration> | se1l | mu_r.inspect | inspect | pass | - | best inspect relative delta 1.424e-1 >= 1000*accuracy 1.000e-7 (accuracy=1.000e-10, exponent=+2.0, seed=1, probes=10) | - |
  312. 146.98 s gammaloop-nextest-integration> +------+-----------------+---------+--------+----------+-----------------------------------------------------------------------------------------------------------------------+-------+
  313. 146.98 s gammaloop-nextest-integration> | se1l | target | - | pass | - | 2sigma | - |
  314. 146.98 s gammaloop-nextest-integration> +------+-----------------+---------+--------+----------+-----------------------------------------------------------------------------------------------------------------------+-------+
  315. 146.98 s gammaloop-nextest-integration> test se1l_uv ... FAILED
  316. 146.98 s gammaloop-nextest-integration>
  317. 146.98 s gammaloop-nextest-integration> failures:
  318. 146.98 s gammaloop-nextest-integration>
  319. 146.98 s gammaloop-nextest-integration> failures:
  320. 146.98 s gammaloop-nextest-integration> se1l_uv
  321. 146.98 s gammaloop-nextest-integration>
  322. 146.98 s gammaloop-nextest-integration> test result: FAILED. 0 passed; 1 failed; 0 ignored; 0 measured; 24 filtered out; finished in 108.84s
  323. 146.98 s gammaloop-nextest-integration> system-err
  324. 146.98 s gammaloop-nextest-integration> [2026-08-26 05:42:51.693] @gammaloop_api::se... INFO : Running command run generate
  325. 146.98 s gammaloop-nextest-integration> [2026-08-26 05:42:51.693] @gammaloop_api::se... INFO : Starting command block generate
  326. 146.98 s gammaloop-nextest-integration> [2026-08-26 05:42:51.693] @gammaloop_api::se... INFO : Running command import model sm-default
  327. 146.98 s gammaloop-nextest-integration> [2026-08-26 05:42:51.693] @import::model INFO : Loading built-in JSON model sm-default
  328. 146.98 s gammaloop-nextest-integration> [2026-08-26 05:42:51.735] @gammalooprs::model INFO : The following 11 external parameters were forced to zero by the restriction card:
  329. 146.98 s gammaloop-nextest-integration> lamWS, AWS, rhoWS, etaWS, ymc, yme, ymm, MC, Me, MM, WTau
  330. 146.98 s gammaloop-nextest-integration> [2026-08-26 05:42:51.735] @gammalooprs::model INFO : The following 34 vertex rules were removed by the restriction card:
  331. 146.98 s gammaloop-nextest-integration> V_82 -> (c~, d, G+) | V_83 -> (t~, d, G+) | V_84 -> (c~, s, G+) | V_85 -> (t~, s, G+) | V_86 -> (u~, b, G+) | V_87 -> (c~, b, G+) | V_90 -> (c~, d, W+) | V_91 -> (t~, d, W+) | V_92 -> (u~, s, W+) | V_94 -> (t~, s, W+) | V_95 -> (u~, b, W+) | V_96 -> (c~, b, W+) | V_101 -> (e+, e-, G0) | V_102 -> (mu+, mu-, G0) | V_104 -> (e+, e-, H) | V_105 -> (mu+, mu-, H) | V_110 -> (ve~, e-, G+) | V_111 -> (vm~, mu-, G+) | V_116 -> (b~, u, G-) | V_117 -> (d~, c, G-) | V_118 -> (s~, c, G-) | V_119 -> (b~, c, G-) | V_120 -> (d~, t, G-) | V_121 -> (s~, t, G-) | V_124 -> (s~, u, W-) | V_125 -> (b~, u, W-) | V_126 -> (d~, c, W-) | V_128 -> (b~, c, W-) | V_129 -> (d~, t, W-) | V_130 -> (s~, t, W-) | V_138 -> (c~, c, G0) | V_140 -> (c~, c, H) | V_145 -> (e+, ve, G-) | V_146 -> (mu+, vm, G-)
  332. 146.98 s gammaloop-nextest-integration> [2026-08-26 05:42:51.735] @gammalooprs::model INFO : The following 36 couplings were removed by the restriction card:
  333. 146.98 s gammaloop-nextest-integration> GC_13, GC_14, GC_16, GC_17, GC_18, GC_19, GC_20, GC_22, GC_23, GC_24, GC_25, GC_26, GC_28, GC_29, GC_42, GC_43, GC_44, GC_46, GC_47, GC_48, GC_84, GC_85, GC_86, GC_87, GC_88, GC_89, GC_90, GC_91, GC_92, GC_93, GC_101, GC_102, GC_103, GC_105, GC_106, GC_107
  334. 146.98 s gammaloop-nextest-integration> [2026-08-26 05:42:51.735] @gammaloop_api::se... INFO : Running command remove processes
  335. 146.98 s gammaloop-nextest-integration> [2026-08-26 05:42:51.735] @gammaloop_api::se... INFO : Running command set global kv global.generation.uv.generate_integrated=true
  336. 146.98 s gammaloop-nextest-integration> [2026-08-26 05:42:51.736] @gammaloop_api::se... INFO : Running command import graphs ./tests/resources/graphs/uv_tests/se1l.dot -p se1l -i se1l
  337. 146.98 s gammaloop-nextest-integration> [2026-08-26 05:42:51.736] @commands::import INFO : Loading graphs from '/build/source/tests/resources/graphs/uv_tests/se1l.dot'
  338. 146.98 s gammaloop-nextest-integration> [2026-08-26 05:42:51.742] @gammaloop_api::se... INFO : Running command generate existing -p se1l -i se1l
  339. 146.98 s gammaloop-nextest-integration> [2026-08-26 05:42:55.742] @commands::generate INFO :
  340. 146.98 s gammaloop-nextest-integration> Integrand generation summary
  341. 146.98 s gammaloop-nextest-integration> peak RAM 89.38 MiB | cores 1
  342. 146.98 s gammaloop-nextest-integration> ╭───────────┬───────┬─────────┬─────────────┬──────────────┬────────────────┬─────────────╮
  343. 146.98 s gammaloop-nextest-integration> │ integrand │ graph │ # evals │ expr build │ spenso │ symbolica eval │ compile │
  344. 146.98 s gammaloop-nextest-integration> ├───────────┼───────┼─────────┼─────────────┼──────────────┼────────────────┼─────────────┤
  345. 146.98 s gammaloop-nextest-integration> │ se1l │ se1l │ 5 │ 3.39s (86%) │ 191ms (4.9%) │ 359ms (9.1%) │ 0ms (0.00%) │
  346. 146.98 s gammaloop-nextest-integration> ├───────────┼───────┼─────────┼─────────────┼──────────────┼────────────────┼─────────────┤
  347. 146.98 s gammaloop-nextest-integration> │ Total │ │ 5 │ 3.39s (86%) │ 191ms (4.9%) │ 359ms (9.1%) │ 0ms (0.00%) │
  348. 146.98 s gammaloop-nextest-integration> ╰───────────┴───────┴─────────┴─────────────┴──────────────┴────────────────┴─────────────╯
  349. 146.98 s gammaloop-nextest-integration> [2026-08-26 05:42:55.743] @gammaloop_api::se... INFO : Running command set process -p se1l -i se1l kv general.m_uv=0.2
  350. 146.98 s gammaloop-nextest-integration> [2026-08-26 05:42:55.750] @gammaloop_api::se... INFO : Running command set process -p se1l -i se1l kv general.mu_r=0.2
  351. 146.98 s gammaloop-nextest-integration> [2026-08-26 05:42:55.751] @gammaloop_api::se... INFO : Running command set process -p se1l -i se1l kv general.renormalization_localization_scale=0.2
  352. 146.98 s gammaloop-nextest-integration> [2026-08-26 05:42:55.770] @gammaloop_api::se... INFO : Running command duplicate integrand -p se1l -i se1l --output_process_name se1l --output_integrand_name se1l_muv_shifted
  353. 146.98 s gammaloop-nextest-integration> [2026-08-26 05:42:55.794] @gammaloop_api::se... INFO : Running command set process -p se1l -i se1l_muv_shifted kv general.m_uv=0.5
  354. 146.98 s gammaloop-nextest-integration> [2026-08-26 05:42:55.806] @gammaloop_api::se... INFO : Running command duplicate integrand -p se1l -i se1l --output_process_name se1l --output_integrand_name se1l_rls_shifted
  355. 146.98 s gammaloop-nextest-integration> [2026-08-26 05:42:55.820] @gammaloop_api::se... INFO : Running command set process -p se1l -i se1l_rls_shifted kv general.renormalization_localization_scale=1
  356. 146.98 s gammaloop-nextest-integration> [2026-08-26 05:42:55.826] @gammaloop_api::se... INFO : Running command duplicate integrand -p se1l -i se1l --output_process_name se1l --output_integrand_name se1l_mur_shifted
  357. 146.98 s gammaloop-nextest-integration> [2026-08-26 05:42:55.844] @gammaloop_api::se... INFO : Running command set process -p se1l -i se1l_mur_shifted kv general.mu_r=0.8
  358. 146.98 s gammaloop-nextest-integration> [2026-08-26 05:42:55.884] @process::amplitude WARNING : External state 0 ('g', PDG 21, helicity +) is off shell: p^2 = +2.5e5, expected m^2 = +0e0 (|Δ| = +2.5e5). Fixed-helicity spinor/vector/tensor external states may be ill-defined at this kinematic point.
  359. 146.98 s gammaloop-nextest-integration> field value
  360. 146.98 s gammaloop-nextest-integration> span warm_up{integrand.name=se1l}
  361. 146.98 s gammaloop-nextest-integration> [2026-08-26 05:42:55.894] @process::amplitude WARNING : External state 1 ('g', PDG 21, helicity -) is off shell: p^2 = +2.5e5, expected m^2 = +0e0 (|Δ| = +2.5e5). Fixed-helicity spinor/vector/tensor external states may be ill-defined at this kinematic point.
  362. 146.98 s gammaloop-nextest-integration> field value
  363. 146.98 s gammaloop-nextest-integration> span warm_up{integrand.name=se1l}
  364. 146.98 s gammaloop-nextest-integration> [2026-08-26 05:42:55.895] @process::amplitude INFO : Input is above threshold: 1 existing threshold E-surfaces across 1/1 graph groups
  365. 146.98 s gammaloop-nextest-integration> field value
  366. 146.98 s gammaloop-nextest-integration> existing_esurfaces 1
  367. 146.98 s gammaloop-nextest-integration> group_count 1
  368. 146.98 s gammaloop-nextest-integration> groups_above_threshold 1
  369. 146.98 s gammaloop-nextest-integration> integrand se1l
  370. 146.98 s gammaloop-nextest-integration> span warm_up{integrand.name=se1l}
  371. 146.98 s gammaloop-nextest-integration> threshold_status above threshold
  372. 146.98 s gammaloop-nextest-integration> [2026-08-26 05:42:55.895] @process::amplitude INFO : overlap structure of group 0: [1: [0(2,3)]]
  373. 146.98 s gammaloop-nextest-integration> field value
  374. 146.98 s gammaloop-nextest-integration> span warm_up{integrand.name=se1l}
  375. 146.98 s gammaloop-nextest-integration> [2026-08-26 05:42:56.476] @commands::profile INFO :
  376. 146.98 s gammaloop-nextest-integration> ╭───────┬──────┬──────────┬───────┬─────┬──────────┬───────────╮
  377. 146.98 s gammaloop-nextest-integration> │ fixed │ → ∞ │ slope │ r2 │ DOD │ bare DOD │ inspect │
  378. 146.98 s gammaloop-nextest-integration> ├───────┼──────┼──────────┼───────┼─────┼──────────┼───────────┤
  379. 146.98 s gammaloop-nextest-integration> │ {} │ {e3} │ 1.639236 │ 0.904 │ 2 │ 2 │ arb retry │
  380. 146.98 s gammaloop-nextest-integration> │ {} │ {e2} │ 1.698834 │ 0.902 │ 2 │ 2 │ arb retry │
  381. 146.98 s gammaloop-nextest-integration> ╰───────┴──────┴──────────┴───────┴─────┴──────────┴───────────╯
  382. 146.98 s gammaloop-nextest-integration> [2026-08-26 05:42:56.476] @commands::profile INFO :
  383. 146.98 s gammaloop-nextest-integration> ╭───────┬──────┬─────────────┬──────────┬───────┬─────┬──────────┬───────────╮
  384. 146.98 s gammaloop-nextest-integration> │ fixed │ → ∞ │ orientation │ slope │ r2 │ DOD │ bare DOD │ inspect │
  385. 146.98 s gammaloop-nextest-integration> ├───────┼──────┼─────────────┼──────────┼───────┼─────┼──────────┼───────────┤
  386. 146.98 s gammaloop-nextest-integration> │ {} │ {e3} │ 00-+ │ 0.343429 │ 0.145 │ 0 │ 2 │ arb retry │
  387. 146.98 s gammaloop-nextest-integration> │ {} │ {e3} │ 00+- │ 0.342577 │ 0.135 │ 0 │ 2 │ arb retry │
  388. 146.98 s gammaloop-nextest-integration> │ {} │ {e2} │ 00-+ │ 0.385975 │ 0.161 │ 0 │ 2 │ arb retry │
  389. 146.98 s gammaloop-nextest-integration> │ {} │ {e2} │ 00+- │ 0.384920 │ 0.192 │ 0 │ 2 │ arb retry │
  390. 146.98 s gammaloop-nextest-integration> ╰───────┴──────┴─────────────┴──────────┴───────┴─────┴──────────┴───────────╯
  391. 146.98 s gammaloop-nextest-integration> [2026-08-26 05:42:56.477] @gammaloop_api::se... INFO : Running command set process kv integrator.target_relative_accuracy=0.001 integrator.n_increase=0 integrator.n_start=50000 integrator.n_max=400000 integrator.seed=1337
  392. 146.98 s gammaloop-nextest-integration> [2026-08-26 05:42:56.478] @commands::integrate INFO : Created workspace directory at /build/source/tests/artifacts/se1l/integration_workspace_se1l
  393. 146.98 s gammaloop-nextest-integration> [2026-08-26 05:42:56.509] @commands::integrate INFO : No integration state found, starting new integration
  394. 146.98 s gammaloop-nextest-integration> [2026-08-26 05:42:56.509] @commands::integrate INFO : Gammaloop now integrates se1l@se1l, se1l@se1l_muv_shifted, se1l@se1l_rls_shifted
  395. 146.98 s gammaloop-nextest-integration> [2026-08-26 05:42:56.509] @process::amplitude WARNING : External state 0 ('g', PDG 21, helicity +) is off shell: p^2 = +2.5e5, expected m^2 = +0e0 (|Δ| = +2.5e5). Fixed-helicity spinor/vector/tensor external states may be ill-defined at this kinematic point.
  396. 146.98 s gammaloop-nextest-integration> field value
  397. 146.98 s gammaloop-nextest-integration> span warm_up{integrand.name=se1l}
  398. 146.98 s gammaloop-nextest-integration> [2026-08-26 05:42:56.510] @process::amplitude WARNING : External state 1 ('g', PDG 21, helicity -) is off shell: p^2 = +2.5e5, expected m^2 = +0e0 (|Δ| = +2.5e5). Fixed-helicity spinor/vector/tensor external states may be ill-defined at this kinematic point.
  399. 146.98 s gammaloop-nextest-integration> field value
  400. 146.98 s gammaloop-nextest-integration> span warm_up{integrand.name=se1l}
  401. 146.98 s gammaloop-nextest-integration> [2026-08-26 05:42:56.510] @process::amplitude INFO : Input is above threshold: 1 existing threshold E-surfaces across 1/1 graph groups
  402. 146.98 s gammaloop-nextest-integration> field value
  403. 146.98 s gammaloop-nextest-integration> existing_esurfaces 1
  404. 146.98 s gammaloop-nextest-integration> group_count 1
  405. 146.98 s gammaloop-nextest-integration> groups_above_threshold 1
  406. 146.98 s gammaloop-nextest-integration> integrand se1l
  407. 146.98 s gammaloop-nextest-integration> span warm_up{integrand.name=se1l}
  408. 146.98 s gammaloop-nextest-integration> threshold_status above threshold
  409. 146.98 s gammaloop-nextest-integration> [2026-08-26 05:42:56.510] @process::amplitude INFO : overlap structure of group 0: [1: [0(2,3)]]
  410. 146.98 s gammaloop-nextest-integration> field value
  411. 146.98 s gammaloop-nextest-integration> span warm_up{integrand.name=se1l}
  412. 146.98 s gammaloop-nextest-integration> [2026-08-26 05:42:56.511] @process::amplitude WARNING : External state 0 ('g', PDG 21, helicity +) is off shell: p^2 = +2.5e5, expected m^2 = +0e0 (|Δ| = +2.5e5). Fixed-helicity spinor/vector/tensor external states may be ill-defined at this kinematic point.
  413. 146.98 s gammaloop-nextest-integration> field value
  414. 146.98 s gammaloop-nextest-integration> span warm_up{integrand.name=se1l_muv_shifted}
  415. 146.98 s gammaloop-nextest-integration> [2026-08-26 05:42:56.511] @process::amplitude WARNING : External state 1 ('g', PDG 21, helicity -) is off shell: p^2 = +2.5e5, expected m^2 = +0e0 (|Δ| = +2.5e5). Fixed-helicity spinor/vector/tensor external states may be ill-defined at this kinematic point.
  416. 146.98 s gammaloop-nextest-integration> field value
  417. 146.98 s gammaloop-nextest-integration> span warm_up{integrand.name=se1l_muv_shifted}
  418. 146.98 s gammaloop-nextest-integration> [2026-08-26 05:42:56.511] @process::amplitude INFO : Input is above threshold: 1 existing threshold E-surfaces across 1/1 graph groups
  419. 146.98 s gammaloop-nextest-integration> field value
  420. 146.98 s gammaloop-nextest-integration> existing_esurfaces 1
  421. 146.98 s gammaloop-nextest-integration> group_count 1
  422. 146.98 s gammaloop-nextest-integration> groups_above_threshold 1
  423. 146.98 s gammaloop-nextest-integration> integrand se1l_muv_shifted
  424. 146.98 s gammaloop-nextest-integration> span warm_up{integrand.name=se1l_muv_shifted}
  425. 146.98 s gammaloop-nextest-integration> threshold_status above threshold
  426. 146.98 s gammaloop-nextest-integration> [2026-08-26 05:42:56.511] @process::amplitude INFO : overlap structure of group 0: [1: [0(2,3)]]
  427. 146.98 s gammaloop-nextest-integration> field value
  428. 146.98 s gammaloop-nextest-integration> span warm_up{integrand.name=se1l_muv_shifted}
  429. 146.98 s gammaloop-nextest-integration> [2026-08-26 05:42:56.516] @process::amplitude WARNING : External state 0 ('g', PDG 21, helicity +) is off shell: p^2 = +2.5e5, expected m^2 = +0e0 (|Δ| = +2.5e5). Fixed-helicity spinor/vector/tensor external states may be ill-defined at this kinematic point.
  430. 146.98 s gammaloop-nextest-integration> field value
  431. 146.98 s gammaloop-nextest-integration> span warm_up{integrand.name=se1l_rls_shifted}
  432. 146.98 s gammaloop-nextest-integration> [2026-08-26 05:42:56.516] @process::amplitude WARNING : External state 1 ('g', PDG 21, helicity -) is off shell: p^2 = +2.5e5, expected m^2 = +0e0 (|Δ| = +2.5e5). Fixed-helicity spinor/vector/tensor external states may be ill-defined at this kinematic point.
  433. 146.98 s gammaloop-nextest-integration> field value
  434. 146.98 s gammaloop-nextest-integration> span warm_up{integrand.name=se1l_rls_shifted}
  435. 146.98 s gammaloop-nextest-integration> [2026-08-26 05:42:56.516] @process::amplitude INFO : Input is above threshold: 1 existing threshold E-surfaces across 1/1 graph groups
  436. 146.98 s gammaloop-nextest-integration> field value
  437. 146.98 s gammaloop-nextest-integration> existing_esurfaces 1
  438. 146.98 s gammaloop-nextest-integration> group_count 1
  439. 146.98 s gammaloop-nextest-integration> groups_above_threshold 1
  440. 146.98 s gammaloop-nextest-integration> integrand se1l_rls_shifted
  441. 146.98 s gammaloop-nextest-integration> span warm_up{integrand.name=se1l_rls_shifted}
  442. 146.98 s gammaloop-nextest-integration> threshold_status above threshold
  443. 146.98 s gammaloop-nextest-integration> ... omitted 1410 more lines; see full nextest output above
  444. 146.98 s gammaloop-nextest-integration> =========================================
  445. 147.10 s [0 built (1 failed), 0.0error: Cannot build '/nix/store/z64pzsmdh7l76572yr3sfrwn8clcnq7n-gammaloop-nextest-integration.drv'.
  446. 147.10 s Reason: builder failed with exit code 100.
  447. 147.10 s Output paths:
  448. 147.10 s /nix/store/ig9divdxs867pdkmxwq7j78q7xgh2c40-gammaloop-nextest-integration
  449. 147.10 s Last 2048 log lines:
  450. 147.10 s > span warm_up{integrand.name=se1l_muv_shifted}
  451. 147.10 s > threshold_status above threshold
  452. 147.10 s > [2026-08-26 05:44:38.546] @process::amplitude INFO : overlap structure of group 0: [1: [0(2,3)]]
  453. 147.10 s > field value
  454. 147.10 s > span warm_up{integrand.name=se1l_muv_shifted}
  455. 147.10 s > [2026-08-26 05:44:38.550] @process::amplitude WARNING : External state 0 ('g', PDG 21, helicity +) is off shell: p^2 = +2.5e5, expected m^2 = +0e0 (|Δ| = +2.5e5). Fixed-helicity spinor/vector/tensor external states may be ill-defined at this kinematic point.
  456. 147.10 s > field value
  457. 147.10 s > span warm_up{integrand.name=se1l}
  458. 147.10 s > [2026-08-26 05:44:38.550] @process::amplitude WARNING : External state 1 ('g', PDG 21, helicity -) is off shell: p^2 = +2.5e5, expected m^2 = +0e0 (|Δ| = +2.5e5). Fixed-helicity spinor/vector/tensor external states may be ill-defined at this kinematic point.
  459. 147.10 s > field value
  460. 147.10 s > span warm_up{integrand.name=se1l}
  461. 147.10 s > [2026-08-26 05:44:38.550] @process::amplitude INFO : Input is above threshold: 1 existing threshold E-surfaces across 1/1 graph groups
  462. 147.10 s > field value
  463. 147.10 s > existing_esurfaces 1
  464. 147.10 s > group_count 1
  465. 147.10 s > groups_above_threshold 1
  466. 147.10 s > integrand se1l
  467. 147.10 s > span warm_up{integrand.name=se1l}
  468. 147.10 s > threshold_status above threshold
  469. 147.10 s > [2026-08-26 05:44:38.550] @process::amplitude INFO : overlap structure of group 0: [1: [0(2,3)]]
  470. 147.10 s > field value
  471. 147.10 s > span warm_up{integrand.name=se1l}
  472. 147.10 s > [2026-08-26 05:44:38.553] @process::amplitude WARNING : External state 0 ('g', PDG 21, helicity +) is off shell: p^2 = +2.5e5, expected m^2 = +0e0 (|Δ| = +2.5e5). Fixed-helicity spinor/vector/tensor external states may be ill-defined at this kinematic point.
  473. 147.10 s > field value
  474. 147.10 s > span warm_up{integrand.name=se1l_muv_shifted}
  475. 147.10 s > [2026-08-26 05:44:38.553] @process::amplitude WARNING : External state 1 ('g', PDG 21, helicity -) is off shell: p^2 = +2.5e5, expected m^2 = +0e0 (|Δ| = +2.5e5). Fixed-helicity spinor/vector/tensor external states may be ill-defined at this kinematic point.
  476. 147.10 s > field value
  477. 147.10 s > span warm_up{integrand.name=se1l_muv_shifted}
  478. 147.10 s > [2026-08-26 05:44:38.553] @process::amplitude INFO : Input is above threshold: 1 existing threshold E-surfaces across 1/1 graph groups
  479. 147.10 s > field value
  480. 147.10 s > existing_esurfaces 1
  481. 147.10 s > group_count 1
  482. 147.10 s > groups_above_threshold 1
  483. 147.10 s > integrand se1l_muv_shifted
  484. 147.10 s > span warm_up{integrand.name=se1l_muv_shifted}
  485. 147.10 s > threshold_status above threshold
  486. 147.10 s > [2026-08-26 05:44:38.553] @process::amplitude INFO : overlap structure of group 0: [1: [0(2,3)]]
  487. 147.10 s > field value
  488. 147.10 s > span warm_up{integrand.name=se1l_muv_shifted}
  489. 147.10 s > [2026-08-26 05:44:38.557] @process::amplitude WARNING : External state 0 ('g', PDG 21, helicity +) is off shell: p^2 = +2.5e5, expected m^2 = +0e0 (|Δ| = +2.5e5). Fixed-helicity spinor/vector/tensor external states may be ill-defined at this kinematic point.
  490. 147.10 s > field value
  491. 147.10 s > span warm_up{integrand.name=se1l}
  492. 147.10 s > [2026-08-26 05:44:38.557] @process::amplitude WARNING : External state 1 ('g', PDG 21, helicity -) is off shell: p^2 = +2.5e5, expected m^2 = +0e0 (|Δ| = +2.5e5). Fixed-helicity spinor/vector/tensor external states may be ill-defined at this kinematic point.
  493. 147.10 s > field value
  494. 147.10 s > span warm_up{integrand.name=se1l}
  495. 147.10 s > [2026-08-26 05:44:38.557] @process::amplitude INFO : Input is above threshold: 1 existing threshold E-surfaces across 1/1 graph groups
  496. 147.10 s > field value
  497. 147.10 s > existing_esurfaces 1
  498. 147.10 s > group_count 1
  499. 147.10 s > groups_above_threshold 1
  500. 147.10 s > integrand se1l
  501. 147.10 s > span warm_up{integrand.name=se1l}
  502. 147.10 s > threshold_status above threshold
  503. 147.10 s > [2026-08-26 05:44:38.557] @process::amplitude INFO : overlap structure of group 0: [1: [0(2,3)]]
  504. 147.10 s > field value
  505. 147.10 s > span warm_up{integrand.name=se1l}
  506. 147.10 s > [2026-08-26 05:44:38.561] @process::amplitude WARNING : External state 0 ('g', PDG 21, helicity +) is off shell: p^2 = +2.5e5, expected m^2 = +0e0 (|Δ| = +2.5e5). Fixed-helicity spinor/vector/tensor external states may be ill-defined at this kinematic point.
  507. 147.10 s > field value
  508. 147.10 s > span warm_up{integrand.name=se1l_muv_shifted}
  509. 147.10 s > [2026-08-26 05:44:38.561] @process::amplitude WARNING : External state 1 ('g', PDG 21, helicity -) is off shell: p^2 = +2.5e5, expected m^2 = +0e0 (|Δ| = +2.5e5). Fixed-helicity spinor/vector/tensor external states may be ill-defined at this kinematic point.
  510. 147.10 s > field value
  511. 147.10 s > span warm_up{integrand.name=se1l_muv_shifted}
  512. 147.10 s > [2026-08-26 05:44:38.561] @process::amplitude INFO : Input is above threshold: 1 existing threshold E-surfaces across 1/1 graph groups
  513. 147.10 s > field value
  514. 147.10 s > existing_esurfaces 1
  515. 147.10 s > group_count 1
  516. 147.10 s > groups_above_threshold 1
  517. 147.10 s > integrand se1l_muv_shifted
  518. 147.10 s > span warm_up{integrand.name=se1l_muv_shifted}
  519. 147.10 s > threshold_status above threshold
  520. 147.10 s > [2026-08-26 05:44:38.561] @process::amplitude INFO : overlap structure of group 0: [1: [0(2,3)]]
  521. 147.10 s > field value
  522. 147.10 s > span warm_up{integrand.name=se1l_muv_shifted}
  523. 147.10 s > [2026-08-26 05:44:38.565] @process::amplitude WARNING : External state 0 ('g', PDG 21, helicity +) is off shell: p^2 = +2.5e5, expected m^2 = +0e0 (|Δ| = +2.5e5). Fixed-helicity spinor/vector/tensor external states may be ill-defined at this kinematic point.
  524. 147.10 s > field value
  525. 147.10 s > span warm_up{integrand.name=se1l}
  526. 147.10 s > [2026-08-26 05:44:38.565] @process::amplitude WARNING : External state 1 ('g', PDG 21, helicity -) is off shell: p^2 = +2.5e5, expected m^2 = +0e0 (|Δ| = +2.5e5). Fixed-helicity spinor/vector/tensor external states may be ill-defined at this kinematic point.
  527. 147.10 s > field value
  528. 147.10 s > span warm_up{integrand.name=se1l}
  529. 147.10 s > [2026-08-26 05:44:38.565] @process::amplitude INFO : Input is above threshold: 1 existing threshold E-surfaces across 1/1 graph groups
  530. 147.10 s > field value
  531. 147.10 s > existing_esurfaces 1
  532. 147.10 s > group_count 1
  533. 147.10 s > groups_above_threshold 1
  534. 147.10 s > integrand se1l
  535. 147.10 s > span warm_up{integrand.name=se1l}
  536. 147.10 s > threshold_status above threshold
  537. 147.10 s > [2026-08-26 05:44:38.565] @process::amplitude INFO : overlap structure of group 0: [1: [0(2,3)]]
  538. 147.10 s > field value
  539. 147.10 s > span warm_up{integrand.name=se1l}
  540. 147.10 s > [2026-08-26 05:44:38.568] @process::amplitude WARNING : External state 0 ('g', PDG 21, helicity +) is off shell: p^2 = +2.5e5, expected m^2 = +0e0 (|Δ| = +2.5e5). Fixed-helicity spinor/vector/tensor external states may be ill-defined at this kinematic point.
  541. 147.10 s > field value
  542. 147.10 s > span warm_up{integrand.name=se1l_muv_shifted}
  543. 147.10 s > [2026-08-26 05:44:38.568] @process::amplitude WARNING : External state 1 ('g', PDG 21, helicity -) is off shell: p^2 = +2.5e5, expected m^2 = +0e0 (|Δ| = +2.5e5). Fixed-helicity spinor/vector/tensor external states may be ill-defined at this kinematic point.
  544. 147.10 s > field value
  545. 147.10 s > span warm_up{integrand.name=se1l_muv_shifted}
  546. 147.10 s > [2026-08-26 05:44:38.569] @process::amplitude INFO : Input is above threshold: 1 existing threshold E-surfaces across 1/1 graph groups
  547. 147.10 s > field value
  548. 147.10 s > existing_esurfaces 1
  549. 147.10 s > group_count 1
  550. 147.10 s > groups_above_threshold 1
  551. 147.10 s > integrand se1l_muv_shifted
  552. 147.10 s > span warm_up{integrand.name=se1l_muv_shifted}
  553. 147.10 s > threshold_status above threshold
  554. 147.10 s > [2026-08-26 05:44:38.569] @process::amplitude INFO : overlap structure of group 0: [1: [0(2,3)]]
  555. 147.10 s > field value
  556. 147.10 s > span warm_up{integrand.name=se1l_muv_shifted}
  557. 147.10 s > [2026-08-26 05:44:38.572] @process::amplitude WARNING : External state 0 ('g', PDG 21, helicity +) is off shell: p^2 = +2.5e5, expected m^2 = +0e0 (|Δ| = +2.5e5). Fixed-helicity spinor/vector/tensor external states may be ill-defined at this kinematic point.
  558. 147.10 s > field value
  559. 147.10 s > span warm_up{integrand.name=se1l}
  560. 147.10 s > [2026-08-26 05:44:38.572] @process::amplitude WARNING : External state 1 ('g', PDG 21, helicity -) is off shell: p^2 = +2.5e5, expected m^2 = +0e0 (|Δ| = +2.5e5). Fixed-helicity spinor/vector/tensor external states may be ill-defined at this kinematic point.
  561. 147.10 s > field value
  562. 147.10 s > span warm_up{integrand.name=se1l}
  563. 147.10 s > [2026-08-26 05:44:38.572] @process::amplitude INFO : Input is above threshold: 1 existing threshold E-surfaces across 1/1 graph groups
  564. 147.10 s > field value
  565. 147.10 s > existing_esurfaces 1
  566. 147.10 s > group_count 1
  567. 147.10 s > groups_above_threshold 1
  568. 147.10 s > integrand se1l
  569. 147.10 s > span warm_up{integrand.name=se1l}
  570. 147.10 s > threshold_status above threshold
  571. 147.10 s > [2026-08-26 05:44:38.572] @process::amplitude INFO : overlap structure of group 0: [1: [0(2,3)]]
  572. 147.10 s > field value
  573. 147.10 s > span warm_up{integrand.name=se1l}
  574. 147.10 s > [2026-08-26 05:44:38.576] @process::amplitude WARNING : External state 0 ('g', PDG 21, helicity +) is off shell: p^2 = +2.5e5, expected m^2 = +0e0 (|Δ| = +2.5e5). Fixed-helicity spinor/vector/tensor external states may be ill-defined at this kinematic point.
  575. 147.10 s > field value
  576. 147.10 s > span warm_up{integrand.name=se1l_rls_shifted}
  577. 147.10 s > [2026-08-26 05:44:38.576] @process::amplitude WARNING : External state 1 ('g', PDG 21, helicity -) is off shell: p^2 = +2.5e5, expected m^2 = +0e0 (|Δ| = +2.5e5). Fixed-helicity spinor/vector/tensor external states may be ill-defined at this kinematic point.
  578. 147.10 s > field value
  579. 147.10 s > span warm_up{integrand.name=se1l_rls_shifted}
  580. 147.10 s > [2026-08-26 05:44:38.577] @process::amplitude INFO : Input is above threshold: 1 existing threshold E-surfaces across 1/1 graph groups
  581. 147.10 s > field value
  582. 147.10 s > existing_esurfaces 1
  583. 147.10 s > group_count 1
  584. 147.10 s > groups_above_threshold 1
  585. 147.10 s > integrand se1l_rls_shifted
  586. 147.10 s > span warm_up{integrand.name=se1l_rls_shifted}
  587. 147.10 s > threshold_status above threshold
  588. 147.10 s > [2026-08-26 05:44:38.577] @process::amplitude INFO : overlap structure of group 0: [1: [0(2,3)]]
  589. 147.10 s > field value
  590. 147.10 s > span warm_up{integrand.name=se1l_rls_shifted}
  591. 147.10 s > [2026-08-26 05:44:38.580] @process::amplitude WARNING : External state 0 ('g', PDG 21, helicity +) is off shell: p^2 = +2.5e5, expected m^2 = +0e0 (|Δ| = +2.5e5). Fixed-helicity spinor/vector/tensor external states may be ill-defined at this kinematic point.
  592. 147.10 s > field value
  593. 147.10 s > span warm_up{integrand.name=se1l}
  594. 147.10 s > [2026-08-26 05:44:38.580] @process::amplitude WARNING : External state 1 ('g', PDG 21, helicity -) is off shell: p^2 = +2.5e5, expected m^2 = +0e0 (|Δ| = +2.5e5). Fixed-helicity spinor/vector/tensor external states may be ill-defined at this kinematic point.
  595. 147.10 s > field value
  596. 147.10 s > span warm_up{integrand.name=se1l}
  597. 147.10 s > [2026-08-26 05:44:38.580] @process::amplitude INFO : Input is above threshold: 1 existing threshold E-surfaces across 1/1 graph groups
  598. 147.10 s > field value
  599. 147.10 s > existing_esurfaces 1
  600. 147.10 s > group_count 1
  601. 147.10 s > groups_above_threshold 1
  602. 147.10 s > integrand se1l
  603. 147.10 s > span warm_up{integrand.name=se1l}
  604. 147.10 s > threshold_status above threshold
  605. 147.10 s > [2026-08-26 05:44:38.580] @process::amplitude INFO : overlap structure of group 0: [1: [0(2,3)]]
  606. 147.10 s > field value
  607. 147.10 s > span warm_up{integrand.name=se1l}
  608. 147.10 s > [2026-08-26 05:44:38.584] @process::amplitude WARNING : External state 0 ('g', PDG 21, helicity +) is off shell: p^2 = +2.5e5, expected m^2 = +0e0 (|Δ| = +2.5e5). Fixed-helicity spinor/vector/tensor external states may be ill-defined at this kinematic point.
  609. 147.10 s > field value
  610. 147.10 s > span warm_up{integrand.name=se1l_rls_shifted}
  611. 147.10 s > [2026-08-26 05:44:38.584] @process::amplitude WARNING : External state 1 ('g', PDG 21, helicity -) is off shell: p^2 = +2.5e5, expected m^2 = +0e0 (|Δ| = +2.5e5). Fixed-helicity spinor/vector/tensor external states may be ill-defined at this kinematic point.
  612. 147.10 s > field value
  613. 147.10 s > span warm_up{integrand.name=se1l_rls_shifted}
  614. 147.10 s > [2026-08-26 05:44:38.584] @process::amplitude INFO : Input is above threshold: 1 existing threshold E-surfaces across 1/1 graph groups
  615. 147.10 s > field value
  616. 147.10 s > existing_esurfaces 1
  617. 147.10 s > group_count 1
  618. 147.10 s > groups_above_threshold 1
  619. 147.10 s > integrand se1l_rls_shifted
  620. 147.10 s > span warm_up{integrand.name=se1l_rls_shifted}
  621. 147.10 s > threshold_status above threshold
  622. 147.10 s > [2026-08-26 05:44:38.584] @process::amplitude INFO : overlap structure of group 0: [1: [0(2,3)]]
  623. 147.10 s > field value
  624. 147.10 s > span warm_up{integrand.name=se1l_rls_shifted}
  625. 147.10 s > [2026-08-26 05:44:38.588] @process::amplitude WARNING : External state 0 ('g', PDG 21, helicity +) is off shell: p^2 = +2.5e5, expected m^2 = +0e0 (|Δ| = +2.5e5). Fixed-helicity spinor/vector/tensor external states may be ill-defined at this kinematic point.
  626. 147.10 s > field value
  627. 147.10 s > span warm_up{integrand.name=se1l}
  628. 147.10 s > [2026-08-26 05:44:38.588] @process::amplitude WARNING : External state 1 ('g', PDG 21, helicity -) is off shell: p^2 = +2.5e5, expected m^2 = +0e0 (|Δ| = +2.5e5). Fixed-helicity spinor/vector/tensor external states may be ill-defined at this kinematic point.
  629. 147.10 s > field value
  630. 147.10 s > span warm_up{integrand.name=se1l}
  631. 147.10 s > [2026-08-26 05:44:38.588] @process::amplitude INFO : Input is above threshold: 1 existing threshold E-surfaces across 1/1 graph groups
  632. 147.10 s > field value
  633. 147.10 s > existing_esurfaces 1
  634. 147.10 s > group_count 1
  635. 147.10 s > groups_above_threshold 1
  636. 147.10 s > integrand se1l
  637. 147.10 s > span warm_up{integrand.name=se1l}
  638. 147.10 s > threshold_status above threshold
  639. 147.10 s > [2026-08-26 05:44:38.588] @process::amplitude INFO : overlap structure of group 0: [1: [0(2,3)]]
  640. 147.10 s > field value
  641. 147.10 s > span warm_up{integrand.name=se1l}
  642. 147.10 s > [2026-08-26 05:44:38.592] @process::amplitude WARNING : External state 0 ('g', PDG 21, helicity +) is off shell: p^2 = +2.5e5, expected m^2 = +0e0 (|Δ| = +2.5e5). Fixed-helicity spinor/vector/tensor external states may be ill-defined at this kinematic point.
  643. 147.10 s > field value
  644. 147.10 s > span warm_up{integrand.name=se1l_rls_shifted}
  645. 147.10 s > [2026-08-26 05:44:38.592] @process::amplitude WARNING : External state 1 ('g', PDG 21, helicity -) is off shell: p^2 = +2.5e5, expected m^2 = +0e0 (|Δ| = +2.5e5). Fixed-helicity spinor/vector/tensor external states may be ill-defined at this kinematic point.
  646. 147.10 s > field value
  647. 147.10 s > span warm_up{integrand.name=se1l_rls_shifted}
  648. 147.10 s > [2026-08-26 05:44:38.592] @process::amplitude INFO : Input is above threshold: 1 existing threshold E-surfaces across 1/1 graph groups
  649. 147.10 s > field value
  650. 147.10 s > existing_esurfaces 1
  651. 147.10 s > group_count 1
  652. 147.10 s > groups_above_threshold 1
  653. 147.10 s > integrand se1l_rls_shifted
  654. 147.10 s > span warm_up{integrand.name=se1l_rls_shifted}
  655. 147.10 s > threshold_status above threshold
  656. 147.10 s > [2026-08-26 05:44:38.592] @process::amplitude INFO : overlap structure of group 0: [1: [0(2,3)]]
  657. 147.10 s > field value
  658. 147.10 s > span warm_up{integrand.name=se1l_rls_shifted}
  659. 147.10 s > [2026-08-26 05:44:38.595] @process::amplitude WARNING : External state 0 ('g', PDG 21, helicity +) is off shell: p^2 = +2.5e5, expected m^2 = +0e0 (|Δ| = +2.5e5). Fixed-helicity spinor/vector/tensor external states may be ill-defined at this kinematic point.
  660. 147.10 s > field value
  661. 147.10 s > span warm_up{integrand.name=se1l}
  662. 147.10 s > [2026-08-26 05:44:38.595] @process::amplitude WARNING : External state 1 ('g', PDG 21, helicity -) is off shell: p^2 = +2.5e5, expected m^2 = +0e0 (|Δ| = +2.5e5). Fixed-helicity spinor/vector/tensor external states may be ill-defined at this kinematic point.
  663. 147.10 s > field value
  664. 147.10 s > span warm_up{integrand.name=se1l}
  665. 147.10 s > [2026-08-26 05:44:38.595] @process::amplitude INFO : Input is above threshold: 1 existing threshold E-surfaces across 1/1 graph groups
  666. 147.10 s > field value
  667. 147.10 s > existing_esurfaces 1
  668. 147.10 s > group_count 1
  669. 147.10 s > groups_above_threshold 1
  670. 147.10 s > integrand se1l
  671. 147.10 s > span warm_up{integrand.name=se1l}
  672. 147.10 s > threshold_status above threshold
  673. 147.10 s > [2026-08-26 05:44:38.595] @process::amplitude INFO : overlap structure of group 0: [1: [0(2,3)]]
  674. 147.10 s > field value
  675. 147.10 s > span warm_up{integrand.name=se1l}
  676. 147.10 s > [2026-08-26 05:44:38.599] @process::amplitude WARNING : External state 0 ('g', PDG 21, helicity +) is off shell: p^2 = +2.5e5, expected m^2 = +0e0 (|Δ| = +2.5e5). Fixed-helicity spinor/vector/tensor external states may be ill-defined at this kinematic point.
  677. 147.10 s > field value
  678. 147.10 s > span warm_up{integrand.name=se1l_rls_shifted}
  679. 147.10 s > [2026-08-26 05:44:38.599] @process::amplitude WARNING : External state 1 ('g', PDG 21, helicity -) is off shell: p^2 = +2.5e5, expected m^2 = +0e0 (|Δ| = +2.5e5). Fixed-helicity spinor/vector/tensor external states may be ill-defined at this kinematic point.
  680. 147.10 s > field value
  681. 147.10 s > span warm_up{integrand.name=se1l_rls_shifted}
  682. 147.10 s > [2026-08-26 05:44:38.599] @process::amplitude INFO : Input is above threshold: 1 existing threshold E-surfaces across 1/1 graph groups
  683. 147.10 s > field value
  684. 147.10 s > existing_esurfaces 1
  685. 147.10 s > group_count 1
  686. 147.10 s > groups_above_threshold 1
  687. 147.10 s > integrand se1l_rls_shifted
  688. 147.10 s > span warm_up{integrand.name=se1l_rls_shifted}
  689. 147.10 s > threshold_status above threshold
  690. 147.10 s > [2026-08-26 05:44:38.599] @process::amplitude INFO : overlap structure of group 0: [1: [0(2,3)]]
  691. 147.10 s > field value
  692. 147.10 s > span warm_up{integrand.name=se1l_rls_shifted}
  693. 147.10 s > [2026-08-26 05:44:38.603] @process::amplitude WARNING : External state 0 ('g', PDG 21, helicity +) is off shell: p^2 = +2.5e5, expected m^2 = +0e0 (|Δ| = +2.5e5). Fixed-helicity spinor/vector/tensor external states may be ill-defined at this kinematic point.
  694. 147.10 s > field value
  695. 147.10 s > span warm_up{integrand.name=se1l}
  696. 147.10 s > [2026-08-26 05:44:38.603] @process::amplitude WARNING : External state 1 ('g', PDG 21, helicity -) is off shell: p^2 = +2.5e5, expected m^2 = +0e0 (|Δ| = +2.5e5). Fixed-helicity spinor/vector/tensor external states may be ill-defined at this kinematic point.
  697. 147.10 s > field value
  698. 147.10 s > span warm_up{integrand.name=se1l}
  699. 147.10 s > [2026-08-26 05:44:38.603] @process::amplitude INFO : Input is above threshold: 1 existing threshold E-surfaces across 1/1 graph groups
  700. 147.10 s > field value
  701. 147.10 s > existing_esurfaces 1
  702. 147.10 s > group_count 1
  703. 147.10 s > groups_above_threshold 1
  704. 147.10 s > integrand se1l
  705. 147.10 s > span warm_up{integrand.name=se1l}
  706. 147.10 s > threshold_status above threshold
  707. 147.10 s > [2026-08-26 05:44:38.603] @process::amplitude INFO : overlap structure of group 0: [1: [0(2,3)]]
  708. 147.10 s > field value
  709. 147.10 s > span warm_up{integrand.name=se1l}
  710. 147.10 s > [2026-08-26 05:44:38.606] @process::amplitude WARNING : External state 0 ('g', PDG 21, helicity +) is off shell: p^2 = +2.5e5, expected m^2 = +0e0 (|Δ| = +2.5e5). Fixed-helicity spinor/vector/tensor external states may be ill-defined at this kinematic point.
  711. 147.10 s > field value
  712. 147.10 s > span warm_up{integrand.name=se1l_rls_shifted}
  713. 147.10 s > [2026-08-26 05:44:38.607] @process::amplitude WARNING : External state 1 ('g', PDG 21, helicity -) is off shell: p^2 = +2.5e5, expected m^2 = +0e0 (|Δ| = +2.5e5). Fixed-helicity spinor/vector/tensor external states may be ill-defined at this kinematic point.
  714. 147.10 s > field value
  715. 147.10 s > span warm_up{integrand.name=se1l_rls_shifted}
  716. 147.10 s > [2026-08-26 05:44:38.607] @process::amplitude INFO : Input is above threshold: 1 existing threshold E-surfaces across 1/1 graph groups
  717. 147.10 s > field value
  718. 147.10 s > existing_esurfaces 1
  719. 147.10 s > group_count 1
  720. 147.10 s > groups_above_threshold 1
  721. 147.10 s > integrand se1l_rls_shifted
  722. 147.10 s > span warm_up{integrand.name=se1l_rls_shifted}
  723. 147.10 s > threshold_status above threshold
  724. 147.10 s > [2026-08-26 05:44:38.607] @process::amplitude INFO : overlap structure of group 0: [1: [0(2,3)]]
  725. 147.10 s > field value
  726. 147.10 s > span warm_up{integrand.name=se1l_rls_shifted}
  727. 147.10 s > [2026-08-26 05:44:38.610] @process::amplitude WARNING : External state 0 ('g', PDG 21, helicity +) is off shell: p^2 = +2.5e5, expected m^2 = +0e0 (|Δ| = +2.5e5). Fixed-helicity spinor/vector/tensor external states may be ill-defined at this kinematic point.
  728. 147.10 s > field value
  729. 147.10 s > span warm_up{integrand.name=se1l}
  730. 147.10 s > [2026-08-26 05:44:38.610] @process::amplitude WARNING : External state 1 ('g', PDG 21, helicity -) is off shell: p^2 = +2.5e5, expected m^2 = +0e0 (|Δ| = +2.5e5). Fixed-helicity spinor/vector/tensor external states may be ill-defined at this kinematic point.
  731. 147.10 s > field value
  732. 147.10 s > span warm_up{integrand.name=se1l}
  733. 147.10 s > [2026-08-26 05:44:38.611] @process::amplitude INFO : Input is above threshold: 1 existing threshold E-surfaces across 1/1 graph groups
  734. 147.10 s > field value
  735. 147.10 s > existing_esurfaces 1
  736. 147.10 s > group_count 1
  737. 147.10 s > groups_above_threshold 1
  738. 147.10 s > integrand se1l
  739. 147.10 s > span warm_up{integrand.name=se1l}
  740. 147.10 s > threshold_status above threshold
  741. 147.10 s > [2026-08-26 05:44:38.611] @process::amplitude INFO : overlap structure of group 0: [1: [0(2,3)]]
  742. 147.10 s > field value
  743. 147.10 s > span warm_up{integrand.name=se1l}
  744. 147.10 s > [2026-08-26 05:44:38.614] @process::amplitude WARNING : External state 0 ('g', PDG 21, helicity +) is off shell: p^2 = +2.5e5, expected m^2 = +0e0 (|Δ| = +2.5e5). Fixed-helicity spinor/vector/tensor external states may be ill-defined at this kinematic point.
  745. 147.10 s > field value
  746. 147.10 s > span warm_up{integrand.name=se1l_rls_shifted}
  747. 147.10 s > [2026-08-26 05:44:38.614] @process::amplitude WARNING : External state 1 ('g', PDG 21, helicity -) is off shell: p^2 = +2.5e5, expected m^2 = +0e0 (|Δ| = +2.5e5). Fixed-helicity spinor/vector/tensor external states may be ill-defined at this kinematic point.
  748. 147.10 s > field value
  749. 147.10 s > span warm_up{integrand.name=se1l_rls_shifted}
  750. 147.10 s > [2026-08-26 05:44:38.614] @process::amplitude INFO : Input is above threshold: 1 existing threshold E-surfaces across 1/1 graph groups
  751. 147.10 s > field value
  752. 147.10 s > existing_esurfaces 1
  753. 147.10 s > group_count 1
  754. 147.10 s > groups_above_threshold 1
  755. 147.10 s > integrand se1l_rls_shifted
  756. 147.10 s > span warm_up{integrand.name=se1l_rls_shifted}
  757. 147.10 s > threshold_status above threshold
  758. 147.10 s > [2026-08-26 05:44:38.614] @process::amplitude INFO : overlap structure of group 0: [1: [0(2,3)]]
  759. 147.10 s > field value
  760. 147.10 s > span warm_up{integrand.name=se1l_rls_shifted}
  761. 147.10 s > [2026-08-26 05:44:38.618] @process::amplitude WARNING : External state 0 ('g', PDG 21, helicity +) is off shell: p^2 = +2.5e5, expected m^2 = +0e0 (|Δ| = +2.5e5). Fixed-helicity spinor/vector/tensor external states may be ill-defined at this kinematic point.
  762. 147.10 s > field value
  763. 147.10 s > span warm_up{integrand.name=se1l}
  764. 147.10 s > [2026-08-26 05:44:38.618] @process::amplitude WARNING : External state 1 ('g', PDG 21, helicity -) is off shell: p^2 = +2.5e5, expected m^2 = +0e0 (|Δ| = +2.5e5). Fixed-helicity spinor/vector/tensor external states may be ill-defined at this kinematic point.
  765. 147.10 s > field value
  766. 147.10 s > span warm_up{integrand.name=se1l}
  767. 147.10 s > [2026-08-26 05:44:38.618] @process::amplitude INFO : Input is above threshold: 1 existing threshold E-surfaces across 1/1 graph groups
  768. 147.10 s > field value
  769. 147.10 s > existing_esurfaces 1
  770. 147.10 s > group_count 1
  771. 147.10 s > groups_above_threshold 1
  772. 147.10 s > integrand se1l
  773. 147.10 s > span warm_up{integrand.name=se1l}
  774. 147.10 s > threshold_status above threshold
  775. 147.10 s > [2026-08-26 05:44:38.618] @process::amplitude INFO : overlap structure of group 0: [1: [0(2,3)]]
  776. 147.10 s > field value
  777. 147.10 s > span warm_up{integrand.name=se1l}
  778. 147.10 s > [2026-08-26 05:44:38.621] @process::amplitude WARNING : External state 0 ('g', PDG 21, helicity +) is off shell: p^2 = +2.5e5, expected m^2 = +0e0 (|Δ| = +2.5e5). Fixed-helicity spinor/vector/tensor external states may be ill-defined at this kinematic point.
  779. 147.10 s > field value
  780. 147.10 s > span warm_up{integrand.name=se1l_rls_shifted}
  781. 147.10 s > [2026-08-26 05:44:38.621] @process::amplitude WARNING : External state 1 ('g', PDG 21, helicity -) is off shell: p^2 = +2.5e5, expected m^2 = +0e0 (|Δ| = +2.5e5). Fixed-helicity spinor/vector/tensor external states may be ill-defined at this kinematic point.
  782. 147.10 s > field value
  783. 147.10 s > span warm_up{integrand.name=se1l_rls_shifted}
  784. 147.10 s > [2026-08-26 05:44:38.622] @process::amplitude INFO : Input is above threshold: 1 existing threshold E-surfaces across 1/1 graph groups
  785. 147.10 s > field value
  786. 147.10 s > existing_esurfaces 1
  787. 147.10 s > group_count 1
  788. 147.10 s > groups_above_threshold 1
  789. 147.10 s > integrand se1l_rls_shifted
  790. 147.10 s > span warm_up{integrand.name=se1l_rls_shifted}
  791. 147.10 s > threshold_status above threshold
  792. 147.10 s > [2026-08-26 05:44:38.622] @process::amplitude INFO : overlap structure of group 0: [1: [0(2,3)]]
  793. 147.10 s > field value
  794. 147.10 s > span warm_up{integrand.name=se1l_rls_shifted}
  795. 147.10 s > [2026-08-26 05:44:38.625] @process::amplitude WARNING : External state 0 ('g', PDG 21, helicity +) is off shell: p^2 = +2.5e5, expected m^2 = +0e0 (|Δ| = +2.5e5). Fixed-helicity spinor/vector/tensor external states may be ill-defined at this kinematic point.
  796. 147.10 s > field value
  797. 147.10 s > span warm_up{integrand.name=se1l}
  798. 147.10 s > [2026-08-26 05:44:38.625] @process::amplitude WARNING : External state 1 ('g', PDG 21, helicity -) is off shell: p^2 = +2.5e5, expected m^2 = +0e0 (|Δ| = +2.5e5). Fixed-helicity spinor/vector/tensor external states may be ill-defined at this kinematic point.
  799. 147.10 s > field value
  800. 147.10 s > span warm_up{integrand.name=se1l}
  801. 147.10 s > [2026-08-26 05:44:38.625] @process::amplitude INFO : Input is above threshold: 1 existing threshold E-surfaces across 1/1 graph groups
  802. 147.10 s > field value
  803. 147.10 s > existing_esurfaces 1
  804. 147.10 s > group_count 1
  805. 147.10 s > groups_above_threshold 1
  806. 147.10 s > integrand se1l
  807. 147.10 s > span warm_up{integrand.name=se1l}
  808. 147.10 s > threshold_status above threshold
  809. 147.10 s > [2026-08-26 05:44:38.626] @process::amplitude INFO : overlap structure of group 0: [1: [0(2,3)]]
  810. 147.10 s > field value
  811. 147.10 s > span warm_up{integrand.name=se1l}
  812. 147.10 s > [2026-08-26 05:44:38.629] @process::amplitude WARNING : External state 0 ('g', PDG 21, helicity +) is off shell: p^2 = +2.5e5, expected m^2 = +0e0 (|Δ| = +2.5e5). Fixed-helicity spinor/vector/tensor external states may be ill-defined at this kinematic point.
  813. 147.10 s > field value
  814. 147.10 s > span warm_up{integrand.name=se1l_rls_shifted}
  815. 147.10 s > [2026-08-26 05:44:38.629] @process::amplitude WARNING : External state 1 ('g', PDG 21, helicity -) is off shell: p^2 = +2.5e5, expected m^2 = +0e0 (|Δ| = +2.5e5). Fixed-helicity spinor/vector/tensor external states may be ill-defined at this kinematic point.
  816. 147.10 s > field value
  817. 147.10 s > span warm_up{integrand.name=se1l_rls_shifted}
  818. 147.10 s > [2026-08-26 05:44:38.629] @process::amplitude INFO : Input is above threshold: 1 existing threshold E-surfaces across 1/1 graph groups
  819. 147.10 s > field value
  820. 147.10 s > existing_esurfaces 1
  821. 147.10 s > group_count 1
  822. 147.10 s > groups_above_threshold 1
  823. 147.10 s > integrand se1l_rls_shifted
  824. 147.10 s > span warm_up{integrand.name=se1l_rls_shifted}
  825. 147.10 s > threshold_status above threshold
  826. 147.10 s > [2026-08-26 05:44:38.629] @process::amplitude INFO : overlap structure of group 0: [1: [0(2,3)]]
  827. 147.10 s > field value
  828. 147.10 s > span warm_up{integrand.name=se1l_rls_shifted}
  829. 147.10 s > [2026-08-26 05:44:38.633] @process::amplitude WARNING : External state 0 ('g', PDG 21, helicity +) is off shell: p^2 = +2.5e5, expected m^2 = +0e0 (|Δ| = +2.5e5). Fixed-helicity spinor/vector/tensor external states may be ill-defined at this kinematic point.
  830. 147.10 s > field value
  831. 147.10 s > span warm_up{integrand.name=se1l}
  832. 147.10 s > [2026-08-26 05:44:38.633] @process::amplitude WARNING : External state 1 ('g', PDG 21, helicity -) is off shell: p^2 = +2.5e5, expected m^2 = +0e0 (|Δ| = +2.5e5). Fixed-helicity spinor/vector/tensor external states may be ill-defined at this kinematic point.
  833. 147.10 s > field value
  834. 147.10 s > span warm_up{integrand.name=se1l}
  835. 147.10 s > [2026-08-26 05:44:38.633] @process::amplitude INFO : Input is above threshold: 1 existing threshold E-surfaces across 1/1 graph groups
  836. 147.10 s > field value
  837. 147.10 s > existing_esurfaces 1
  838. 147.10 s > group_count 1
  839. 147.10 s > groups_above_threshold 1
  840. 147.10 s > integrand se1l
  841. 147.10 s > span warm_up{integrand.name=se1l}
  842. 147.10 s > threshold_status above threshold
  843. 147.10 s > [2026-08-26 05:44:38.633] @process::amplitude INFO : overlap structure of group 0: [1: [0(2,3)]]
  844. 147.10 s > field value
  845. 147.10 s > span warm_up{integrand.name=se1l}
  846. 147.10 s > [2026-08-26 05:44:38.637] @process::amplitude WARNING : External state 0 ('g', PDG 21, helicity +) is off shell: p^2 = +2.5e5, expected m^2 = +0e0 (|Δ| = +2.5e5). Fixed-helicity spinor/vector/tensor external states may be ill-defined at this kinematic point.
  847. 147.10 s > field value
  848. 147.10 s > span warm_up{integrand.name=se1l_rls_shifted}
  849. 147.10 s > [2026-08-26 05:44:38.637] @process::amplitude WARNING : External state 1 ('g', PDG 21, helicity -) is off shell: p^2 = +2.5e5, expected m^2 = +0e0 (|Δ| = +2.5e5). Fixed-helicity spinor/vector/tensor external states may be ill-defined at this kinematic point.
  850. 147.10 s > field value
  851. 147.10 s > span warm_up{integrand.name=se1l_rls_shifted}
  852. 147.10 s > [2026-08-26 05:44:38.637] @process::amplitude INFO : Input is above threshold: 1 existing threshold E-surfaces across 1/1 graph groups
  853. 147.10 s > field value
  854. 147.10 s > existing_esurfaces 1
  855. 147.10 s > group_count 1
  856. 147.10 s > groups_above_threshold 1
  857. 147.10 s > integrand se1l_rls_shifted
  858. 147.10 s > span warm_up{integrand.name=se1l_rls_shifted}
  859. 147.10 s > threshold_status above threshold
  860. 147.10 s > [2026-08-26 05:44:38.637] @process::amplitude INFO : overlap structure of group 0: [1: [0(2,3)]]
  861. 147.10 s > field value
  862. 147.10 s > span warm_up{integrand.name=se1l_rls_shifted}
  863. 147.10 s > [2026-08-26 05:44:38.641] @process::amplitude WARNING : External state 0 ('g', PDG 21, helicity +) is off shell: p^2 = +2.5e5, expected m^2 = +0e0 (|Δ| = +2.5e5). Fixed-helicity spinor/vector/tensor external states may be ill-defined at this kinematic point.
  864. 147.10 s > field value
  865. 147.10 s > span warm_up{integrand.name=se1l}
  866. 147.10 s > [2026-08-26 05:44:38.641] @process::amplitude WARNING : External state 1 ('g', PDG 21, helicity -) is off shell: p^2 = +2.5e5, expected m^2 = +0e0 (|Δ| = +2.5e5). Fixed-helicity spinor/vector/tensor external states may be ill-defined at this kinematic point.
  867. 147.10 s > field value
  868. 147.10 s > span warm_up{integrand.name=se1l}
  869. 147.10 s > [2026-08-26 05:44:38.641] @process::amplitude INFO : Input is above threshold: 1 existing threshold E-surfaces across 1/1 graph groups
  870. 147.10 s > field value
  871. 147.10 s > existing_esurfaces 1
  872. 147.10 s > group_count 1
  873. 147.10 s > groups_above_threshold 1
  874. 147.10 s > integrand se1l
  875. 147.10 s > span warm_up{integrand.name=se1l}
  876. 147.10 s > threshold_status above threshold
  877. 147.10 s > [2026-08-26 05:44:38.641] @process::amplitude INFO : overlap structure of group 0: [1: [0(2,3)]]
  878. 147.10 s > field value
  879. 147.10 s > span warm_up{integrand.name=se1l}
  880. 147.10 s > [2026-08-26 05:44:38.644] @process::amplitude WARNING : External state 0 ('g', PDG 21, helicity +) is off shell: p^2 = +2.5e5, expected m^2 = +0e0 (|Δ| = +2.5e5). Fixed-helicity spinor/vector/tensor external states may be ill-defined at this kinematic point.
  881. 147.10 s > field value
  882. 147.10 s > span warm_up{integrand.name=se1l_rls_shifted}
  883. 147.10 s > [2026-08-26 05:44:38.644] @process::amplitude WARNING : External state 1 ('g', PDG 21, helicity -) is off shell: p^2 = +2.5e5, expected m^2 = +0e0 (|Δ| = +2.5e5). Fixed-helicity spinor/vector/tensor external states may be ill-defined at this kinematic point.
  884. 147.10 s > field value
  885. 147.10 s > span warm_up{integrand.name=se1l_rls_shifted}
  886. 147.10 s > [2026-08-26 05:44:38.644] @process::amplitude INFO : Input is above threshold: 1 existing threshold E-surfaces across 1/1 graph groups
  887. 147.10 s > field value
  888. 147.10 s > existing_esurfaces 1
  889. 147.10 s > group_count 1
  890. 147.10 s > groups_above_threshold 1
  891. 147.10 s > integrand se1l_rls_shifted
  892. 147.10 s > span warm_up{integrand.name=se1l_rls_shifted}
  893. 147.10 s > threshold_status above threshold
  894. 147.10 s > [2026-08-26 05:44:38.645] @process::amplitude INFO : overlap structure of group 0: [1: [0(2,3)]]
  895. 147.10 s > field value
  896. 147.10 s > span warm_up{integrand.name=se1l_rls_shifted}
  897. 147.10 s > [2026-08-26 05:44:38.648] @process::amplitude WARNING : External state 0 ('g', PDG 21, helicity +) is off shell: p^2 = +2.5e5, expected m^2 = +0e0 (|Δ| = +2.5e5). Fixed-helicity spinor/vector/tensor external states may be ill-defined at this kinematic point.
  898. 147.10 s > field value
  899. 147.10 s > span warm_up{integrand.name=se1l}
  900. 147.10 s > [2026-08-26 05:44:38.648] @process::amplitude WARNING : External state 1 ('g', PDG 21, helicity -) is off shell: p^2 = +2.5e5, expected m^2 = +0e0 (|Δ| = +2.5e5). Fixed-helicity spinor/vector/tensor external states may be ill-defined at this kinematic point.
  901. 147.10 s > field value
  902. 147.10 s > span warm_up{integrand.name=se1l}
  903. 147.10 s > [2026-08-26 05:44:38.648] @process::amplitude INFO : Input is above threshold: 1 existing threshold E-surfaces across 1/1 graph groups
  904. 147.10 s > field value
  905. 147.10 s > existing_esurfaces 1
  906. 147.10 s > group_count 1
  907. 147.10 s > groups_above_threshold 1
  908. 147.10 s > integrand se1l
  909. 147.10 s > span warm_up{integrand.name=se1l}
  910. 147.10 s > threshold_status above threshold
  911. 147.10 s > [2026-08-26 05:44:38.649] @process::amplitude INFO : overlap structure of group 0: [1: [0(2,3)]]
  912. 147.10 s > field value
  913. 147.10 s > span warm_up{integrand.name=se1l}
  914. 147.10 s > [2026-08-26 05:44:38.652] @process::amplitude WARNING : External state 0 ('g', PDG 21, helicity +) is off shell: p^2 = +2.5e5, expected m^2 = +0e0 (|Δ| = +2.5e5). Fixed-helicity spinor/vector/tensor external states may be ill-defined at this kinematic point.
  915. 147.10 s > field value
  916. 147.10 s > span warm_up{integrand.name=se1l_mur_shifted}
  917. 147.10 s > [2026-08-26 05:44:38.652] @process::amplitude WARNING : External state 1 ('g', PDG 21, helicity -) is off shell: p^2 = +2.5e5, expected m^2 = +0e0 (|Δ| = +2.5e5). Fixed-helicity spinor/vector/tensor external states may be ill-defined at this kinematic point.
  918. 147.10 s > field value
  919. 147.10 s > span warm_up{integrand.name=se1l_mur_shifted}
  920. 147.10 s > [2026-08-26 05:44:38.652] @process::amplitude INFO : Input is above threshold: 1 existing threshold E-surfaces across 1/1 graph groups
  921. 147.10 s > field value
  922. 147.10 s > existing_esurfaces 1
  923. 147.10 s > group_count 1
  924. 147.10 s > groups_above_threshold 1
  925. 147.10 s > integrand se1l_mur_shifted
  926. 147.10 s > span warm_up{integrand.name=se1l_mur_shifted}
  927. 147.10 s > threshold_status above threshold
  928. 147.10 s > [2026-08-26 05:44:38.652] @process::amplitude INFO : overlap structure of group 0: [1: [0(2,3)]]
  929. 147.10 s > field value
  930. 147.10 s > span warm_up{integrand.name=se1l_mur_shifted}
  931. 147.10 s > [2026-08-26 05:44:38.657] @process::amplitude WARNING : External state 0 ('g', PDG 21, helicity +) is off shell: p^2 = +2.5e5, expected m^2 = +0e0 (|Δ| = +2.5e5). Fixed-helicity spinor/vector/tensor external states may be ill-defined at this kinematic point.
  932. 147.10 s > field value
  933. 147.10 s > span warm_up{integrand.name=se1l}
  934. 147.10 s > [2026-08-26 05:44:38.657] @process::amplitude WARNING : External state 1 ('g', PDG 21, helicity -) is off shell: p^2 = +2.5e5, expected m^2 = +0e0 (|Δ| = +2.5e5). Fixed-helicity spinor/vector/tensor external states may be ill-defined at this kinematic point.
  935. 147.10 s > field value
  936. 147.10 s > span warm_up{integrand.name=se1l}
  937. 147.10 s > [2026-08-26 05:44:38.657] @process::amplitude INFO : Input is above threshold: 1 existing threshold E-surfaces across 1/1 graph groups
  938. 147.10 s > field value
  939. 147.10 s > existing_esurfaces 1
  940. 147.10 s > group_count 1
  941. 147.10 s > groups_above_threshold 1
  942. 147.10 s > integrand se1l
  943. 147.10 s > span warm_up{integrand.name=se1l}
  944. 147.10 s > threshold_status above threshold
  945. 147.10 s > [2026-08-26 05:44:38.657] @process::amplitude INFO : overlap structure of group 0: [1: [0(2,3)]]
  946. 147.10 s > field value
  947. 147.10 s > span warm_up{integrand.name=se1l}
  948. 147.10 s > [2026-08-26 05:44:38.660] @process::amplitude WARNING : External state 0 ('g', PDG 21, helicity +) is off shell: p^2 = +2.5e5, expected m^2 = +0e0 (|Δ| = +2.5e5). Fixed-helicity spinor/vector/tensor external states may be ill-defined at this kinematic point.
  949. 147.10 s > field value
  950. 147.10 s > span warm_up{integrand.name=se1l_mur_shifted}
  951. 147.10 s > [2026-08-26 05:44:38.660] @process::amplitude WARNING : External state 1 ('g', PDG 21, helicity -) is off shell: p^2 = +2.5e5, expected m^2 = +0e0 (|Δ| = +2.5e5). Fixed-helicity spinor/vector/tensor external states may be ill-defined at this kinematic point.
  952. 147.10 s > field value
  953. 147.10 s > span warm_up{integrand.name=se1l_mur_shifted}
  954. 147.10 s > [2026-08-26 05:44:38.660] @process::amplitude INFO : Input is above threshold: 1 existing threshold E-surfaces across 1/1 graph groups
  955. 147.10 s > field value
  956. 147.10 s > existing_esurfaces 1
  957. 147.10 s > group_count 1
  958. 147.10 s > groups_above_threshold 1
  959. 147.10 s > integrand se1l_mur_shifted
  960. 147.10 s > span warm_up{integrand.name=se1l_mur_shifted}
  961. 147.10 s > threshold_status above threshold
  962. 147.10 s > [2026-08-26 05:44:38.661] @process::amplitude INFO : overlap structure of group 0: [1: [0(2,3)]]
  963. 147.10 s > field value
  964. 147.10 s > span warm_up{integrand.name=se1l_mur_shifted}
  965. 147.10 s > [2026-08-26 05:44:38.664] @process::amplitude WARNING : External state 0 ('g', PDG 21, helicity +) is off shell: p^2 = +2.5e5, expected m^2 = +0e0 (|Δ| = +2.5e5). Fixed-helicity spinor/vector/tensor external states may be ill-defined at this kinematic point.
  966. 147.10 s > field value
  967. 147.10 s > span warm_up{integrand.name=se1l}
  968. 147.10 s > [2026-08-26 05:44:38.664] @process::amplitude WARNING : External state 1 ('g', PDG 21, helicity -) is off shell: p^2 = +2.5e5, expected m^2 = +0e0 (|Δ| = +2.5e5). Fixed-helicity spinor/vector/tensor external states may be ill-defined at this kinematic point.
  969. 147.10 s > field value
  970. 147.10 s > span warm_up{integrand.name=se1l}
  971. 147.10 s > [2026-08-26 05:44:38.664] @process::amplitude INFO : Input is above threshold: 1 existing threshold E-surfaces across 1/1 graph groups
  972. 147.10 s > field value
  973. 147.10 s > existing_esurfaces 1
  974. 147.10 s > group_count 1
  975. 147.10 s > groups_above_threshold 1
  976. 147.10 s > integrand se1l
  977. 147.10 s > span warm_up{integrand.name=se1l}
  978. 147.10 s > threshold_status above threshold
  979. 147.10 s > [2026-08-26 05:44:38.664] @process::amplitude INFO : overlap structure of group 0: [1: [0(2,3)]]
  980. 147.10 s > field value
  981. 147.10 s > span warm_up{integrand.name=se1l}
  982. 147.10 s > [2026-08-26 05:44:38.668] @process::amplitude WARNING : External state 0 ('g', PDG 21, helicity +) is off shell: p^2 = +2.5e5, expected m^2 = +0e0 (|Δ| = +2.5e5). Fixed-helicity spinor/vector/tensor external states may be ill-defined at this kinematic point.
  983. 147.10 s > field value
  984. 147.10 s > span warm_up{integrand.name=se1l_mur_shifted}
  985. 147.10 s > [2026-08-26 05:44:38.668] @process::amplitude WARNING : External state 1 ('g', PDG 21, helicity -) is off shell: p^2 = +2.5e5, expected m^2 = +0e0 (|Δ| = +2.5e5). Fixed-helicity spinor/vector/tensor external states may be ill-defined at this kinematic point.
  986. 147.10 s > field value
  987. 147.10 s > span warm_up{integrand.name=se1l_mur_shifted}
  988. 147.10 s > [2026-08-26 05:44:38.668] @process::amplitude INFO : Input is above threshold: 1 existing threshold E-surfaces across 1/1 graph groups
  989. 147.10 s > field value
  990. 147.10 s > existing_esurfaces 1
  991. 147.10 s > group_count 1
  992. 147.10 s > groups_above_threshold 1
  993. 147.10 s > integrand se1l_mur_shifted
  994. 147.10 s > span warm_up{integrand.name=se1l_mur_shifted}
  995. 147.10 s > threshold_status above threshold
  996. 147.10 s > [2026-08-26 05:44:38.668] @process::amplitude INFO : overlap structure of group 0: [1: [0(2,3)]]
  997. 147.10 s > field value
  998. 147.10 s > span warm_up{integrand.name=se1l_mur_shifted}
  999. 147.10 s > [2026-08-26 05:44:38.672] @process::amplitude WARNING : External state 0 ('g', PDG 21, helicity +) is off shell: p^2 = +2.5e5, expected m^2 = +0e0 (|Δ| = +2.5e5). Fixed-helicity spinor/vector/tensor external states may be ill-defined at this kinematic point.
  1000. 147.10 s > field value
  1001. 147.10 s > span warm_up{integrand.name=se1l}
  1002. 147.10 s > [2026-08-26 05:44:38.672] @process::amplitude WARNING : External state 1 ('g', PDG 21, helicity -) is off shell: p^2 = +2.5e5, expected m^2 = +0e0 (|Δ| = +2.5e5). Fixed-helicity spinor/vector/tensor external states may be ill-defined at this kinematic point.
  1003. 147.10 s > field value
  1004. 147.10 s > span warm_up{integrand.name=se1l}
  1005. 147.10 s > [2026-08-26 05:44:38.672] @process::amplitude INFO : Input is above threshold: 1 existing threshold E-surfaces across 1/1 graph groups
  1006. 147.10 s > field value
  1007. 147.10 s > existing_esurfaces 1
  1008. 147.10 s > group_count 1
  1009. 147.10 s > groups_above_threshold 1
  1010. 147.10 s > integrand se1l
  1011. 147.10 s > span warm_up{integrand.name=se1l}
  1012. 147.10 s > threshold_status above threshold
  1013. 147.10 s > [2026-08-26 05:44:38.672] @process::amplitude INFO : overlap structure of group 0: [1: [0(2,3)]]
  1014. 147.10 s > field value
  1015. 147.10 s > span warm_up{integrand.name=se1l}
  1016. 147.10 s > [2026-08-26 05:44:38.676] @process::amplitude WARNING : External state 0 ('g', PDG 21, helicity +) is off shell: p^2 = +2.5e5, expected m^2 = +0e0 (|Δ| = +2.5e5). Fixed-helicity spinor/vector/tensor external states may be ill-defined at this kinematic point.
  1017. 147.10 s > field value
  1018. 147.10 s > span warm_up{integrand.name=se1l_mur_shifted}
  1019. 147.10 s > [2026-08-26 05:44:38.676] @process::amplitude WARNING : External state 1 ('g', PDG 21, helicity -) is off shell: p^2 = +2.5e5, expected m^2 = +0e0 (|Δ| = +2.5e5). Fixed-helicity spinor/vector/tensor external states may be ill-defined at this kinematic point.
  1020. 147.10 s > field value
  1021. 147.10 s > span warm_up{integrand.name=se1l_mur_shifted}
  1022. 147.10 s > [2026-08-26 05:44:38.676] @process::amplitude INFO : Input is above threshold: 1 existing threshold E-surfaces across 1/1 graph groups
  1023. 147.10 s > field value
  1024. 147.10 s > existing_esurfaces 1
  1025. 147.10 s > group_count 1
  1026. 147.10 s > groups_above_threshold 1
  1027. 147.10 s > integrand se1l_mur_shifted
  1028. 147.10 s > span warm_up{integrand.name=se1l_mur_shifted}
  1029. 147.10 s > threshold_status above threshold
  1030. 147.10 s > [2026-08-26 05:44:38.676] @process::amplitude INFO : overlap structure of group 0: [1: [0(2,3)]]
  1031. 147.10 s > field value
  1032. 147.10 s > span warm_up{integrand.name=se1l_mur_shifted}
  1033. 147.10 s > [2026-08-26 05:44:38.680] @process::amplitude WARNING : External state 0 ('g', PDG 21, helicity +) is off shell: p^2 = +2.5e5, expected m^2 = +0e0 (|Δ| = +2.5e5). Fixed-helicity spinor/vector/tensor external states may be ill-defined at this kinematic point.
  1034. 147.10 s > field value
  1035. 147.10 s > span warm_up{integrand.name=se1l}
  1036. 147.10 s > [2026-08-26 05:44:38.680] @process::amplitude WARNING : External state 1 ('g', PDG 21, helicity -) is off shell: p^2 = +2.5e5, expected m^2 = +0e0 (|Δ| = +2.5e5). Fixed-helicity spinor/vector/tensor external states may be ill-defined at this kinematic point.
  1037. 147.10 s > field value
  1038. 147.10 s > span warm_up{integrand.name=se1l}
  1039. 147.10 s > [2026-08-26 05:44:38.680] @process::amplitude INFO : Input is above threshold: 1 existing threshold E-surfaces across 1/1 graph groups
  1040. 147.10 s > field value
  1041. 147.10 s > existing_esurfaces 1
  1042. 147.10 s > group_count 1
  1043. 147.10 s > groups_above_threshold 1
  1044. 147.10 s > integrand se1l
  1045. 147.10 s > span warm_up{integrand.name=se1l}
  1046. 147.10 s > threshold_status above threshold
  1047. 147.10 s > [2026-08-26 05:44:38.680] @process::amplitude INFO : overlap structure of group 0: [1: [0(2,3)]]
  1048. 147.10 s > field value
  1049. 147.10 s > span warm_up{integrand.name=se1l}
  1050. 147.10 s > [2026-08-26 05:44:38.684] @process::amplitude WARNING : External state 0 ('g', PDG 21, helicity +) is off shell: p^2 = +2.5e5, expected m^2 = +0e0 (|Δ| = +2.5e5). Fixed-helicity spinor/vector/tensor external states may be ill-defined at this kinematic point.
  1051. 147.10 s > field value
  1052. 147.10 s > span warm_up{integrand.name=se1l_mur_shifted}
  1053. 147.10 s > [2026-08-26 05:44:38.684] @process::amplitude WARNING : External state 1 ('g', PDG 21, helicity -) is off shell: p^2 = +2.5e5, expected m^2 = +0e0 (|Δ| = +2.5e5). Fixed-helicity spinor/vector/tensor external states may be ill-defined at this kinematic point.
  1054. 147.10 s > field value
  1055. 147.10 s > span warm_up{integrand.name=se1l_mur_shifted}
  1056. 147.10 s > [2026-08-26 05:44:38.684] @process::amplitude INFO : Input is above threshold: 1 existing threshold E-surfaces across 1/1 graph groups
  1057. 147.10 s > field value
  1058. 147.10 s > existing_esurfaces 1
  1059. 147.10 s > group_count 1
  1060. 147.10 s > groups_above_threshold 1
  1061. 147.10 s > integrand se1l_mur_shifted
  1062. 147.10 s > span warm_up{integrand.name=se1l_mur_shifted}
  1063. 147.10 s > threshold_status above threshold
  1064. 147.10 s > [2026-08-26 05:44:38.684] @process::amplitude INFO : overlap structure of group 0: [1: [0(2,3)]]
  1065. 147.10 s > field value
  1066. 147.10 s > span warm_up{integrand.name=se1l_mur_shifted}
  1067. 147.10 s > [2026-08-26 05:44:38.689] @process::amplitude WARNING : External state 0 ('g', PDG 21, helicity +) is off shell: p^2 = +2.5e5, expected m^2 = +0e0 (|Δ| = +2.5e5). Fixed-helicity spinor/vector/tensor external states may be ill-defined at this kinematic point.
  1068. 147.10 s > field value
  1069. 147.10 s > span warm_up{integrand.name=se1l}
  1070. 147.10 s > [2026-08-26 05:44:38.689] @process::amplitude WARNING : External state 1 ('g', PDG 21, helicity -) is off shell: p^2 = +2.5e5, expected m^2 = +0e0 (|Δ| = +2.5e5). Fixed-helicity spinor/vector/tensor external states may be ill-defined at this kinematic point.
  1071. 147.10 s > field value
  1072. 147.10 s > span warm_up{integrand.name=se1l}
  1073. 147.10 s > [2026-08-26 05:44:38.690] @process::amplitude INFO : Input is above threshold: 1 existing threshold E-surfaces across 1/1 graph groups
  1074. 147.10 s > field value
  1075. 147.10 s > existing_esurfaces 1
  1076. 147.10 s > group_count 1
  1077. 147.10 s > groups_above_threshold 1
  1078. 147.10 s > integrand se1l
  1079. 147.10 s > span warm_up{integrand.name=se1l}
  1080. 147.10 s > threshold_status above threshold
  1081. 147.10 s > [2026-08-26 05:44:38.690] @process::amplitude INFO : overlap structure of group 0: [1: [0(2,3)]]
  1082. 147.10 s > field value
  1083. 147.10 s > span warm_up{integrand.name=se1l}
  1084. 147.10 s > [2026-08-26 05:44:38.693] @process::amplitude WARNING : External state 0 ('g', PDG 21, helicity +) is off shell: p^2 = +2.5e5, expected m^2 = +0e0 (|Δ| = +2.5e5). Fixed-helicity spinor/vector/tensor external states may be ill-defined at this kinematic point.
  1085. 147.10 s > field value
  1086. 147.10 s > span warm_up{integrand.name=se1l_mur_shifted}
  1087. 147.10 s > [2026-08-26 05:44:38.693] @process::amplitude WARNING : External state 1 ('g', PDG 21, helicity -) is off shell: p^2 = +2.5e5, expected m^2 = +0e0 (|Δ| = +2.5e5). Fixed-helicity spinor/vector/tensor external states may be ill-defined at this kinematic point.
  1088. 147.10 s > field value
  1089. 147.10 s > span warm_up{integrand.name=se1l_mur_shifted}
  1090. 147.10 s > [2026-08-26 05:44:38.693] @process::amplitude INFO : Input is above threshold: 1 existing threshold E-surfaces across 1/1 graph groups
  1091. 147.10 s > field value
  1092. 147.10 s > existing_esurfaces 1
  1093. 147.10 s > group_count 1
  1094. 147.10 s > groups_above_threshold 1
  1095. 147.10 s > integrand se1l_mur_shifted
  1096. 147.10 s > span warm_up{integrand.name=se1l_mur_shifted}
  1097. 147.10 s > threshold_status above threshold
  1098. 147.10 s > [2026-08-26 05:44:38.693] @process::amplitude INFO : overlap structure of group 0: [1: [0(2,3)]]
  1099. 147.10 s > field value
  1100. 147.10 s > span warm_up{integrand.name=se1l_mur_shifted}
  1101. 147.10 s > [2026-08-26 05:44:38.698] @process::amplitude WARNING : External state 0 ('g', PDG 21, helicity +) is off shell: p^2 = +2.5e5, expected m^2 = +0e0 (|Δ| = +2.5e5). Fixed-helicity spinor/vector/tensor external states may be ill-defined at this kinematic point.
  1102. 147.10 s > field value
  1103. 147.10 s > span warm_up{integrand.name=se1l}
  1104. 147.10 s > [2026-08-26 05:44:38.698] @process::amplitude WARNING : External state 1 ('g', PDG 21, helicity -) is off shell: p^2 = +2.5e5, expected m^2 = +0e0 (|Δ| = +2.5e5). Fixed-helicity spinor/vector/tensor external states may be ill-defined at this kinematic point.
  1105. 147.10 s > field value
  1106. 147.10 s > span warm_up{integrand.name=se1l}
  1107. 147.10 s > [2026-08-26 05:44:38.698] @process::amplitude INFO : Input is above threshold: 1 existing threshold E-surfaces across 1/1 graph groups
  1108. 147.10 s > field value
  1109. 147.10 s > existing_esurfaces 1
  1110. 147.10 s > group_count 1
  1111. 147.10 s > groups_above_threshold 1
  1112. 147.10 s > integrand se1l
  1113. 147.10 s > span warm_up{integrand.name=se1l}
  1114. 147.10 s > threshold_status above threshold
  1115. 147.10 s > [2026-08-26 05:44:38.698] @process::amplitude INFO : overlap structure of group 0: [1: [0(2,3)]]
  1116. 147.10 s > field value
  1117. 147.10 s > span warm_up{integrand.name=se1l}
  1118. 147.10 s > [2026-08-26 05:44:38.703] @process::amplitude WARNING : External state 0 ('g', PDG 21, helicity +) is off shell: p^2 = +2.5e5, expected m^2 = +0e0 (|Δ| = +2.5e5). Fixed-helicity spinor/vector/tensor external states may be ill-defined at this kinematic point.
  1119. 147.10 s > field value
  1120. 147.10 s > span warm_up{integrand.name=se1l_mur_shifted}
  1121. 147.10 s > [2026-08-26 05:44:38.703] @process::amplitude WARNING : External state 1 ('g', PDG 21, helicity -) is off shell: p^2 = +2.5e5, expected m^2 = +0e0 (|Δ| = +2.5e5). Fixed-helicity spinor/vector/tensor external states may be ill-defined at this kinematic point.
  1122. 147.10 s > field value
  1123. 147.10 s > span warm_up{integrand.name=se1l_mur_shifted}
  1124. 147.10 s > [2026-08-26 05:44:38.703] @process::amplitude INFO : Input is above threshold: 1 existing threshold E-surfaces across 1/1 graph groups
  1125. 147.10 s > field value
  1126. 147.10 s > existing_esurfaces 1
  1127. 147.10 s > group_count 1
  1128. 147.10 s > groups_above_threshold 1
  1129. 147.10 s > integrand se1l_mur_shifted
  1130. 147.10 s > span warm_up{integrand.name=se1l_mur_shifted}
  1131. 147.10 s > threshold_status above threshold
  1132. 147.10 s > [2026-08-26 05:44:38.704] @process::amplitude INFO : overlap structure of group 0: [1: [0(2,3)]]
  1133. 147.10 s > field value
  1134. 147.10 s > span warm_up{integrand.name=se1l_mur_shifted}
  1135. 147.10 s > [2026-08-26 05:44:38.707] @process::amplitude WARNING : External state 0 ('g', PDG 21, helicity +) is off shell: p^2 = +2.5e5, expected m^2 = +0e0 (|Δ| = +2.5e5). Fixed-helicity spinor/vector/tensor external states may be ill-defined at this kinematic point.
  1136. 147.10 s > field value
  1137. 147.10 s > span warm_up{integrand.name=se1l}
  1138. 147.10 s > [2026-08-26 05:44:38.707] @process::amplitude WARNING : External state 1 ('g', PDG 21, helicity -) is off shell: p^2 = +2.5e5, expected m^2 = +0e0 (|Δ| = +2.5e5). Fixed-helicity spinor/vector/tensor external states may be ill-defined at this kinematic point.
  1139. 147.10 s > field value
  1140. 147.10 s > span warm_up{integrand.name=se1l}
  1141. 147.10 s > [2026-08-26 05:44:38.707] @process::amplitude INFO : Input is above threshold: 1 existing threshold E-surfaces across 1/1 graph groups
  1142. 147.10 s > field value
  1143. 147.10 s > existing_esurfaces 1
  1144. 147.10 s > group_count 1
  1145. 147.10 s > groups_above_threshold 1
  1146. 147.10 s > integrand se1l
  1147. 147.10 s > span warm_up{integrand.name=se1l}
  1148. 147.10 s > threshold_status above threshold
  1149. 147.10 s > [2026-08-26 05:44:38.707] @process::amplitude INFO : overlap structure of group 0: [1: [0(2,3)]]
  1150. 147.10 s > field value
  1151. 147.10 s > span warm_up{integrand.name=se1l}
  1152. 147.10 s > [2026-08-26 05:44:38.711] @process::amplitude WARNING : External state 0 ('g', PDG 21, helicity +) is off shell: p^2 = +2.5e5, expected m^2 = +0e0 (|Δ| = +2.5e5). Fixed-helicity spinor/vector/tensor external states may be ill-defined at this kinematic point.
  1153. 147.10 s > field value
  1154. 147.10 s > span warm_up{integrand.name=se1l_mur_shifted}
  1155. 147.10 s > [2026-08-26 05:44:38.711] @process::amplitude WARNING : External state 1 ('g', PDG 21, helicity -) is off shell: p^2 = +2.5e5, expected m^2 = +0e0 (|Δ| = +2.5e5). Fixed-helicity spinor/vector/tensor external states may be ill-defined at this kinematic point.
  1156. 147.10 s > field value
  1157. 147.10 s > span warm_up{integrand.name=se1l_mur_shifted}
  1158. 147.10 s > [2026-08-26 05:44:38.711] @process::amplitude INFO : Input is above threshold: 1 existing threshold E-surfaces across 1/1 graph groups
  1159. 147.10 s > field value
  1160. 147.10 s > existing_esurfaces 1
  1161. 147.10 s > group_count 1
  1162. 147.10 s > groups_above_threshold 1
  1163. 147.10 s > integrand se1l_mur_shifted
  1164. 147.10 s > span warm_up{integrand.name=se1l_mur_shifted}
  1165. 147.10 s > threshold_status above threshold
  1166. 147.10 s > [2026-08-26 05:44:38.711] @process::amplitude INFO : overlap structure of group 0: [1: [0(2,3)]]
  1167. 147.10 s > field value
  1168. 147.10 s > span warm_up{integrand.name=se1l_mur_shifted}
  1169. 147.10 s > [2026-08-26 05:44:38.715] @process::amplitude WARNING : External state 0 ('g', PDG 21, helicity +) is off shell: p^2 = +2.5e5, expected m^2 = +0e0 (|Δ| = +2.5e5). Fixed-helicity spinor/vector/tensor external states may be ill-defined at this kinematic point.
  1170. 147.10 s > field value
  1171. 147.10 s > span warm_up{integrand.name=se1l}
  1172. 147.10 s > [2026-08-26 05:44:38.715] @process::amplitude WARNING : External state 1 ('g', PDG 21, helicity -) is off shell: p^2 = +2.5e5, expected m^2 = +0e0 (|Δ| = +2.5e5). Fixed-helicity spinor/vector/tensor external states may be ill-defined at this kinematic point.
  1173. 147.10 s > field value
  1174. 147.10 s > span warm_up{integrand.name=se1l}
  1175. 147.10 s > [2026-08-26 05:44:38.715] @process::amplitude INFO : Input is above threshold: 1 existing threshold E-surfaces across 1/1 graph groups
  1176. 147.10 s > field value
  1177. 147.10 s > existing_esurfaces 1
  1178. 147.10 s > group_count 1
  1179. 147.10 s > groups_above_threshold 1
  1180. 147.10 s > integrand se1l
  1181. 147.10 s > span warm_up{integrand.name=se1l}
  1182. 147.10 s > threshold_status above threshold
  1183. 147.10 s > [2026-08-26 05:44:38.715] @process::amplitude INFO : overlap structure of group 0: [1: [0(2,3)]]
  1184. 147.10 s > field value
  1185. 147.10 s > span warm_up{integrand.name=se1l}
  1186. 147.10 s > [2026-08-26 05:44:38.719] @process::amplitude WARNING : External state 0 ('g', PDG 21, helicity +) is off shell: p^2 = +2.5e5, expected m^2 = +0e0 (|Δ| = +2.5e5). Fixed-helicity spinor/vector/tensor external states may be ill-defined at this kinematic point.
  1187. 147.10 s > field value
  1188. 147.10 s > span warm_up{integrand.name=se1l_mur_shifted}
  1189. 147.10 s > [2026-08-26 05:44:38.719] @process::amplitude WARNING : External state 1 ('g', PDG 21, helicity -) is off shell: p^2 = +2.5e5, expected m^2 = +0e0 (|Δ| = +2.5e5). Fixed-helicity spinor/vector/tensor external states may be ill-defined at this kinematic point.
  1190. 147.10 s > field value
  1191. 147.10 s > span warm_up{integrand.name=se1l_mur_shifted}
  1192. 147.10 s > [2026-08-26 05:44:38.719] @process::amplitude INFO : Input is above threshold: 1 existing threshold E-surfaces across 1/1 graph groups
  1193. 147.10 s > field value
  1194. 147.10 s > existing_esurfaces 1
  1195. 147.10 s > group_count 1
  1196. 147.10 s > groups_above_threshold 1
  1197. 147.10 s > integrand se1l_mur_shifted
  1198. 147.10 s > span warm_up{integrand.name=se1l_mur_shifted}
  1199. 147.10 s > threshold_status above threshold
  1200. 147.10 s > [2026-08-26 05:44:38.719] @process::amplitude INFO : overlap structure of group 0: [1: [0(2,3)]]
  1201. 147.10 s > field value
  1202. 147.10 s > span warm_up{integrand.name=se1l_mur_shifted}
  1203. 147.10 s > [2026-08-26 05:44:38.723] @process::amplitude WARNING : External state 0 ('g', PDG 21, helicity +) is off shell: p^2 = +2.5e5, expected m^2 = +0e0 (|Δ| = +2.5e5). Fixed-helicity spinor/vector/tensor external states may be ill-defined at this kinematic point.
  1204. 147.10 s > field value
  1205. 147.10 s > span warm_up{integrand.name=se1l}
  1206. 147.10 s > [2026-08-26 05:44:38.723] @process::amplitude WARNING : External state 1 ('g', PDG 21, helicity -) is off shell: p^2 = +2.5e5, expected m^2 = +0e0 (|Δ| = +2.5e5). Fixed-helicity spinor/vector/tensor external states may be ill-defined at this kinematic point.
  1207. 147.10 s > field value
  1208. 147.10 s > span warm_up{integrand.name=se1l}
  1209. 147.10 s > [2026-08-26 05:44:38.723] @process::amplitude INFO : Input is above threshold: 1 existing threshold E-surfaces across 1/1 graph groups
  1210. 147.10 s > field value
  1211. 147.10 s > existing_esurfaces 1
  1212. 147.10 s > group_count 1
  1213. 147.10 s > groups_above_threshold 1
  1214. 147.10 s > integrand se1l
  1215. 147.10 s > span warm_up{integrand.name=se1l}
  1216. 147.10 s > threshold_status above threshold
  1217. 147.10 s > [2026-08-26 05:44:38.723] @process::amplitude INFO : overlap structure of group 0: [1: [0(2,3)]]
  1218. 147.10 s > field value
  1219. 147.10 s > span warm_up{integrand.name=se1l}
  1220. 147.10 s > [2026-08-26 05:44:38.726] @process::amplitude WARNING : External state 0 ('g', PDG 21, helicity +) is off shell: p^2 = +2.5e5, expected m^2 = +0e0 (|Δ| = +2.5e5). Fixed-helicity spinor/vector/tensor external states may be ill-defined at this kinematic point.
  1221. 147.10 s > field value
  1222. 147.10 s > span warm_up{integrand.name=se1l_mur_shifted}
  1223. 147.10 s > [2026-08-26 05:44:38.726] @process::amplitude WARNING : External state 1 ('g', PDG 21, helicity -) is off shell: p^2 = +2.5e5, expected m^2 = +0e0 (|Δ| = +2.5e5). Fixed-helicity spinor/vector/tensor external states may be ill-defined at this kinematic point.
  1224. 147.10 s > field value
  1225. 147.10 s > span warm_up{integrand.name=se1l_mur_shifted}
  1226. 147.10 s > [2026-08-26 05:44:38.726] @process::amplitude INFO : Input is above threshold: 1 existing threshold E-surfaces across 1/1 graph groups
  1227. 147.10 s > field value
  1228. 147.10 s > existing_esurfaces 1
  1229. 147.10 s > group_count 1
  1230. 147.10 s > groups_above_threshold 1
  1231. 147.10 s > integrand se1l_mur_shifted
  1232. 147.10 s > span warm_up{integrand.name=se1l_mur_shifted}
  1233. 147.10 s > threshold_status above threshold
  1234. 147.10 s > [2026-08-26 05:44:38.726] @process::amplitude INFO : overlap structure of group 0: [1: [0(2,3)]]
  1235. 147.10 s > field value
  1236. 147.10 s > span warm_up{integrand.name=se1l_mur_shifted}
  1237. 147.10 s > The application panicked (crashed).
  1238. 147.10 s > Message: Integrated UV case failed: se1l
  1239. 147.10 s > Location: tests/tests/uv.rs:1068
  1240. 147.10 s >
  1241. 147.10 s > ━━━━━━━━━━━━━━━━━━━━━━━━━━━━━━━━━━ BACKTRACE ━━━━━━━━━━━━━━━━━━━━━━━━━━━━━━━━━━━
  1242. 147.10 s > 1: <color_eyre[51793ea62743adbd]::config::PanicHook>::panic_report<unknown>
  1243. 147.10 s > at <unknown source file>:<unknown line>
  1244. 147.10 s > 2: <color_eyre[51793ea62743adbd]::config::PanicHook>::into_panic_hook::{closure#0}<unknown>
  1245. 147.10 s > at <unknown source file>:<unknown line>
  1246. 147.10 s > 3: std[bcb96dfbba0ab899]::panicking::panic_with_hook<unknown>
  1247. 147.10 s > at <unknown source file>:<unknown line>
  1248. 147.10 s > 4: std[bcb96dfbba0ab899]::panicking::panic_handler::{closure#0}<unknown>
  1249. 147.10 s > at <unknown source file>:<unknown line>
  1250. 147.10 s > 5: std[bcb96dfbba0ab899]::sys::backtrace::__rust_end_short_backtrace::<std[bcb96dfbba0ab899]::panicking::panic_handler::{closure#0}, !><unknown>
  1251. 147.10 s > at <unknown source file>:<unknown line>
  1252. 147.10 s > 6: __rustc[6c289b9f9c454d21]::rust_begin_unwind<unknown>
  1253. 147.10 s > at <unknown source file>:<unknown line>
  1254. 147.10 s > 7: core[940e698046960fd5]::panicking::panic_fmt<unknown>
  1255. 147.10 s > at <unknown source file>:<unknown line>
  1256. 147.10 s > 8: uv[52cf2b63f0104e31]::run_single_integrated_uv_case<unknown>
  1257. 147.10 s > at <unknown source file>:<unknown line>
  1258. 147.10 s > 9: <uv[52cf2b63f0104e31]::se1l_uv::{closure#0} as core[940e698046960fd5]::ops::function::FnOnce<()>>::call_once<unknown>
  1259. 147.10 s > at <unknown source file>:<unknown line>
  1260. 147.10 s > 10: test[75d6903177b1d7e9]::__rust_begin_short_backtrace::<core[940e698046960fd5]::result::Result<(), alloc[2ea6bcb46fca0c42]::string::String>, fn() -> core[940e698046960fd5]::result::Result<(), alloc[2ea6bcb46fca0c42]::string::String>><unknown>
  1261. 147.10 s > at <unknown source file>:<unknown line>
  1262. 147.10 s > 11: test[75d6903177b1d7e9]::run_test::{closure#0}<unknown>
  1263. 147.10 s > at <unknown source file>:<unknown line>
  1264. 147.10 s > 12: std[bcb96dfbba0ab899]::sys::backtrace::__rust_begin_short_backtrace::<test[75d6903177b1d7e9]::run_test::{closure#1}, ()><unknown>
  1265. 147.10 s > at <unknown source file>:<unknown line>
  1266. 147.10 s > 13: <std[bcb96dfbba0ab899]::thread::lifecycle::spawn_unchecked<test[75d6903177b1d7e9]::run_test::{closure#1}, ()>::{closure#1} as core[940e698046960fd5]::ops::function::FnOnce<()>>::call_once::{shim:vtable#0}<unknown>
  1267. 147.10 s > at <unknown source file>:<unknown line>
  1268. 147.10 s > 14: <std[bcb96dfbba0ab899]::sys::thread::unix::Thread>::new::thread_start<unknown>
  1269. 147.10 s > at <unknown source file>:<unknown line>
  1270. 147.10 s > 15: start_thread<unknown>
  1271. 147.10 s > at <unknown source file>:<unknown line>
  1272. 147.10 s > 16: __clone3<unknown>
  1273. 147.10 s > at <unknown source file>:<unknown line>
  1274. 147.10 s >
  1275. 147.10 s > Run with COLORBT_SHOW_HIDDEN=1 environment variable to disable frame filtering.
  1276. 147.10 s > Run with RUST_BACKTRACE=full to include source snippets.
  1277. 147.10 s >
  1278. 147.10 s > error: test run failed
  1279. 147.10 s >
  1280. 147.10 s > ========== nextest test summary ==========
  1281. 147.10 s > report: target/nextest/ci_gammaloop/junit.xml
  1282. 147.10 s > tests: 106, failures: 9, errors: 0
  1283. 147.10 s >
  1284. 147.10 s > 1. gammaloop-integration-tests::test_runs::approach::approach_momentum_space_reports_incomplete_triplet_cleanly
  1285. 147.10 s > failure: test failure with exit code 101
  1286. 147.10 s > system-out
  1287. 147.10 s > running 1 test
  1288. 147.10 s > test approach::approach_momentum_space_reports_incomplete_triplet_cleanly ... FAILED
  1289. 147.10 s >
  1290. 147.10 s > failures:
  1291. 147.10 s >
  1292. 147.10 s > failures:
  1293. 147.10 s > approach::approach_momentum_space_reports_incomplete_triplet_cleanly
  1294. 147.10 s >
  1295. 147.10 s > test result: FAILED. 0 passed; 1 failed; 0 ignored; 0 measured; 82 filtered out; finished in 0.63s
  1296. 147.10 s > system-err
  1297. 147.10 s > [2026-08-26 05:42:36.752] @gammaloop_api::se... INFO : Running command import model scalars-default.json
  1298. 147.10 s > [2026-08-26 05:42:36.752] @import::model INFO : Loading built-in JSON model scalars-default
  1299. 147.10 s > [2026-08-26 05:42:36.757] @gammalooprs::model INFO : The following 2 external parameters were forced to zero by the restriction card:
  1300. 147.10 s > width_scalar_1, width_scalar_2
  1301. 147.10 s > [2026-08-26 05:42:36.758] @gammaloop_api::se... INFO : Running command remove processes
  1302. 147.10 s > [2026-08-26 05:42:36.759] @gammaloop_api::se... INFO : Running command generate amp scalar_1 > scalar_0 scalar_0 [{1}] --allowed-vertex-interactions V_3_SCALAR_022 V_3_SCALAR_122 -p triangle -i scalar_tri
  1303. 147.10 s > [2026-08-26 05:42:36.761] @feyngen::diagram_... INFO : 0s | Δ=0s | Starting Feynman graph generation with Symbolica...
  1304. 147.10 s > [2026-08-26 05:42:36.761] @feyngen::diagram_... INFO : 0s | Δ=0s | Number of graphs resulting from Symbolica generation: 1
  1305. 147.10 s > [2026-08-26 05:42:36.761] @feyngen::diagram_... INFO : 0s | Δ=0s | Number of graphs retained after removal of vetoed topologies: 1
  1306. 147.10 s > [2026-08-26 05:42:36.761] @feyngen::diagram_... INFO : 0s | Δ=0s | Number of graphs after vertex info assignment: 1
  1307. 147.10 s > [2026-08-26 05:42:36.761] @feyngen::diagram_... INFO : 0s | Δ=0s | Number of graphs after all complete graphs filters are applied: 1
  1308. 147.10 s > [2026-08-26 05:42:36.761] @feyngen::diagram_... INFO : 0s | Δ=0s | Number of graphs after closed fermion chains analysis: 1
  1309. 147.10 s > [2026-08-26 05:42:36.761] @feyngen::diagram_... INFO : 0s | Δ=0s | Number of graphs after symmetrization of external states: 1
  1310. 147.10 s > [2026-08-26 05:42:36.762] @feyngen::diagram_... INFO : 0s | Δ=0s | Number of graphs after canonization of vertices, edges and flows (graph labels assigned here): 1
  1311. 147.10 s > [2026-08-26 05:42:36.770] @feyngen::diagram_... INFO : 0s | Δ=0s | Number of graphs after numerator-aware grouping with strategy 'up to a scalar rescaling': 1 (1 isomorphically unique graph, 0 color zero, 0 lorentz zero, 0 grouped and 0 cancellation)
  1312. 147.10 s > [2026-08-26 05:42:36.770] @feyngen::diagram_... INFO : ( Sum of the symmetry factors from each graph generated = 1 )
  1313. 147.10 s > [2026-08-26 05:42:36.770] @commands::generate INFO : Generated amplitude 1 graphs.
  1314. 147.10 s > [2026-08-26 05:42:36.813] @settings::runtime WARNING : No external kinematics were provided; using default-generated external momenta and helicities.
  1315. 147.10 s > [2026-08-26 05:42:36.876] @commands::generate INFO :
  1316. 147.10 s > Integrand generation summary
  1317. 147.10 s > peak RAM 65.48 MiB | cores 1
  1318. 147.10 s > ╭────────────┬───────┬─────────┬────────────┬────────────┬────────────────┬─────────────╮
  1319. 147.10 s > │ integrand │ graph │ # evals │ expr build │ spenso │ symbolica eval │ compile │
  1320. 147.10 s > ├────────────┼───────┼─────────┼────────────┼────────────┼────────────────┼─────────────┤
  1321. 147.10 s > │ scalar_tri │ GL0 │ 9 │ 21ms (52%) │ 2ms (6.8%) │ 16ms (41%) │ 0ms (0.00%) │
  1322. 147.10 s > ├────────────┼───────┼─────────┼────────────┼────────────┼────────────────┼─────────────┤
  1323. 147.10 s > │ Total │ │ 9 │ 21ms (52%) │ 2ms (6.8%) │ 16ms (41%) │ 0ms (0.00%) │
  1324. 147.10 s > ╰────────────┴───────┴─────────┴────────────┴────────────┴────────────────┴─────────────╯
  1325. 147.10 s > [2026-08-26 05:42:36.877] @gammaloop_api::se... INFO : Running command generate amp scalar_0 scalar_0 > scalar_0 scalar_0 [{1}] --allowed-vertex-interactions V_3_SCALAR_022 -p box -i scalar_box --select-graphs GL0
  1326. 147.10 s > [2026-08-26 05:42:36.878] @feyngen::diagram_... INFO : 0s | Δ=0s | Starting Feynman graph generation with Symbolica...
  1327. 147.10 s > [2026-08-26 05:42:36.878] @feyngen::diagram_... INFO : 0s | Δ=0s | Number of graphs resulting from Symbolica generation: 3
  1328. 147.10 s > [2026-08-26 05:42:36.878] @feyngen::diagram_... INFO : 0s | Δ=0s | Number of graphs retained after removal of vetoed topologies: 3
  1329. 147.10 s > [2026-08-26 05:42:36.879] @feyngen::diagram_... INFO : 0s | Δ=0s | Number of graphs after vertex info assignment: 3
  1330. 147.10 s > [2026-08-26 05:42:36.879] @feyngen::diagram_... INFO : 0s | Δ=0s | Number of graphs after all complete graphs filters are applied: 3
  1331. 147.10 s > [2026-08-26 05:42:36.879] @feyngen::diagram_... INFO : 0s | Δ=0s | Number of graphs after closed fermion chains analysis: 3
  1332. 147.10 s > [2026-08-26 05:42:36.879] @feyngen::diagram_... INFO : 0s | Δ=0s | Number of graphs after symmetrization of external states: 3
  1333. 147.10 s > [2026-08-26 05:42:36.879] @feyngen::diagram_... INFO : 0s | Δ=0s | Number of graphs after canonization of vertices, edges and flows (graph labels assigned here): 3
  1334. 147.10 s > [2026-08-26 05:42:36.886] @feyngen::diagram_... INFO : 0s | Δ=0s | Number of graphs after numerator-aware grouping with strategy 'up to a scalar rescaling': 1 (1 isomorphically unique graph, 0 color zero, 0 lorentz zero, 0 grouped and 0 cancellation)
  1335. 147.10 s > [2026-08-26 05:42:36.886] @feyngen::diagram_... INFO : ( Sum of the symmetry factors from each graph generated = 1 )
  1336. 147.10 s > [2026-08-26 05:42:36.887] @commands::generate INFO : Generated amplitude 1 graphs.
  1337. 147.10 s > [2026-08-26 05:42:36.980] @settings::runtime WARNING : No external kinematics were provided; using default-generated external momenta and helicities.
  1338. 147.10 s > [2026-08-26 05:42:37.000] @commands::generate INFO :
  1339. 147.10 s > Integrand generation summary
  1340. 147.10 s > peak RAM 68.52 MiB | cores 1
  1341. 147.10 s > ╭────────────┬───────┬─────────┬────────────┬────────────┬────────────────┬─────────────╮
  1342. 147.10 s > │ integrand │ graph │ # evals │ expr build │ spenso │ symbolica eval │ compile │
  1343. 147.10 s > ├────────────┼───────┼─────────┼────────────┼────────────┼────────────────┼─────────────┤
  1344. 147.10 s > │ scalar_box │ GL0 │ 13 │ 54ms (61%) │ 7ms (8.1%) │ 27ms (31%) │ 0ms (0.00%) │
  1345. 147.10 s > ├────────────┼───────┼─────────┼────────────┼────────────┼────────────────┼─────────────┤
  1346. 147.10 s > │ Total │ │ 13 │ 54ms (61%) │ 7ms (8.1%) │ 27ms (31%) │ 0ms (0.00%) │
  1347. 147.10 s > ╰────────────┴───────┴─────────┴────────────┴────────────┴────────────────┴─────────────╯
  1348. 147.10 s > [2026-08-26 05:42:37.001] @gammaloop_api::se... INFO : Running command generate
  1349. 147.10 s > [2026-08-26 05:42:37.076] @settings::runtime WARNING : No external kinematics were provided; using default-generated external momenta and helicities.
  1350. 147.10 s > [2026-08-26 05:42:37.146] @settings::runtime WARNING : No external kinematics were provided; using default-generated external momenta and helicities.
  1351. 147.10 s > [2026-08-26 05:42:37.219] @commands::generate INFO :
  1352. 147.10 s > Integrand generation summary
  1353. 147.10 s > peak RAM 71.54 MiB | cores 1
  1354. 147.10 s > ╭────────────┬───────┬─────────┬────────────┬─────────────┬────────────────┬─────────────╮
  1355. 147.10 s > │ integrand │ graph │ # evals │ expr build │ spenso │ symbolica eval │ compile │
  1356. 147.10 s > ├────────────┼───────┼─────────┼────────────┼─────────────┼────────────────┼─────────────┤
  1357. 147.10 s > │ scalar_tri │ GL0 │ 9 │ 11ms (38%) │ 2ms (7.9%) │ 15ms (54%) │ 0ms (0.00%) │
  1358. 147.10 s > │ scalar_box │ GL0 │ 13 │ 40ms (38%) │ 9ms (8.6%) │ 56ms (53%) │ 0ms (0.00%) │
  1359. 147.10 s > ├────────────┼───────┼─────────┼────────────┼─────────────┼────────────────┼─────────────┤
  1360. 147.10 s > │ Total │ │ 22 │ 51ms (38%) │ 11ms (8.5%) │ 72ms (54%) │ 0ms (0.00%) │
  1361. 147.10 s > ╰────────────┴───────┴─────────┴────────────┴─────────────┴────────────────┴─────────────╯
  1362. 147.10 s > [2026-08-26 05:42:37.220] @gammaloop_api::se... INFO : Running command set model mass_scalar_2=2.0
  1363. 147.10 s > [2026-08-26 05:42:37.221] @gammaloop_api::se... INFO : Running command set model mass_scalar_1=1.0
  1364. 147.10 s > [2026-08-26 05:42:37.223] @gammaloop_api::se... INFO : Running command set process -p triangle -i scalar_tri string '
  1365. 147.10 s > [kinematics.externals]
  1366. 147.10 s > type = "constant"
  1367. 147.10 s >
  1368. 147.10 s > [kinematics.externals.data]
  1369. 147.10 s > [...]
  1370. 147.10 s > [2026-08-26 05:42:37.224] @gammaloop_api::se... INFO : Running command set process -p box -i scalar_box string '
  1371. 147.10 s > [kinematics.externals]
  1372. 147.10 s > type = "constant"
  1373. 147.10 s >
  1374. 147.10 s > [kinematics.externals.data]
  1375. 147.10 s > [...]
  1376. 147.10 s > [2026-08-26 05:42:37.225] @gammaloop_api::se... INFO : Running command approach -x 1.0000000000000001e-1,2.0000000000000001e-1,2.9999999999999999e-1,4.0000000000000002e-1 --approach-axis 1.0000000000000000e-3,0.0000000000000000e0,0.0000000000000000e0,0.0000000000000000e0 --n-points 1 --n-cores 1 --output-results /build/source/tests/artifacts/scalar_box_invalid_momentum_approach/approach_momentum.json --momentum-space --graph-id 0
  1377. 147.10 s > The application panicked (crashed).
  1378. 147.10 s > Message: There are 2 processes available. Please specify a process.
  1379. 147.10 s > Location: tests/tests/test_runs/approach.rs:332
  1380. 147.10 s >
  1381. 147.10 s > ━━━━━━━━━━━━━━━━━━━━━━━━━━━━━━━━━━ BACKTRACE ━━━━━━━━━━━━━━━━━━━━━━━━━━━━━━━━━━━
  1382. 147.10 s > 1: <color_eyre[51793ea62743adbd]::config::PanicHook>::panic_report<unknown>
  1383. 147.10 s > at <unknown source file>:<unknown line>
  1384. 147.10 s > 2: <color_eyre[51793ea62743adbd]::config::PanicHook>::into_panic_hook::{closure#0}<unknown>
  1385. 147.10 s > at <unknown source file>:<unknown line>
  1386. 147.10 s > 3: std[bcb96dfbba0ab899]::panicking::panic_with_hook<unknown>
  1387. 147.10 s > at <unknown source file>:<unknown line>
  1388. 147.10 s > 4: std[bcb96dfbba0ab899]::panicking::panic_handler::{closure#0}<unknown>
  1389. 147.10 s > at <unknown source file>:<unknown line>
  1390. 147.10 s > 5: std[bcb96dfbba0ab899]::sys::backtrace::__rust_end_short_backtrace::<std[bcb96dfbba0ab899]::panicking::panic_handler::{closure#0}, !><unknown>
  1391. 147.10 s > at <unknown source file>:<unknown line>
  1392. 147.10 s > 6: __rustc[6c289b9f9c454d21]::rust_begin_unwind<unknown>
  1393. 147.10 s > at <unknown source file>:<unknown line>
  1394. 147.10 s > 7: core[940e698046960fd5]::panicking::panic_fmt<unknown>
  1395. 147.10 s > at <unknown source file>:<unknown line>
  1396. 147.10 s > 8: test_runs[3e7a390caee4e338]::approach::approach_momentum_space_reports_incomplete_triplet_cleanly<unknown>
  1397. 147.10 s > at <unknown source file>:<unknown line>
  1398. 147.10 s > 9: <test_runs[3e7a390caee4e338]::approach::approach_momentum_space_reports_incomplete_triplet_cleanly::{closure#0} as core[940e698046960fd5]::ops::function::FnOnce<()>>::call_once<unknown>
  1399. 147.10 s > at <unknown source file>:<unknown line>
  1400. 147.10 s > 10: test[75d6903177b1d7e9]::__rust_begin_short_backtrace::<core[940e698046960fd5]::result::Result<(), alloc[2ea6bcb46fca0c42]::string::String>, fn() -> core[940e698046960fd5]::result::Result<(), alloc[2ea6bcb46fca0c42]::string::String>><unknown>
  1401. 147.10 s > at <unknown source file>:<unknown line>
  1402. 147.10 s > 11: test[75d6903177b1d7e9]::run_test::{closure#0}<unknown>
  1403. 147.10 s > at <unknown source file>:<unknown line>
  1404. 147.10 s > 12: std[bcb96dfbba0ab899]::sys::backtrace::__rust_begin_short_backtrace::<test[75d6903177b1d7e9]::run_test::{closure#1}, ()><unknown>
  1405. 147.10 s > at <unknown source file>:<unknown line>
  1406. 147.10 s > 13: <std[bcb96dfbba0ab899]::thread::lifecycle::spawn_unchecked<test[75d6903177b1d7e9]::run_test::{closure#1}, ()>::{closure#1} as core[940e698046960fd5]::ops::function::FnOnce<()>>::call_once::{shim:vtable#0}<unknown>
  1407. 147.10 s > at <unknown source file>:<unknown line>
  1408. 147.10 s > 14: <std[bcb96dfbba0ab899]::sys::thread::unix::Thread>::new::thread_start<unknown>
  1409. 147.10 s > at <unknown source file>:<unknown line>
  1410. 147.10 s > 15: start_thread<unknown>
  1411. 147.10 s > at <unknown source file>:<unknown line>
  1412. 147.10 s > 16: __clone3<unknown>
  1413. 147.10 s > at <unknown source file>:<unknown line>
  1414. 147.10 s >
  1415. 147.10 s > Run with COLORBT_SHOW_HIDDEN=1 environment variable to disable frame filtering.
  1416. 147.10 s > ... omitted 1 more lines; see full nextest output above
  1417. 147.10 s >
  1418. 147.10 s > 2. gammaloop-integration-tests::test_runs::profile_bulk::dotted_bubble_amp_bulk_profile_passes
  1419. 147.10 s > failure: test failure with exit code 101
  1420. 147.10 s > Error:
  1421. 147.10 s > 0: IR profiling requested arbitrary precision but received a quad-precision result
  1422. 147.10 s >
  1423. 147.10 s > Location:
  1424. 147.10 s > crates/gammalooprs/src/integrands/process/ir.rs:2123
  1425. 147.10 s >
  1426. 147.10 s > ━━━━━━━━━━━━━━━━━━━━━━━━━━━━━━━━━━ BACKTRACE ━━━━━━━━━━━━━━━━━━━━━━━━━━━━━━━━━━━
  1427. 147.10 s > 1: <color_eyre[51793ea62743adbd]::config::EyreHook>::into_eyre_hook::{closure#0}<unknown>
  1428. 147.10 s > at <unknown source file>:<unknown line>
  1429. 147.10 s > 2: eyre[cb2fd339c0c40fca]::capture_handler<unknown>
  1430. 147.10 s > at <unknown source file>:<unknown line>
  1431. 147.10 s > 3: eyre[cb2fd339c0c40fca]::private::format_err<unknown>
  1432. 147.10 s > at <unknown source file>:<unknown line>
  1433. 147.10 s > 4: gammalooprs[d7a7c067ebd19583]::integrands::process::ir::evaluate_profile_momentum_point_arb::<gammalooprs[d7a7c067ebd19583]::integrands::process::amplitude::AmplitudeIntegrand><unknown>
  1434. 147.10 s > at <unknown source file>:<unknown line>
  1435. 147.10 s > 5: <gammalooprs[d7a7c067ebd19583]::integrands::process::amplitude::AmplitudeIntegrand>::test_single_ir_limit_impl<unknown>
  1436. 147.10 s > at <unknown source file>:<unknown line>
  1437. 147.10 s > 6: gammalooprs[d7a7c067ebd19583]::integrands::process::ir::run_ir_profile::<gammalooprs[d7a7c067ebd19583]::integrands::process::amplitude::AmplitudeIntegrand, <gammalooprs[d7a7c067ebd19583]::integrands::process::amplitude::AmplitudeIntegrand>::enumerate_ir_limits, <gammalooprs[d7a7c067ebd19583]::integrands::process::amplitude::AmplitudeIntegrand>::graph_cut_definitions, <gammalooprs[d7a7c067ebd19583]::integrands::process::amplitude::AmplitudeIntegrand>::test_single_ir_limit_impl><unknown>
  1438. 147.10 s > at <unknown source file>:<unknown line>
  1439. 147.10 s > 7: <gammalooprs[d7a7c067ebd19583]::integrands::process::amplitude::AmplitudeIntegrand>::test_ir<unknown>
  1440. 147.10 s > at <unknown source file>:<unknown line>
  1441. 147.10 s > 8: <gammaloop_api[92ae732909e47e14]::commands::profile::Profile>::run<unknown>
  1442. 147.10 s > at <unknown source file>:<unknown line>
  1443. 147.10 s > 9: test_runs[3e7a390caee4e338]::profile_bulk::dotted_bubble_amp_bulk_profile_passes<unknown>
  1444. 147.10 s > at <unknown source file>:<unknown line>
  1445. 147.10 s > 10: <test_runs[3e7a390caee4e338]::profile_bulk::dotted_bubble_amp_bulk_profile_passes::{closure#0} as core[940e698046960fd5]::ops::function::FnOnce<()>>::call_once<unknown>
  1446. 147.10 s > at <unknown source file>:<unknown line>
  1447. 147.10 s > 11: test[75d6903177b1d7e9]::__rust_begin_short_backtrace::<core[940e698046960fd5]::result::Result<(), alloc[2ea6bcb46fca0c42]::string::String>, fn() -> core[940e698046960fd5]::result::Result<(), alloc[2ea6bcb46fca0c42]::string::String>><unknown>
  1448. 147.10 s > at <unknown source file>:<unknown line>
  1449. 147.10 s > 12: test[75d6903177b1d7e9]::run_test::{closure#0}<unknown>
  1450. 147.10 s > at <unknown source file>:<unknown line>
  1451. 147.10 s > 13: std[bcb96dfbba0ab899]::sys::backtrace::__rust_begin_short_backtrace::<test[75d6903177b1d7e9]::run_test::{closure#1}, ()><unknown>
  1452. 147.10 s > at <unknown source file>:<unknown line>
  1453. 147.10 s > 14: <std[bcb96dfbba0ab899]::thread::lifecycle::spawn_unchecked<test[75d6903177b1d7e9]::run_test::{closure#1}, ()>::{closure#1} as core[940e698046960fd5]::ops::function::FnOnce<()>>::call_once::{shim:vtable#0}<unknown>
  1454. 147.10 s > at <unknown source file>:<unknown line>
  1455. 147.10 s > 15: <std[bcb96dfbba0ab899]::sys::thread::unix::Thread>::new::thread_start<unknown>
  1456. 147.10 s > at <unknown source file>:<unknown line>
  1457. 147.10 s > 16: start_thread<unknown>
  1458. 147.10 s > at <unknown source file>:<unknown line>
  1459. 147.10 s > 17: __clone3<unknown>
  1460. 147.10 s > at <unknown source file>:<unknown line>
  1461. 147.10 s >
  1462. 147.10 s > Run with COLORBT_SHOW_HIDDEN=1 environment variable to disable frame filtering.
  1463. 147.10 s > Run with RUST_BACKTRACE=full to include source snippets.
  1464. 147.10 s > Warning: SpanTrace capture is Unsupported.
  1465. 147.10 s > Ensure that you've setup a tracing-error ErrorLayer and the semver versions are compatible
  1466. 147.10 s > system-out
  1467. 147.10 s > running 1 test
  1468. 147.10 s > test profile_bulk::dotted_bubble_amp_bulk_profile_passes ... FAILED
  1469. 147.10 s >
  1470. 147.10 s > failures:
  1471. 147.10 s >
  1472. 147.10 s > failures:
  1473. 147.10 s > profile_bulk::dotted_bubble_amp_bulk_profile_passes
  1474. 147.10 s >
  1475. 147.10 s > test result: FAILED. 0 passed; 1 failed; 0 ignored; 0 measured; 82 filtered out; finished in 0.41s
  1476. 147.10 s > system-err
  1477. 147.10 s > [2026-08-26 05:42:38.877] @gammaloop_api::se... INFO : Running command import model ./assets/models/json/scalars/scalars_2p_3p.json
  1478. 147.10 s > [2026-08-26 05:42:38.877] @import::model INFO : Loading JSON model scalars_2p_3p-default from /build/source/assets/models/json/scalars/scalars_2p_3p
  1479. 147.10 s > [2026-08-26 05:42:38.878] @gammaloop_api::se... INFO : Running command import graphs ./tests/resources/graphs/dotted_bubble_amp.dot
  1480. 147.10 s > [2026-08-26 05:42:38.878] @commands::import INFO : Loading graphs from '/build/source/tests/resources/graphs/dotted_bubble_amp.dot'
  1481. 147.10 s > [2026-08-26 05:42:38.881] @gammaloop_api::se... INFO : Running command generate
  1482. 147.10 s > [2026-08-26 05:42:38.990] @commands::generate INFO :
  1483. 147.10 s > Integrand generation summary
  1484. 147.10 s > peak RAM 64.83 MiB | cores 1
  1485. 147.10 s > ╭───────────┬───────────────────┬─────────┬────────────┬────────────┬────────────────┬─────────────╮
  1486. 147.10 s > │ integrand │ graph │ # evals │ expr build │ spenso │ symbolica eval │ compile │
  1487. 147.10 s > ├───────────┼───────────────────┼─────────┼────────────┼────────────┼────────────────┼─────────────┤
  1488. 147.10 s > │ default │ dotted_bubble_amp │ 8 │ 6ms (58%) │ 1ms (9.3%) │ 3ms (33%) │ 0ms (0.00%) │
  1489. 147.10 s > ├───────────┼───────────────────┼─────────┼────────────┼────────────┼────────────────┼─────────────┤
  1490. 147.10 s > │ Total │ │ 8 │ 6ms (58%) │ 1ms (9.3%) │ 3ms (33%) │ 0ms (0.00%) │
  1491. 147.10 s > ╰───────────┴───────────────────┴─────────┴────────────┴────────────┴────────────────┴─────────────╯
  1492. 147.10 s > [2026-08-26 05:42:38.991] @process::amplitude INFO : Input is above threshold: 1 existing threshold E-surfaces across 1/1 graph groups
  1493. 147.10 s > [2026-08-26 05:42:38.992] @process::amplitude INFO : overlap structure of group 0: [1: [1(1,3)]]
  1494. 147.10 s > Error:
  1495. 147.10 s > 0: IR profiling requested arbitrary precision but received a quad-precision result
  1496. 147.10 s >
  1497. 147.10 s > Location:
  1498. 147.10 s > crates/gammalooprs/src/integrands/process/ir.rs:2123
  1499. 147.10 s >
  1500. 147.10 s > ━━━━━━━━━━━━━━━━━━━━━━━━━━━━━━━━━━ BACKTRACE ━━━━━━━━━━━━━━━━━━━━━━━━━━━━━━━━━━━
  1501. 147.10 s > 1: <color_eyre[51793ea62743adbd]::config::EyreHook>::into_eyre_hook::{closure#0}<unknown>
  1502. 147.10 s > at <unknown source file>:<unknown line>
  1503. 147.10 s > 2: eyre[cb2fd339c0c40fca]::capture_handler<unknown>
  1504. 147.10 s > at <unknown source file>:<unknown line>
  1505. 147.10 s > 3: eyre[cb2fd339c0c40fca]::private::format_err<unknown>
  1506. 147.10 s > at <unknown source file>:<unknown line>
  1507. 147.10 s > 4: gammalooprs[d7a7c067ebd19583]::integrands::process::ir::evaluate_profile_momentum_point_arb::<gammalooprs[d7a7c067ebd19583]::integrands::process::amplitude::AmplitudeIntegrand><unknown>
  1508. 147.10 s > at <unknown source file>:<unknown line>
  1509. 147.10 s > 5: <gammalooprs[d7a7c067ebd19583]::integrands::process::amplitude::AmplitudeIntegrand>::test_single_ir_limit_impl<unknown>
  1510. 147.10 s > at <unknown source file>:<unknown line>
  1511. 147.10 s > 6: gammalooprs[d7a7c067ebd19583]::integrands::process::ir::run_ir_profile::<gammalooprs[d7a7c067ebd19583]::integrands::process::amplitude::AmplitudeIntegrand, <gammalooprs[d7a7c067ebd19583]::integrands::process::amplitude::AmplitudeIntegrand>::enumerate_ir_limits, <gammalooprs[d7a7c067ebd19583]::integrands::process::amplitude::AmplitudeIntegrand>::graph_cut_definitions, <gammalooprs[d7a7c067ebd19583]::integrands::process::amplitude::AmplitudeIntegrand>::test_single_ir_limit_impl><unknown>
  1512. 147.10 s > at <unknown source file>:<unknown line>
  1513. 147.10 s > 7: <gammalooprs[d7a7c067ebd19583]::integrands::process::amplitude::AmplitudeIntegrand>::test_ir<unknown>
  1514. 147.10 s > at <unknown source file>:<unknown line>
  1515. 147.10 s > 8: <gammaloop_api[92ae732909e47e14]::commands::profile::Profile>::run<unknown>
  1516. 147.10 s > at <unknown source file>:<unknown line>
  1517. 147.10 s > 9: test_runs[3e7a390caee4e338]::profile_bulk::dotted_bubble_amp_bulk_profile_passes<unknown>
  1518. 147.10 s > at <unknown source file>:<unknown line>
  1519. 147.10 s > 10: <test_runs[3e7a390caee4e338]::profile_bulk::dotted_bubble_amp_bulk_profile_passes::{closure#0} as core[940e698046960fd5]::ops::function::FnOnce<()>>::call_once<unknown>
  1520. 147.10 s > at <unknown source file>:<unknown line>
  1521. 147.10 s > 11: test[75d6903177b1d7e9]::__rust_begin_short_backtrace::<core[940e698046960fd5]::result::Result<(), alloc[2ea6bcb46fca0c42]::string::String>, fn() -> core[940e698046960fd5]::result::Result<(), alloc[2ea6bcb46fca0c42]::string::String>><unknown>
  1522. 147.10 s > at <unknown source file>:<unknown line>
  1523. 147.10 s > 12: test[75d6903177b1d7e9]::run_test::{closure#0}<unknown>
  1524. 147.10 s > at <unknown source file>:<unknown line>
  1525. 147.10 s > 13: std[bcb96dfbba0ab899]::sys::backtrace::__rust_begin_short_backtrace::<test[75d6903177b1d7e9]::run_test::{closure#1}, ()><unknown>
  1526. 147.10 s > at <unknown source file>:<unknown line>
  1527. 147.10 s > 14: <std[bcb96dfbba0ab899]::thread::lifecycle::spawn_unchecked<test[75d6903177b1d7e9]::run_test::{closure#1}, ()>::{closure#1} as core[940e698046960fd5]::ops::function::FnOnce<()>>::call_once::{shim:vtable#0}<unknown>
  1528. 147.10 s > at <unknown source file>:<unknown line>
  1529. 147.10 s > 15: <std[bcb96dfbba0ab899]::sys::thread::unix::Thread>::new::thread_start<unknown>
  1530. 147.10 s > at <unknown source file>:<unknown line>
  1531. 147.10 s > 16: start_thread<unknown>
  1532. 147.10 s > at <unknown source file>:<unknown line>
  1533. 147.10 s > 17: __clone3<unknown>
  1534. 147.10 s > at <unknown source file>:<unknown line>
  1535. 147.10 s >
  1536. 147.10 s > Run with COLORBT_SHOW_HIDDEN=1 environment variable to disable frame filtering.
  1537. 147.10 s > Run with RUST_BACKTRACE=full to include source snippets.
  1538. 147.10 s > Warning: SpanTrace capture is Unsupported.
  1539. 147.10 s > Ensure that you've setup a tracing-error ErrorLayer and the semver versions are compatible
  1540. 147.10 s >
  1541. 147.10 s > 3. gammaloop-integration-tests::test_runs::profile_bulk::box_4e_bulk_profile_passes
  1542. 147.10 s > failure: test failure with exit code 101
  1543. 147.10 s > Error:
  1544. 147.10 s > 0: IR profiling requested arbitrary precision but received a quad-precision result
  1545. 147.10 s >
  1546. 147.10 s > Location:
  1547. 147.10 s > crates/gammalooprs/src/integrands/process/ir.rs:2123
  1548. 147.10 s >
  1549. 147.10 s > ━━━━━━━━━━━━━━━━━━━━━━━━━━━━━━━━━━ BACKTRACE ━━━━━━━━━━━━━━━━━━━━━━━━━━━━━━━━━━━
  1550. 147.10 s > 1: <color_eyre[51793ea62743adbd]::config::EyreHook>::into_eyre_hook::{closure#0}<unknown>
  1551. 147.10 s > at <unknown source file>:<unknown line>
  1552. 147.10 s > 2: eyre[cb2fd339c0c40fca]::capture_handler<unknown>
  1553. 147.10 s > at <unknown source file>:<unknown line>
  1554. 147.10 s > 3: eyre[cb2fd339c0c40fca]::private::format_err<unknown>
  1555. 147.10 s > at <unknown source file>:<unknown line>
  1556. 147.10 s > 4: gammalooprs[d7a7c067ebd19583]::integrands::process::ir::evaluate_profile_momentum_point_arb::<gammalooprs[d7a7c067ebd19583]::integrands::process::amplitude::AmplitudeIntegrand><unknown>
  1557. 147.10 s > at <unknown source file>:<unknown line>
  1558. 147.10 s > 5: <gammalooprs[d7a7c067ebd19583]::integrands::process::amplitude::AmplitudeIntegrand>::test_single_ir_limit_impl<unknown>
  1559. 147.10 s > at <unknown source file>:<unknown line>
  1560. 147.10 s > 6: gammalooprs[d7a7c067ebd19583]::integrands::process::ir::run_ir_profile::<gammalooprs[d7a7c067ebd19583]::integrands::process::amplitude::AmplitudeIntegrand, <gammalooprs[d7a7c067ebd19583]::integrands::process::amplitude::AmplitudeIntegrand>::enumerate_ir_limits, <gammalooprs[d7a7c067ebd19583]::integrands::process::amplitude::AmplitudeIntegrand>::graph_cut_definitions, <gammalooprs[d7a7c067ebd19583]::integrands::process::amplitude::AmplitudeIntegrand>::test_single_ir_limit_impl><unknown>
  1561. 147.10 s > at <unknown source file>:<unknown line>
  1562. 147.10 s > 7: <gammalooprs[d7a7c067ebd19583]::integrands::process::amplitude::AmplitudeIntegrand>::test_ir<unknown>
  1563. 147.10 s > at <unknown source file>:<unknown line>
  1564. 147.10 s > 8: <gammaloop_api[92ae732909e47e14]::commands::profile::Profile>::run<unknown>
  1565. 147.10 s > at <unknown source file>:<unknown line>
  1566. 147.10 s > 9: test_runs[3e7a390caee4e338]::profile_bulk::box_4e_bulk_profile_passes<unknown>
  1567. 147.10 s > at <unknown source file>:<unknown line>
  1568. 147.10 s > 10: <test_runs[3e7a390caee4e338]::profile_bulk::box_4e_bulk_profile_passes::{closure#0} as core[940e698046960fd5]::ops::function::FnOnce<()>>::call_once<unknown>
  1569. 147.10 s > at <unknown source file>:<unknown line>
  1570. 147.10 s > 11: test[75d6903177b1d7e9]::__rust_begin_short_backtrace::<core[940e698046960fd5]::result::Result<(), alloc[2ea6bcb46fca0c42]::string::String>, fn() -> core[940e698046960fd5]::result::Result<(), alloc[2ea6bcb46fca0c42]::string::String>><unknown>
  1571. 147.10 s > at <unknown source file>:<unknown line>
  1572. 147.10 s > 12: test[75d6903177b1d7e9]::run_test::{closure#0}<unknown>
  1573. 147.10 s > at <unknown source file>:<unknown line>
  1574. 147.10 s > 13: std[bcb96dfbba0ab899]::sys::backtrace::__rust_begin_short_backtrace::<test[75d6903177b1d7e9]::run_test::{closure#1}, ()><unknown>
  1575. 147.10 s > at <unknown source file>:<unknown line>
  1576. 147.10 s > 14: <std[bcb96dfbba0ab899]::thread::lifecycle::spawn_unchecked<test[75d6903177b1d7e9]::run_test::{closure#1}, ()>::{closure#1} as core[940e698046960fd5]::ops::function::FnOnce<()>>::call_once::{shim:vtable#0}<unknown>
  1577. 147.10 s > at <unknown source file>:<unknown line>
  1578. 147.10 s > 15: <std[bcb96dfbba0ab899]::sys::thread::unix::Thread>::new::thread_start<unknown>
  1579. 147.10 s > at <unknown source file>:<unknown line>
  1580. 147.10 s > 16: start_thread<unknown>
  1581. 147.10 s > at <unknown source file>:<unknown line>
  1582. 147.10 s > 17: __clone3<unknown>
  1583. 147.10 s > at <unknown source file>:<unknown line>
  1584. 147.10 s >
  1585. 147.10 s > Run with COLORBT_SHOW_HIDDEN=1 environment variable to disable frame filtering.
  1586. 147.10 s > Run with RUST_BACKTRACE=full to include source snippets.
  1587. 147.10 s > Warning: SpanTrace capture is Unsupported.
  1588. 147.10 s > Ensure that you've setup a tracing-error ErrorLayer and the semver versions are compatible
  1589. 147.10 s > system-out
  1590. 147.10 s > running 1 test
  1591. 147.10 s > test profile_bulk::box_4e_bulk_profile_passes ... FAILED
  1592. 147.10 s >
  1593. 147.10 s > failures:
  1594. 147.10 s >
  1595. 147.10 s > failures:
  1596. 147.10 s > profile_bulk::box_4e_bulk_profile_passes
  1597. 147.10 s >
  1598. 147.10 s > test result: FAILED. 0 passed; 1 failed; 0 ignored; 0 measured; 82 filtered out; finished in 0.53s
  1599. 147.10 s > system-err
  1600. 147.10 s > [2026-08-26 05:42:38.741] @gammaloop_api::se... INFO : Running command import model ./assets/models/json/scalars/scalars.json
  1601. 147.10 s > [2026-08-26 05:42:38.741] @import::model INFO : Loading JSON model scalars-default from /build/source/assets/models/json/scalars/scalars
  1602. 147.10 s > [2026-08-26 05:42:38.745] @gammalooprs::model INFO : The following 2 external parameters were forced to zero by the restriction card:
  1603. 147.10 s > width_scalar_1, width_scalar_2
  1604. 147.10 s > [2026-08-26 05:42:38.745] @gammaloop_api::se... INFO : Running command import graphs ./tests/resources/graphs/massless_box.dot
  1605. 147.10 s > [2026-08-26 05:42:38.745] @commands::import INFO : Loading graphs from '/build/source/tests/resources/graphs/massless_box.dot'
  1606. 147.10 s > [2026-08-26 05:42:38.752] @gammaloop_api::se... INFO : Running command generate
  1607. 147.10 s > [2026-08-26 05:42:38.977] @commands::generate INFO :
  1608. 147.10 s > Integrand generation summary
  1609. 147.10 s > peak RAM 66.00 MiB | cores 1
  1610. 147.10 s > ╭───────────┬────────────────┬─────────┬─────────────┬────────────┬────────────────┬─────────────╮
  1611. 147.10 s > │ integrand │ graph │ # evals │ expr build │ spenso │ symbolica eval │ compile │
  1612. 147.10 s > ├───────────┼────────────────┼─────────┼─────────────┼────────────┼────────────────┼─────────────┤
  1613. 147.10 s > │ default │ massless_box_0 │ 14 │ 146ms (81%) │ 22ms (13%) │ 10ms (6.1%) │ 0ms (0.00%) │
  1614. 147.10 s > ├───────────┼────────────────┼─────────┼─────────────┼────────────┼────────────────┼─────────────┤
  1615. 147.10 s > │ Total │ │ 14 │ 146ms (81%) │ 22ms (13%) │ 10ms (6.1%) │ 0ms (0.00%) │
  1616. 147.10 s > ╰───────────┴────────────────┴─────────┴─────────────┴────────────┴────────────────┴─────────────╯
  1617. 147.10 s > [2026-08-26 05:42:38.980] @process::amplitude INFO : Input is above threshold: 4 existing threshold E-surfaces across 1/1 graph groups
  1618. 147.10 s > [2026-08-26 05:42:38.987] @process::amplitude INFO : overlap structure of group 0: [2: [8(4,6), 11(5,6)], 2: [4(3,4), 9(3,5)], 2: [9(3,5), 11(5,6)], 2: [4(3,4), 8(4,6)]]
  1619. 147.10 s > Error:
  1620. 147.10 s > 0: IR profiling requested arbitrary precision but received a quad-precision result
  1621. 147.10 s >
  1622. 147.10 s > Location:
  1623. 147.10 s > crates/gammalooprs/src/integrands/process/ir.rs:2123
  1624. 147.10 s >
  1625. 147.10 s > ━━━━━━━━━━━━━━━━━━━━━━━━━━━━━━━━━━ BACKTRACE ━━━━━━━━━━━━━━━━━━━━━━━━━━━━━━━━━━━
  1626. 147.10 s > 1: <color_eyre[51793ea62743adbd]::config::EyreHook>::into_eyre_hook::{closure#0}<unknown>
  1627. 147.10 s > at <unknown source file>:<unknown line>
  1628. 147.10 s > 2: eyre[cb2fd339c0c40fca]::capture_handler<unknown>
  1629. 147.10 s > at <unknown source file>:<unknown line>
  1630. 147.10 s > 3: eyre[cb2fd339c0c40fca]::private::format_err<unknown>
  1631. 147.10 s > at <unknown source file>:<unknown line>
  1632. 147.10 s > 4: gammalooprs[d7a7c067ebd19583]::integrands::process::ir::evaluate_profile_momentum_point_arb::<gammalooprs[d7a7c067ebd19583]::integrands::process::amplitude::AmplitudeIntegrand><unknown>
  1633. 147.10 s > at <unknown source file>:<unknown line>
  1634. 147.10 s > 5: <gammalooprs[d7a7c067ebd19583]::integrands::process::amplitude::AmplitudeIntegrand>::test_single_ir_limit_impl<unknown>
  1635. 147.10 s > at <unknown source file>:<unknown line>
  1636. 147.10 s > 6: gammalooprs[d7a7c067ebd19583]::integrands::process::ir::run_ir_profile::<gammalooprs[d7a7c067ebd19583]::integrands::process::amplitude::AmplitudeIntegrand, <gammalooprs[d7a7c067ebd19583]::integrands::process::amplitude::AmplitudeIntegrand>::enumerate_ir_limits, <gammalooprs[d7a7c067ebd19583]::integrands::process::amplitude::AmplitudeIntegrand>::graph_cut_definitions, <gammalooprs[d7a7c067ebd19583]::integrands::process::amplitude::AmplitudeIntegrand>::test_single_ir_limit_impl><unknown>
  1637. 147.10 s > at <unknown source file>:<unknown line>
  1638. 147.10 s > 7: <gammalooprs[d7a7c067ebd19583]::integrands::process::amplitude::AmplitudeIntegrand>::test_ir<unknown>
  1639. 147.10 s > at <unknown source file>:<unknown line>
  1640. 147.10 s > 8: <gammaloop_api[92ae732909e47e14]::commands::profile::Profile>::run<unknown>
  1641. 147.10 s > at <unknown source file>:<unknown line>
  1642. 147.10 s > 9: test_runs[3e7a390caee4e338]::profile_bulk::box_4e_bulk_profile_passes<unknown>
  1643. 147.10 s > at <unknown source file>:<unknown line>
  1644. 147.10 s > 10: <test_runs[3e7a390caee4e338]::profile_bulk::box_4e_bulk_profile_passes::{closure#0} as core[940e698046960fd5]::ops::function::FnOnce<()>>::call_once<unknown>
  1645. 147.10 s > at <unknown source file>:<unknown line>
  1646. 147.10 s > 11: test[75d6903177b1d7e9]::__rust_begin_short_backtrace::<core[940e698046960fd5]::result::Result<(), alloc[2ea6bcb46fca0c42]::string::String>, fn() -> core[940e698046960fd5]::result::Result<(), alloc[2ea6bcb46fca0c42]::string::String>><unknown>
  1647. 147.10 s > at <unknown source file>:<unknown line>
  1648. 147.10 s > 12: test[75d6903177b1d7e9]::run_test::{closure#0}<unknown>
  1649. 147.10 s > at <unknown source file>:<unknown line>
  1650. 147.10 s > 13: std[bcb96dfbba0ab899]::sys::backtrace::__rust_begin_short_backtrace::<test[75d6903177b1d7e9]::run_test::{closure#1}, ()><unknown>
  1651. 147.10 s > at <unknown source file>:<unknown line>
  1652. 147.10 s > 14: <std[bcb96dfbba0ab899]::thread::lifecycle::spawn_unchecked<test[75d6903177b1d7e9]::run_test::{closure#1}, ()>::{closure#1} as core[940e698046960fd5]::ops::function::FnOnce<()>>::call_once::{shim:vtable#0}<unknown>
  1653. 147.10 s > at <unknown source file>:<unknown line>
  1654. 147.10 s > 15: <std[bcb96dfbba0ab899]::sys::thread::unix::Thread>::new::thread_start<unknown>
  1655. 147.10 s > at <unknown source file>:<unknown line>
  1656. 147.10 s > 16: start_thread<unknown>
  1657. 147.10 s > at <unknown source file>:<unknown line>
  1658. 147.10 s > 17: __clone3<unknown>
  1659. 147.10 s > at <unknown source file>:<unknown line>
  1660. 147.10 s >
  1661. 147.10 s > Run with COLORBT_SHOW_HIDDEN=1 environment variable to disable frame filtering.
  1662. 147.10 s > Run with RUST_BACKTRACE=full to include source snippets.
  1663. 147.10 s > Warning: SpanTrace capture is Unsupported.
  1664. 147.10 s > Ensure that you've setup a tracing-error ErrorLayer and the semver versions are compatible
  1665. 147.10 s >
  1666. 147.10 s > 4. gammaloop-integration-tests::test_runs::profile_bulk::double_dotted_bubble_amp_bulk_profile_passes
  1667. 147.10 s > failure: test failure with exit code 101
  1668. 147.10 s > Error:
  1669. 147.10 s > 0: IR profiling requested arbitrary precision but received a quad-precision result
  1670. 147.10 s >
  1671. 147.10 s > Location:
  1672. 147.10 s > crates/gammalooprs/src/integrands/process/ir.rs:2123
  1673. 147.10 s >
  1674. 147.10 s > ━━━━━━━━━━━━━━━━━━━━━━━━━━━━━━━━━━ BACKTRACE ━━━━━━━━━━━━━━━━━━━━━━━━━━━━━━━━━━━
  1675. 147.10 s > 1: <color_eyre[51793ea62743adbd]::config::EyreHook>::into_eyre_hook::{closure#0}<unknown>
  1676. 147.10 s > at <unknown source file>:<unknown line>
  1677. 147.10 s > 2: eyre[cb2fd339c0c40fca]::capture_handler<unknown>
  1678. 147.10 s > at <unknown source file>:<unknown line>
  1679. 147.10 s > 3: eyre[cb2fd339c0c40fca]::private::format_err<unknown>
  1680. 147.10 s > at <unknown source file>:<unknown line>
  1681. 147.10 s > 4: gammalooprs[d7a7c067ebd19583]::integrands::process::ir::evaluate_profile_momentum_point_arb::<gammalooprs[d7a7c067ebd19583]::integrands::process::amplitude::AmplitudeIntegrand><unknown>
  1682. 147.10 s > at <unknown source file>:<unknown line>
  1683. 147.10 s > 5: <gammalooprs[d7a7c067ebd19583]::integrands::process::amplitude::AmplitudeIntegrand>::test_single_ir_limit_impl<unknown>
  1684. 147.10 s > at <unknown source file>:<unknown line>
  1685. 147.10 s > 6: gammalooprs[d7a7c067ebd19583]::integrands::process::ir::run_ir_profile::<gammalooprs[d7a7c067ebd19583]::integrands::process::amplitude::AmplitudeIntegrand, <gammalooprs[d7a7c067ebd19583]::integrands::process::amplitude::AmplitudeIntegrand>::enumerate_ir_limits, <gammalooprs[d7a7c067ebd19583]::integrands::process::amplitude::AmplitudeIntegrand>::graph_cut_definitions, <gammalooprs[d7a7c067ebd19583]::integrands::process::amplitude::AmplitudeIntegrand>::test_single_ir_limit_impl><unknown>
  1686. 147.10 s > at <unknown source file>:<unknown line>
  1687. 147.10 s > 7: <gammalooprs[d7a7c067ebd19583]::integrands::process::amplitude::AmplitudeIntegrand>::test_ir<unknown>
  1688. 147.10 s > at <unknown source file>:<unknown line>
  1689. 147.10 s > 8: <gammaloop_api[92ae732909e47e14]::commands::profile::Profile>::run<unknown>
  1690. 147.10 s > at <unknown source file>:<unknown line>
  1691. 147.10 s > 9: test_runs[3e7a390caee4e338]::profile_bulk::double_dotted_bubble_amp_bulk_profile_passes<unknown>
  1692. 147.10 s > at <unknown source file>:<unknown line>
  1693. 147.10 s > 10: <test_runs[3e7a390caee4e338]::profile_bulk::double_dotted_bubble_amp_bulk_profile_passes::{closure#0} as core[940e698046960fd5]::ops::function::FnOnce<()>>::call_once<unknown>
  1694. 147.11 s > at <unknown source file>:<unknown line>
  1695. 147.11 s > 11: test[75d6903177b1d7e9]::__rust_begin_short_backtrace::<core[940e698046960fd5]::result::Result<(), alloc[2ea6bcb46fca0c42]::string::String>, fn() -> core[940e698046960fd5]::result::Result<(), alloc[2ea6bcb46fca0c42]::string::String>><unknown>
  1696. 147.11 s > at <unknown source file>:<unknown line>
  1697. 147.11 s > 12: test[75d6903177b1d7e9]::run_test::{closure#0}<unknown>
  1698. 147.11 s > at <unknown source file>:<unknown line>
  1699. 147.11 s > 13: std[bcb96dfbba0ab899]::sys::backtrace::__rust_begin_short_backtrace::<test[75d6903177b1d7e9]::run_test::{closure#1}, ()><unknown>
  1700. 147.11 s > at <unknown source file>:<unknown line>
  1701. 147.11 s > 14: <std[bcb96dfbba0ab899]::thread::lifecycle::spawn_unchecked<test[75d6903177b1d7e9]::run_test::{closure#1}, ()>::{closure#1} as core[940e698046960fd5]::ops::function::FnOnce<()>>::call_once::{shim:vtable#0}<unknown>
  1702. 147.11 s > at <unknown source file>:<unknown line>
  1703. 147.11 s > 15: <std[bcb96dfbba0ab899]::sys::thread::unix::Thread>::new::thread_start<unknown>
  1704. 147.11 s > at <unknown source file>:<unknown line>
  1705. 147.11 s > 16: start_thread<unknown>
  1706. 147.11 s > at <unknown source file>:<unknown line>
  1707. 147.11 s > 17: __clone3<unknown>
  1708. 147.11 s > at <unknown source file>:<unknown line>
  1709. 147.11 s >
  1710. 147.11 s > Run with COLORBT_SHOW_HIDDEN=1 environment variable to disable frame filtering.
  1711. 147.11 s > Run with RUST_BACKTRACE=full to include source snippets.
  1712. 147.11 s > Warning: SpanTrace capture is Unsupported.
  1713. 147.11 s > Ensure that you've setup a tracing-error ErrorLayer and the semver versions are compatible
  1714. 147.11 s > system-out
  1715. 147.11 s > running 1 test
  1716. 147.11 s > test profile_bulk::double_dotted_bubble_amp_bulk_profile_passes ... FAILED
  1717. 147.11 s >
  1718. 147.11 s > failures:
  1719. 147.11 s >
  1720. 147.11 s > failures:
  1721. 147.11 s > profile_bulk::double_dotted_bubble_amp_bulk_profile_passes
  1722. 147.11 s >
  1723. 147.11 s > test result: FAILED. 0 passed; 1 failed; 0 ignored; 0 measured; 82 filtered out; finished in 0.49s
  1724. 147.11 s > system-err
  1725. 147.11 s > [2026-08-26 05:42:38.965] @gammaloop_api::se... INFO : Running command import model ./assets/models/json/scalars/scalars_2p_3p.json
  1726. 147.11 s > [2026-08-26 05:42:38.965] @import::model INFO : Loading JSON model scalars_2p_3p-default from /build/source/assets/models/json/scalars/scalars_2p_3p
  1727. 147.11 s > [2026-08-26 05:42:38.967] @gammaloop_api::se... INFO : Running command import graphs ./tests/resources/graphs/double_dotted_bubble_amp.dot
  1728. 147.11 s > [2026-08-26 05:42:38.967] @commands::import INFO : Loading graphs from '/build/source/tests/resources/graphs/double_dotted_bubble_amp.dot'
  1729. 147.11 s > [2026-08-26 05:42:38.970] @gammaloop_api::se... INFO : Running command generate
  1730. 147.11 s > [2026-08-26 05:42:39.078] @commands::generate INFO :
  1731. 147.11 s > Integrand generation summary
  1732. 147.11 s > peak RAM 61.91 MiB | cores 1
  1733. 147.11 s > ╭───────────┬──────────────────────────┬─────────┬────────────┬────────────┬────────────────┬─────────────╮
  1734. 147.11 s > │ integrand │ graph │ # evals │ expr build │ spenso │ symbolica eval │ compile │
  1735. 147.11 s > ├───────────┼──────────────────────────┼─────────┼────────────┼────────────┼────────────────┼─────────────┤
  1736. 147.11 s > │ default │ double_dotted_bubble_amp │ 11 │ 18ms (54%) │ 2ms (7.6%) │ 12ms (38%) │ 0ms (0.00%) │
  1737. 147.11 s > ├───────────┼──────────────────────────┼─────────┼────────────┼────────────┼────────────────┼─────────────┤
  1738. 147.11 s > │ Total │ │ 11 │ 18ms (54%) │ 2ms (7.6%) │ 12ms (38%) │ 0ms (0.00%) │
  1739. 147.11 s > ╰───────────┴──────────────────────────┴─────────┴────────────┴────────────┴────────────────┴─────────────╯
  1740. 147.11 s > [2026-08-26 05:42:39.099] @process::amplitude INFO : Input is above threshold: 1 existing threshold E-surfaces across 1/1 graph groups
  1741. 147.11 s > [2026-08-26 05:42:39.099] @process::amplitude INFO : overlap structure of group 0: [1: [1(1,4)]]
  1742. 147.11 s > Error:
  1743. 147.11 s > 0: IR profiling requested arbitrary precision but received a quad-precision result
  1744. 147.11 s >
  1745. 147.11 s > Location:
  1746. 147.11 s > crates/gammalooprs/src/integrands/process/ir.rs:2123
  1747. 147.11 s >
  1748. 147.11 s > ━━━━━━━━━━━━━━━━━━━━━━━━━━━━━━━━━━ BACKTRACE ━━━━━━━━━━━━━━━━━━━━━━━━━━━━━━━━━━━
  1749. 147.11 s > 1: <color_eyre[51793ea62743adbd]::config::EyreHook>::into_eyre_hook::{closure#0}<unknown>
  1750. 147.11 s > at <unknown source file>:<unknown line>
  1751. 147.11 s > 2: eyre[cb2fd339c0c40fca]::capture_handler<unknown>
  1752. 147.11 s > at <unknown source file>:<unknown line>
  1753. 147.11 s > 3: eyre[cb2fd339c0c40fca]::private::format_err<unknown>
  1754. 147.11 s > at <unknown source file>:<unknown line>
  1755. 147.11 s > 4: gammalooprs[d7a7c067ebd19583]::integrands::process::ir::evaluate_profile_momentum_point_arb::<gammalooprs[d7a7c067ebd19583]::integrands::process::amplitude::AmplitudeIntegrand><unknown>
  1756. 147.11 s > at <unknown source file>:<unknown line>
  1757. 147.11 s > 5: <gammalooprs[d7a7c067ebd19583]::integrands::process::amplitude::AmplitudeIntegrand>::test_single_ir_limit_impl<unknown>
  1758. 147.11 s > at <unknown source file>:<unknown line>
  1759. 147.11 s > 6: gammalooprs[d7a7c067ebd19583]::integrands::process::ir::run_ir_profile::<gammalooprs[d7a7c067ebd19583]::integrands::process::amplitude::AmplitudeIntegrand, <gammalooprs[d7a7c067ebd19583]::integrands::process::amplitude::AmplitudeIntegrand>::enumerate_ir_limits, <gammalooprs[d7a7c067ebd19583]::integrands::process::amplitude::AmplitudeIntegrand>::graph_cut_definitions, <gammalooprs[d7a7c067ebd19583]::integrands::process::amplitude::AmplitudeIntegrand>::test_single_ir_limit_impl><unknown>
  1760. 147.11 s > at <unknown source file>:<unknown line>
  1761. 147.11 s > 7: <gammalooprs[d7a7c067ebd19583]::integrands::process::amplitude::AmplitudeIntegrand>::test_ir<unknown>
  1762. 147.11 s > at <unknown source file>:<unknown line>
  1763. 147.11 s > 8: <gammaloop_api[92ae732909e47e14]::commands::profile::Profile>::run<unknown>
  1764. 147.11 s > at <unknown source file>:<unknown line>
  1765. 147.11 s > 9: test_runs[3e7a390caee4e338]::profile_bulk::double_dotted_bubble_amp_bulk_profile_passes<unknown>
  1766. 147.11 s > at <unknown source file>:<unknown line>
  1767. 147.11 s > 10: <test_runs[3e7a390caee4e338]::profile_bulk::double_dotted_bubble_amp_bulk_profile_passes::{closure#0} as core[940e698046960fd5]::ops::function::FnOnce<()>>::call_once<unknown>
  1768. 147.11 s > at <unknown source file>:<unknown line>
  1769. 147.11 s > 11: test[75d6903177b1d7e9]::__rust_begin_short_backtrace::<core[940e698046960fd5]::result::Result<(), alloc[2ea6bcb46fca0c42]::string::String>, fn() -> core[940e698046960fd5]::result::Result<(), alloc[2ea6bcb46fca0c42]::string::String>><unknown>
  1770. 147.11 s > at <unknown source file>:<unknown line>
  1771. 147.11 s > 12: test[75d6903177b1d7e9]::run_test::{closure#0}<unknown>
  1772. 147.11 s > at <unknown source file>:<unknown line>
  1773. 147.11 s > 13: std[bcb96dfbba0ab899]::sys::backtrace::__rust_begin_short_backtrace::<test[75d6903177b1d7e9]::run_test::{closure#1}, ()><unknown>
  1774. 147.11 s > at <unknown source file>:<unknown line>
  1775. 147.11 s > 14: <std[bcb96dfbba0ab899]::thread::lifecycle::spawn_unchecked<test[75d6903177b1d7e9]::run_test::{closure#1}, ()>::{closure#1} as core[940e698046960fd5]::ops::function::FnOnce<()>>::call_once::{shim:vtable#0}<unknown>
  1776. 147.11 s > at <unknown source file>:<unknown line>
  1777. 147.11 s > 15: <std[bcb96dfbba0ab899]::sys::thread::unix::Thread>::new::thread_start<unknown>
  1778. 147.11 s > at <unknown source file>:<unknown line>
  1779. 147.11 s > 16: start_thread<unknown>
  1780. 147.11 s > at <unknown source file>:<unknown line>
  1781. 147.11 s > 17: __clone3<unknown>
  1782. 147.11 s > at <unknown source file>:<unknown line>
  1783. 147.11 s >
  1784. 147.11 s > Run with COLORBT_SHOW_HIDDEN=1 environment variable to disable frame filtering.
  1785. 147.11 s > Run with RUST_BACKTRACE=full to include source snippets.
  1786. 147.11 s > Warning: SpanTrace capture is Unsupported.
  1787. 147.11 s > Ensure that you've setup a tracing-error ErrorLayer and the semver versions are compatible
  1788. 147.11 s >
  1789. 147.11 s > 5. gammaloop-integration-tests::test_runs::profile_bulk::massless_triangle_bulk_profile_passes
  1790. 147.11 s > failure: test failure with exit code 101
  1791. 147.11 s > Error:
  1792. 147.11 s > 0: IR profiling requested arbitrary precision but received a quad-precision result
  1793. 147.11 s >
  1794. 147.11 s > Location:
  1795. 147.11 s > crates/gammalooprs/src/integrands/process/ir.rs:2123
  1796. 147.11 s >
  1797. 147.11 s > ━━━━━━━━━━━━━━━━━━━━━━━━━━━━━━━━━━ BACKTRACE ━━━━━━━━━━━━━━━━━━━━━━━━━━━━━━━━━━━
  1798. 147.11 s > 1: <color_eyre[51793ea62743adbd]::config::EyreHook>::into_eyre_hook::{closure#0}<unknown>
  1799. 147.11 s > at <unknown source file>:<unknown line>
  1800. 147.11 s > 2: eyre[cb2fd339c0c40fca]::capture_handler<unknown>
  1801. 147.11 s > at <unknown source file>:<unknown line>
  1802. 147.11 s > 3: eyre[cb2fd339c0c40fca]::private::format_err<unknown>
  1803. 147.11 s > at <unknown source file>:<unknown line>
  1804. 147.11 s > 4: gammalooprs[d7a7c067ebd19583]::integrands::process::ir::evaluate_profile_momentum_point_arb::<gammalooprs[d7a7c067ebd19583]::integrands::process::amplitude::AmplitudeIntegrand><unknown>
  1805. 147.11 s > at <unknown source file>:<unknown line>
  1806. 147.11 s > 5: <gammalooprs[d7a7c067ebd19583]::integrands::process::amplitude::AmplitudeIntegrand>::test_single_ir_limit_impl<unknown>
  1807. 147.11 s > at <unknown source file>:<unknown line>
  1808. 147.11 s > 6: gammalooprs[d7a7c067ebd19583]::integrands::process::ir::run_ir_profile::<gammalooprs[d7a7c067ebd19583]::integrands::process::amplitude::AmplitudeIntegrand, <gammalooprs[d7a7c067ebd19583]::integrands::process::amplitude::AmplitudeIntegrand>::enumerate_ir_limits, <gammalooprs[d7a7c067ebd19583]::integrands::process::amplitude::AmplitudeIntegrand>::graph_cut_definitions, <gammalooprs[d7a7c067ebd19583]::integrands::process::amplitude::AmplitudeIntegrand>::test_single_ir_limit_impl><unknown>
  1809. 147.11 s > at <unknown source file>:<unknown line>
  1810. 147.11 s > 7: <gammalooprs[d7a7c067ebd19583]::integrands::process::amplitude::AmplitudeIntegrand>::test_ir<unknown>
  1811. 147.11 s > at <unknown source file>:<unknown line>
  1812. 147.11 s > 8: <gammaloop_api[92ae732909e47e14]::commands::profile::Profile>::run<unknown>
  1813. 147.11 s > at <unknown source file>:<unknown line>
  1814. 147.11 s > 9: test_runs[3e7a390caee4e338]::profile_bulk::massless_triangle_bulk_profile_passes<unknown>
  1815. 147.11 s > at <unknown source file>:<unknown line>
  1816. 147.11 s > 10: <test_runs[3e7a390caee4e338]::profile_bulk::massless_triangle_bulk_profile_passes::{closure#0} as core[940e698046960fd5]::ops::function::FnOnce<()>>::call_once<unknown>
  1817. 147.11 s > at <unknown source file>:<unknown line>
  1818. 147.11 s > 11: test[75d6903177b1d7e9]::__rust_begin_short_backtrace::<core[940e698046960fd5]::result::Result<(), alloc[2ea6bcb46fca0c42]::string::String>, fn() -> core[940e698046960fd5]::result::Result<(), alloc[2ea6bcb46fca0c42]::string::String>><unknown>
  1819. 147.11 s > at <unknown source file>:<unknown line>
  1820. 147.11 s > 12: test[75d6903177b1d7e9]::run_test::{closure#0}<unknown>
  1821. 147.11 s > at <unknown source file>:<unknown line>
  1822. 147.11 s > 13: std[bcb96dfbba0ab899]::sys::backtrace::__rust_begin_short_backtrace::<test[75d6903177b1d7e9]::run_test::{closure#1}, ()><unknown>
  1823. 147.11 s > at <unknown source file>:<unknown line>
  1824. 147.11 s > 14: <std[bcb96dfbba0ab899]::thread::lifecycle::spawn_unchecked<test[75d6903177b1d7e9]::run_test::{closure#1}, ()>::{closure#1} as core[940e698046960fd5]::ops::function::FnOnce<()>>::call_once::{shim:vtable#0}<unknown>
  1825. 147.11 s > at <unknown source file>:<unknown line>
  1826. 147.11 s > 15: <std[bcb96dfbba0ab899]::sys::thread::unix::Thread>::new::thread_start<unknown>
  1827. 147.11 s > at <unknown source file>:<unknown line>
  1828. 147.11 s > 16: start_thread<unknown>
  1829. 147.11 s > at <unknown source file>:<unknown line>
  1830. 147.11 s > 17: __clone3<unknown>
  1831. 147.11 s > at <unknown source file>:<unknown line>
  1832. 147.11 s >
  1833. 147.11 s > Run with COLORBT_SHOW_HIDDEN=1 environment variable to disable frame filtering.
  1834. 147.11 s > Run with RUST_BACKTRACE=full to include source snippets.
  1835. 147.11 s > Warning: SpanTrace capture is Unsupported.
  1836. 147.11 s > Ensure that you've setup a tracing-error ErrorLayer and the semver versions are compatible
  1837. 147.11 s > system-out
  1838. 147.11 s > running 1 test
  1839. 147.11 s > test profile_bulk::massless_triangle_bulk_profile_passes ... FAILED
  1840. 147.11 s >
  1841. 147.11 s > failures:
  1842. 147.11 s >
  1843. 147.11 s > failures:
  1844. 147.11 s > profile_bulk::massless_triangle_bulk_profile_passes
  1845. 147.11 s >
  1846. 147.11 s > test result: FAILED. 0 passed; 1 failed; 0 ignored; 0 measured; 82 filtered out; finished in 0.57s
  1847. 147.11 s > system-err
  1848. 147.11 s > [2026-08-26 05:42:39.450] @gammaloop_api::se... INFO : Running command import model scalars
  1849. 147.11 s > [2026-08-26 05:42:39.450] @import::model INFO : Loading built-in JSON model scalars-default
  1850. 147.11 s > [2026-08-26 05:42:39.453] @gammalooprs::model INFO : The following 2 external parameters were forced to zero by the restriction card:
  1851. 147.11 s > width_scalar_1, width_scalar_2
  1852. 147.11 s > [2026-08-26 05:42:39.454] @gammaloop_api::se... INFO : Running command import graphs ./tests/resources/graphs/massless_triangle.dot
  1853. 147.11 s > [2026-08-26 05:42:39.454] @commands::import INFO : Loading graphs from '/build/source/tests/resources/graphs/massless_triangle.dot'
  1854. 147.11 s > [2026-08-26 05:42:39.460] @gammaloop_api::se... INFO : Running command generate
  1855. 147.11 s > [2026-08-26 05:42:39.593] @commands::generate INFO :
  1856. 147.11 s > Integrand generation summary
  1857. 147.11 s > peak RAM 63.21 MiB | cores 1
  1858. 147.11 s > ╭───────────┬─────────────────────┬─────────┬────────────┬────────────┬────────────────┬─────────────╮
  1859. 147.11 s > │ integrand │ graph │ # evals │ expr build │ spenso │ symbolica eval │ compile │
  1860. 147.11 s > ├───────────┼─────────────────────┼─────────┼────────────┼────────────┼────────────────┼─────────────┤
  1861. 147.11 s > │ default │ massless_triangle_0 │ 9 │ 23ms (64%) │ 1ms (4.9%) │ 11ms (31%) │ 0ms (0.00%) │
  1862. 147.11 s > ├───────────┼─────────────────────┼─────────┼────────────┼────────────┼────────────────┼─────────────┤
  1863. 147.11 s > │ Total │ │ 9 │ 23ms (64%) │ 1ms (4.9%) │ 11ms (31%) │ 0ms (0.00%) │
  1864. 147.11 s > ╰───────────┴─────────────────────┴─────────┴────────────┴────────────┴────────────────┴─────────────╯
  1865. 147.11 s > [2026-08-26 05:42:39.595] @process::amplitude INFO : Input is above threshold: 2 existing threshold E-surfaces across 1/1 graph groups
  1866. 147.11 s > [2026-08-26 05:42:39.595] @process::amplitude INFO : overlap structure of group 0: [2: [0(1,5), 1(1,3)]]
  1867. 147.11 s > Error:
  1868. 147.11 s > 0: IR profiling requested arbitrary precision but received a quad-precision result
  1869. 147.11 s >
  1870. 147.11 s > Location:
  1871. 147.11 s > crates/gammalooprs/src/integrands/process/ir.rs:2123
  1872. 147.11 s >
  1873. 147.11 s > ━━━━━━━━━━━━━━━━━━━━━━━━━━━━━━━━━━ BACKTRACE ━━━━━━━━━━━━━━━━━━━━━━━━━━━━━━━━━━━
  1874. 147.11 s > 1: <color_eyre[51793ea62743adbd]::config::EyreHook>::into_eyre_hook::{closure#0}<unknown>
  1875. 147.11 s > at <unknown source file>:<unknown line>
  1876. 147.11 s > 2: eyre[cb2fd339c0c40fca]::capture_handler<unknown>
  1877. 147.11 s > at <unknown source file>:<unknown line>
  1878. 147.11 s > 3: eyre[cb2fd339c0c40fca]::private::format_err<unknown>
  1879. 147.11 s > at <unknown source file>:<unknown line>
  1880. 147.11 s > 4: gammalooprs[d7a7c067ebd19583]::integrands::process::ir::evaluate_profile_momentum_point_arb::<gammalooprs[d7a7c067ebd19583]::integrands::process::amplitude::AmplitudeIntegrand><unknown>
  1881. 147.11 s > at <unknown source file>:<unknown line>
  1882. 147.11 s > 5: <gammalooprs[d7a7c067ebd19583]::integrands::process::amplitude::AmplitudeIntegrand>::test_single_ir_limit_impl<unknown>
  1883. 147.11 s > at <unknown source file>:<unknown line>
  1884. 147.11 s > 6: gammalooprs[d7a7c067ebd19583]::integrands::process::ir::run_ir_profile::<gammalooprs[d7a7c067ebd19583]::integrands::process::amplitude::AmplitudeIntegrand, <gammalooprs[d7a7c067ebd19583]::integrands::process::amplitude::AmplitudeIntegrand>::enumerate_ir_limits, <gammalooprs[d7a7c067ebd19583]::integrands::process::amplitude::AmplitudeIntegrand>::graph_cut_definitions, <gammalooprs[d7a7c067ebd19583]::integrands::process::amplitude::AmplitudeIntegrand>::test_single_ir_limit_impl><unknown>
  1885. 147.11 s > at <unknown source file>:<unknown line>
  1886. 147.11 s > 7: <gammalooprs[d7a7c067ebd19583]::integrands::process::amplitude::AmplitudeIntegrand>::test_ir<unknown>
  1887. 147.11 s > at <unknown source file>:<unknown line>
  1888. 147.11 s > 8: <gammaloop_api[92ae732909e47e14]::commands::profile::Profile>::run<unknown>
  1889. 147.11 s > at <unknown source file>:<unknown line>
  1890. 147.11 s > 9: test_runs[3e7a390caee4e338]::profile_bulk::massless_triangle_bulk_profile_passes<unknown>
  1891. 147.11 s > at <unknown source file>:<unknown line>
  1892. 147.11 s > 10: <test_runs[3e7a390caee4e338]::profile_bulk::massless_triangle_bulk_profile_passes::{closure#0} as core[940e698046960fd5]::ops::function::FnOnce<()>>::call_once<unknown>
  1893. 147.11 s > at <unknown source file>:<unknown line>
  1894. 147.11 s > 11: test[75d6903177b1d7e9]::__rust_begin_short_backtrace::<core[940e698046960fd5]::result::Result<(), alloc[2ea6bcb46fca0c42]::string::String>, fn() -> core[940e698046960fd5]::result::Result<(), alloc[2ea6bcb46fca0c42]::string::String>><unknown>
  1895. 147.11 s > at <unknown source file>:<unknown line>
  1896. 147.11 s > 12: test[75d6903177b1d7e9]::run_test::{closure#0}<unknown>
  1897. 147.11 s > at <unknown source file>:<unknown line>
  1898. 147.11 s > 13: std[bcb96dfbba0ab899]::sys::backtrace::__rust_begin_short_backtrace::<test[75d6903177b1d7e9]::run_test::{closure#1}, ()><unknown>
  1899. 147.11 s > at <unknown source file>:<unknown line>
  1900. 147.11 s > 14: <std[bcb96dfbba0ab899]::thread::lifecycle::spawn_unchecked<test[75d6903177b1d7e9]::run_test::{closure#1}, ()>::{closure#1} as core[940e698046960fd5]::ops::function::FnOnce<()>>::call_once::{shim:vtable#0}<unknown>
  1901. 147.11 s > at <unknown source file>:<unknown line>
  1902. 147.11 s > 15: <std[bcb96dfbba0ab899]::sys::thread::unix::Thread>::new::thread_start<unknown>
  1903. 147.11 s > at <unknown source file>:<unknown line>
  1904. 147.11 s > 16: start_thread<unknown>
  1905. 147.11 s > at <unknown source file>:<unknown line>
  1906. 147.11 s > 17: __clone3<unknown>
  1907. 147.11 s > at <unknown source file>:<unknown line>
  1908. 147.11 s >
  1909. 147.11 s > Run with COLORBT_SHOW_HIDDEN=1 environment variable to disable frame filtering.
  1910. 147.11 s > Run with RUST_BACKTRACE=full to include source snippets.
  1911. 147.11 s > Warning: SpanTrace capture is Unsupported.
  1912. 147.11 s > Ensure that you've setup a tracing-error ErrorLayer and the semver versions are compatible
  1913. 147.11 s >
  1914. 147.11 s > 6. gammaloop-integration-tests::test_runs::profile_bulk::scalar_self_energy_amp_bulk_profile_passes
  1915. 147.11 s > failure: test failure with exit code 101
  1916. 147.11 s > Error:
  1917. 147.11 s > 0: IR profiling requested arbitrary precision but received a quad-precision result
  1918. 147.11 s >
  1919. 147.11 s > Location:
  1920. 147.11 s > crates/gammalooprs/src/integrands/process/ir.rs:2123
  1921. 147.11 s >
  1922. 147.11 s > ━━━━━━━━━━━━━━━━━━━━━━━━━━━━━━━━━━ BACKTRACE ━━━━━━━━━━━━━━━━━━━━━━━━━━━━━━━━━━━
  1923. 147.11 s > 1: <color_eyre[51793ea62743adbd]::config::EyreHook>::into_eyre_hook::{closure#0}<unknown>
  1924. 147.11 s > at <unknown source file>:<unknown line>
  1925. 147.11 s > 2: eyre[cb2fd339c0c40fca]::capture_handler<unknown>
  1926. 147.11 s > at <unknown source file>:<unknown line>
  1927. 147.11 s > 3: eyre[cb2fd339c0c40fca]::private::format_err<unknown>
  1928. 147.11 s > at <unknown source file>:<unknown line>
  1929. 147.11 s > 4: gammalooprs[d7a7c067ebd19583]::integrands::process::ir::evaluate_profile_momentum_point_arb::<gammalooprs[d7a7c067ebd19583]::integrands::process::amplitude::AmplitudeIntegrand><unknown>
  1930. 147.11 s > at <unknown source file>:<unknown line>
  1931. 147.11 s > 5: <gammalooprs[d7a7c067ebd19583]::integrands::process::amplitude::AmplitudeIntegrand>::test_single_ir_limit_impl<unknown>
  1932. 147.11 s > at <unknown source file>:<unknown line>
  1933. 147.11 s > 6: gammalooprs[d7a7c067ebd19583]::integrands::process::ir::run_ir_profile::<gammalooprs[d7a7c067ebd19583]::integrands::process::amplitude::AmplitudeIntegrand, <gammalooprs[d7a7c067ebd19583]::integrands::process::amplitude::AmplitudeIntegrand>::enumerate_ir_limits, <gammalooprs[d7a7c067ebd19583]::integrands::process::amplitude::AmplitudeIntegrand>::graph_cut_definitions, <gammalooprs[d7a7c067ebd19583]::integrands::process::amplitude::AmplitudeIntegrand>::test_single_ir_limit_impl><unknown>
  1934. 147.11 s > at <unknown source file>:<unknown line>
  1935. 147.11 s > 7: <gammalooprs[d7a7c067ebd19583]::integrands::process::amplitude::AmplitudeIntegrand>::test_ir<unknown>
  1936. 147.11 s > at <unknown source file>:<unknown line>
  1937. 147.11 s > 8: <gammaloop_api[92ae732909e47e14]::commands::profile::Profile>::run<unknown>
  1938. 147.11 s > at <unknown source file>:<unknown line>
  1939. 147.11 s > 9: test_runs[3e7a390caee4e338]::profile_bulk::scalar_self_energy_amp_bulk_profile_passes<unknown>
  1940. 147.11 s > at <unknown source file>:<unknown line>
  1941. 147.11 s > 10: <test_runs[3e7a390caee4e338]::profile_bulk::scalar_self_energy_amp_bulk_profile_passes::{closure#0} as core[940e698046960fd5]::ops::function::FnOnce<()>>::call_once<unknown>
  1942. 147.11 s > at <unknown source file>:<unknown line>
  1943. 147.11 s > 11: test[75d6903177b1d7e9]::__rust_begin_short_backtrace::<core[940e698046960fd5]::result::Result<(), alloc[2ea6bcb46fca0c42]::string::String>, fn() -> core[940e698046960fd5]::result::Result<(), alloc[2ea6bcb46fca0c42]::string::String>><unknown>
  1944. 147.11 s > at <unknown source file>:<unknown line>
  1945. 147.11 s > 12: test[75d6903177b1d7e9]::run_test::{closure#0}<unknown>
  1946. 147.11 s > at <unknown source file>:<unknown line>
  1947. 147.11 s > 13: std[bcb96dfbba0ab899]::sys::backtrace::__rust_begin_short_backtrace::<test[75d6903177b1d7e9]::run_test::{closure#1}, ()><unknown>
  1948. 147.11 s > at <unknown source file>:<unknown line>
  1949. 147.11 s > 14: <std[bcb96dfbba0ab899]::thread::lifecycle::spawn_unchecked<test[75d6903177b1d7e9]::run_test::{closure#1}, ()>::{closure#1} as core[940e698046960fd5]::ops::function::FnOnce<()>>::call_once::{shim:vtable#0}<unknown>
  1950. 147.11 s > at <unknown source file>:<unknown line>
  1951. 147.11 s > 15: <std[bcb96dfbba0ab899]::sys::thread::unix::Thread>::new::thread_start<unknown>
  1952. 147.11 s > at <unknown source file>:<unknown line>
  1953. 147.11 s > 16: start_thread<unknown>
  1954. 147.11 s > at <unknown source file>:<unknown line>
  1955. 147.11 s > 17: __clone3<unknown>
  1956. 147.11 s > at <unknown source file>:<unknown line>
  1957. 147.11 s >
  1958. 147.11 s > Run with COLORBT_SHOW_HIDDEN=1 environment variable to disable frame filtering.
  1959. 147.11 s > Run with RUST_BACKTRACE=full to include source snippets.
  1960. 147.11 s > Warning: SpanTrace capture is Unsupported.
  1961. 147.11 s > Ensure that you've setup a tracing-error ErrorLayer and the semver versions are compatible
  1962. 147.11 s > system-out
  1963. 147.11 s > running 1 test
  1964. 147.11 s > test profile_bulk::scalar_self_energy_amp_bulk_profile_passes ... FAILED
  1965. 147.11 s >
  1966. 147.11 s > failures:
  1967. 147.11 s >
  1968. 147.11 s > failures:
  1969. 147.11 s > profile_bulk::scalar_self_energy_amp_bulk_profile_passes
  1970. 147.11 s >
  1971. 147.11 s > test result: FAILED. 0 passed; 1 failed; 0 ignored; 0 measured; 82 filtered out; finished in 1.44s
  1972. 147.11 s > system-err
  1973. 147.11 s > [2026-08-26 05:42:39.491] @gammaloop_api::se... INFO : Running command import model ./assets/models/json/scalars/scalars.json
  1974. 147.11 s > [2026-08-26 05:42:39.491] @import::model INFO : Loading JSON model scalars-default from /build/source/assets/models/json/scalars/scalars
  1975. 147.11 s > [2026-08-26 05:42:39.501] @gammalooprs::model INFO : The following 2 external parameters were forced to zero by the restriction card:
  1976. 147.11 s > width_scalar_1, width_scalar_2
  1977. 147.11 s > [2026-08-26 05:42:39.501] @gammaloop_api::se... INFO : Running command import graphs ./tests/resources/graphs/scalar_self_energy_amp.dot
  1978. 147.11 s > [2026-08-26 05:42:39.501] @commands::import INFO : Loading graphs from '/build/source/tests/resources/graphs/scalar_self_energy_amp.dot'
  1979. 147.11 s > [2026-08-26 05:42:39.511] @gammaloop_api::se... INFO : Running command generate
  1980. 147.11 s > [2026-08-26 05:42:40.572] @commands::generate INFO :
  1981. 147.11 s > Integrand generation summary
  1982. 147.11 s > peak RAM 70.37 MiB | cores 1
  1983. 147.11 s > ╭───────────┬────────────────────────┬─────────┬─────────────┬─────────────┬────────────────┬─────────────╮
  1984. 147.11 s > │ integrand │ graph │ # evals │ expr build │ spenso │ symbolica eval │ compile │
  1985. 147.11 s > ├───────────┼────────────────────────┼─────────┼─────────────┼─────────────┼────────────────┼─────────────┤
  1986. 147.11 s > │ default │ scalar_self_energy_amp │ 6 │ 952ms (97%) │ 11ms (1.2%) │ 17ms (1.8%) │ 0ms (0.00%) │
  1987. 147.11 s > ├───────────┼────────────────────────┼─────────┼─────────────┼─────────────┼────────────────┼─────────────┤
  1988. 147.11 s > │ Total │ │ 6 │ 952ms (97%) │ 11ms (1.2%) │ 17ms (1.8%) │ 0ms (0.00%) │
  1989. 147.11 s > ╰───────────┴────────────────────────┴─────────┴─────────────┴─────────────┴────────────────┴─────────────╯
  1990. 147.11 s > [2026-08-26 05:42:40.574] @process::amplitude INFO : Input is above threshold: 2 existing threshold E-surfaces across 1/1 graph groups
  1991. 147.11 s > [2026-08-26 05:42:40.574] @process::amplitude INFO : overlap structure of group 0: [2: [2(1,5), 4(2,3,5)]]
  1992. 147.11 s > Error:
  1993. 147.11 s > 0: IR profiling requested arbitrary precision but received a quad-precision result
  1994. 147.11 s >
  1995. 147.11 s > Location:
  1996. 147.11 s > crates/gammalooprs/src/integrands/process/ir.rs:2123
  1997. 147.11 s >
  1998. 147.11 s > ━━━━━━━━━━━━━━━━━━━━━━━━━━━━━━━━━━ BACKTRACE ━━━━━━━━━━━━━━━━━━━━━━━━━━━━━━━━━━━
  1999. 147.11 s > 1: <color_eyre[51793ea62743adbd]::config::EyreHook>::into_eyre_hook::{closure#0}<unknown>
  2000. 147.11 s > at <unknown source file>:<unknown line>
  2001. 147.11 s > 2: eyre[cb2fd339c0c40fca]::capture_handler<unknown>
  2002. 147.11 s > at <unknown source file>:<unknown line>
  2003. 147.11 s > 3: eyre[cb2fd339c0c40fca]::private::format_err<unknown>
  2004. 147.11 s > at <unknown source file>:<unknown line>
  2005. 147.11 s > 4: gammalooprs[d7a7c067ebd19583]::integrands::process::ir::evaluate_profile_momentum_point_arb::<gammalooprs[d7a7c067ebd19583]::integrands::process::amplitude::AmplitudeIntegrand><unknown>
  2006. 147.11 s > at <unknown source file>:<unknown line>
  2007. 147.11 s > 5: <gammalooprs[d7a7c067ebd19583]::integrands::process::amplitude::AmplitudeIntegrand>::test_single_ir_limit_impl<unknown>
  2008. 147.11 s > at <unknown source file>:<unknown line>
  2009. 147.11 s > 6: gammalooprs[d7a7c067ebd19583]::integrands::process::ir::run_ir_profile::<gammalooprs[d7a7c067ebd19583]::integrands::process::amplitude::AmplitudeIntegrand, <gammalooprs[d7a7c067ebd19583]::integrands::process::amplitude::AmplitudeIntegrand>::enumerate_ir_limits, <gammalooprs[d7a7c067ebd19583]::integrands::process::amplitude::AmplitudeIntegrand>::graph_cut_definitions, <gammalooprs[d7a7c067ebd19583]::integrands::process::amplitude::AmplitudeIntegrand>::test_single_ir_limit_impl><unknown>
  2010. 147.11 s > at <unknown source file>:<unknown line>
  2011. 147.11 s > 7: <gammalooprs[d7a7c067ebd19583]::integrands::process::amplitude::AmplitudeIntegrand>::test_ir<unknown>
  2012. 147.11 s > at <unknown source file>:<unknown line>
  2013. 147.11 s > 8: <gammaloop_api[92ae732909e47e14]::commands::profile::Profile>::run<unknown>
  2014. 147.11 s > at <unknown source file>:<unknown line>
  2015. 147.11 s > 9: test_runs[3e7a390caee4e338]::profile_bulk::scalar_self_energy_amp_bulk_profile_passes<unknown>
  2016. 147.11 s > at <unknown source file>:<unknown line>
  2017. 147.11 s > 10: <test_runs[3e7a390caee4e338]::profile_bulk::scalar_self_energy_amp_bulk_profile_passes::{closure#0} as core[940e698046960fd5]::ops::function::FnOnce<()>>::call_once<unknown>
  2018. 147.11 s > at <unknown source file>:<unknown line>
  2019. 147.11 s > 11: test[75d6903177b1d7e9]::__rust_begin_short_backtrace::<core[940e698046960fd5]::result::Result<(), alloc[2ea6bcb46fca0c42]::string::String>, fn() -> core[940e698046960fd5]::result::Result<(), alloc[2ea6bcb46fca0c42]::string::String>><unknown>
  2020. 147.11 s > at <unknown source file>:<unknown line>
  2021. 147.11 s > 12: test[75d6903177b1d7e9]::run_test::{closure#0}<unknown>
  2022. 147.11 s > at <unknown source file>:<unknown line>
  2023. 147.11 s > 13: std[bcb96dfbba0ab899]::sys::backtrace::__rust_begin_short_backtrace::<test[75d6903177b1d7e9]::run_test::{closure#1}, ()><unknown>
  2024. 147.11 s > at <unknown source file>:<unknown line>
  2025. 147.11 s > 14: <std[bcb96dfbba0ab899]::thread::lifecycle::spawn_unchecked<test[75d6903177b1d7e9]::run_test::{closure#1}, ()>::{closure#1} as core[940e698046960fd5]::ops::function::FnOnce<()>>::call_once::{shim:vtable#0}<unknown>
  2026. 147.11 s > at <unknown source file>:<unknown line>
  2027. 147.11 s > 15: <std[bcb96dfbba0ab899]::sys::thread::unix::Thread>::new::thread_start<unknown>
  2028. 147.11 s > at <unknown source file>:<unknown line>
  2029. 147.11 s > 16: start_thread<unknown>
  2030. 147.11 s > at <unknown source file>:<unknown line>
  2031. 147.11 s > 17: __clone3<unknown>
  2032. 147.11 s > at <unknown source file>:<unknown line>
  2033. 147.11 s >
  2034. 147.11 s > Run with COLORBT_SHOW_HIDDEN=1 environment variable to disable frame filtering.
  2035. 147.11 s > Run with RUST_BACKTRACE=full to include source snippets.
  2036. 147.11 s > Warning: SpanTrace capture is Unsupported.
  2037. 147.11 s > Ensure that you've setup a tracing-error ErrorLayer and the semver versions are compatible
  2038. 147.11 s >
  2039. 147.11 s > 7. gammaloop-integration-tests::uv::dod2_bubble_uv
  2040. 147.11 s > failure: test failure with exit code 101
  2041. 147.11 s > system-out
  2042. 147.11 s > running 1 test
  2043. 147.11 s > +-------------+-----------------+---------+--------+----------+-----------------------------------------------------------------------------------------------------------------------+-------+
  2044. 147.11 s > | case | check | graph | status | sigma | threshold | error |
  2045. 147.11 s > +-------------+-----------------+---------+--------+----------+-----------------------------------------------------------------------------------------------------------------------+-------+
  2046. 147.11 s > | dod2_bubble | uv_profile | - | FAIL | - | - | - |
  2047. 147.11 s > +-------------+-----------------+---------+--------+----------+-----------------------------------------------------------------------------------------------------------------------+-------+
  2048. 147.11 s > | dod2_bubble | m_uv.inspect | inspect | pass | - | best inspect relative delta 1.000e0 >= 1000*accuracy 1.000e-7 (accuracy=1.000e-10, exponent=+8.0, seed=0, probes=10) | - |
  2049. 147.11 s > +-------------+-----------------+---------+--------+----------+-----------------------------------------------------------------------------------------------------------------------+-------+
  2050. 147.11 s > | dod2_bubble | m_uv.integrated | GL0 | pass | 0.0sigma | compatible within 2sigma | - |
  2051. 147.11 s > +-------------+-----------------+---------+--------+----------+-----------------------------------------------------------------------------------------------------------------------+-------+
  2052. 147.11 s > | dod2_bubble | rls.inspect | inspect | pass | - | best inspect relative delta 2.822e-3 >= 1000*accuracy 1.000e-7 (accuracy=1.000e-10, exponent=+2.0, seed=1, probes=10) | - |
  2053. 147.11 s > +-------------+-----------------+---------+--------+----------+-----------------------------------------------------------------------------------------------------------------------+-------+
  2054. 147.11 s > | dod2_bubble | rls.integrated | GL0 | pass | 0.0sigma | compatible within 2sigma | - |
  2055. 147.11 s > +-------------+-----------------+---------+--------+----------+-----------------------------------------------------------------------------------------------------------------------+-------+
  2056. 147.11 s > | dod2_bubble | mu_r.inspect | inspect | pass | - | best inspect relative delta 6.951e-1 >= 1000*accuracy 1.000e-7 (accuracy=1.000e-10, exponent=+0.0, seed=0, probes=10) | - |
  2057. 147.11 s > +-------------+-----------------+---------+--------+----------+-----------------------------------------------------------------------------------------------------------------------+-------+
  2058. 147.11 s > | dod2_bubble | target | - | pass | - | 2sigma | - |
  2059. 147.11 s > +-------------+-----------------+---------+--------+----------+-----------------------------------------------------------------------------------------------------------------------+-------+
  2060. 147.11 s > test dod2_bubble_uv ... FAILED
  2061. 147.11 s >
  2062. 147.11 s > failures:
  2063. 147.11 s >
  2064. 147.11 s > failures:
  2065. 147.11 s > dod2_bubble_uv
  2066. 147.11 s >
  2067. 147.11 s > test result: FAILED. 0 passed; 1 failed; 0 ignored; 0 measured; 24 filtered out; finished in 50.14s
  2068. 147.11 s > system-err
  2069. 147.11 s > [2026-08-26 05:42:42.466] @gammaloop_api::se... INFO : Running command run generate
  2070. 147.11 s > [2026-08-26 05:42:42.466] @gammaloop_api::se... INFO : Starting command block generate
  2071. 147.11 s > [2026-08-26 05:42:42.466] @gammaloop_api::se... INFO : Running command import model scalars-default.json
  2072. 147.11 s > [2026-08-26 05:42:42.467] @import::model INFO : Loading built-in JSON model scalars-default
  2073. 147.11 s > [2026-08-26 05:42:42.470] @gammalooprs::model INFO : The following 2 external parameters were forced to zero by the restriction card:
  2074. 147.11 s > width_scalar_1, width_scalar_2
  2075. 147.11 s > [2026-08-26 05:42:42.471] @gammaloop_api::se... INFO : Running command remove processes
  2076. 147.11 s > [2026-08-26 05:42:42.471] @gammaloop_api::se... INFO : Running command set global kv global.generation.uv.generate_integrated=true
  2077. 147.11 s > [2026-08-26 05:42:42.471] @gammaloop_api::se... INFO : Running command import graphs ./tests/resources/graphs/scalar/dod2_bubble.dot -p bubble_dod2 -i scalar_bubble_below_thres
  2078. 147.11 s > [2026-08-26 05:42:42.471] @commands::import INFO : Loading graphs from '/build/source/tests/resources/graphs/scalar/dod2_bubble.dot'
  2079. 147.11 s > [2026-08-26 05:42:42.474] @gammaloop_api::se... INFO : Running command generate existing -p bubble_dod2 -i scalar_bubble_below_thres
  2080. 147.11 s > [2026-08-26 05:42:42.476] @approx::local_4d [{#uv, #inspect, #integrated}] DEBUG : Rescaled momenta expanded
  2081. 147.11 s > field value
  2082. 147.11 s > res n-terms: 1, byte size: 3,expr:
  2083. 147.11 s > 1
  2084. 147.11 s > [2026-08-26 05:42:42.477] @approx::local_4d [{#uv, #inspect, #integrated}] DEBUG : Rescaled momenta expanded
  2085. 147.11 s > field value
  2086. 147.11 s > res n-terms: 1, byte size: 585,expr:
  2087. 147.11 s > -SCALAR_COUPLING²·q₀(αᵉ².¹)·q₀(αᵉ³.¹)·q₂(αᵉ².¹)·q₂(αᵉ³.¹)
  2088. 147.11 s > /(t²·denom(3,-q₀-q₂/t,mass_scalar_2²,-mass_scalar_2²+2·(q₀.q₂)/t+(q₂.q₂)/t²+(q₀.q₀))
  2089. 147.11 s > ·denom(2,q₂/t,mass_scalar_2²,-mass_scalar_2²+(q₂.q₂)/t²))
  2090. 147.11 s > [2026-08-26 05:42:42.478] @approx::final_integrand[{#generation, #profile, #uv, #graph, #summary}] DEBUG : Computed global numerator
  2091. 147.11 s > field value
  2092. 147.11 s > global_num n-terms: 1, byte size: 4,expr:
  2093. 147.11 s > 1/2
  2094. 147.11 s > span build_3d{span_context=true graph=GL0 current=subgraph=0, topo_order=0, dod=0}
  2095. 147.11 s > [2026-08-26 05:42:42.480] @uv::approx [{#generation, #uv, #fourd}] DEBUG : Computing 4D
  2096. 147.11 s > field value
  2097. 147.11 s > simple subgraph(S_11,S_y)*Approx(subgraph(S_y,0)) of GL0
  2098. 147.11 s > span compute_4d{span_context=true graph=GL0 current=subgraph=y, topo_order=1, dod=2 given=subgraph=0, topo_order=0, dod=0 reduced=SubSet { set: BitVec<usize, bitvec::order::Lsb0> { addr: 0x7fffec027530, head: 000000, bits: 6, capacity: 64 } [0, 0, 1, 1, 1, 1], id: PhantomData<linnet::half_edge::involution::Hedge> }}
  2099. 147.11 s > [2026-08-26 05:42:42.481] @approx::local_4d [{#uv, #algebra, #integrated, #start}] DEBUG :
  2100. 147.11 s > field value
  2101. 147.11 s > integrand n-terms: 1, byte size: 409,expr:
  2102. 147.11 s > SCALAR_COUPLING²·(q₀(αᵉ³.¹)+q₃(αᵉ³.¹))·q₀(αᵉ².¹)·q₀(αᵉ³.¹)·q₂(αᵉ².¹)
  2103. 147.11 s > /(denom(2,q₂,mass_scalar_2²,-mass_scalar_2²+(q₂.q₂))·denom(3,q₃,mass_scalar_2²,-mass_scalar_2²+(q₃.q₃)))
  2104. 147.11 s > reduced y
  2105. 147.11 s > span grow{span_context=true current=subgraph=y, topo_order=1, dod=2 given=subgraph=0, topo_order=0, dod=0}
  2106. 147.11 s > [2026-08-26 05:42:42.481] @approx::local_4d [{#uv, #inspect, #integrated}] DEBUG : Rescaled momenta expanded
  2107. 147.11 s > field value
  2108. 147.11 s > res n-terms: 1, byte size: 585,expr:
  2109. 147.11 s > -SCALAR_COUPLING²·q₀(αᵉ².¹)·q₀(αᵉ³.¹)·q₂(αᵉ².¹)·q₂(αᵉ³.¹)
  2110. 147.11 s > /(t²·denom(3,-q₀-q₂/t,mass_scalar_2²,-mass_scalar_2²+2·(q₀.q₂)/t+(q₂.q₂)/t²+(q₀.q₀))
  2111. 147.11 s > ·denom(2,q₂/t,mass_scalar_2²,-mass_scalar_2²+(q₂.q₂)/t²))
  2112. 147.11 s > span t{span_context=true current=subgraph=y, topo_order=1, dod=2 given=subgraph=0, topo_order=0, dod=0}
  2113. 147.11 s > [2026-08-26 05:42:42.502] @approx::local_4d [{#uv, #integrated, #rescaled}] DEBUG : Rescaled expanded
  2114. 147.11 s > field value
  2115. 147.11 s > n_loops 1
  2116. 147.11 s > res n-terms: 1, byte size: 707,expr:
  2117. 147.11 s > -SCALAR_COUPLING²·q₀(αᵉ².¹)·q₀(αᵉ³.¹)·q₂(αᵉ².¹)·q₂(αᵉ³.¹)
  2118. 147.11 s > /(t²·denom(3,-q₂,mUVexp²+t²·mass_scalar_2²,-mUV²+t²·(-mass_scalar_2²+2·(q₀.q₂)/t+(q₂.q₂)/t²+(q₀.q₀))+t²·mUVexp²)
  2119. 147.11 s > ·denom(2,q₂,mUVexp²+t²·mass_scalar_2²,-mUV²+t²·(-mass_scalar_2²+(q₂.q₂)/t²)+t²·mUVexp²))
  2120. 147.11 s > span t{span_context=true current=subgraph=y, topo_order=1, dod=2 given=subgraph=0, topo_order=0, dod=0}
  2121. 147.11 s > [2026-08-26 05:42:42.503] @approx::local_4d [{#uv, #integrated, #series}] DEBUG : Series expanded
  2122. 147.11 s > field value
  2123. 147.11 s > res n-terms: 3, byte size: 1896,expr:
  2124. 147.11 s > (1/2·SCALAR_COUPLING²·(2·mUVexp²-2·mass_scalar_2²)/(denom(2,q₂,mUVexp²,-mUV²+(q₂.q₂))²·denom(3,-q₂,mUVexp²,-mUV²+(q₂.q₂)))
  2125. 147.11 s > -SCALAR_COUPLING²
  2126. 147.11 s > ·(-1/2·(2·mUVexp²-2·mass_scalar_2²+2·(q₀.q₀))/denom(3,-q₂,mUVexp²,-mUV²+(q₂.q₂))
  2127. 147.11 s > +4·(q₀.q₂)²/denom(3,-q₂,mUVexp²,-mUV²+(q₂.q₂))²
  2128. 147.11 s > )/(denom(2,q₂,mUVexp²,-mUV²+(q₂.q₂))·denom(3,-q₂,mUVexp²,-mUV²+(q₂.q₂)))
  2129. 147.11 s > )·q₀(αᵉ².¹)·q₀(αᵉ³.¹)·q₂(αᵉ².¹)·q₂(αᵉ³.¹)
  2130. 147.11 s > +2·SCALAR_COUPLING²·(q₀.q₂)·q₀(αᵉ².¹)·q₀(αᵉ³.¹)·q₂(αᵉ².¹)·q₂(αᵉ³.¹)
  2131. 147.11 s > /(t·denom(2,q₂,mUVexp²,-mUV²+(q₂.q₂))·denom(3,-q₂,mUVexp²,-mUV²+(q₂.q₂))²)
  2132. 147.11 s > -SCALAR_COUPLING²·q₀(αᵉ².¹)·q₀(αᵉ³.¹)·q₂(αᵉ².¹)·q₂(αᵉ³.¹)
  2133. 147.11 s > /(t²·denom(2,q₂,mUVexp²,-mUV²+(q₂.q₂))·denom(3,-q₂,mUVexp²,-mUV²+(q₂.q₂)))
  2134. 147.11 s > span t{span_context=true current=subgraph=y, topo_order=1, dod=2 given=subgraph=0, topo_order=0, dod=0}
  2135. 147.11 s > [2026-08-26 05:42:42.504] @approx::local_4d [{#uv, #integrated, #series}] DEBUG : Evaluated at t = 1
  2136. 147.11 s > field value
  2137. 147.11 s > res n-terms: 3, byte size: 1880,expr:
  2138. 147.11 s > (1/2·SCALAR_COUPLING²·(2·mUVexp²-2·mass_scalar_2²)/(denom(2,q₂,mUVexp²,-mUV²+(q₂.q₂))²·denom(3,-q₂,mUVexp²,-mUV²+(q₂.q₂)))
  2139. 147.11 s > -SCALAR_COUPLING²
  2140. 147.11 s > ·(-1/2·(2·mUVexp²-2·mass_scalar_2²+2·(q₀.q₀))/denom(3,-q₂,mUVexp²,-mUV²+(q₂.q₂))
  2141. 147.11 s > +4·(q₀.q₂)²/denom(3,-q₂,mUVexp²,-mUV²+(q₂.q₂))²
  2142. 147.11 s > )/(denom(2,q₂,mUVexp²,-mUV²+(q₂.q₂))·denom(3,-q₂,mUVexp²,-mUV²+(q₂.q₂)))
  2143. 147.11 s > )·q₀(αᵉ².¹)·q₀(αᵉ³.¹)·q₂(αᵉ².¹)·q₂(αᵉ³.¹)
  2144. 147.11 s > -SCALAR_COUPLING²·q₀(αᵉ².¹)·q₀(αᵉ³.¹)·q₂(αᵉ².¹)·q₂(αᵉ³.¹)
  2145. 147.11 s > /(denom(2,q₂,mUVexp²,-mUV²+(q₂.q₂))·denom(3,-q₂,mUVexp²,-mUV²+(q₂.q₂)))
  2146. 147.11 s > +2·SCALAR_COUPLING²·(q₀.q₂)·q₀(αᵉ².¹)·q₀(αᵉ³.¹)·q₂(αᵉ².¹)·q₂(αᵉ³.¹)
  2147. 147.11 s > /(denom(2,q₂,mUVexp²,-mUV²+(q₂.q₂))·denom(3,-q₂,mUVexp²,-mUV²+(q₂.q₂))²)
  2148. 147.11 s > span t{span_context=true current=subgraph=y, topo_order=1, dod=2 given=subgraph=0, topo_order=0, dod=0}
  2149. 147.11 s > [2026-08-26 05:42:42.505] @approx::local_4d [{#uv, #collect, #integrated}] DEBUG : After gamma chain collection
  2150. 147.11 s > field value
  2151. 147.11 s > expr n-terms: 3, byte size: 1880,expr:
  2152. 147.11 s > (1/2·SCALAR_COUPLING²·(2·mUVexp²-2·mass_scalar_2²)/(denom(2,q₂,mUVexp²,-mUV²+(q₂.q₂))²·denom(3,-q₂,mUVexp²,-mUV²+(q₂.q₂)))
  2153. 147.11 s > -SCALAR_COUPLING²
  2154. 147.11 s > ·(-1/2·(2·mUVexp²-2·mass_scalar_2²+2·(q₀.q₀))/denom(3,-q₂,mUVexp²,-mUV²+(q₂.q₂))
  2155. 147.11 s > +4·(q₀.q₂)²/denom(3,-q₂,mUVexp²,-mUV²+(q₂.q₂))²
  2156. 147.11 s > )/(denom(2,q₂,mUVexp²,-mUV²+(q₂.q₂))·denom(3,-q₂,mUVexp²,-mUV²+(q₂.q₂)))
  2157. 147.11 s > )·q₀(αᵉ².¹)·q₀(αᵉ³.¹)·q₂(αᵉ².¹)·q₂(αᵉ³.¹)
  2158. 147.11 s > -SCALAR_COUPLING²·q₀(αᵉ².¹)·q₀(αᵉ³.¹)·q₂(αᵉ².¹)·q₂(αᵉ³.¹)
  2159. 147.11 s > /(denom(2,q₂,mUVexp²,-mUV²+(q₂.q₂))·denom(3,-q₂,mUVexp²,-mUV²+(q₂.q₂)))
  2160. 147.11 s > +2·SCALAR_COUPLING²·(q₀.q₂)·q₀(αᵉ².¹)·q₀(αᵉ³.¹)·q₂(αᵉ².¹)·q₂(αᵉ³.¹)
  2161. 147.11 s > /(denom(2,q₂,mUVexp²,-mUV²+(q₂.q₂))·denom(3,-q₂,mUVexp²,-mUV²+(q₂.q₂))²)
  2162. 147.11 s > span t{span_context=true current=subgraph=y, topo_order=1, dod=2 given=subgraph=0, topo_order=0, dod=0}
  2163. 147.11 s > [2026-08-26 05:42:42.506] @approx::local_4d [{#profile, #uv, #collect, #integrated, #start, #trace}] DEBUG : After gamma schoonschip
  2164. 147.11 s > field value
  2165. 147.11 s > expr n-terms: 3, byte size: 1631,expr:
  2166. 147.11 s > (1/2·SCALAR_COUPLING²·(2·mUVexp²-2·mass_scalar_2²)/(denom(2,q₂,mUVexp²,-mUV²+(q₂.q₂))²·denom(3,-q₂,mUVexp²,-mUV²+(q₂.q₂)))
  2167. 147.11 s > -SCALAR_COUPLING²
  2168. 147.11 s > ·(-1/2·(2·mUVexp²-2·mass_scalar_2²+2·(q₀.q₀))/denom(3,-q₂,mUVexp²,-mUV²+(q₂.q₂))
  2169. 147.11 s > +4·(q₀.q₂)²/denom(3,-q₂,mUVexp²,-mUV²+(q₂.q₂))²
  2170. 147.11 s > )/(denom(2,q₂,mUVexp²,-mUV²+(q₂.q₂))·denom(3,-q₂,mUVexp²,-mUV²+(q₂.q₂)))
  2171. 147.11 s > )·(q₀.q₂)²
  2172. 147.11 s > -SCALAR_COUPLING²·(q₀.q₂)²/(denom(2,q₂,mUVexp²,-mUV²+(q₂.q₂))·denom(3,-q₂,mUVexp²,-mUV²+(q₂.q₂)))
  2173. 147.11 s > +2·SCALAR_COUPLING²·(q₀.q₂)·(q₀.q₂)²
  2174. 147.11 s > /(denom(2,q₂,mUVexp²,-mUV²+(q₂.q₂))·denom(3,-q₂,mUVexp²,-mUV²+(q₂.q₂))²)
  2175. 147.11 s > span t{span_context=true current=subgraph=y, topo_order=1, dod=2 given=subgraph=0, topo_order=0, dod=0}
  2176. 147.11 s > [2026-08-26 05:42:42.507] @approx::local_4d [{#profile, #uv, #collect, #integrated, #start, #trace}] DEBUG : After gamma collection
  2177. 147.11 s > field value
  2178. 147.11 s > expr n-terms: 1, byte size: 1347,expr:
  2179. 147.11 s > SCALAR_COUPLING²
  2180. 147.11 s > ·(-denom(2,q₂,mUVexp²,-mUV²+(q₂.q₂))·denom(3,-q₂,mUVexp²,-mUV²+(q₂.q₂))²
  2181. 147.11 s > +1/2·(2·mUVexp²-2·mass_scalar_2²)·denom(3,-q₂,mUVexp²,-mUV²+(q₂.q₂))²
  2182. 147.11 s > -(-1/2·(2·mUVexp²-2·mass_scalar_2²+2·(q₀.q₀))·denom(3,-q₂,mUVexp²,-mUV²+(q₂.q₂))+4·(q₀.q₂)²)
  2183. 147.11 s > ·denom(2,q₂,mUVexp²,-mUV²+(q₂.q₂))
  2184. 147.11 s > +2·(q₀.q₂)·denom(2,q₂,mUVexp²,-mUV²+(q₂.q₂))·denom(3,-q₂,mUVexp²,-mUV²+(q₂.q₂))
  2185. 147.11 s > )·(q₀.q₂)²/(denom(2,q₂,mUVexp²,-mUV²+(q₂.q₂))²·denom(3,-q₂,mUVexp²,-mUV²+(q₂.q₂))³)
  2186. 147.11 s > span t{span_context=true current=subgraph=y, topo_order=1, dod=2 given=subgraph=0, topo_order=0, dod=0}
  2187. 147.11 s > [2026-08-26 05:42:42.508] @approx::local_4d [{#profile, #uv, #gamma, #integrated, #start, #trace, #vakint}] DEBUG : After gamma simplification
  2188. 147.11 s > ... omitted 3263 more lines; see full nextest output above
  2189. 147.11 s >
  2190. 147.11 s > 8. gammaloop-integration-tests::uv::sunrise_scalar_1_uv
  2191. 147.11 s > failure: test failure with exit code 101
  2192. 147.11 s > system-out
  2193. 147.11 s > running 1 test
  2194. 147.11 s > test sunrise_scalar_1_uv has been running for over 60 seconds
  2195. 147.11 s > +------------------+------------------------+--------------+--------+----------+----------------------------------------------------------------------------------------------------------------------+-------+
  2196. 147.11 s > | case | check | graph | status | sigma | threshold | error |
  2197. 147.11 s > +------------------+------------------------+--------------+--------+----------+----------------------------------------------------------------------------------------------------------------------+-------+
  2198. 147.11 s > | sunrise_scalar_1 | uv_profile | - | FAIL | - | - | - |
  2199. 147.11 s > +------------------+------------------------+--------------+--------+----------+----------------------------------------------------------------------------------------------------------------------+-------+
  2200. 147.11 s > | sunrise_scalar_1 | m_uv.inspect | inspect | pass | - | best inspect relative delta 1.624e0 >= 1000*accuracy 1.000e-3 (accuracy=1.000e-6, exponent=+1.0, seed=1, probes=10) | - |
  2201. 147.11 s > +------------------+------------------------+--------------+--------+----------+----------------------------------------------------------------------------------------------------------------------+-------+
  2202. 147.11 s > | sunrise_scalar_1 | m_uv.integrated | sunrise | pass | 0.1sigma | compatible within 2sigma | - |
  2203. 147.11 s > +------------------+------------------------+--------------+--------+----------+----------------------------------------------------------------------------------------------------------------------+-------+
  2204. 147.11 s > | sunrise_scalar_1 | rls.inspect | inspect | pass | - | best inspect relative delta 8.682e-1 >= 1000*accuracy 1.000e-3 (accuracy=1.000e-6, exponent=+1.0, seed=1, probes=10) | - |
  2205. 147.11 s > +------------------+------------------------+--------------+--------+----------+----------------------------------------------------------------------------------------------------------------------+-------+
  2206. 147.11 s > | sunrise_scalar_1 | rls.integrated | sunrise | pass | 0.0sigma | compatible within 2sigma | - |
  2207. 147.11 s > +------------------+------------------------+--------------+--------+----------+----------------------------------------------------------------------------------------------------------------------+-------+
  2208. 147.11 s > | sunrise_scalar_1 | mu_r.inspect | inspect | pass | - | best inspect relative delta 1.752e0 >= 1000*accuracy 1.000e-3 (accuracy=1.000e-6, exponent=+1.0, seed=1, probes=10) | - |
  2209. 147.11 s > +------------------+------------------------+--------------+--------+----------+----------------------------------------------------------------------------------------------------------------------+-------+
  2210. 147.11 s > | sunrise_scalar_1 | integrated.relerr | integrated | pass | - | relative error 9.20% <= 10.00% | - |
  2211. 147.11 s > +------------------+------------------------+--------------+--------+----------+----------------------------------------------------------------------------------------------------------------------+-------+
  2212. 147.11 s > | sunrise_scalar_1 | m_uv.integrated.relerr | m_uv-shifted | pass | - | relative error 5.89% <= 10.00% | - |
  2213. 147.11 s > +------------------+------------------------+--------------+--------+----------+----------------------------------------------------------------------------------------------------------------------+-------+
  2214. 147.11 s > | sunrise_scalar_1 | target | - | pass | - | 2sigma | - |
  2215. 147.11 s > +------------------+------------------------+--------------+--------+----------+----------------------------------------------------------------------------------------------------------------------+-------+
  2216. 147.11 s > test sunrise_scalar_1_uv ... FAILED
  2217. 147.11 s >
  2218. 147.11 s > failures:
  2219. 147.11 s >
  2220. 147.11 s > failures:
  2221. 147.11 s > sunrise_scalar_1_uv
  2222. 147.11 s >
  2223. 147.11 s > test result: FAILED. 0 passed; 1 failed; 0 ignored; 0 measured; 24 filtered out; finished in 97.64s
  2224. 147.11 s > system-err
  2225. 147.11 s > [2026-08-26 05:42:55.207] @gammaloop_api::se... INFO : Running command run generate
  2226. 147.11 s > [2026-08-26 05:42:55.207] @gammaloop_api::se... INFO : Starting command block generate
  2227. 147.11 s > [2026-08-26 05:42:55.207] @gammaloop_api::se... INFO : Running command import model scalars-default.json
  2228. 147.11 s > [2026-08-26 05:42:55.210] @import::model INFO : Loading built-in JSON model scalars-default
  2229. 147.11 s > [2026-08-26 05:42:55.239] @gammalooprs::model INFO : The following 2 external parameters were forced to zero by the restriction card:
  2230. 147.11 s > width_scalar_1, width_scalar_2
  2231. 147.11 s > [2026-08-26 05:42:55.249] @gammaloop_api::se... INFO : Running command remove processes
  2232. 147.11 s > [2026-08-26 05:42:55.254] @gammaloop_api::se... INFO : Running command set global kv global.generation.uv.generate_integrated=true
  2233. 147.11 s > [2026-08-26 05:42:55.257] @gammaloop_api::se... INFO : Running command import graphs ./tests/resources/graphs/scalar_sunrise.dot -p sunrise_scalar_1 -i scalar_sunrise
  2234. 147.11 s > [2026-08-26 05:42:55.261] @commands::import INFO : Loading graphs from '/build/source/tests/resources/graphs/scalar_sunrise.dot'
  2235. 147.11 s > [2026-08-26 05:42:55.279] @gammaloop_api::se... INFO : Running command generate existing -p sunrise_scalar_1 -i scalar_sunrise
  2236. 147.11 s > [2026-08-26 05:42:55.312] @approx::local_4d [{#uv, #inspect, #integrated}] DEBUG : Rescaled momenta expanded
  2237. 147.11 s > field value
  2238. 147.11 s > res n-terms: 1, byte size: 611,expr:
  2239. 147.11 s > 1/(denom(1,q₁/t,mass_scalar_1²,-mass_scalar_1²+(q₁.q₁)/t²)
  2240. 147.11 s > ·denom(2,-q₀+q₃-q₁/t,mass_scalar_1²,
  2241. 147.11 s > -mass_scalar_1²+2·(q₀.q₁)/t-2·(q₁.q₃)/t+(q₁.q₁)/t²+(q₀.q₀)
  2242. 147.11 s > -2·(q₀.q₃)+(q₃.q₃)
  2243. 147.11 s > ))
  2244. 147.11 s > [2026-08-26 05:42:55.313] @approx::local_4d [{#uv, #inspect, #integrated}] DEBUG : Rescaled momenta expanded
  2245. 147.11 s > field value
  2246. 147.11 s > res n-terms: 1, byte size: 777,expr:
  2247. 147.11 s > 1/(denom(0,q₀/t,mass_scalar_1²,-mass_scalar_1²+(q₀.q₀)/t²)·denom(1,q₁/t,mass_scalar_1²,-mass_scalar_1²+(q₁.q₁)/t²)
  2248. 147.11 s > ·denom(2,q₄-q₀/t-q₁/t,mass_scalar_1²,
  2249. 147.11 s > -mass_scalar_1²-2·(q₀.q₄)/t-2·(q₁.q₄)/t+(q₀.q₀)/t²+2·(q₀.q₁)/t²
  2250. 147.11 s > +(q₁.q₁)/t²+(q₄.q₄)
  2251. 147.11 s > ))
  2252. 147.11 s > [2026-08-26 05:42:55.319] @approx::local_4d [{#uv, #inspect, #integrated}] DEBUG : Rescaled momenta expanded
  2253. 147.11 s > field value
  2254. 147.11 s > res n-terms: 1, byte size: 611,expr:
  2255. 147.11 s > 1/(denom(0,q₀/t,mass_scalar_1²,-mass_scalar_1²+(q₀.q₀)/t²)
  2256. 147.11 s > ·denom(2,-q₁+q₃-q₀/t,mass_scalar_1²,
  2257. 147.11 s > -mass_scalar_1²+2·(q₀.q₁)/t-2·(q₀.q₃)/t+(q₀.q₀)/t²+(q₁.q₁)
  2258. 147.11 s > -2·(q₁.q₃)+(q₃.q₃)
  2259. 147.11 s > ))
  2260. 147.11 s > [2026-08-26 05:42:55.320] @approx::local_4d [{#uv, #inspect, #integrated}] DEBUG : Rescaled momenta expanded
  2261. 147.11 s > field value
  2262. 147.11 s > res n-terms: 1, byte size: 611,expr:
  2263. 147.11 s > 1/(denom(0,q₀/t,mass_scalar_1²,-mass_scalar_1²+(q₀.q₀)/t²)
  2264. 147.11 s > ·denom(1,-q₂+q₃-q₀/t,mass_scalar_1²,
  2265. 147.11 s > -mass_scalar_1²+2·(q₀.q₂)/t-2·(q₀.q₃)/t+(q₀.q₀)/t²+(q₂.q₂)
  2266. 147.11 s > -2·(q₂.q₃)+(q₃.q₃)
  2267. 147.11 s > ))
  2268. 147.11 s > [2026-08-26 05:42:55.323] @approx::local_4d [{#uv, #inspect, #integrated}] DEBUG : Rescaled momenta expanded
  2269. 147.11 s > field value
  2270. 147.11 s > res n-terms: 1, byte size: 3,expr:
  2271. 147.11 s > 1
  2272. 147.11 s > [2026-08-26 05:42:55.324] @approx::final_integrand[{#generation, #profile, #uv, #graph, #summary}] DEBUG : Computed global numerator
  2273. 147.11 s > field value
  2274. 147.11 s > global_num n-terms: 1, byte size: 3,expr:
  2275. 147.11 s > 1
  2276. 147.11 s > span build_3d{span_context=true graph=sunrise current=subgraph=0, topo_order=0, dod=0}
  2277. 147.11 s > [2026-08-26 05:42:55.325] @uv::approx [{#generation, #uv, #fourd}] DEBUG : Computing 4D
  2278. 147.11 s > field value
  2279. 147.11 s > simple subgraph(S_47,S_3s)*Approx(subgraph(S_3s,0)) of sunrise
  2280. 147.11 s > span compute_4d{span_context=true graph=sunrise current=subgraph=3s, topo_order=1, dod=0 given=subgraph=0, topo_order=0, dod=0 reduced=SubSet { set: BitVec<usize, bitvec::order::Lsb0> { addr: 0x7fffb400a8f0, head: 000000, bits: 8, capacity: 64 } [0, 0, 0, 0, 1, 1, 1, 1], id: PhantomData<linnet::half_edge::involution::Hedge> }}
  2281. 147.11 s > [2026-08-26 05:42:55.326] @approx::local_4d [{#uv, #algebra, #integrated, #start}] DEBUG :
  2282. 147.11 s > field value
  2283. 147.11 s > integrand n-terms: 1, byte size: 217,expr:
  2284. 147.11 s > 1/(denom(1,q₁,mass_scalar_1²,-mass_scalar_1²+(q₁.q₁))·denom(2,q₂,mass_scalar_1²,-mass_scalar_1²+(q₂.q₂)))
  2285. 147.11 s > reduced 3s
  2286. 147.11 s > span grow{span_context=true current=subgraph=3s, topo_order=1, dod=0 given=subgraph=0, topo_order=0, dod=0}
  2287. 147.11 s > [2026-08-26 05:42:55.326] @approx::local_4d [{#uv, #inspect, #integrated}] DEBUG : Rescaled momenta expanded
  2288. 147.11 s > field value
  2289. 147.11 s > res n-terms: 1, byte size: 611,expr:
  2290. 147.11 s > 1/(denom(1,q₁/t,mass_scalar_1²,-mass_scalar_1²+(q₁.q₁)/t²)
  2291. 147.11 s > ·denom(2,-q₀+q₃-q₁/t,mass_scalar_1²,
  2292. 147.11 s > -mass_scalar_1²+2·(q₀.q₁)/t-2·(q₁.q₃)/t+(q₁.q₁)/t²+(q₀.q₀)
  2293. 147.11 s > -2·(q₀.q₃)+(q₃.q₃)
  2294. 147.11 s > ))
  2295. 147.11 s > span t{span_context=true current=subgraph=3s, topo_order=1, dod=0 given=subgraph=0, topo_order=0, dod=0}
  2296. 147.11 s > [2026-08-26 05:42:55.329] @approx::local_4d [{#uv, #integrated, #rescaled}] DEBUG : Rescaled expanded
  2297. 147.11 s > field value
  2298. 147.11 s > n_loops 1
  2299. 147.11 s > res n-terms: 1, byte size: 723,expr:
  2300. 147.11 s > 1/(denom(1,q₁,mUVexp²+t²·mass_scalar_1²,-mUV²+t²·(-mass_scalar_1²+(q₁.q₁)/t²)+t²·mUVexp²)
  2301. 147.11 s > ·denom(2,-q₁,mUVexp²+t²·mass_scalar_1²,
  2302. 147.11 s > -mUV²
  2303. 147.11 s > +t²
  2304. 147.11 s > ·(-mass_scalar_1²+2·(q₀.q₁)/t-2·(q₁.q₃)/t+(q₁.q₁)/t²+(q₀.q₀)
  2305. 147.11 s > -2·(q₀.q₃)+(q₃.q₃)
  2306. 147.11 s > )
  2307. 147.11 s > +t²·mUVexp²
  2308. 147.11 s > ))
  2309. 147.11 s > span t{span_context=true current=subgraph=3s, topo_order=1, dod=0 given=subgraph=0, topo_order=0, dod=0}
  2310. 147.11 s > [2026-08-26 05:42:55.330] @approx::local_4d [{#uv, #integrated, #series}] DEBUG : Series expanded
  2311. 147.11 s > field value
  2312. 147.11 s > res n-terms: 1, byte size: 223,expr:
  2313. 147.11 s > 1/(denom(1,q₁,mUVexp²,-mUV²+(q₁.q₁))·denom(2,-q₁,mUVexp²,-mUV²+(q₁.q₁)))
  2314. 147.11 s > span t{span_context=true current=subgraph=3s, topo_order=1, dod=0 given=subgraph=0, topo_order=0, dod=0}
  2315. 147.11 s > [2026-08-26 05:42:55.330] @approx::local_4d [{#uv, #integrated, #series}] DEBUG : Evaluated at t = 1
  2316. 147.11 s > field value
  2317. 147.11 s > res n-terms: 1, byte size: 223,expr:
  2318. 147.11 s > 1/(denom(1,q₁,mUVexp²,-mUV²+(q₁.q₁))·denom(2,-q₁,mUVexp²,-mUV²+(q₁.q₁)))
  2319. 147.11 s > span t{span_context=true current=subgraph=3s, topo_order=1, dod=0 given=subgraph=0, topo_order=0, dod=0}
  2320. 147.11 s > [2026-08-26 05:42:55.330] @approx::local_4d [{#uv, #collect, #integrated}] DEBUG : After gamma chain collection
  2321. 147.11 s > field value
  2322. 147.11 s > expr n-terms: 1, byte size: 223,expr:
  2323. 147.11 s > 1/(denom(1,q₁,mUVexp²,-mUV²+(q₁.q₁))·denom(2,-q₁,mUVexp²,-mUV²+(q₁.q₁)))
  2324. 147.11 s > span t{span_context=true current=subgraph=3s, topo_order=1, dod=0 given=subgraph=0, topo_order=0, dod=0}
  2325. 147.11 s > [2026-08-26 05:42:55.330] @approx::local_4d [{#profile, #uv, #collect, #integrated, #start, #trace}] DEBUG : After gamma schoonschip
  2326. 147.11 s > field value
  2327. 147.11 s > expr n-terms: 1, byte size: 223,expr:
  2328. 147.11 s > 1/(denom(1,q₁,mUVexp²,-mUV²+(q₁.q₁))·denom(2,-q₁,mUVexp²,-mUV²+(q₁.q₁)))
  2329. 147.11 s > span t{span_context=true current=subgraph=3s, topo_order=1, dod=0 given=subgraph=0, topo_order=0, dod=0}
  2330. 147.11 s > [2026-08-26 05:42:55.330] @approx::local_4d [{#profile, #uv, #collect, #integrated, #start, #trace}] DEBUG : After gamma collection
  2331. 147.11 s > field value
  2332. 147.11 s > expr n-terms: 1, byte size: 223,expr:
  2333. 147.11 s > 1/(denom(1,q₁,mUVexp²,-mUV²+(q₁.q₁))·denom(2,-q₁,mUVexp²,-mUV²+(q₁.q₁)))
  2334. 147.11 s > span t{span_context=true current=subgraph=3s, topo_order=1, dod=0 given=subgraph=0, topo_order=0, dod=0}
  2335. 147.11 s > [2026-08-26 05:42:55.331] @approx::local_4d [{#profile, #uv, #gamma, #integrated, #start, #trace, #vakint}] DEBUG : After gamma simplification
  2336. 147.11 s > field value
  2337. 147.11 s > expr n-terms: 1, byte size: 223,expr:
  2338. 147.11 s > 1/(denom(1,q₁,mUVexp²,-mUV²+(q₁.q₁))·denom(2,-q₁,mUVexp²,-mUV²+(q₁.q₁)))
  2339. 147.11 s > span t{span_context=true current=subgraph=3s, topo_order=1, dod=0 given=subgraph=0, topo_order=0, dod=0}
  2340. 147.11 s > [2026-08-26 05:42:55.331] @approx::local_4d [{#profile, #uv, #integrated, #schoonschip, #start, #trace, #vakint}] DEBUG : After Schoonschip net
  2341. 147.11 s > field value
  2342. 147.11 s > expr n-terms: 1, byte size: 223,expr:
  2343. 147.11 s > 1/(denom(1,q₁,mUVexp²,-mUV²+(q₁.q₁))·denom(2,-q₁,mUVexp²,-mUV²+(q₁.q₁)))
  2344. 147.11 s > ... omitted 20090 more lines; see full nextest output above
  2345. 147.11 s >
  2346. 147.11 s > 9. gammaloop-integration-tests::uv::se1l_uv
  2347. 147.11 s > failure: test failure with exit code 101
  2348. 147.11 s > system-out
  2349. 147.11 s > running 1 test
  2350. 147.11 s > test se1l_uv has been running for over 60 seconds
  2351. 147.11 s > +------+-----------------+---------+--------+----------+-----------------------------------------------------------------------------------------------------------------------+-------+
  2352. 147.11 s > | case | check | graph | status | sigma | threshold | error |
  2353. 147.11 s > +------+-----------------+---------+--------+----------+-----------------------------------------------------------------------------------------------------------------------+-------+
  2354. 147.11 s > | se1l | uv_profile | - | FAIL | - | - | - |
  2355. 147.11 s > +------+-----------------+---------+--------+----------+-----------------------------------------------------------------------------------------------------------------------+-------+
  2356. 147.11 s > | se1l | m_uv.inspect | inspect | pass | - | best inspect relative delta 1.097e-1 >= 1000*accuracy 1.000e-7 (accuracy=1.000e-10, exponent=+2.0, seed=1, probes=10) | - |
  2357. 147.11 s > +------+-----------------+---------+--------+----------+-----------------------------------------------------------------------------------------------------------------------+-------+
  2358. 147.11 s > | se1l | m_uv.integrated | se1l | pass | 0.1sigma | compatible within 2sigma | - |
  2359. 147.11 s > +------+-----------------+---------+--------+----------+-----------------------------------------------------------------------------------------------------------------------+-------+
  2360. 147.11 s > | se1l | rls.inspect | inspect | pass | - | best inspect relative delta 4.499e-2 >= 1000*accuracy 1.000e-7 (accuracy=1.000e-10, exponent=+2.0, seed=1, probes=10) | - |
  2361. 147.11 s > +------+-----------------+---------+--------+----------+-----------------------------------------------------------------------------------------------------------------------+-------+
  2362. 147.11 s > | se1l | rls.integrated | se1l | pass | 0.0sigma | compatible within 2sigma | - |
  2363. 147.11 s > +------+-----------------+---------+--------+----------+-----------------------------------------------------------------------------------------------------------------------+-------+
  2364. 147.11 s > | se1l | mu_r.inspect | inspect | pass | - | best inspect relative delta 1.424e-1 >= 1000*accuracy 1.000e-7 (accuracy=1.000e-10, exponent=+2.0, seed=1, probes=10) | - |
  2365. 147.11 s > +------+-----------------+---------+--------+----------+-----------------------------------------------------------------------------------------------------------------------+-------+
  2366. 147.11 s > | se1l | target | - | pass | - | 2sigma | - |
  2367. 147.11 s > +------+-----------------+---------+--------+----------+-----------------------------------------------------------------------------------------------------------------------+-------+
  2368. 147.11 s > test se1l_uv ... FAILED
  2369. 147.11 s >
  2370. 147.11 s > failures:
  2371. 147.11 s >
  2372. 147.11 s > failures:
  2373. 147.11 s > se1l_uv
  2374. 147.11 s >
  2375. 147.11 s > test result: FAILED. 0 passed; 1 failed; 0 ignored; 0 measured; 24 filtered out; finished in 108.84s
  2376. 147.11 s > system-err
  2377. 147.11 s > [2026-08-26 05:42:51.693] @gammaloop_api::se... INFO : Running command run generate
  2378. 147.11 s > [2026-08-26 05:42:51.693] @gammaloop_api::se... INFO : Starting command block generate
  2379. 147.11 s > [2026-08-26 05:42:51.693] @gammaloop_api::se... INFO : Running command import model sm-default
  2380. 147.11 s > [2026-08-26 05:42:51.693] @import::model INFO : Loading built-in JSON model sm-default
  2381. 147.11 s > [2026-08-26 05:42:51.735] @gammalooprs::model INFO : The following 11 external parameters were forced to zero by the restriction card:
  2382. 147.11 s > lamWS, AWS, rhoWS, etaWS, ymc, yme, ymm, MC, Me, MM, WTau
  2383. 147.11 s > [2026-08-26 05:42:51.735] @gammalooprs::model INFO : The following 34 vertex rules were removed by the restriction card:
  2384. 147.11 s > V_82 -> (c~, d, G+) | V_83 -> (t~, d, G+) | V_84 -> (c~, s, G+) | V_85 -> (t~, s, G+) | V_86 -> (u~, b, G+) | V_87 -> (c~, b, G+) | V_90 -> (c~, d, W+) | V_91 -> (t~, d, W+) | V_92 -> (u~, s, W+) | V_94 -> (t~, s, W+) | V_95 -> (u~, b, W+) | V_96 -> (c~, b, W+) | V_101 -> (e+, e-, G0) | V_102 -> (mu+, mu-, G0) | V_104 -> (e+, e-, H) | V_105 -> (mu+, mu-, H) | V_110 -> (ve~, e-, G+) | V_111 -> (vm~, mu-, G+) | V_116 -> (b~, u, G-) | V_117 -> (d~, c, G-) | V_118 -> (s~, c, G-) | V_119 -> (b~, c, G-) | V_120 -> (d~, t, G-) | V_121 -> (s~, t, G-) | V_124 -> (s~, u, W-) | V_125 -> (b~, u, W-) | V_126 -> (d~, c, W-) | V_128 -> (b~, c, W-) | V_129 -> (d~, t, W-) | V_130 -> (s~, t, W-) | V_138 -> (c~, c, G0) | V_140 -> (c~, c, H) | V_145 -> (e+, ve, G-) | V_146 -> (mu+, vm, G-)
  2385. 147.11 s > [2026-08-26 05:42:51.735] @gammalooprs::model INFO : The following 36 couplings were removed by the restriction card:
  2386. 147.11 s > GC_13, GC_14, GC_16, GC_17, GC_18, GC_19, GC_20, GC_22, GC_23, GC_24, GC_25, GC_26, GC_28, GC_29, GC_42, GC_43, GC_44, GC_46, GC_47, GC_48, GC_84, GC_85, GC_86, GC_87, GC_88, GC_89, GC_90, GC_91, GC_92, GC_93, GC_101, GC_102, GC_103, GC_105, GC_106, GC_107
  2387. 147.11 s > [2026-08-26 05:42:51.735] @gammaloop_api::se... INFO : Running command remove processes
  2388. 147.11 s > [2026-08-26 05:42:51.735] @gammaloop_api::se... INFO : Running command set global kv global.generation.uv.generate_integrated=true
  2389. 147.11 s > [2026-08-26 05:42:51.736] @gammaloop_api::se... INFO : Running command import graphs ./tests/resources/graphs/uv_tests/se1l.dot -p se1l -i se1l
  2390. 147.11 s > [2026-08-26 05:42:51.736] @commands::import INFO : Loading graphs from '/build/source/tests/resources/graphs/uv_tests/se1l.dot'
  2391. 147.11 s > [2026-08-26 05:42:51.742] @gammaloop_api::se... INFO : Running command generate existing -p se1l -i se1l
  2392. 147.11 s > [2026-08-26 05:42:55.742] @commands::generate INFO :
  2393. 147.11 s > Integrand generation summary
  2394. 147.11 s > peak RAM 89.38 MiB | cores 1
  2395. 147.11 s > ╭───────────┬───────┬─────────┬─────────────┬──────────────┬────────────────┬─────────────╮
  2396. 147.11 s > │ integrand │ graph │ # evals │ expr build │ spenso │ symbolica eval │ compile │
  2397. 147.11 s > ├───────────┼───────┼─────────┼─────────────┼──────────────┼────────────────┼─────────────┤
  2398. 147.11 s > │ se1l │ se1l │ 5 │ 3.39s (86%) │ 191ms (4.9%) │ 359ms (9.1%) │ 0ms (0.00%) │
  2399. 147.11 s > ├───────────┼───────┼─────────┼─────────────┼──────────────┼────────────────┼─────────────┤
  2400. 147.11 s > │ Total │ │ 5 │ 3.39s (86%) │ 191ms (4.9%) │ 359ms (9.1%) │ 0ms (0.00%) │
  2401. 147.11 s > ╰───────────┴───────┴─────────┴─────────────┴──────────────┴────────────────┴─────────────╯
  2402. 147.11 s > [2026-08-26 05:42:55.743] @gammaloop_api::se... INFO : Running command set process -p se1l -i se1l kv general.m_uv=0.2
  2403. 147.11 s > [2026-08-26 05:42:55.750] @gammaloop_api::se... INFO : Running command set process -p se1l -i se1l kv general.mu_r=0.2
  2404. 147.11 s > [2026-08-26 05:42:55.751] @gammaloop_api::se... INFO : Running command set process -p se1l -i se1l kv general.renormalization_localization_scale=0.2
  2405. 147.11 s > [2026-08-26 05:42:55.770] @gammaloop_api::se... INFO : Running command duplicate integrand -p se1l -i se1l --output_process_name se1l --output_integrand_name se1l_muv_shifted
  2406. 147.11 s > [2026-08-26 05:42:55.794] @gammaloop_api::se... INFO : Running command set process -p se1l -i se1l_muv_shifted kv general.m_uv=0.5
  2407. 147.11 s > [2026-08-26 05:42:55.806] @gammaloop_api::se... INFO : Running command duplicate integrand -p se1l -i se1l --output_process_name se1l --output_integrand_name se1l_rls_shifted
  2408. 147.11 s > [2026-08-26 05:42:55.820] @gammaloop_api::se... INFO : Running command set process -p se1l -i se1l_rls_shifted kv general.renormalization_localization_scale=1
  2409. 147.11 s > [2026-08-26 05:42:55.826] @gammaloop_api::se... INFO : Running command duplicate integrand -p se1l -i se1l --output_process_name se1l --output_integrand_name se1l_mur_shifted
  2410. 147.11 s > [2026-08-26 05:42:55.844] @gammaloop_api::se... INFO : Running command set process -p se1l -i se1l_mur_shifted kv general.mu_r=0.8
  2411. 147.11 s > [2026-08-26 05:42:55.884] @process::amplitude WARNING : External state 0 ('g', PDG 21, helicity +) is off shell: p^2 = +2.5e5, expected m^2 = +0e0 (|Δ| = +2.5e5). Fixed-helicity spinor/vector/tensor external states may be ill-defined at this kinematic point.
  2412. 147.11 s > field value
  2413. 147.11 s > span warm_up{integrand.name=se1l}
  2414. 147.11 s > [2026-08-26 05:42:55.894] @process::amplitude WARNING : External state 1 ('g', PDG 21, helicity -) is off shell: p^2 = +2.5e5, expected m^2 = +0e0 (|Δ| = +2.5e5). Fixed-helicity spinor/vector/tensor external states may be ill-defined at this kinematic point.
  2415. 147.11 s > field value
  2416. 147.11 s > span warm_up{integrand.name=se1l}
  2417. 147.11 s > [2026-08-26 05:42:55.895] @process::amplitude INFO : Input is above threshold: 1 existing threshold E-surfaces across 1/1 graph groups
  2418. 147.11 s > field value
  2419. 147.11 s > existing_esurfaces 1
  2420. 147.11 s > group_count 1
  2421. 147.11 s > groups_above_threshold 1
  2422. 147.11 s > integrand se1l
  2423. 147.11 s > span warm_up{integrand.name=se1l}
  2424. 147.11 s > threshold_status above threshold
  2425. 147.11 s > [2026-08-26 05:42:55.895] @process::amplitude INFO : overlap structure of group 0: [1: [0(2,3)]]
  2426. 147.11 s > field value
  2427. 147.11 s > span warm_up{integrand.name=se1l}
  2428. 147.11 s > [2026-08-26 05:42:56.476] @commands::profile INFO :
  2429. 147.11 s > ╭───────┬──────┬──────────┬───────┬─────┬──────────┬───────────╮
  2430. 147.11 s > │ fixed │ → ∞ │ slope │ r2 │ DOD │ bare DOD │ inspect │
  2431. 147.11 s > ├───────┼──────┼──────────┼───────┼─────┼──────────┼───────────┤
  2432. 147.11 s > │ {} │ {e3} │ 1.639236 │ 0.904 │ 2 │ 2 │ arb retry │
  2433. 147.11 s > │ {} │ {e2} │ 1.698834 │ 0.902 │ 2 │ 2 │ arb retry │
  2434. 147.11 s > ╰───────┴──────┴──────────┴───────┴─────┴──────────┴───────────╯
  2435. 147.11 s > [2026-08-26 05:42:56.476] @commands::profile INFO :
  2436. 147.11 s > ╭───────┬──────┬─────────────┬──────────┬───────┬─────┬──────────┬───────────╮
  2437. 147.11 s > │ fixed │ → ∞ │ orientation │ slope │ r2 │ DOD │ bare DOD │ inspect │
  2438. 147.11 s > ├───────┼──────┼─────────────┼──────────┼───────┼─────┼──────────┼───────────┤
  2439. 147.11 s > │ {} │ {e3} │ 00-+ │ 0.343429 │ 0.145 │ 0 │ 2 │ arb retry │
  2440. 147.11 s > │ {} │ {e3} │ 00+- │ 0.342577 │ 0.135 │ 0 │ 2 │ arb retry │
  2441. 147.11 s > │ {} │ {e2} │ 00-+ │ 0.385975 │ 0.161 │ 0 │ 2 │ arb retry │
  2442. 147.11 s > │ {} │ {e2} │ 00+- │ 0.384920 │ 0.192 │ 0 │ 2 │ arb retry │
  2443. 147.11 s > ╰───────┴──────┴─────────────┴──────────┴───────┴─────┴──────────┴───────────╯
  2444. 147.11 s > [2026-08-26 05:42:56.477] @gammaloop_api::se... INFO : Running command set process kv integrator.target_relative_accuracy=0.001 integrator.n_increase=0 integrator.n_start=50000 integrator.n_max=400000 integrator.seed=1337
  2445. 147.11 s > [2026-08-26 05:42:56.478] @commands::integrate INFO : Created workspace directory at /build/source/tests/artifacts/se1l/integration_workspace_se1l
  2446. 147.11 s > [2026-08-26 05:42:56.509] @commands::integrate INFO : No integration state found, starting new integration
  2447. 147.11 s > [2026-08-26 05:42:56.509] @commands::integrate INFO : Gammaloop now integrates se1l@se1l, se1l@se1l_muv_shifted, se1l@se1l_rls_shifted
  2448. 147.11 s > [2026-08-26 05:42:56.509] @process::amplitude WARNING : External state 0 ('g', PDG 21, helicity +) is off shell: p^2 = +2.5e5, expected m^2 = +0e0 (|Δ| = +2.5e5). Fixed-helicity spinor/vector/tensor external states may be ill-defined at this kinematic point.
  2449. 147.11 s > field value
  2450. 147.11 s > span warm_up{integrand.name=se1l}
  2451. 147.11 s > [2026-08-26 05:42:56.510] @process::amplitude WARNING : External state 1 ('g', PDG 21, helicity -) is off shell: p^2 = +2.5e5, expected m^2 = +0e0 (|Δ| = +2.5e5). Fixed-helicity spinor/vector/tensor external states may be ill-defined at this kinematic point.
  2452. 147.11 s > field value
  2453. 147.11 s > span warm_up{integrand.name=se1l}
  2454. 147.11 s > [2026-08-26 05:42:56.510] @process::amplitude INFO : Input is above threshold: 1 existing threshold E-surfaces across 1/1 graph groups
  2455. 147.11 s > field value
  2456. 147.11 s > existing_esurfaces 1
  2457. 147.11 s > group_count 1
  2458. 147.11 s > groups_above_threshold 1
  2459. 147.11 s > integrand se1l
  2460. 147.11 s > span warm_up{integrand.name=se1l}
  2461. 147.11 s > threshold_status above threshold
  2462. 147.11 s > [2026-08-26 05:42:56.510] @process::amplitude INFO : overlap structure of group 0: [1: [0(2,3)]]
  2463. 147.11 s > field value
  2464. 147.11 s > span warm_up{integrand.name=se1l}
  2465. 147.11 s > [2026-08-26 05:42:56.511] @process::amplitude WARNING : External state 0 ('g', PDG 21, helicity +) is off shell: p^2 = +2.5e5, expected m^2 = +0e0 (|Δ| = +2.5e5). Fixed-helicity spinor/vector/tensor external states may be ill-defined at this kinematic point.
  2466. 147.11 s > field value
  2467. 147.11 s > span warm_up{integrand.name=se1l_muv_shifted}
  2468. 147.11 s > [2026-08-26 05:42:56.511] @process::amplitude WARNING : External state 1 ('g', PDG 21, helicity -) is off shell: p^2 = +2.5e5, expected m^2 = +0e0 (|Δ| = +2.5e5). Fixed-helicity spinor/vector/tensor external states may be ill-defined at this kinematic point.
  2469. 147.11 s > field value
  2470. 147.11 s > span warm_up{integrand.name=se1l_muv_shifted}
  2471. 147.11 s > [2026-08-26 05:42:56.511] @process::amplitude INFO : Input is above threshold: 1 existing threshold E-surfaces across 1/1 graph groups
  2472. 147.11 s > field value
  2473. 147.11 s > existing_esurfaces 1
  2474. 147.11 s > group_count 1
  2475. 147.11 s > groups_above_threshold 1
  2476. 147.11 s > integrand se1l_muv_shifted
  2477. 147.11 s > span warm_up{integrand.name=se1l_muv_shifted}
  2478. 147.11 s > threshold_status above threshold
  2479. 147.11 s > [2026-08-26 05:42:56.511] @process::amplitude INFO : overlap structure of group 0: [1: [0(2,3)]]
  2480. 147.11 s > field value
  2481. 147.11 s > span warm_up{integrand.name=se1l_muv_shifted}
  2482. 147.11 s > [2026-08-26 05:42:56.516] @process::amplitude WARNING : External state 0 ('g', PDG 21, helicity +) is off shell: p^2 = +2.5e5, expected m^2 = +0e0 (|Δ| = +2.5e5). Fixed-helicity spinor/vector/tensor external states may be ill-defined at this kinematic point.
  2483. 147.11 s > field value
  2484. 147.11 s > span warm_up{integrand.name=se1l_rls_shifted}
  2485. 147.11 s > [2026-08-26 05:42:56.516] @process::amplitude WARNING : External state 1 ('g', PDG 21, helicity -) is off shell: p^2 = +2.5e5, expected m^2 = +0e0 (|Δ| = +2.5e5). Fixed-helicity spinor/vector/tensor external states may be ill-defined at this kinematic point.
  2486. 147.11 s > field value
  2487. 147.11 s > span warm_up{integrand.name=se1l_rls_shifted}
  2488. 147.11 s > [2026-08-26 05:42:56.516] @process::amplitude INFO : Input is above threshold: 1 existing threshold E-surfaces across 1/1 graph groups
  2489. 147.11 s > field value
  2490. 147.11 s > existing_esurfaces 1
  2491. 147.11 s > group_count 1
  2492. 147.11 s > groups_above_threshold 1
  2493. 147.11 s > integrand se1l_rls_shifted
  2494. 147.11 s > span warm_up{integrand.name=se1l_rls_shifted}
  2495. 147.11 s > threshold_status above threshold
  2496. 147.11 s > ... omitted 1410 more lines; see full nextest output above
  2497. 147.11 s > =========================================
  2498. 147.11 s For full logs, run:
  2499. 147.11 s nix log /nix/store/z64pzsmdh7l76572yr3sfrwn8clcnq7n-gammaloop-nextest-integration.drv
  2500. 147.23 s Run failed.