test packages.x86_64-linux.nix-ci-check-gammaloop-nextest-integration

Reproduce this run
Retry Run
  1. 212.24 s gammaloop-nextest-integration> | dod2_bubble | rls.integrated | GL0 | pass | 0.0sigma | compatible within 2sigma | - |
  2. 212.24 s gammaloop-nextest-integration> +-------------+-----------------+---------+--------+----------+-----------------------------------------------------------------------------------------------------------------------+-------+
  3. 212.24 s gammaloop-nextest-integration> | dod2_bubble | mu_r.inspect | inspect | pass | - | best inspect relative delta 6.951e-1 >= 1000*accuracy 1.000e-7 (accuracy=1.000e-10, exponent=+0.0, seed=0, probes=10) | - |
  4. 212.24 s gammaloop-nextest-integration> +-------------+-----------------+---------+--------+----------+-----------------------------------------------------------------------------------------------------------------------+-------+
  5. 212.24 s gammaloop-nextest-integration> | dod2_bubble | target | - | pass | - | 2sigma | - |
  6. 212.24 s gammaloop-nextest-integration> +-------------+-----------------+---------+--------+----------+-----------------------------------------------------------------------------------------------------------------------+-------+
  7. 212.24 s gammaloop-nextest-integration> test dod2_bubble_uv ... FAILED
  8. 212.24 s gammaloop-nextest-integration>
  9. 212.24 s gammaloop-nextest-integration> failures:
  10. 212.24 s gammaloop-nextest-integration>
  11. 212.24 s gammaloop-nextest-integration> failures:
  12. 212.24 s gammaloop-nextest-integration> dod2_bubble_uv
  13. 212.24 s gammaloop-nextest-integration>
  14. 212.24 s gammaloop-nextest-integration> test result: FAILED. 0 passed; 1 failed; 0 ignored; 0 measured; 24 filtered out; finished in 49.54s
  15. 212.24 s gammaloop-nextest-integration> system-err
  16. 212.24 s gammaloop-nextest-integration> [2026-08-26 05:39:13.726] @gammaloop_api::se... INFO : Running command run generate
  17. 212.24 s gammaloop-nextest-integration> [2026-08-26 05:39:13.726] @gammaloop_api::se... INFO : Starting command block generate
  18. 212.24 s gammaloop-nextest-integration> [2026-08-26 05:39:13.726] @gammaloop_api::se... INFO : Running command import model scalars-default.json
  19. 212.24 s gammaloop-nextest-integration> [2026-08-26 05:39:13.726] @import::model INFO : Loading built-in JSON model scalars-default
  20. 212.24 s gammaloop-nextest-integration> [2026-08-26 05:39:13.730] @gammalooprs::model INFO : The following 2 external parameters were forced to zero by the restriction card:
  21. 212.24 s gammaloop-nextest-integration> width_scalar_1, width_scalar_2
  22. 212.24 s gammaloop-nextest-integration> [2026-08-26 05:39:13.730] @gammaloop_api::se... INFO : Running command remove processes
  23. 212.24 s gammaloop-nextest-integration> [2026-08-26 05:39:13.730] @gammaloop_api::se... INFO : Running command set global kv global.generation.uv.generate_integrated=true
  24. 212.24 s gammaloop-nextest-integration> [2026-08-26 05:39:13.731] @gammaloop_api::se... INFO : Running command import graphs ./tests/resources/graphs/scalar/dod2_bubble.dot -p bubble_dod2 -i scalar_bubble_below_thres
  25. 212.24 s gammaloop-nextest-integration> [2026-08-26 05:39:13.731] @commands::import INFO : Loading graphs from '/build/source/tests/resources/graphs/scalar/dod2_bubble.dot'
  26. 212.24 s gammaloop-nextest-integration> [2026-08-26 05:39:13.733] @gammaloop_api::se... INFO : Running command generate existing -p bubble_dod2 -i scalar_bubble_below_thres
  27. 212.24 s gammaloop-nextest-integration> [2026-08-26 05:39:13.734] @approx::local_4d [{#uv, #inspect, #integrated}] DEBUG : Rescaled momenta expanded
  28. 212.24 s gammaloop-nextest-integration> field value
  29. 212.24 s gammaloop-nextest-integration> res n-terms: 1, byte size: 3,expr:
  30. 212.24 s gammaloop-nextest-integration> 1
  31. 212.24 s gammaloop-nextest-integration> [2026-08-26 05:39:13.735] @approx::local_4d [{#uv, #inspect, #integrated}] DEBUG : Rescaled momenta expanded
  32. 212.24 s gammaloop-nextest-integration> field value
  33. 212.24 s gammaloop-nextest-integration> res n-terms: 1, byte size: 585,expr:
  34. 212.24 s gammaloop-nextest-integration> -SCALAR_COUPLING²·q₀(αᵉ².¹)·q₀(αᵉ³.¹)·q₂(αᵉ².¹)·q₂(αᵉ³.¹)
  35. 212.24 s gammaloop-nextest-integration> /(t²·denom(3,-q₀-q₂/t,mass_scalar_2²,-mass_scalar_2²+2·(q₀.q₂)/t+(q₂.q₂)/t²+(q₀.q₀))
  36. 212.24 s gammaloop-nextest-integration> ·denom(2,q₂/t,mass_scalar_2²,-mass_scalar_2²+(q₂.q₂)/t²))
  37. 212.24 s gammaloop-nextest-integration> [2026-08-26 05:39:13.736] @approx::final_integrand[{#generation, #profile, #uv, #graph, #summary}] DEBUG : Computed global numerator
  38. 212.24 s gammaloop-nextest-integration> field value
  39. 212.24 s gammaloop-nextest-integration> global_num n-terms: 1, byte size: 4,expr:
  40. 212.24 s gammaloop-nextest-integration> 1/2
  41. 212.24 s gammaloop-nextest-integration> span build_3d{span_context=true graph=GL0 current=subgraph=0, topo_order=0, dod=0}
  42. 212.24 s gammaloop-nextest-integration> [2026-08-26 05:39:13.738] @uv::approx [{#generation, #uv, #fourd}] DEBUG : Computing 4D
  43. 212.24 s gammaloop-nextest-integration> field value
  44. 212.24 s gammaloop-nextest-integration> simple subgraph(S_11,S_y)*Approx(subgraph(S_y,0)) of GL0
  45. 212.24 s gammaloop-nextest-integration> span compute_4d{span_context=true graph=GL0 current=subgraph=y, topo_order=1, dod=2 given=subgraph=0, topo_order=0, dod=0 reduced=SubSet { set: BitVec<usize, bitvec::order::Lsb0> { addr: 0x7fffec027530, head: 000000, bits: 6, capacity: 64 } [0, 0, 1, 1, 1, 1], id: PhantomData<linnet::half_edge::involution::Hedge> }}
  46. 212.24 s gammaloop-nextest-integration> [2026-08-26 05:39:13.739] @approx::local_4d [{#uv, #algebra, #integrated, #start}] DEBUG :
  47. 212.24 s gammaloop-nextest-integration> field value
  48. 212.24 s gammaloop-nextest-integration> integrand n-terms: 1, byte size: 409,expr:
  49. 212.24 s gammaloop-nextest-integration> SCALAR_COUPLING²·(q₀(αᵉ³.¹)+q₃(αᵉ³.¹))·q₀(αᵉ².¹)·q₀(αᵉ³.¹)·q₂(αᵉ².¹)
  50. 212.24 s gammaloop-nextest-integration> /(denom(2,q₂,mass_scalar_2²,-mass_scalar_2²+(q₂.q₂))·denom(3,q₃,mass_scalar_2²,-mass_scalar_2²+(q₃.q₃)))
  51. 212.24 s gammaloop-nextest-integration> reduced y
  52. 212.24 s gammaloop-nextest-integration> span grow{span_context=true current=subgraph=y, topo_order=1, dod=2 given=subgraph=0, topo_order=0, dod=0}
  53. 212.24 s gammaloop-nextest-integration> [2026-08-26 05:39:13.739] @approx::local_4d [{#uv, #inspect, #integrated}] DEBUG : Rescaled momenta expanded
  54. 212.24 s gammaloop-nextest-integration> field value
  55. 212.24 s gammaloop-nextest-integration> res n-terms: 1, byte size: 585,expr:
  56. 212.24 s gammaloop-nextest-integration> -SCALAR_COUPLING²·q₀(αᵉ².¹)·q₀(αᵉ³.¹)·q₂(αᵉ².¹)·q₂(αᵉ³.¹)
  57. 212.24 s gammaloop-nextest-integration> /(t²·denom(3,-q₀-q₂/t,mass_scalar_2²,-mass_scalar_2²+2·(q₀.q₂)/t+(q₂.q₂)/t²+(q₀.q₀))
  58. 212.24 s gammaloop-nextest-integration> ·denom(2,q₂/t,mass_scalar_2²,-mass_scalar_2²+(q₂.q₂)/t²))
  59. 212.24 s gammaloop-nextest-integration> span t{span_context=true current=subgraph=y, topo_order=1, dod=2 given=subgraph=0, topo_order=0, dod=0}
  60. 212.24 s gammaloop-nextest-integration> [2026-08-26 05:39:13.739] @approx::local_4d [{#uv, #integrated, #rescaled}] DEBUG : Rescaled expanded
  61. 212.24 s gammaloop-nextest-integration> field value
  62. 212.24 s gammaloop-nextest-integration> n_loops 1
  63. 212.24 s gammaloop-nextest-integration> res n-terms: 1, byte size: 707,expr:
  64. 212.24 s gammaloop-nextest-integration> -SCALAR_COUPLING²·q₀(αᵉ².¹)·q₀(αᵉ³.¹)·q₂(αᵉ².¹)·q₂(αᵉ³.¹)
  65. 212.24 s gammaloop-nextest-integration> /(t²·denom(3,-q₂,mUVexp²+t²·mass_scalar_2²,-mUV²+t²·(-mass_scalar_2²+2·(q₀.q₂)/t+(q₂.q₂)/t²+(q₀.q₀))+t²·mUVexp²)
  66. 212.24 s gammaloop-nextest-integration> ·denom(2,q₂,mUVexp²+t²·mass_scalar_2²,-mUV²+t²·(-mass_scalar_2²+(q₂.q₂)/t²)+t²·mUVexp²))
  67. 212.24 s gammaloop-nextest-integration> span t{span_context=true current=subgraph=y, topo_order=1, dod=2 given=subgraph=0, topo_order=0, dod=0}
  68. 212.24 s gammaloop-nextest-integration> [2026-08-26 05:39:13.740] @approx::local_4d [{#uv, #integrated, #series}] DEBUG : Series expanded
  69. 212.24 s gammaloop-nextest-integration> field value
  70. 212.24 s gammaloop-nextest-integration> res n-terms: 3, byte size: 1896,expr:
  71. 212.24 s gammaloop-nextest-integration> (1/2·SCALAR_COUPLING²·(2·mUVexp²-2·mass_scalar_2²)/(denom(2,q₂,mUVexp²,-mUV²+(q₂.q₂))²·denom(3,-q₂,mUVexp²,-mUV²+(q₂.q₂)))
  72. 212.24 s gammaloop-nextest-integration> -SCALAR_COUPLING²
  73. 212.24 s gammaloop-nextest-integration> ·(-1/2·(2·mUVexp²-2·mass_scalar_2²+2·(q₀.q₀))/denom(3,-q₂,mUVexp²,-mUV²+(q₂.q₂))
  74. 212.24 s gammaloop-nextest-integration> +4·(q₀.q₂)²/denom(3,-q₂,mUVexp²,-mUV²+(q₂.q₂))²
  75. 212.24 s gammaloop-nextest-integration> )/(denom(2,q₂,mUVexp²,-mUV²+(q₂.q₂))·denom(3,-q₂,mUVexp²,-mUV²+(q₂.q₂)))
  76. 212.24 s gammaloop-nextest-integration> )·q₀(αᵉ².¹)·q₀(αᵉ³.¹)·q₂(αᵉ².¹)·q₂(αᵉ³.¹)
  77. 212.24 s gammaloop-nextest-integration> +2·SCALAR_COUPLING²·(q₀.q₂)·q₀(αᵉ².¹)·q₀(αᵉ³.¹)·q₂(αᵉ².¹)·q₂(αᵉ³.¹)
  78. 212.24 s gammaloop-nextest-integration> /(t·denom(2,q₂,mUVexp²,-mUV²+(q₂.q₂))·denom(3,-q₂,mUVexp²,-mUV²+(q₂.q₂))²)
  79. 212.24 s gammaloop-nextest-integration> -SCALAR_COUPLING²·q₀(αᵉ².¹)·q₀(αᵉ³.¹)·q₂(αᵉ².¹)·q₂(αᵉ³.¹)
  80. 212.24 s gammaloop-nextest-integration> /(t²·denom(2,q₂,mUVexp²,-mUV²+(q₂.q₂))·denom(3,-q₂,mUVexp²,-mUV²+(q₂.q₂)))
  81. 212.24 s gammaloop-nextest-integration> span t{span_context=true current=subgraph=y, topo_order=1, dod=2 given=subgraph=0, topo_order=0, dod=0}
  82. 212.24 s gammaloop-nextest-integration> [2026-08-26 05:39:13.740] @approx::local_4d [{#uv, #integrated, #series}] DEBUG : Evaluated at t = 1
  83. 212.24 s gammaloop-nextest-integration> field value
  84. 212.24 s gammaloop-nextest-integration> res n-terms: 3, byte size: 1880,expr:
  85. 212.24 s gammaloop-nextest-integration> (1/2·SCALAR_COUPLING²·(2·mUVexp²-2·mass_scalar_2²)/(denom(2,q₂,mUVexp²,-mUV²+(q₂.q₂))²·denom(3,-q₂,mUVexp²,-mUV²+(q₂.q₂)))
  86. 212.24 s gammaloop-nextest-integration> -SCALAR_COUPLING²
  87. 212.24 s gammaloop-nextest-integration> ·(-1/2·(2·mUVexp²-2·mass_scalar_2²+2·(q₀.q₀))/denom(3,-q₂,mUVexp²,-mUV²+(q₂.q₂))
  88. 212.24 s gammaloop-nextest-integration> +4·(q₀.q₂)²/denom(3,-q₂,mUVexp²,-mUV²+(q₂.q₂))²
  89. 212.24 s gammaloop-nextest-integration> )/(denom(2,q₂,mUVexp²,-mUV²+(q₂.q₂))·denom(3,-q₂,mUVexp²,-mUV²+(q₂.q₂)))
  90. 212.24 s gammaloop-nextest-integration> )·q₀(αᵉ².¹)·q₀(αᵉ³.¹)·q₂(αᵉ².¹)·q₂(αᵉ³.¹)
  91. 212.24 s gammaloop-nextest-integration> -SCALAR_COUPLING²·q₀(αᵉ².¹)·q₀(αᵉ³.¹)·q₂(αᵉ².¹)·q₂(αᵉ³.¹)
  92. 212.24 s gammaloop-nextest-integration> /(denom(2,q₂,mUVexp²,-mUV²+(q₂.q₂))·denom(3,-q₂,mUVexp²,-mUV²+(q₂.q₂)))
  93. 212.24 s gammaloop-nextest-integration> +2·SCALAR_COUPLING²·(q₀.q₂)·q₀(αᵉ².¹)·q₀(αᵉ³.¹)·q₂(αᵉ².¹)·q₂(αᵉ³.¹)
  94. 212.24 s gammaloop-nextest-integration> /(denom(2,q₂,mUVexp²,-mUV²+(q₂.q₂))·denom(3,-q₂,mUVexp²,-mUV²+(q₂.q₂))²)
  95. 212.24 s gammaloop-nextest-integration> span t{span_context=true current=subgraph=y, topo_order=1, dod=2 given=subgraph=0, topo_order=0, dod=0}
  96. 212.24 s gammaloop-nextest-integration> [2026-08-26 05:39:13.741] @approx::local_4d [{#uv, #collect, #integrated}] DEBUG : After gamma chain collection
  97. 212.24 s gammaloop-nextest-integration> field value
  98. 212.24 s gammaloop-nextest-integration> expr n-terms: 3, byte size: 1880,expr:
  99. 212.24 s gammaloop-nextest-integration> (1/2·SCALAR_COUPLING²·(2·mUVexp²-2·mass_scalar_2²)/(denom(2,q₂,mUVexp²,-mUV²+(q₂.q₂))²·denom(3,-q₂,mUVexp²,-mUV²+(q₂.q₂)))
  100. 212.24 s gammaloop-nextest-integration> -SCALAR_COUPLING²
  101. 212.24 s gammaloop-nextest-integration> ·(-1/2·(2·mUVexp²-2·mass_scalar_2²+2·(q₀.q₀))/denom(3,-q₂,mUVexp²,-mUV²+(q₂.q₂))
  102. 212.24 s gammaloop-nextest-integration> +4·(q₀.q₂)²/denom(3,-q₂,mUVexp²,-mUV²+(q₂.q₂))²
  103. 212.24 s gammaloop-nextest-integration> )/(denom(2,q₂,mUVexp²,-mUV²+(q₂.q₂))·denom(3,-q₂,mUVexp²,-mUV²+(q₂.q₂)))
  104. 212.24 s gammaloop-nextest-integration> )·q₀(αᵉ².¹)·q₀(αᵉ³.¹)·q₂(αᵉ².¹)·q₂(αᵉ³.¹)
  105. 212.24 s gammaloop-nextest-integration> -SCALAR_COUPLING²·q₀(αᵉ².¹)·q₀(αᵉ³.¹)·q₂(αᵉ².¹)·q₂(αᵉ³.¹)
  106. 212.24 s gammaloop-nextest-integration> /(denom(2,q₂,mUVexp²,-mUV²+(q₂.q₂))·denom(3,-q₂,mUVexp²,-mUV²+(q₂.q₂)))
  107. 212.24 s gammaloop-nextest-integration> +2·SCALAR_COUPLING²·(q₀.q₂)·q₀(αᵉ².¹)·q₀(αᵉ³.¹)·q₂(αᵉ².¹)·q₂(αᵉ³.¹)
  108. 212.24 s gammaloop-nextest-integration> /(denom(2,q₂,mUVexp²,-mUV²+(q₂.q₂))·denom(3,-q₂,mUVexp²,-mUV²+(q₂.q₂))²)
  109. 212.24 s gammaloop-nextest-integration> span t{span_context=true current=subgraph=y, topo_order=1, dod=2 given=subgraph=0, topo_order=0, dod=0}
  110. 212.24 s gammaloop-nextest-integration> [2026-08-26 05:39:13.743] @approx::local_4d [{#profile, #uv, #collect, #integrated, #start, #trace}] DEBUG : After gamma schoonschip
  111. 212.24 s gammaloop-nextest-integration> field value
  112. 212.24 s gammaloop-nextest-integration> expr n-terms: 3, byte size: 1631,expr:
  113. 212.24 s gammaloop-nextest-integration> (1/2·SCALAR_COUPLING²·(2·mUVexp²-2·mass_scalar_2²)/(denom(2,q₂,mUVexp²,-mUV²+(q₂.q₂))²·denom(3,-q₂,mUVexp²,-mUV²+(q₂.q₂)))
  114. 212.24 s gammaloop-nextest-integration> -SCALAR_COUPLING²
  115. 212.24 s gammaloop-nextest-integration> ·(-1/2·(2·mUVexp²-2·mass_scalar_2²+2·(q₀.q₀))/denom(3,-q₂,mUVexp²,-mUV²+(q₂.q₂))
  116. 212.24 s gammaloop-nextest-integration> +4·(q₀.q₂)²/denom(3,-q₂,mUVexp²,-mUV²+(q₂.q₂))²
  117. 212.24 s gammaloop-nextest-integration> )/(denom(2,q₂,mUVexp²,-mUV²+(q₂.q₂))·denom(3,-q₂,mUVexp²,-mUV²+(q₂.q₂)))
  118. 212.24 s gammaloop-nextest-integration> )·(q₀.q₂)²
  119. 212.24 s gammaloop-nextest-integration> -SCALAR_COUPLING²·(q₀.q₂)²/(denom(2,q₂,mUVexp²,-mUV²+(q₂.q₂))·denom(3,-q₂,mUVexp²,-mUV²+(q₂.q₂)))
  120. 212.24 s gammaloop-nextest-integration> +2·SCALAR_COUPLING²·(q₀.q₂)·(q₀.q₂)²
  121. 212.24 s gammaloop-nextest-integration> /(denom(2,q₂,mUVexp²,-mUV²+(q₂.q₂))·denom(3,-q₂,mUVexp²,-mUV²+(q₂.q₂))²)
  122. 212.24 s gammaloop-nextest-integration> span t{span_context=true current=subgraph=y, topo_order=1, dod=2 given=subgraph=0, topo_order=0, dod=0}
  123. 212.24 s gammaloop-nextest-integration> [2026-08-26 05:39:13.744] @approx::local_4d [{#profile, #uv, #collect, #integrated, #start, #trace}] DEBUG : After gamma collection
  124. 212.24 s gammaloop-nextest-integration> field value
  125. 212.24 s gammaloop-nextest-integration> expr n-terms: 1, byte size: 1347,expr:
  126. 212.24 s gammaloop-nextest-integration> SCALAR_COUPLING²
  127. 212.24 s gammaloop-nextest-integration> ·(-denom(2,q₂,mUVexp²,-mUV²+(q₂.q₂))·denom(3,-q₂,mUVexp²,-mUV²+(q₂.q₂))²
  128. 212.24 s gammaloop-nextest-integration> +1/2·(2·mUVexp²-2·mass_scalar_2²)·denom(3,-q₂,mUVexp²,-mUV²+(q₂.q₂))²
  129. 212.24 s gammaloop-nextest-integration> -(-1/2·(2·mUVexp²-2·mass_scalar_2²+2·(q₀.q₀))·denom(3,-q₂,mUVexp²,-mUV²+(q₂.q₂))+4·(q₀.q₂)²)
  130. 212.24 s gammaloop-nextest-integration> ·denom(2,q₂,mUVexp²,-mUV²+(q₂.q₂))
  131. 212.24 s gammaloop-nextest-integration> +2·(q₀.q₂)·denom(2,q₂,mUVexp²,-mUV²+(q₂.q₂))·denom(3,-q₂,mUVexp²,-mUV²+(q₂.q₂))
  132. 212.24 s gammaloop-nextest-integration> )·(q₀.q₂)²/(denom(2,q₂,mUVexp²,-mUV²+(q₂.q₂))²·denom(3,-q₂,mUVexp²,-mUV²+(q₂.q₂))³)
  133. 212.24 s gammaloop-nextest-integration> span t{span_context=true current=subgraph=y, topo_order=1, dod=2 given=subgraph=0, topo_order=0, dod=0}
  134. 212.24 s gammaloop-nextest-integration> [2026-08-26 05:39:13.745] @approx::local_4d [{#profile, #uv, #gamma, #integrated, #start, #trace, #vakint}] DEBUG : After gamma simplification
  135. 212.24 s gammaloop-nextest-integration> ... omitted 3263 more lines; see full nextest output above
  136. 212.24 s gammaloop-nextest-integration>
  137. 212.24 s gammaloop-nextest-integration> 8. gammaloop-integration-tests::uv::sunrise_scalar_1_uv
  138. 212.24 s gammaloop-nextest-integration> failure: test failure with exit code 101
  139. 212.24 s gammaloop-nextest-integration> system-out
  140. 212.24 s gammaloop-nextest-integration> running 1 test
  141. 212.24 s gammaloop-nextest-integration> test sunrise_scalar_1_uv has been running for over 60 seconds
  142. 212.24 s gammaloop-nextest-integration> +------------------+------------------------+--------------+--------+----------+----------------------------------------------------------------------------------------------------------------------+-------+
  143. 212.24 s gammaloop-nextest-integration> | case | check | graph | status | sigma | threshold | error |
  144. 212.24 s gammaloop-nextest-integration> +------------------+------------------------+--------------+--------+----------+----------------------------------------------------------------------------------------------------------------------+-------+
  145. 212.24 s gammaloop-nextest-integration> | sunrise_scalar_1 | uv_profile | - | FAIL | - | - | - |
  146. 212.24 s gammaloop-nextest-integration> +------------------+------------------------+--------------+--------+----------+----------------------------------------------------------------------------------------------------------------------+-------+
  147. 212.24 s gammaloop-nextest-integration> | sunrise_scalar_1 | m_uv.inspect | inspect | pass | - | best inspect relative delta 1.624e0 >= 1000*accuracy 1.000e-3 (accuracy=1.000e-6, exponent=+1.0, seed=1, probes=10) | - |
  148. 212.24 s gammaloop-nextest-integration> +------------------+------------------------+--------------+--------+----------+----------------------------------------------------------------------------------------------------------------------+-------+
  149. 212.24 s gammaloop-nextest-integration> | sunrise_scalar_1 | m_uv.integrated | sunrise | pass | 0.1sigma | compatible within 2sigma | - |
  150. 212.24 s gammaloop-nextest-integration> +------------------+------------------------+--------------+--------+----------+----------------------------------------------------------------------------------------------------------------------+-------+
  151. 212.24 s gammaloop-nextest-integration> | sunrise_scalar_1 | rls.inspect | inspect | pass | - | best inspect relative delta 8.682e-1 >= 1000*accuracy 1.000e-3 (accuracy=1.000e-6, exponent=+1.0, seed=1, probes=10) | - |
  152. 212.24 s gammaloop-nextest-integration> +------------------+------------------------+--------------+--------+----------+----------------------------------------------------------------------------------------------------------------------+-------+
  153. 212.24 s gammaloop-nextest-integration> | sunrise_scalar_1 | rls.integrated | sunrise | pass | 0.0sigma | compatible within 2sigma | - |
  154. 212.24 s gammaloop-nextest-integration> +------------------+------------------------+--------------+--------+----------+----------------------------------------------------------------------------------------------------------------------+-------+
  155. 212.24 s gammaloop-nextest-integration> | sunrise_scalar_1 | mu_r.inspect | inspect | pass | - | best inspect relative delta 1.752e0 >= 1000*accuracy 1.000e-3 (accuracy=1.000e-6, exponent=+1.0, seed=1, probes=10) | - |
  156. 212.24 s gammaloop-nextest-integration> +------------------+------------------------+--------------+--------+----------+----------------------------------------------------------------------------------------------------------------------+-------+
  157. 212.24 s gammaloop-nextest-integration> | sunrise_scalar_1 | integrated.relerr | integrated | pass | - | relative error 9.20% <= 10.00% | - |
  158. 212.24 s gammaloop-nextest-integration> +------------------+------------------------+--------------+--------+----------+----------------------------------------------------------------------------------------------------------------------+-------+
  159. 212.24 s gammaloop-nextest-integration> | sunrise_scalar_1 | m_uv.integrated.relerr | m_uv-shifted | pass | - | relative error 5.89% <= 10.00% | - |
  160. 212.24 s gammaloop-nextest-integration> +------------------+------------------------+--------------+--------+----------+----------------------------------------------------------------------------------------------------------------------+-------+
  161. 212.24 s gammaloop-nextest-integration> | sunrise_scalar_1 | target | - | pass | - | 2sigma | - |
  162. 212.24 s gammaloop-nextest-integration> +------------------+------------------------+--------------+--------+----------+----------------------------------------------------------------------------------------------------------------------+-------+
  163. 212.24 s gammaloop-nextest-integration> test sunrise_scalar_1_uv ... FAILED
  164. 212.24 s gammaloop-nextest-integration>
  165. 212.24 s gammaloop-nextest-integration> failures:
  166. 212.24 s gammaloop-nextest-integration>
  167. 212.24 s gammaloop-nextest-integration> failures:
  168. 212.24 s gammaloop-nextest-integration> sunrise_scalar_1_uv
  169. 212.24 s gammaloop-nextest-integration>
  170. 212.24 s gammaloop-nextest-integration> test result: FAILED. 0 passed; 1 failed; 0 ignored; 0 measured; 24 filtered out; finished in 117.83s
  171. 212.24 s gammaloop-nextest-integration> system-err
  172. 212.24 s gammaloop-nextest-integration> [2026-08-26 05:39:18.338] @gammaloop_api::se... INFO : Running command run generate
  173. 212.24 s gammaloop-nextest-integration> [2026-08-26 05:39:18.338] @gammaloop_api::se... INFO : Starting command block generate
  174. 212.24 s gammaloop-nextest-integration> [2026-08-26 05:39:18.339] @gammaloop_api::se... INFO : Running command import model scalars-default.json
  175. 212.24 s gammaloop-nextest-integration> [2026-08-26 05:39:18.339] @import::model INFO : Loading built-in JSON model scalars-default
  176. 212.24 s gammaloop-nextest-integration> [2026-08-26 05:39:18.342] @gammalooprs::model INFO : The following 2 external parameters were forced to zero by the restriction card:
  177. 212.24 s gammaloop-nextest-integration> width_scalar_1, width_scalar_2
  178. 212.24 s gammaloop-nextest-integration> [2026-08-26 05:39:18.343] @gammaloop_api::se... INFO : Running command remove processes
  179. 212.24 s gammaloop-nextest-integration> [2026-08-26 05:39:18.343] @gammaloop_api::se... INFO : Running command set global kv global.generation.uv.generate_integrated=true
  180. 212.24 s gammaloop-nextest-integration> [2026-08-26 05:39:18.343] @gammaloop_api::se... INFO : Running command import graphs ./tests/resources/graphs/scalar_sunrise.dot -p sunrise_scalar_1 -i scalar_sunrise
  181. 212.24 s gammaloop-nextest-integration> [2026-08-26 05:39:18.343] @commands::import INFO : Loading graphs from '/build/source/tests/resources/graphs/scalar_sunrise.dot'
  182. 212.24 s gammaloop-nextest-integration> [2026-08-26 05:39:18.346] @gammaloop_api::se... INFO : Running command generate existing -p sunrise_scalar_1 -i scalar_sunrise
  183. 212.24 s gammaloop-nextest-integration> [2026-08-26 05:39:18.348] @approx::local_4d [{#uv, #inspect, #integrated}] DEBUG : Rescaled momenta expanded
  184. 212.24 s gammaloop-nextest-integration> field value
  185. 212.24 s gammaloop-nextest-integration> res n-terms: 1, byte size: 777,expr:
  186. 212.24 s gammaloop-nextest-integration> 1/(denom(0,q₀/t,mass_scalar_1²,-mass_scalar_1²+(q₀.q₀)/t²)·denom(1,q₁/t,mass_scalar_1²,-mass_scalar_1²+(q₁.q₁)/t²)
  187. 212.24 s gammaloop-nextest-integration> ·denom(2,q₄-q₀/t-q₁/t,mass_scalar_1²,
  188. 212.24 s gammaloop-nextest-integration> -mass_scalar_1²-2·(q₀.q₄)/t-2·(q₁.q₄)/t+(q₀.q₀)/t²+2·(q₀.q₁)/t²
  189. 212.24 s gammaloop-nextest-integration> +(q₁.q₁)/t²+(q₄.q₄)
  190. 212.24 s gammaloop-nextest-integration> ))
  191. 212.24 s gammaloop-nextest-integration> [2026-08-26 05:39:18.351] @approx::local_4d [{#uv, #inspect, #integrated}] DEBUG : Rescaled momenta expanded
  192. 212.24 s gammaloop-nextest-integration> field value
  193. 212.24 s gammaloop-nextest-integration> res n-terms: 1, byte size: 3,expr:
  194. 212.24 s gammaloop-nextest-integration> 1
  195. 212.24 s gammaloop-nextest-integration> [2026-08-26 05:39:18.352] @approx::local_4d [{#uv, #inspect, #integrated}] DEBUG : Rescaled momenta expanded
  196. 212.24 s gammaloop-nextest-integration> field value
  197. 212.24 s gammaloop-nextest-integration> res n-terms: 1, byte size: 611,expr:
  198. 212.24 s gammaloop-nextest-integration> 1/(denom(0,q₀/t,mass_scalar_1²,-mass_scalar_1²+(q₀.q₀)/t²)
  199. 212.24 s gammaloop-nextest-integration> ·denom(1,-q₂+q₃-q₀/t,mass_scalar_1²,
  200. 212.24 s gammaloop-nextest-integration> -mass_scalar_1²+2·(q₀.q₂)/t-2·(q₀.q₃)/t+(q₀.q₀)/t²+(q₂.q₂)
  201. 212.24 s gammaloop-nextest-integration> -2·(q₂.q₃)+(q₃.q₃)
  202. 212.24 s gammaloop-nextest-integration> ))
  203. 212.24 s gammaloop-nextest-integration> [2026-08-26 05:39:18.354] @approx::local_4d [{#uv, #inspect, #integrated}] DEBUG : Rescaled momenta expanded
  204. 212.24 s gammaloop-nextest-integration> field value
  205. 212.24 s gammaloop-nextest-integration> res n-terms: 1, byte size: 611,expr:
  206. 212.24 s gammaloop-nextest-integration> 1/(denom(1,q₁/t,mass_scalar_1²,-mass_scalar_1²+(q₁.q₁)/t²)
  207. 212.24 s gammaloop-nextest-integration> ·denom(2,-q₀+q₃-q₁/t,mass_scalar_1²,
  208. 212.24 s gammaloop-nextest-integration> -mass_scalar_1²+2·(q₀.q₁)/t-2·(q₁.q₃)/t+(q₁.q₁)/t²+(q₀.q₀)
  209. 212.24 s gammaloop-nextest-integration> -2·(q₀.q₃)+(q₃.q₃)
  210. 212.24 s gammaloop-nextest-integration> ))
  211. 212.24 s gammaloop-nextest-integration> [2026-08-26 05:39:18.355] @approx::local_4d [{#uv, #inspect, #integrated}] DEBUG : Rescaled momenta expanded
  212. 212.24 s gammaloop-nextest-integration> field value
  213. 212.24 s gammaloop-nextest-integration> res n-terms: 1, byte size: 611,expr:
  214. 212.24 s gammaloop-nextest-integration> 1/(denom(0,q₀/t,mass_scalar_1²,-mass_scalar_1²+(q₀.q₀)/t²)
  215. 212.24 s gammaloop-nextest-integration> ·denom(2,-q₁+q₃-q₀/t,mass_scalar_1²,
  216. 212.24 s gammaloop-nextest-integration> -mass_scalar_1²+2·(q₀.q₁)/t-2·(q₀.q₃)/t+(q₀.q₀)/t²+(q₁.q₁)
  217. 212.24 s gammaloop-nextest-integration> -2·(q₁.q₃)+(q₃.q₃)
  218. 212.24 s gammaloop-nextest-integration> ))
  219. 212.24 s gammaloop-nextest-integration> [2026-08-26 05:39:18.356] @approx::final_integrand[{#generation, #profile, #uv, #graph, #summary}] DEBUG : Computed global numerator
  220. 212.24 s gammaloop-nextest-integration> field value
  221. 212.24 s gammaloop-nextest-integration> global_num n-terms: 1, byte size: 3,expr:
  222. 212.24 s gammaloop-nextest-integration> 1
  223. 212.24 s gammaloop-nextest-integration> span build_3d{span_context=true graph=sunrise current=subgraph=0, topo_order=0, dod=0}
  224. 212.24 s gammaloop-nextest-integration> [2026-08-26 05:39:18.357] @uv::approx [{#generation, #uv, #fourd}] DEBUG : Computing 4D
  225. 212.24 s gammaloop-nextest-integration> field value
  226. 212.24 s gammaloop-nextest-integration> simple subgraph(S_47,S_44)*Approx(subgraph(S_44,0)) of sunrise
  227. 212.24 s gammaloop-nextest-integration> span compute_4d{span_context=true graph=sunrise current=subgraph=44, topo_order=1, dod=2 given=subgraph=0, topo_order=0, dod=0 reduced=SubSet { set: BitVec<usize, bitvec::order::Lsb0> { addr: 0x7fffec012f40, head: 000000, bits: 8, capacity: 64 } [0, 0, 1, 1, 1, 1, 1, 1], id: PhantomData<linnet::half_edge::involution::Hedge> }}
  228. 212.24 s gammaloop-nextest-integration> [2026-08-26 05:39:18.358] @approx::local_4d [{#uv, #algebra, #integrated, #start}] DEBUG :
  229. 212.24 s gammaloop-nextest-integration> field value
  230. 212.24 s gammaloop-nextest-integration> integrand n-terms: 1, byte size: 322,expr:
  231. 212.24 s gammaloop-nextest-integration> 1/(denom(0,q₀,mass_scalar_1²,-mass_scalar_1²+(q₀.q₀))·denom(1,q₁,mass_scalar_1²,-mass_scalar_1²+(q₁.q₁))
  232. 212.24 s gammaloop-nextest-integration> ·denom(2,q₂,mass_scalar_1²,-mass_scalar_1²+(q₂.q₂)))
  233. 212.24 s gammaloop-nextest-integration> reduced 44
  234. 212.24 s gammaloop-nextest-integration> span grow{span_context=true current=subgraph=44, topo_order=1, dod=2 given=subgraph=0, topo_order=0, dod=0}
  235. 212.24 s gammaloop-nextest-integration> [2026-08-26 05:39:18.358] @approx::local_4d [{#uv, #inspect, #integrated}] DEBUG : Rescaled momenta expanded
  236. 212.24 s gammaloop-nextest-integration> field value
  237. 212.24 s gammaloop-nextest-integration> res n-terms: 1, byte size: 777,expr:
  238. 212.24 s gammaloop-nextest-integration> 1/(denom(0,q₀/t,mass_scalar_1²,-mass_scalar_1²+(q₀.q₀)/t²)·denom(1,q₁/t,mass_scalar_1²,-mass_scalar_1²+(q₁.q₁)/t²)
  239. 212.24 s gammaloop-nextest-integration> ·denom(2,q₄-q₀/t-q₁/t,mass_scalar_1²,
  240. 212.24 s gammaloop-nextest-integration> -mass_scalar_1²-2·(q₀.q₄)/t-2·(q₁.q₄)/t+(q₀.q₀)/t²+2·(q₀.q₁)/t²
  241. 212.24 s gammaloop-nextest-integration> +(q₁.q₁)/t²+(q₄.q₄)
  242. 212.24 s gammaloop-nextest-integration> ))
  243. 212.24 s gammaloop-nextest-integration> span t{span_context=true current=subgraph=44, topo_order=1, dod=2 given=subgraph=0, topo_order=0, dod=0}
  244. 212.24 s gammaloop-nextest-integration> [2026-08-26 05:39:18.358] @approx::local_4d [{#uv, #integrated, #rescaled}] DEBUG : Rescaled expanded
  245. 212.24 s gammaloop-nextest-integration> field value
  246. 212.24 s gammaloop-nextest-integration> n_loops 2
  247. 212.24 s gammaloop-nextest-integration> res n-terms: 1, byte size: 982,expr:
  248. 212.24 s gammaloop-nextest-integration> 1/(t²
  249. 212.24 s gammaloop-nextest-integration> ·denom(2,-q₀-q₁,mUVexp²+t²·mass_scalar_1²,
  250. 212.24 s gammaloop-nextest-integration> -mUV²
  251. 212.24 s gammaloop-nextest-integration> +t²
  252. 212.24 s gammaloop-nextest-integration> ·(-mass_scalar_1²-2·(q₀.q₄)/t-2·(q₁.q₄)/t+(q₀.q₀)/t²+2·(q₀.q₁)/t²
  253. 212.24 s gammaloop-nextest-integration> +(q₁.q₁)/t²+(q₄.q₄)
  254. 212.24 s gammaloop-nextest-integration> )
  255. 212.24 s gammaloop-nextest-integration> +t²·mUVexp²
  256. 212.24 s gammaloop-nextest-integration> )
  257. 212.24 s gammaloop-nextest-integration> ·denom(0,q₀,mUVexp²+t²·mass_scalar_1²,-mUV²+t²·(-mass_scalar_1²+(q₀.q₀)/t²)+t²·mUVexp²)
  258. 212.24 s gammaloop-nextest-integration> ·denom(1,q₁,mUVexp²+t²·mass_scalar_1²,-mUV²+t²·(-mass_scalar_1²+(q₁.q₁)/t²)+t²·mUVexp²))
  259. 212.24 s gammaloop-nextest-integration> span t{span_context=true current=subgraph=44, topo_order=1, dod=2 given=subgraph=0, topo_order=0, dod=0}
  260. 212.24 s gammaloop-nextest-integration> [2026-08-26 05:39:18.359] @approx::local_4d [{#uv, #integrated, #series}] DEBUG : Series expanded
  261. 212.24 s gammaloop-nextest-integration> field value
  262. 212.24 s gammaloop-nextest-integration> res n-terms: 4, byte size: 3187,expr:
  263. 212.24 s gammaloop-nextest-integration> -1/2·(2·mUVexp²-2·mass_scalar_1²)
  264. 212.24 s gammaloop-nextest-integration> /(denom(0,q₀,mUVexp²,-mUV²+(q₀.q₀))·denom(1,q₁,mUVexp²,-mUV²+(q₁.q₁))²
  265. 212.24 s gammaloop-nextest-integration> ·denom(2,-q₀-q₁,mUVexp²,-mUV²+(q₀.q₀)+2·(q₀.q₁)+(q₁.q₁)))
  266. 212.24 s gammaloop-nextest-integration> +(-1/2·(2·mUVexp²-2·mass_scalar_1²)
  267. 212.24 s gammaloop-nextest-integration> /(denom(0,q₀,mUVexp²,-mUV²+(q₀.q₀))²
  268. 212.24 s gammaloop-nextest-integration> ·denom(2,-q₀-q₁,mUVexp²,-mUV²+(q₀.q₀)+2·(q₀.q₁)+(q₁.q₁)))
  269. 212.24 s gammaloop-nextest-integration> +(-1/2·(2·mUVexp²-2·mass_scalar_1²+2·(q₄.q₄))
  270. 212.24 s gammaloop-nextest-integration> /denom(2,-q₀-q₁,mUVexp²,-mUV²+(q₀.q₀)+2·(q₀.q₁)+(q₁.q₁))
  271. 212.24 s gammaloop-nextest-integration> +(-2·(q₀.q₄)-2·(q₁.q₄))²
  272. 212.24 s gammaloop-nextest-integration> /denom(2,-q₀-q₁,mUVexp²,-mUV²+(q₀.q₀)+2·(q₀.q₁)+(q₁.q₁))²
  273. 212.24 s gammaloop-nextest-integration> )
  274. 212.24 s gammaloop-nextest-integration> /(denom(0,q₀,mUVexp²,-mUV²+(q₀.q₀))
  275. 212.24 s gammaloop-nextest-integration> ·denom(2,-q₀-q₁,mUVexp²,-mUV²+(q₀.q₀)+2·(q₀.q₁)+(q₁.q₁)))
  276. 212.24 s gammaloop-nextest-integration> )/denom(1,q₁,mUVexp²,-mUV²+(q₁.q₁))
  277. 212.24 s gammaloop-nextest-integration> -(-2·(q₀.q₄)-2·(q₁.q₄))
  278. 212.24 s gammaloop-nextest-integration> /(t·denom(0,q₀,mUVexp²,-mUV²+(q₀.q₀))·denom(1,q₁,mUVexp²,-mUV²+(q₁.q₁))
  279. 212.24 s gammaloop-nextest-integration> ·denom(2,-q₀-q₁,mUVexp²,-mUV²+(q₀.q₀)+2·(q₀.q₁)+(q₁.q₁))²)
  280. 212.24 s gammaloop-nextest-integration> +1/(t²·denom(0,q₀,mUVexp²,-mUV²+(q₀.q₀))·denom(1,q₁,mUVexp²,-mUV²+(q₁.q₁))
  281. 212.25 s gammaloop-nextest-integration> ·denom(2,-q₀-q₁,mUVexp²,-mUV²+(q₀.q₀)+2·(q₀.q₁)+(q₁.q₁)))
  282. 212.25 s gammaloop-nextest-integration> span t{span_context=true current=subgraph=44, topo_order=1, dod=2 given=subgraph=0, topo_order=0, dod=0}
  283. 212.25 s gammaloop-nextest-integration> [2026-08-26 05:39:18.360] @approx::local_4d [{#uv, #integrated, #series}] DEBUG : Evaluated at t = 1
  284. 212.25 s gammaloop-nextest-integration> field value
  285. 212.25 s gammaloop-nextest-integration> res n-terms: 4, byte size: 3171,expr:
  286. 212.25 s gammaloop-nextest-integration> -1/2·(2·mUVexp²-2·mass_scalar_1²)
  287. 212.25 s gammaloop-nextest-integration> /(denom(0,q₀,mUVexp²,-mUV²+(q₀.q₀))·denom(1,q₁,mUVexp²,-mUV²+(q₁.q₁))²
  288. 212.25 s gammaloop-nextest-integration> ·denom(2,-q₀-q₁,mUVexp²,-mUV²+(q₀.q₀)+2·(q₀.q₁)+(q₁.q₁)))
  289. 212.25 s gammaloop-nextest-integration> -(-2·(q₀.q₄)-2·(q₁.q₄))
  290. 212.25 s gammaloop-nextest-integration> /(denom(0,q₀,mUVexp²,-mUV²+(q₀.q₀))·denom(1,q₁,mUVexp²,-mUV²+(q₁.q₁))
  291. 212.25 s gammaloop-nextest-integration> ... omitted 20090 more lines; see full nextest output above
  292. 212.25 s gammaloop-nextest-integration>
  293. 212.25 s gammaloop-nextest-integration> 9. gammaloop-integration-tests::uv::se1l_uv
  294. 212.25 s gammaloop-nextest-integration> failure: test failure with exit code 101
  295. 212.25 s gammaloop-nextest-integration> system-out
  296. 212.25 s gammaloop-nextest-integration> running 1 test
  297. 212.25 s gammaloop-nextest-integration> test se1l_uv has been running for over 60 seconds
  298. 212.25 s gammaloop-nextest-integration> +------+-----------------+---------+--------+----------+-----------------------------------------------------------------------------------------------------------------------+-------+
  299. 212.25 s gammaloop-nextest-integration> | case | check | graph | status | sigma | threshold | error |
  300. 212.25 s gammaloop-nextest-integration> +------+-----------------+---------+--------+----------+-----------------------------------------------------------------------------------------------------------------------+-------+
  301. 212.25 s gammaloop-nextest-integration> | se1l | uv_profile | - | FAIL | - | - | - |
  302. 212.25 s gammaloop-nextest-integration> +------+-----------------+---------+--------+----------+-----------------------------------------------------------------------------------------------------------------------+-------+
  303. 212.25 s gammaloop-nextest-integration> | se1l | m_uv.inspect | inspect | pass | - | best inspect relative delta 1.097e-1 >= 1000*accuracy 1.000e-7 (accuracy=1.000e-10, exponent=+2.0, seed=1, probes=10) | - |
  304. 212.25 s gammaloop-nextest-integration> +------+-----------------+---------+--------+----------+-----------------------------------------------------------------------------------------------------------------------+-------+
  305. 212.25 s gammaloop-nextest-integration> | se1l | m_uv.integrated | se1l | pass | 0.1sigma | compatible within 2sigma | - |
  306. 212.25 s gammaloop-nextest-integration> +------+-----------------+---------+--------+----------+-----------------------------------------------------------------------------------------------------------------------+-------+
  307. 212.25 s gammaloop-nextest-integration> | se1l | rls.inspect | inspect | pass | - | best inspect relative delta 4.499e-2 >= 1000*accuracy 1.000e-7 (accuracy=1.000e-10, exponent=+2.0, seed=1, probes=10) | - |
  308. 212.25 s gammaloop-nextest-integration> +------+-----------------+---------+--------+----------+-----------------------------------------------------------------------------------------------------------------------+-------+
  309. 212.25 s gammaloop-nextest-integration> | se1l | rls.integrated | se1l | pass | 0.0sigma | compatible within 2sigma | - |
  310. 212.25 s gammaloop-nextest-integration> +------+-----------------+---------+--------+----------+-----------------------------------------------------------------------------------------------------------------------+-------+
  311. 212.25 s gammaloop-nextest-integration> | se1l | mu_r.inspect | inspect | pass | - | best inspect relative delta 1.424e-1 >= 1000*accuracy 1.000e-7 (accuracy=1.000e-10, exponent=+2.0, seed=1, probes=10) | - |
  312. 212.25 s gammaloop-nextest-integration> +------+-----------------+---------+--------+----------+-----------------------------------------------------------------------------------------------------------------------+-------+
  313. 212.25 s gammaloop-nextest-integration> | se1l | target | - | pass | - | 2sigma | - |
  314. 212.25 s gammaloop-nextest-integration> +------+-----------------+---------+--------+----------+-----------------------------------------------------------------------------------------------------------------------+-------+
  315. 212.25 s gammaloop-nextest-integration> test se1l_uv ... FAILED
  316. 212.25 s gammaloop-nextest-integration>
  317. 212.25 s gammaloop-nextest-integration> failures:
  318. 212.25 s gammaloop-nextest-integration>
  319. 212.25 s gammaloop-nextest-integration> failures:
  320. 212.25 s gammaloop-nextest-integration> se1l_uv
  321. 212.25 s gammaloop-nextest-integration>
  322. 212.25 s gammaloop-nextest-integration> test result: FAILED. 0 passed; 1 failed; 0 ignored; 0 measured; 24 filtered out; finished in 136.02s
  323. 212.25 s gammaloop-nextest-integration> system-err
  324. 212.25 s gammaloop-nextest-integration> [2026-08-26 05:39:18.119] @gammaloop_api::se... INFO : Running command run generate
  325. 212.25 s gammaloop-nextest-integration> [2026-08-26 05:39:18.119] @gammaloop_api::se... INFO : Starting command block generate
  326. 212.25 s gammaloop-nextest-integration> [2026-08-26 05:39:18.119] @gammaloop_api::se... INFO : Running command import model sm-default
  327. 212.25 s gammaloop-nextest-integration> [2026-08-26 05:39:18.120] @import::model INFO : Loading built-in JSON model sm-default
  328. 212.25 s gammaloop-nextest-integration> [2026-08-26 05:39:18.158] @gammalooprs::model INFO : The following 11 external parameters were forced to zero by the restriction card:
  329. 212.25 s gammaloop-nextest-integration> lamWS, AWS, rhoWS, etaWS, ymc, yme, ymm, MC, Me, MM, WTau
  330. 212.25 s gammaloop-nextest-integration> [2026-08-26 05:39:18.158] @gammalooprs::model INFO : The following 34 vertex rules were removed by the restriction card:
  331. 212.25 s gammaloop-nextest-integration> V_82 -> (c~, d, G+) | V_83 -> (t~, d, G+) | V_84 -> (c~, s, G+) | V_85 -> (t~, s, G+) | V_86 -> (u~, b, G+) | V_87 -> (c~, b, G+) | V_90 -> (c~, d, W+) | V_91 -> (t~, d, W+) | V_92 -> (u~, s, W+) | V_94 -> (t~, s, W+) | V_95 -> (u~, b, W+) | V_96 -> (c~, b, W+) | V_101 -> (e+, e-, G0) | V_102 -> (mu+, mu-, G0) | V_104 -> (e+, e-, H) | V_105 -> (mu+, mu-, H) | V_110 -> (ve~, e-, G+) | V_111 -> (vm~, mu-, G+) | V_116 -> (b~, u, G-) | V_117 -> (d~, c, G-) | V_118 -> (s~, c, G-) | V_119 -> (b~, c, G-) | V_120 -> (d~, t, G-) | V_121 -> (s~, t, G-) | V_124 -> (s~, u, W-) | V_125 -> (b~, u, W-) | V_126 -> (d~, c, W-) | V_128 -> (b~, c, W-) | V_129 -> (d~, t, W-) | V_130 -> (s~, t, W-) | V_138 -> (c~, c, G0) | V_140 -> (c~, c, H) | V_145 -> (e+, ve, G-) | V_146 -> (mu+, vm, G-)
  332. 212.25 s gammaloop-nextest-integration> [2026-08-26 05:39:18.158] @gammalooprs::model INFO : The following 36 couplings were removed by the restriction card:
  333. 212.25 s gammaloop-nextest-integration> GC_13, GC_14, GC_16, GC_17, GC_18, GC_19, GC_20, GC_22, GC_23, GC_24, GC_25, GC_26, GC_28, GC_29, GC_42, GC_43, GC_44, GC_46, GC_47, GC_48, GC_84, GC_85, GC_86, GC_87, GC_88, GC_89, GC_90, GC_91, GC_92, GC_93, GC_101, GC_102, GC_103, GC_105, GC_106, GC_107
  334. 212.25 s gammaloop-nextest-integration> [2026-08-26 05:39:18.158] @gammaloop_api::se... INFO : Running command remove processes
  335. 212.25 s gammaloop-nextest-integration> [2026-08-26 05:39:18.162] @gammaloop_api::se... INFO : Running command set global kv global.generation.uv.generate_integrated=true
  336. 212.25 s gammaloop-nextest-integration> [2026-08-26 05:39:18.162] @gammaloop_api::se... INFO : Running command import graphs ./tests/resources/graphs/uv_tests/se1l.dot -p se1l -i se1l
  337. 212.25 s gammaloop-nextest-integration> [2026-08-26 05:39:18.162] @commands::import INFO : Loading graphs from '/build/source/tests/resources/graphs/uv_tests/se1l.dot'
  338. 212.25 s gammaloop-nextest-integration> [2026-08-26 05:39:18.168] @gammaloop_api::se... INFO : Running command generate existing -p se1l -i se1l
  339. 212.25 s gammaloop-nextest-integration> [2026-08-26 05:39:19.017] @commands::generate INFO :
  340. 212.25 s gammaloop-nextest-integration> Integrand generation summary
  341. 212.25 s gammaloop-nextest-integration> peak RAM 88.47 MiB | cores 1
  342. 212.25 s gammaloop-nextest-integration> ╭───────────┬───────┬─────────┬─────────────┬─────────────┬────────────────┬─────────────╮
  343. 212.25 s gammaloop-nextest-integration> │ integrand │ graph │ # evals │ expr build │ spenso │ symbolica eval │ compile │
  344. 212.25 s gammaloop-nextest-integration> ├───────────┼───────┼─────────┼─────────────┼─────────────┼────────────────┼─────────────┤
  345. 212.25 s gammaloop-nextest-integration> │ se1l │ se1l │ 5 │ 704ms (88%) │ 36ms (4.5%) │ 58ms (7.3%) │ 0ms (0.00%) │
  346. 212.25 s gammaloop-nextest-integration> ├───────────┼───────┼─────────┼─────────────┼─────────────┼────────────────┼─────────────┤
  347. 212.25 s gammaloop-nextest-integration> │ Total │ │ 5 │ 704ms (88%) │ 36ms (4.5%) │ 58ms (7.3%) │ 0ms (0.00%) │
  348. 212.25 s gammaloop-nextest-integration> ╰───────────┴───────┴─────────┴─────────────┴─────────────┴────────────────┴─────────────╯
  349. 212.25 s gammaloop-nextest-integration> [2026-08-26 05:39:19.018] @gammaloop_api::se... INFO : Running command set process -p se1l -i se1l kv general.m_uv=0.2
  350. 212.25 s gammaloop-nextest-integration> [2026-08-26 05:39:19.020] @gammaloop_api::se... INFO : Running command set process -p se1l -i se1l kv general.mu_r=0.2
  351. 212.25 s gammaloop-nextest-integration> [2026-08-26 05:39:19.021] @gammaloop_api::se... INFO : Running command set process -p se1l -i se1l kv general.renormalization_localization_scale=0.2
  352. 212.25 s gammaloop-nextest-integration> [2026-08-26 05:39:19.022] @gammaloop_api::se... INFO : Running command duplicate integrand -p se1l -i se1l --output_process_name se1l --output_integrand_name se1l_muv_shifted
  353. 212.25 s gammaloop-nextest-integration> [2026-08-26 05:39:19.024] @gammaloop_api::se... INFO : Running command set process -p se1l -i se1l_muv_shifted kv general.m_uv=0.5
  354. 212.25 s gammaloop-nextest-integration> [2026-08-26 05:39:19.025] @gammaloop_api::se... INFO : Running command duplicate integrand -p se1l -i se1l --output_process_name se1l --output_integrand_name se1l_rls_shifted
  355. 212.25 s gammaloop-nextest-integration> [2026-08-26 05:39:19.028] @gammaloop_api::se... INFO : Running command set process -p se1l -i se1l_rls_shifted kv general.renormalization_localization_scale=1
  356. 212.25 s gammaloop-nextest-integration> [2026-08-26 05:39:19.029] @gammaloop_api::se... INFO : Running command duplicate integrand -p se1l -i se1l --output_process_name se1l --output_integrand_name se1l_mur_shifted
  357. 212.25 s gammaloop-nextest-integration> [2026-08-26 05:39:19.032] @gammaloop_api::se... INFO : Running command set process -p se1l -i se1l_mur_shifted kv general.mu_r=0.8
  358. 212.25 s gammaloop-nextest-integration> [2026-08-26 05:39:19.040] @process::amplitude WARNING : External state 0 ('g', PDG 21, helicity +) is off shell: p^2 = +2.5e5, expected m^2 = +0e0 (|Δ| = +2.5e5). Fixed-helicity spinor/vector/tensor external states may be ill-defined at this kinematic point.
  359. 212.25 s gammaloop-nextest-integration> field value
  360. 212.25 s gammaloop-nextest-integration> span warm_up{integrand.name=se1l}
  361. 212.25 s gammaloop-nextest-integration> [2026-08-26 05:39:19.040] @process::amplitude WARNING : External state 1 ('g', PDG 21, helicity -) is off shell: p^2 = +2.5e5, expected m^2 = +0e0 (|Δ| = +2.5e5). Fixed-helicity spinor/vector/tensor external states may be ill-defined at this kinematic point.
  362. 212.25 s gammaloop-nextest-integration> field value
  363. 212.25 s gammaloop-nextest-integration> span warm_up{integrand.name=se1l}
  364. 212.25 s gammaloop-nextest-integration> [2026-08-26 05:39:19.041] @process::amplitude INFO : Input is above threshold: 1 existing threshold E-surfaces across 1/1 graph groups
  365. 212.25 s gammaloop-nextest-integration> field value
  366. 212.25 s gammaloop-nextest-integration> existing_esurfaces 1
  367. 212.25 s gammaloop-nextest-integration> group_count 1
  368. 212.25 s gammaloop-nextest-integration> groups_above_threshold 1
  369. 212.25 s gammaloop-nextest-integration> integrand se1l
  370. 212.25 s gammaloop-nextest-integration> span warm_up{integrand.name=se1l}
  371. 212.25 s gammaloop-nextest-integration> threshold_status above threshold
  372. 212.25 s gammaloop-nextest-integration> [2026-08-26 05:39:19.041] @process::amplitude INFO : overlap structure of group 0: [1: [0(2,3)]]
  373. 212.25 s gammaloop-nextest-integration> field value
  374. 212.25 s gammaloop-nextest-integration> span warm_up{integrand.name=se1l}
  375. 212.25 s gammaloop-nextest-integration> [2026-08-26 05:39:19.181] @commands::profile INFO :
  376. 212.25 s gammaloop-nextest-integration> ╭───────┬──────┬──────────┬───────┬─────┬──────────┬───────────╮
  377. 212.25 s gammaloop-nextest-integration> │ fixed │ → ∞ │ slope │ r2 │ DOD │ bare DOD │ inspect │
  378. 212.25 s gammaloop-nextest-integration> ├───────┼──────┼──────────┼───────┼─────┼──────────┼───────────┤
  379. 212.25 s gammaloop-nextest-integration> │ {} │ {e3} │ 1.639236 │ 0.904 │ 2 │ 2 │ arb retry │
  380. 212.25 s gammaloop-nextest-integration> │ {} │ {e2} │ 1.698834 │ 0.902 │ 2 │ 2 │ arb retry │
  381. 212.25 s gammaloop-nextest-integration> ╰───────┴──────┴──────────┴───────┴─────┴──────────┴───────────╯
  382. 212.25 s gammaloop-nextest-integration> [2026-08-26 05:39:19.181] @commands::profile INFO :
  383. 212.25 s gammaloop-nextest-integration> ╭───────┬──────┬─────────────┬──────────┬───────┬─────┬──────────┬───────────╮
  384. 212.25 s gammaloop-nextest-integration> │ fixed │ → ∞ │ orientation │ slope │ r2 │ DOD │ bare DOD │ inspect │
  385. 212.25 s gammaloop-nextest-integration> ├───────┼──────┼─────────────┼──────────┼───────┼─────┼──────────┼───────────┤
  386. 212.25 s gammaloop-nextest-integration> │ {} │ {e3} │ 00-+ │ 0.343429 │ 0.145 │ 0 │ 2 │ arb retry │
  387. 212.25 s gammaloop-nextest-integration> │ {} │ {e3} │ 00+- │ 0.342577 │ 0.135 │ 0 │ 2 │ arb retry │
  388. 212.25 s gammaloop-nextest-integration> │ {} │ {e2} │ 00-+ │ 0.385975 │ 0.161 │ 0 │ 2 │ arb retry │
  389. 212.25 s gammaloop-nextest-integration> │ {} │ {e2} │ 00+- │ 0.384920 │ 0.192 │ 0 │ 2 │ arb retry │
  390. 212.25 s gammaloop-nextest-integration> ╰───────┴──────┴─────────────┴──────────┴───────┴─────┴──────────┴───────────╯
  391. 212.25 s gammaloop-nextest-integration> [2026-08-26 05:39:19.182] @gammaloop_api::se... INFO : Running command set process kv integrator.target_relative_accuracy=0.001 integrator.n_increase=0 integrator.n_start=50000 integrator.n_max=400000 integrator.seed=1337
  392. 212.25 s gammaloop-nextest-integration> [2026-08-26 05:39:19.182] @commands::integrate INFO : Created workspace directory at /build/source/tests/artifacts/se1l/integration_workspace_se1l
  393. 212.25 s gammaloop-nextest-integration> [2026-08-26 05:39:19.200] @commands::integrate INFO : No integration state found, starting new integration
  394. 212.25 s gammaloop-nextest-integration> [2026-08-26 05:39:19.200] @commands::integrate INFO : Gammaloop now integrates se1l@se1l, se1l@se1l_muv_shifted, se1l@se1l_rls_shifted
  395. 212.25 s gammaloop-nextest-integration> [2026-08-26 05:39:19.200] @process::amplitude WARNING : External state 0 ('g', PDG 21, helicity +) is off shell: p^2 = +2.5e5, expected m^2 = +0e0 (|Δ| = +2.5e5). Fixed-helicity spinor/vector/tensor external states may be ill-defined at this kinematic point.
  396. 212.25 s gammaloop-nextest-integration> field value
  397. 212.25 s gammaloop-nextest-integration> span warm_up{integrand.name=se1l}
  398. 212.25 s gammaloop-nextest-integration> [2026-08-26 05:39:19.200] @process::amplitude WARNING : External state 1 ('g', PDG 21, helicity -) is off shell: p^2 = +2.5e5, expected m^2 = +0e0 (|Δ| = +2.5e5). Fixed-helicity spinor/vector/tensor external states may be ill-defined at this kinematic point.
  399. 212.25 s gammaloop-nextest-integration> field value
  400. 212.25 s gammaloop-nextest-integration> span warm_up{integrand.name=se1l}
  401. 212.25 s gammaloop-nextest-integration> [2026-08-26 05:39:19.201] @process::amplitude INFO : Input is above threshold: 1 existing threshold E-surfaces across 1/1 graph groups
  402. 212.25 s gammaloop-nextest-integration> field value
  403. 212.25 s gammaloop-nextest-integration> existing_esurfaces 1
  404. 212.25 s gammaloop-nextest-integration> group_count 1
  405. 212.25 s gammaloop-nextest-integration> groups_above_threshold 1
  406. 212.25 s gammaloop-nextest-integration> integrand se1l
  407. 212.25 s gammaloop-nextest-integration> span warm_up{integrand.name=se1l}
  408. 212.25 s gammaloop-nextest-integration> threshold_status above threshold
  409. 212.25 s gammaloop-nextest-integration> [2026-08-26 05:39:19.201] @process::amplitude INFO : overlap structure of group 0: [1: [0(2,3)]]
  410. 212.25 s gammaloop-nextest-integration> field value
  411. 212.25 s gammaloop-nextest-integration> span warm_up{integrand.name=se1l}
  412. 212.25 s gammaloop-nextest-integration> [2026-08-26 05:39:19.202] @process::amplitude WARNING : External state 0 ('g', PDG 21, helicity +) is off shell: p^2 = +2.5e5, expected m^2 = +0e0 (|Δ| = +2.5e5). Fixed-helicity spinor/vector/tensor external states may be ill-defined at this kinematic point.
  413. 212.25 s gammaloop-nextest-integration> field value
  414. 212.25 s gammaloop-nextest-integration> span warm_up{integrand.name=se1l_muv_shifted}
  415. 212.25 s gammaloop-nextest-integration> [2026-08-26 05:39:19.202] @process::amplitude WARNING : External state 1 ('g', PDG 21, helicity -) is off shell: p^2 = +2.5e5, expected m^2 = +0e0 (|Δ| = +2.5e5). Fixed-helicity spinor/vector/tensor external states may be ill-defined at this kinematic point.
  416. 212.25 s gammaloop-nextest-integration> field value
  417. 212.25 s gammaloop-nextest-integration> span warm_up{integrand.name=se1l_muv_shifted}
  418. 212.25 s gammaloop-nextest-integration> [2026-08-26 05:39:19.202] @process::amplitude INFO : Input is above threshold: 1 existing threshold E-surfaces across 1/1 graph groups
  419. 212.25 s gammaloop-nextest-integration> field value
  420. 212.25 s gammaloop-nextest-integration> existing_esurfaces 1
  421. 212.25 s gammaloop-nextest-integration> group_count 1
  422. 212.25 s gammaloop-nextest-integration> groups_above_threshold 1
  423. 212.25 s gammaloop-nextest-integration> integrand se1l_muv_shifted
  424. 212.25 s gammaloop-nextest-integration> span warm_up{integrand.name=se1l_muv_shifted}
  425. 212.25 s gammaloop-nextest-integration> threshold_status above threshold
  426. 212.25 s gammaloop-nextest-integration> [2026-08-26 05:39:19.202] @process::amplitude INFO : overlap structure of group 0: [1: [0(2,3)]]
  427. 212.25 s gammaloop-nextest-integration> field value
  428. 212.25 s gammaloop-nextest-integration> span warm_up{integrand.name=se1l_muv_shifted}
  429. 212.25 s gammaloop-nextest-integration> [2026-08-26 05:39:19.203] @process::amplitude WARNING : External state 0 ('g', PDG 21, helicity +) is off shell: p^2 = +2.5e5, expected m^2 = +0e0 (|Δ| = +2.5e5). Fixed-helicity spinor/vector/tensor external states may be ill-defined at this kinematic point.
  430. 212.25 s gammaloop-nextest-integration> field value
  431. 212.25 s gammaloop-nextest-integration> span warm_up{integrand.name=se1l_rls_shifted}
  432. 212.25 s gammaloop-nextest-integration> [2026-08-26 05:39:19.203] @process::amplitude WARNING : External state 1 ('g', PDG 21, helicity -) is off shell: p^2 = +2.5e5, expected m^2 = +0e0 (|Δ| = +2.5e5). Fixed-helicity spinor/vector/tensor external states may be ill-defined at this kinematic point.
  433. 212.25 s gammaloop-nextest-integration> field value
  434. 212.25 s gammaloop-nextest-integration> span warm_up{integrand.name=se1l_rls_shifted}
  435. 212.25 s gammaloop-nextest-integration> [2026-08-26 05:39:19.203] @process::amplitude INFO : Input is above threshold: 1 existing threshold E-surfaces across 1/1 graph groups
  436. 212.25 s gammaloop-nextest-integration> field value
  437. 212.25 s gammaloop-nextest-integration> existing_esurfaces 1
  438. 212.25 s gammaloop-nextest-integration> group_count 1
  439. 212.25 s gammaloop-nextest-integration> groups_above_threshold 1
  440. 212.25 s gammaloop-nextest-integration> integrand se1l_rls_shifted
  441. 212.25 s gammaloop-nextest-integration> span warm_up{integrand.name=se1l_rls_shifted}
  442. 212.25 s gammaloop-nextest-integration> threshold_status above threshold
  443. 212.25 s gammaloop-nextest-integration> ... omitted 1410 more lines; see full nextest output above
  444. 212.25 s gammaloop-nextest-integration> =========================================
  445. 212.25 s error: Cannot build '/nix/store/z64pzsmdh7l76572yr3sfrwn8clcnq7n-gammaloop-nextest-integration.drv'.
  446. 212.25 s Reason: builder failed with exit code 100.
  447. 212.25 s Output paths:
  448. 212.25 s /nix/store/ig9divdxs867pdkmxwq7j78q7xgh2c40-gammaloop-nextest-integration
  449. 212.25 s Last 2048 log lines:
  450. 212.25 s > span warm_up{integrand.name=se1l_muv_shifted}
  451. 212.25 s > threshold_status above threshold
  452. 212.25 s > [2026-08-26 05:41:33.651] @process::amplitude INFO : overlap structure of group 0: [1: [0(2,3)]]
  453. 212.25 s > field value
  454. 212.25 s > span warm_up{integrand.name=se1l_muv_shifted}
  455. 212.25 s > [2026-08-26 05:41:33.657] @process::amplitude WARNING : External state 0 ('g', PDG 21, helicity +) is off shell: p^2 = +2.5e5, expected m^2 = +0e0 (|Δ| = +2.5e5). Fixed-helicity spinor/vector/tensor external states may be ill-defined at this kinematic point.
  456. 212.25 s > field value
  457. 212.25 s > span warm_up{integrand.name=se1l}
  458. 212.25 s > [2026-08-26 05:41:33.657] @process::amplitude WARNING : External state 1 ('g', PDG 21, helicity -) is off shell: p^2 = +2.5e5, expected m^2 = +0e0 (|Δ| = +2.5e5). Fixed-helicity spinor/vector/tensor external states may be ill-defined at this kinematic point.
  459. 212.25 s > field value
  460. 212.25 s > span warm_up{integrand.name=se1l}
  461. 212.25 s > [2026-08-26 05:41:33.657] @process::amplitude INFO : Input is above threshold: 1 existing threshold E-surfaces across 1/1 graph groups
  462. 212.25 s > field value
  463. 212.25 s > existing_esurfaces 1
  464. 212.25 s > group_count 1
  465. 212.25 s > groups_above_threshold 1
  466. 212.25 s > integrand se1l
  467. 212.25 s > span warm_up{integrand.name=se1l}
  468. 212.25 s > threshold_status above threshold
  469. 212.25 s > [2026-08-26 05:41:33.658] @process::amplitude INFO : overlap structure of group 0: [1: [0(2,3)]]
  470. 212.25 s > field value
  471. 212.25 s > span warm_up{integrand.name=se1l}
  472. 212.25 s > [2026-08-26 05:41:33.664] @process::amplitude WARNING : External state 0 ('g', PDG 21, helicity +) is off shell: p^2 = +2.5e5, expected m^2 = +0e0 (|Δ| = +2.5e5). Fixed-helicity spinor/vector/tensor external states may be ill-defined at this kinematic point.
  473. 212.25 s > field value
  474. 212.25 s > span warm_up{integrand.name=se1l_muv_shifted}
  475. 212.25 s > [2026-08-26 05:41:33.664] @process::amplitude WARNING : External state 1 ('g', PDG 21, helicity -) is off shell: p^2 = +2.5e5, expected m^2 = +0e0 (|Δ| = +2.5e5). Fixed-helicity spinor/vector/tensor external states may be ill-defined at this kinematic point.
  476. 212.25 s > field value
  477. 212.25 s > span warm_up{integrand.name=se1l_muv_shifted}
  478. 212.25 s > [2026-08-26 05:41:33.664] @process::amplitude INFO : Input is above threshold: 1 existing threshold E-surfaces across 1/1 graph groups
  479. 212.25 s > field value
  480. 212.25 s > existing_esurfaces 1
  481. 212.25 s > group_count 1
  482. 212.25 s > groups_above_threshold 1
  483. 212.25 s > integrand se1l_muv_shifted
  484. 212.25 s > span warm_up{integrand.name=se1l_muv_shifted}
  485. 212.25 s > threshold_status above threshold
  486. 212.25 s > [2026-08-26 05:41:33.664] @process::amplitude INFO : overlap structure of group 0: [1: [0(2,3)]]
  487. 212.25 s > field value
  488. 212.25 s > span warm_up{integrand.name=se1l_muv_shifted}
  489. 212.25 s > [2026-08-26 05:41:33.670] @process::amplitude WARNING : External state 0 ('g', PDG 21, helicity +) is off shell: p^2 = +2.5e5, expected m^2 = +0e0 (|Δ| = +2.5e5). Fixed-helicity spinor/vector/tensor external states may be ill-defined at this kinematic point.
  490. 212.25 s > field value
  491. 212.25 s > span warm_up{integrand.name=se1l}
  492. 212.25 s > [2026-08-26 05:41:33.670] @process::amplitude WARNING : External state 1 ('g', PDG 21, helicity -) is off shell: p^2 = +2.5e5, expected m^2 = +0e0 (|Δ| = +2.5e5). Fixed-helicity spinor/vector/tensor external states may be ill-defined at this kinematic point.
  493. 212.25 s > field value
  494. 212.25 s > span warm_up{integrand.name=se1l}
  495. 212.25 s > [2026-08-26 05:41:33.670] @process::amplitude INFO : Input is above threshold: 1 existing threshold E-surfaces across 1/1 graph groups
  496. 212.25 s > field value
  497. 212.25 s > existing_esurfaces 1
  498. 212.25 s > group_count 1
  499. 212.25 s > groups_above_threshold 1
  500. 212.25 s > integrand se1l
  501. 212.25 s > span warm_up{integrand.name=se1l}
  502. 212.25 s > threshold_status above threshold
  503. 212.25 s > [2026-08-26 05:41:33.670] @process::amplitude INFO : overlap structure of group 0: [1: [0(2,3)]]
  504. 212.25 s > field value
  505. 212.25 s > span warm_up{integrand.name=se1l}
  506. 212.25 s > [2026-08-26 05:41:33.676] @process::amplitude WARNING : External state 0 ('g', PDG 21, helicity +) is off shell: p^2 = +2.5e5, expected m^2 = +0e0 (|Δ| = +2.5e5). Fixed-helicity spinor/vector/tensor external states may be ill-defined at this kinematic point.
  507. 212.25 s > field value
  508. 212.25 s > span warm_up{integrand.name=se1l_muv_shifted}
  509. 212.25 s > [2026-08-26 05:41:33.676] @process::amplitude WARNING : External state 1 ('g', PDG 21, helicity -) is off shell: p^2 = +2.5e5, expected m^2 = +0e0 (|Δ| = +2.5e5). Fixed-helicity spinor/vector/tensor external states may be ill-defined at this kinematic point.
  510. 212.25 s > field value
  511. 212.25 s > span warm_up{integrand.name=se1l_muv_shifted}
  512. 212.25 s > [2026-08-26 05:41:33.677] @process::amplitude INFO : Input is above threshold: 1 existing threshold E-surfaces across 1/1 graph groups
  513. 212.25 s > field value
  514. 212.25 s > existing_esurfaces 1
  515. 212.25 s > group_count 1
  516. 212.25 s > groups_above_threshold 1
  517. 212.25 s > integrand se1l_muv_shifted
  518. 212.25 s > span warm_up{integrand.name=se1l_muv_shifted}
  519. 212.25 s > threshold_status above threshold
  520. 212.25 s > [2026-08-26 05:41:33.677] @process::amplitude INFO : overlap structure of group 0: [1: [0(2,3)]]
  521. 212.25 s > field value
  522. 212.25 s > span warm_up{integrand.name=se1l_muv_shifted}
  523. 212.25 s > [2026-08-26 05:41:33.683] @process::amplitude WARNING : External state 0 ('g', PDG 21, helicity +) is off shell: p^2 = +2.5e5, expected m^2 = +0e0 (|Δ| = +2.5e5). Fixed-helicity spinor/vector/tensor external states may be ill-defined at this kinematic point.
  524. 212.25 s > field value
  525. 212.25 s > span warm_up{integrand.name=se1l}
  526. 212.25 s > [2026-08-26 05:41:33.683] @process::amplitude WARNING : External state 1 ('g', PDG 21, helicity -) is off shell: p^2 = +2.5e5, expected m^2 = +0e0 (|Δ| = +2.5e5). Fixed-helicity spinor/vector/tensor external states may be ill-defined at this kinematic point.
  527. 212.25 s > field value
  528. 212.25 s > span warm_up{integrand.name=se1l}
  529. 212.25 s > [2026-08-26 05:41:33.683] @process::amplitude INFO : Input is above threshold: 1 existing threshold E-surfaces across 1/1 graph groups
  530. 212.25 s > field value
  531. 212.25 s > existing_esurfaces 1
  532. 212.25 s > group_count 1
  533. 212.25 s > groups_above_threshold 1
  534. 212.25 s > integrand se1l
  535. 212.25 s > span warm_up{integrand.name=se1l}
  536. 212.25 s > threshold_status above threshold
  537. 212.25 s > [2026-08-26 05:41:33.683] @process::amplitude INFO : overlap structure of group 0: [1: [0(2,3)]]
  538. 212.25 s > field value
  539. 212.25 s > span warm_up{integrand.name=se1l}
  540. 212.25 s > [2026-08-26 05:41:33.689] @process::amplitude WARNING : External state 0 ('g', PDG 21, helicity +) is off shell: p^2 = +2.5e5, expected m^2 = +0e0 (|Δ| = +2.5e5). Fixed-helicity spinor/vector/tensor external states may be ill-defined at this kinematic point.
  541. 212.25 s > field value
  542. 212.25 s > span warm_up{integrand.name=se1l_muv_shifted}
  543. 212.25 s > [2026-08-26 05:41:33.690] @process::amplitude WARNING : External state 1 ('g', PDG 21, helicity -) is off shell: p^2 = +2.5e5, expected m^2 = +0e0 (|Δ| = +2.5e5). Fixed-helicity spinor/vector/tensor external states may be ill-defined at this kinematic point.
  544. 212.25 s > field value
  545. 212.25 s > span warm_up{integrand.name=se1l_muv_shifted}
  546. 212.25 s > [2026-08-26 05:41:33.690] @process::amplitude INFO : Input is above threshold: 1 existing threshold E-surfaces across 1/1 graph groups
  547. 212.25 s > field value
  548. 212.25 s > existing_esurfaces 1
  549. 212.25 s > group_count 1
  550. 212.25 s > groups_above_threshold 1
  551. 212.25 s > integrand se1l_muv_shifted
  552. 212.25 s > span warm_up{integrand.name=se1l_muv_shifted}
  553. 212.25 s > threshold_status above threshold
  554. 212.25 s > [2026-08-26 05:41:33.690] @process::amplitude INFO : overlap structure of group 0: [1: [0(2,3)]]
  555. 212.25 s > field value
  556. 212.25 s > span warm_up{integrand.name=se1l_muv_shifted}
  557. 212.25 s > [2026-08-26 05:41:33.696] @process::amplitude WARNING : External state 0 ('g', PDG 21, helicity +) is off shell: p^2 = +2.5e5, expected m^2 = +0e0 (|Δ| = +2.5e5). Fixed-helicity spinor/vector/tensor external states may be ill-defined at this kinematic point.
  558. 212.25 s > field value
  559. 212.25 s > span warm_up{integrand.name=se1l}
  560. 212.25 s > [2026-08-26 05:41:33.696] @process::amplitude WARNING : External state 1 ('g', PDG 21, helicity -) is off shell: p^2 = +2.5e5, expected m^2 = +0e0 (|Δ| = +2.5e5). Fixed-helicity spinor/vector/tensor external states may be ill-defined at this kinematic point.
  561. 212.25 s > field value
  562. 212.25 s > span warm_up{integrand.name=se1l}
  563. 212.25 s > [2026-08-26 05:41:33.696] @process::amplitude INFO : Input is above threshold: 1 existing threshold E-surfaces across 1/1 graph groups
  564. 212.25 s > field value
  565. 212.25 s > existing_esurfaces 1
  566. 212.25 s > group_count 1
  567. 212.25 s > groups_above_threshold 1
  568. 212.25 s > integrand se1l
  569. 212.25 s > span warm_up{integrand.name=se1l}
  570. 212.25 s > threshold_status above threshold
  571. 212.25 s > [2026-08-26 05:41:33.696] @process::amplitude INFO : overlap structure of group 0: [1: [0(2,3)]]
  572. 212.25 s > field value
  573. 212.25 s > span warm_up{integrand.name=se1l}
  574. 212.25 s > [2026-08-26 05:41:33.702] @process::amplitude WARNING : External state 0 ('g', PDG 21, helicity +) is off shell: p^2 = +2.5e5, expected m^2 = +0e0 (|Δ| = +2.5e5). Fixed-helicity spinor/vector/tensor external states may be ill-defined at this kinematic point.
  575. 212.25 s > field value
  576. 212.25 s > span warm_up{integrand.name=se1l_rls_shifted}
  577. 212.25 s > [2026-08-26 05:41:33.702] @process::amplitude WARNING : External state 1 ('g', PDG 21, helicity -) is off shell: p^2 = +2.5e5, expected m^2 = +0e0 (|Δ| = +2.5e5). Fixed-helicity spinor/vector/tensor external states may be ill-defined at this kinematic point.
  578. 212.25 s > field value
  579. 212.25 s > span warm_up{integrand.name=se1l_rls_shifted}
  580. 212.25 s > [2026-08-26 05:41:33.702] @process::amplitude INFO : Input is above threshold: 1 existing threshold E-surfaces across 1/1 graph groups
  581. 212.25 s > field value
  582. 212.25 s > existing_esurfaces 1
  583. 212.25 s > group_count 1
  584. 212.25 s > groups_above_threshold 1
  585. 212.25 s > integrand se1l_rls_shifted
  586. 212.25 s > span warm_up{integrand.name=se1l_rls_shifted}
  587. 212.25 s > threshold_status above threshold
  588. 212.25 s > [2026-08-26 05:41:33.702] @process::amplitude INFO : overlap structure of group 0: [1: [0(2,3)]]
  589. 212.25 s > field value
  590. 212.25 s > span warm_up{integrand.name=se1l_rls_shifted}
  591. 212.25 s > [2026-08-26 05:41:33.708] @process::amplitude WARNING : External state 0 ('g', PDG 21, helicity +) is off shell: p^2 = +2.5e5, expected m^2 = +0e0 (|Δ| = +2.5e5). Fixed-helicity spinor/vector/tensor external states may be ill-defined at this kinematic point.
  592. 212.25 s > field value
  593. 212.25 s > span warm_up{integrand.name=se1l}
  594. 212.25 s > [2026-08-26 05:41:33.708] @process::amplitude WARNING : External state 1 ('g', PDG 21, helicity -) is off shell: p^2 = +2.5e5, expected m^2 = +0e0 (|Δ| = +2.5e5). Fixed-helicity spinor/vector/tensor external states may be ill-defined at this kinematic point.
  595. 212.25 s > field value
  596. 212.25 s > span warm_up{integrand.name=se1l}
  597. 212.25 s > [2026-08-26 05:41:33.708] @process::amplitude INFO : Input is above threshold: 1 existing threshold E-surfaces across 1/1 graph groups
  598. 212.25 s > field value
  599. 212.25 s > existing_esurfaces 1
  600. 212.25 s > group_count 1
  601. 212.25 s > groups_above_threshold 1
  602. 212.25 s > integrand se1l
  603. 212.25 s > span warm_up{integrand.name=se1l}
  604. 212.25 s > threshold_status above threshold
  605. 212.25 s > [2026-08-26 05:41:33.709] @process::amplitude INFO : overlap structure of group 0: [1: [0(2,3)]]
  606. 212.25 s > field value
  607. 212.25 s > span warm_up{integrand.name=se1l}
  608. 212.25 s > [2026-08-26 05:41:33.714] @process::amplitude WARNING : External state 0 ('g', PDG 21, helicity +) is off shell: p^2 = +2.5e5, expected m^2 = +0e0 (|Δ| = +2.5e5). Fixed-helicity spinor/vector/tensor external states may be ill-defined at this kinematic point.
  609. 212.25 s > field value
  610. 212.25 s > span warm_up{integrand.name=se1l_rls_shifted}
  611. 212.25 s > [2026-08-26 05:41:33.714] @process::amplitude WARNING : External state 1 ('g', PDG 21, helicity -) is off shell: p^2 = +2.5e5, expected m^2 = +0e0 (|Δ| = +2.5e5). Fixed-helicity spinor/vector/tensor external states may be ill-defined at this kinematic point.
  612. 212.25 s > field value
  613. 212.25 s > span warm_up{integrand.name=se1l_rls_shifted}
  614. 212.25 s > [2026-08-26 05:41:33.715] @process::amplitude INFO : Input is above threshold: 1 existing threshold E-surfaces across 1/1 graph groups
  615. 212.25 s > field value
  616. 212.25 s > existing_esurfaces 1
  617. 212.25 s > group_count 1
  618. 212.25 s > groups_above_threshold 1
  619. 212.25 s > integrand se1l_rls_shifted
  620. 212.25 s > span warm_up{integrand.name=se1l_rls_shifted}
  621. 212.25 s > threshold_status above threshold
  622. 212.25 s > [2026-08-26 05:41:33.715] @process::amplitude INFO : overlap structure of group 0: [1: [0(2,3)]]
  623. 212.25 s > field value
  624. 212.25 s > span warm_up{integrand.name=se1l_rls_shifted}
  625. 212.25 s > [2026-08-26 05:41:33.721] @process::amplitude WARNING : External state 0 ('g', PDG 21, helicity +) is off shell: p^2 = +2.5e5, expected m^2 = +0e0 (|Δ| = +2.5e5). Fixed-helicity spinor/vector/tensor external states may be ill-defined at this kinematic point.
  626. 212.25 s > field value
  627. 212.25 s > span warm_up{integrand.name=se1l}
  628. 212.25 s > [2026-08-26 05:41:33.721] @process::amplitude WARNING : External state 1 ('g', PDG 21, helicity -) is off shell: p^2 = +2.5e5, expected m^2 = +0e0 (|Δ| = +2.5e5). Fixed-helicity spinor/vector/tensor external states may be ill-defined at this kinematic point.
  629. 212.25 s > field value
  630. 212.25 s > span warm_up{integrand.name=se1l}
  631. 212.25 s > [2026-08-26 05:41:33.721] @process::amplitude INFO : Input is above threshold: 1 existing threshold E-surfaces across 1/1 graph groups
  632. 212.25 s > field value
  633. 212.25 s > existing_esurfaces 1
  634. 212.25 s > group_count 1
  635. 212.25 s > groups_above_threshold 1
  636. 212.25 s > integrand se1l
  637. 212.25 s > span warm_up{integrand.name=se1l}
  638. 212.25 s > threshold_status above threshold
  639. 212.25 s > [2026-08-26 05:41:33.721] @process::amplitude INFO : overlap structure of group 0: [1: [0(2,3)]]
  640. 212.25 s > field value
  641. 212.25 s > span warm_up{integrand.name=se1l}
  642. 212.25 s > [2026-08-26 05:41:33.727] @process::amplitude WARNING : External state 0 ('g', PDG 21, helicity +) is off shell: p^2 = +2.5e5, expected m^2 = +0e0 (|Δ| = +2.5e5). Fixed-helicity spinor/vector/tensor external states may be ill-defined at this kinematic point.
  643. 212.25 s > field value
  644. 212.25 s > span warm_up{integrand.name=se1l_rls_shifted}
  645. 212.25 s > [2026-08-26 05:41:33.727] @process::amplitude WARNING : External state 1 ('g', PDG 21, helicity -) is off shell: p^2 = +2.5e5, expected m^2 = +0e0 (|Δ| = +2.5e5). Fixed-helicity spinor/vector/tensor external states may be ill-defined at this kinematic point.
  646. 212.25 s > field value
  647. 212.25 s > span warm_up{integrand.name=se1l_rls_shifted}
  648. 212.25 s > [2026-08-26 05:41:33.727] @process::amplitude INFO : Input is above threshold: 1 existing threshold E-surfaces across 1/1 graph groups
  649. 212.25 s > field value
  650. 212.25 s > existing_esurfaces 1
  651. 212.25 s > group_count 1
  652. 212.25 s > groups_above_threshold 1
  653. 212.25 s > integrand se1l_rls_shifted
  654. 212.25 s > span warm_up{integrand.name=se1l_rls_shifted}
  655. 212.25 s > threshold_status above threshold
  656. 212.25 s > [2026-08-26 05:41:33.727] @process::amplitude INFO : overlap structure of group 0: [1: [0(2,3)]]
  657. 212.25 s > field value
  658. 212.25 s > span warm_up{integrand.name=se1l_rls_shifted}
  659. 212.25 s > [2026-08-26 05:41:33.734] @process::amplitude WARNING : External state 0 ('g', PDG 21, helicity +) is off shell: p^2 = +2.5e5, expected m^2 = +0e0 (|Δ| = +2.5e5). Fixed-helicity spinor/vector/tensor external states may be ill-defined at this kinematic point.
  660. 212.25 s > field value
  661. 212.25 s > span warm_up{integrand.name=se1l}
  662. 212.25 s > [2026-08-26 05:41:33.734] @process::amplitude WARNING : External state 1 ('g', PDG 21, helicity -) is off shell: p^2 = +2.5e5, expected m^2 = +0e0 (|Δ| = +2.5e5). Fixed-helicity spinor/vector/tensor external states may be ill-defined at this kinematic point.
  663. 212.25 s > field value
  664. 212.25 s > span warm_up{integrand.name=se1l}
  665. 212.25 s > [2026-08-26 05:41:33.734] @process::amplitude INFO : Input is above threshold: 1 existing threshold E-surfaces across 1/1 graph groups
  666. 212.25 s > field value
  667. 212.25 s > existing_esurfaces 1
  668. 212.25 s > group_count 1
  669. 212.25 s > groups_above_threshold 1
  670. 212.25 s > integrand se1l
  671. 212.25 s > span warm_up{integrand.name=se1l}
  672. 212.25 s > threshold_status above threshold
  673. 212.25 s > [2026-08-26 05:41:33.734] @process::amplitude INFO : overlap structure of group 0: [1: [0(2,3)]]
  674. 212.25 s > field value
  675. 212.25 s > span warm_up{integrand.name=se1l}
  676. 212.25 s > [2026-08-26 05:41:33.740] @process::amplitude WARNING : External state 0 ('g', PDG 21, helicity +) is off shell: p^2 = +2.5e5, expected m^2 = +0e0 (|Δ| = +2.5e5). Fixed-helicity spinor/vector/tensor external states may be ill-defined at this kinematic point.
  677. 212.25 s > field value
  678. 212.25 s > span warm_up{integrand.name=se1l_rls_shifted}
  679. 212.25 s > [2026-08-26 05:41:33.740] @process::amplitude WARNING : External state 1 ('g', PDG 21, helicity -) is off shell: p^2 = +2.5e5, expected m^2 = +0e0 (|Δ| = +2.5e5). Fixed-helicity spinor/vector/tensor external states may be ill-defined at this kinematic point.
  680. 212.25 s > field value
  681. 212.25 s > span warm_up{integrand.name=se1l_rls_shifted}
  682. 212.25 s > [2026-08-26 05:41:33.740] @process::amplitude INFO : Input is above threshold: 1 existing threshold E-surfaces across 1/1 graph groups
  683. 212.25 s > field value
  684. 212.25 s > existing_esurfaces 1
  685. 212.25 s > group_count 1
  686. 212.25 s > groups_above_threshold 1
  687. 212.25 s > integrand se1l_rls_shifted
  688. 212.25 s > span warm_up{integrand.name=se1l_rls_shifted}
  689. 212.25 s > threshold_status above threshold
  690. 212.25 s > [2026-08-26 05:41:33.740] @process::amplitude INFO : overlap structure of group 0: [1: [0(2,3)]]
  691. 212.25 s > field value
  692. 212.25 s > span warm_up{integrand.name=se1l_rls_shifted}
  693. 212.25 s > [2026-08-26 05:41:33.746] @process::amplitude WARNING : External state 0 ('g', PDG 21, helicity +) is off shell: p^2 = +2.5e5, expected m^2 = +0e0 (|Δ| = +2.5e5). Fixed-helicity spinor/vector/tensor external states may be ill-defined at this kinematic point.
  694. 212.25 s > field value
  695. 212.25 s > span warm_up{integrand.name=se1l}
  696. 212.25 s > [2026-08-26 05:41:33.746] @process::amplitude WARNING : External state 1 ('g', PDG 21, helicity -) is off shell: p^2 = +2.5e5, expected m^2 = +0e0 (|Δ| = +2.5e5). Fixed-helicity spinor/vector/tensor external states may be ill-defined at this kinematic point.
  697. 212.25 s > field value
  698. 212.25 s > span warm_up{integrand.name=se1l}
  699. 212.25 s > [2026-08-26 05:41:33.746] @process::amplitude INFO : Input is above threshold: 1 existing threshold E-surfaces across 1/1 graph groups
  700. 212.25 s > field value
  701. 212.25 s > existing_esurfaces 1
  702. 212.25 s > group_count 1
  703. 212.25 s > groups_above_threshold 1
  704. 212.25 s > integrand se1l
  705. 212.25 s > span warm_up{integrand.name=se1l}
  706. 212.25 s > threshold_status above threshold
  707. 212.25 s > [2026-08-26 05:41:33.747] @process::amplitude INFO : overlap structure of group 0: [1: [0(2,3)]]
  708. 212.25 s > field value
  709. 212.25 s > span warm_up{integrand.name=se1l}
  710. 212.25 s > [2026-08-26 05:41:33.752] @process::amplitude WARNING : External state 0 ('g', PDG 21, helicity +) is off shell: p^2 = +2.5e5, expected m^2 = +0e0 (|Δ| = +2.5e5). Fixed-helicity spinor/vector/tensor external states may be ill-defined at this kinematic point.
  711. 212.25 s > field value
  712. 212.25 s > span warm_up{integrand.name=se1l_rls_shifted}
  713. 212.25 s > [2026-08-26 05:41:33.752] @process::amplitude WARNING : External state 1 ('g', PDG 21, helicity -) is off shell: p^2 = +2.5e5, expected m^2 = +0e0 (|Δ| = +2.5e5). Fixed-helicity spinor/vector/tensor external states may be ill-defined at this kinematic point.
  714. 212.25 s > field value
  715. 212.25 s > span warm_up{integrand.name=se1l_rls_shifted}
  716. 212.25 s > [2026-08-26 05:41:33.753] @process::amplitude INFO : Input is above threshold: 1 existing threshold E-surfaces across 1/1 graph groups
  717. 212.25 s > field value
  718. 212.25 s > existing_esurfaces 1
  719. 212.25 s > group_count 1
  720. 212.25 s > groups_above_threshold 1
  721. 212.25 s > integrand se1l_rls_shifted
  722. 212.25 s > span warm_up{integrand.name=se1l_rls_shifted}
  723. 212.25 s > threshold_status above threshold
  724. 212.25 s > [2026-08-26 05:41:33.753] @process::amplitude INFO : overlap structure of group 0: [1: [0(2,3)]]
  725. 212.25 s > field value
  726. 212.25 s > span warm_up{integrand.name=se1l_rls_shifted}
  727. 212.25 s > [2026-08-26 05:41:33.759] @process::amplitude WARNING : External state 0 ('g', PDG 21, helicity +) is off shell: p^2 = +2.5e5, expected m^2 = +0e0 (|Δ| = +2.5e5). Fixed-helicity spinor/vector/tensor external states may be ill-defined at this kinematic point.
  728. 212.25 s > field value
  729. 212.25 s > span warm_up{integrand.name=se1l}
  730. 212.25 s > [2026-08-26 05:41:33.759] @process::amplitude WARNING : External state 1 ('g', PDG 21, helicity -) is off shell: p^2 = +2.5e5, expected m^2 = +0e0 (|Δ| = +2.5e5). Fixed-helicity spinor/vector/tensor external states may be ill-defined at this kinematic point.
  731. 212.25 s > field value
  732. 212.25 s > span warm_up{integrand.name=se1l}
  733. 212.25 s > [2026-08-26 05:41:33.759] @process::amplitude INFO : Input is above threshold: 1 existing threshold E-surfaces across 1/1 graph groups
  734. 212.25 s > field value
  735. 212.25 s > existing_esurfaces 1
  736. 212.25 s > group_count 1
  737. 212.25 s > groups_above_threshold 1
  738. 212.25 s > integrand se1l
  739. 212.25 s > span warm_up{integrand.name=se1l}
  740. 212.25 s > threshold_status above threshold
  741. 212.25 s > [2026-08-26 05:41:33.759] @process::amplitude INFO : overlap structure of group 0: [1: [0(2,3)]]
  742. 212.25 s > field value
  743. 212.25 s > span warm_up{integrand.name=se1l}
  744. 212.25 s > [2026-08-26 05:41:33.765] @process::amplitude WARNING : External state 0 ('g', PDG 21, helicity +) is off shell: p^2 = +2.5e5, expected m^2 = +0e0 (|Δ| = +2.5e5). Fixed-helicity spinor/vector/tensor external states may be ill-defined at this kinematic point.
  745. 212.25 s > field value
  746. 212.25 s > span warm_up{integrand.name=se1l_rls_shifted}
  747. 212.25 s > [2026-08-26 05:41:33.765] @process::amplitude WARNING : External state 1 ('g', PDG 21, helicity -) is off shell: p^2 = +2.5e5, expected m^2 = +0e0 (|Δ| = +2.5e5). Fixed-helicity spinor/vector/tensor external states may be ill-defined at this kinematic point.
  748. 212.25 s > field value
  749. 212.25 s > span warm_up{integrand.name=se1l_rls_shifted}
  750. 212.25 s > [2026-08-26 05:41:33.766] @process::amplitude INFO : Input is above threshold: 1 existing threshold E-surfaces across 1/1 graph groups
  751. 212.25 s > field value
  752. 212.25 s > existing_esurfaces 1
  753. 212.25 s > group_count 1
  754. 212.25 s > groups_above_threshold 1
  755. 212.25 s > integrand se1l_rls_shifted
  756. 212.25 s > span warm_up{integrand.name=se1l_rls_shifted}
  757. 212.25 s > threshold_status above threshold
  758. 212.25 s > [2026-08-26 05:41:33.766] @process::amplitude INFO : overlap structure of group 0: [1: [0(2,3)]]
  759. 212.25 s > field value
  760. 212.25 s > span warm_up{integrand.name=se1l_rls_shifted}
  761. 212.25 s > [2026-08-26 05:41:33.772] @process::amplitude WARNING : External state 0 ('g', PDG 21, helicity +) is off shell: p^2 = +2.5e5, expected m^2 = +0e0 (|Δ| = +2.5e5). Fixed-helicity spinor/vector/tensor external states may be ill-defined at this kinematic point.
  762. 212.25 s > field value
  763. 212.25 s > span warm_up{integrand.name=se1l}
  764. 212.25 s > [2026-08-26 05:41:33.772] @process::amplitude WARNING : External state 1 ('g', PDG 21, helicity -) is off shell: p^2 = +2.5e5, expected m^2 = +0e0 (|Δ| = +2.5e5). Fixed-helicity spinor/vector/tensor external states may be ill-defined at this kinematic point.
  765. 212.25 s > field value
  766. 212.25 s > span warm_up{integrand.name=se1l}
  767. 212.25 s > [2026-08-26 05:41:33.772] @process::amplitude INFO : Input is above threshold: 1 existing threshold E-surfaces across 1/1 graph groups
  768. 212.25 s > field value
  769. 212.25 s > existing_esurfaces 1
  770. 212.25 s > group_count 1
  771. 212.25 s > groups_above_threshold 1
  772. 212.25 s > integrand se1l
  773. 212.25 s > span warm_up{integrand.name=se1l}
  774. 212.25 s > threshold_status above threshold
  775. 212.25 s > [2026-08-26 05:41:33.772] @process::amplitude INFO : overlap structure of group 0: [1: [0(2,3)]]
  776. 212.25 s > field value
  777. 212.25 s > span warm_up{integrand.name=se1l}
  778. 212.25 s > [2026-08-26 05:41:33.778] @process::amplitude WARNING : External state 0 ('g', PDG 21, helicity +) is off shell: p^2 = +2.5e5, expected m^2 = +0e0 (|Δ| = +2.5e5). Fixed-helicity spinor/vector/tensor external states may be ill-defined at this kinematic point.
  779. 212.25 s > field value
  780. 212.25 s > span warm_up{integrand.name=se1l_rls_shifted}
  781. 212.25 s > [2026-08-26 05:41:33.778] @process::amplitude WARNING : External state 1 ('g', PDG 21, helicity -) is off shell: p^2 = +2.5e5, expected m^2 = +0e0 (|Δ| = +2.5e5). Fixed-helicity spinor/vector/tensor external states may be ill-defined at this kinematic point.
  782. 212.25 s > field value
  783. 212.25 s > span warm_up{integrand.name=se1l_rls_shifted}
  784. 212.25 s > [2026-08-26 05:41:33.778] @process::amplitude INFO : Input is above threshold: 1 existing threshold E-surfaces across 1/1 graph groups
  785. 212.25 s > field value
  786. 212.25 s > existing_esurfaces 1
  787. 212.25 s > group_count 1
  788. 212.25 s > groups_above_threshold 1
  789. 212.25 s > integrand se1l_rls_shifted
  790. 212.25 s > span warm_up{integrand.name=se1l_rls_shifted}
  791. 212.25 s > threshold_status above threshold
  792. 212.25 s > [2026-08-26 05:41:33.779] @process::amplitude INFO : overlap structure of group 0: [1: [0(2,3)]]
  793. 212.25 s > field value
  794. 212.25 s > span warm_up{integrand.name=se1l_rls_shifted}
  795. 212.25 s > [2026-08-26 05:41:33.785] @process::amplitude WARNING : External state 0 ('g', PDG 21, helicity +) is off shell: p^2 = +2.5e5, expected m^2 = +0e0 (|Δ| = +2.5e5). Fixed-helicity spinor/vector/tensor external states may be ill-defined at this kinematic point.
  796. 212.25 s > field value
  797. 212.25 s > span warm_up{integrand.name=se1l}
  798. 212.25 s > [2026-08-26 05:41:33.785] @process::amplitude WARNING : External state 1 ('g', PDG 21, helicity -) is off shell: p^2 = +2.5e5, expected m^2 = +0e0 (|Δ| = +2.5e5). Fixed-helicity spinor/vector/tensor external states may be ill-defined at this kinematic point.
  799. 212.25 s > field value
  800. 212.25 s > span warm_up{integrand.name=se1l}
  801. 212.25 s > [2026-08-26 05:41:33.785] @process::amplitude INFO : Input is above threshold: 1 existing threshold E-surfaces across 1/1 graph groups
  802. 212.25 s > field value
  803. 212.25 s > existing_esurfaces 1
  804. 212.25 s > group_count 1
  805. 212.25 s > groups_above_threshold 1
  806. 212.25 s > integrand se1l
  807. 212.25 s > span warm_up{integrand.name=se1l}
  808. 212.25 s > threshold_status above threshold
  809. 212.25 s > [2026-08-26 05:41:33.785] @process::amplitude INFO : overlap structure of group 0: [1: [0(2,3)]]
  810. 212.25 s > field value
  811. 212.25 s > span warm_up{integrand.name=se1l}
  812. 212.25 s > [2026-08-26 05:41:33.791] @process::amplitude WARNING : External state 0 ('g', PDG 21, helicity +) is off shell: p^2 = +2.5e5, expected m^2 = +0e0 (|Δ| = +2.5e5). Fixed-helicity spinor/vector/tensor external states may be ill-defined at this kinematic point.
  813. 212.25 s > field value
  814. 212.25 s > span warm_up{integrand.name=se1l_rls_shifted}
  815. 212.25 s > [2026-08-26 05:41:33.791] @process::amplitude WARNING : External state 1 ('g', PDG 21, helicity -) is off shell: p^2 = +2.5e5, expected m^2 = +0e0 (|Δ| = +2.5e5). Fixed-helicity spinor/vector/tensor external states may be ill-defined at this kinematic point.
  816. 212.25 s > field value
  817. 212.25 s > span warm_up{integrand.name=se1l_rls_shifted}
  818. 212.25 s > [2026-08-26 05:41:33.792] @process::amplitude INFO : Input is above threshold: 1 existing threshold E-surfaces across 1/1 graph groups
  819. 212.25 s > field value
  820. 212.25 s > existing_esurfaces 1
  821. 212.25 s > group_count 1
  822. 212.25 s > groups_above_threshold 1
  823. 212.25 s > integrand se1l_rls_shifted
  824. 212.25 s > span warm_up{integrand.name=se1l_rls_shifted}
  825. 212.25 s > threshold_status above threshold
  826. 212.25 s > [2026-08-26 05:41:33.792] @process::amplitude INFO : overlap structure of group 0: [1: [0(2,3)]]
  827. 212.25 s > field value
  828. 212.25 s > span warm_up{integrand.name=se1l_rls_shifted}
  829. 212.25 s > [2026-08-26 05:41:33.798] @process::amplitude WARNING : External state 0 ('g', PDG 21, helicity +) is off shell: p^2 = +2.5e5, expected m^2 = +0e0 (|Δ| = +2.5e5). Fixed-helicity spinor/vector/tensor external states may be ill-defined at this kinematic point.
  830. 212.25 s > field value
  831. 212.25 s > span warm_up{integrand.name=se1l}
  832. 212.25 s > [2026-08-26 05:41:33.798] @process::amplitude WARNING : External state 1 ('g', PDG 21, helicity -) is off shell: p^2 = +2.5e5, expected m^2 = +0e0 (|Δ| = +2.5e5). Fixed-helicity spinor/vector/tensor external states may be ill-defined at this kinematic point.
  833. 212.25 s > field value
  834. 212.25 s > span warm_up{integrand.name=se1l}
  835. 212.25 s > [2026-08-26 05:41:33.798] @process::amplitude INFO : Input is above threshold: 1 existing threshold E-surfaces across 1/1 graph groups
  836. 212.25 s > field value
  837. 212.25 s > existing_esurfaces 1
  838. 212.25 s > group_count 1
  839. 212.25 s > groups_above_threshold 1
  840. 212.25 s > integrand se1l
  841. 212.25 s > span warm_up{integrand.name=se1l}
  842. 212.25 s > threshold_status above threshold
  843. 212.25 s > [2026-08-26 05:41:33.798] @process::amplitude INFO : overlap structure of group 0: [1: [0(2,3)]]
  844. 212.25 s > field value
  845. 212.25 s > span warm_up{integrand.name=se1l}
  846. 212.25 s > [2026-08-26 05:41:33.804] @process::amplitude WARNING : External state 0 ('g', PDG 21, helicity +) is off shell: p^2 = +2.5e5, expected m^2 = +0e0 (|Δ| = +2.5e5). Fixed-helicity spinor/vector/tensor external states may be ill-defined at this kinematic point.
  847. 212.25 s > field value
  848. 212.25 s > span warm_up{integrand.name=se1l_rls_shifted}
  849. 212.25 s > [2026-08-26 05:41:33.805] @process::amplitude WARNING : External state 1 ('g', PDG 21, helicity -) is off shell: p^2 = +2.5e5, expected m^2 = +0e0 (|Δ| = +2.5e5). Fixed-helicity spinor/vector/tensor external states may be ill-defined at this kinematic point.
  850. 212.25 s > field value
  851. 212.25 s > span warm_up{integrand.name=se1l_rls_shifted}
  852. 212.25 s > [2026-08-26 05:41:33.805] @process::amplitude INFO : Input is above threshold: 1 existing threshold E-surfaces across 1/1 graph groups
  853. 212.25 s > field value
  854. 212.25 s > existing_esurfaces 1
  855. 212.25 s > group_count 1
  856. 212.25 s > groups_above_threshold 1
  857. 212.25 s > integrand se1l_rls_shifted
  858. 212.25 s > span warm_up{integrand.name=se1l_rls_shifted}
  859. 212.25 s > threshold_status above threshold
  860. 212.25 s > [2026-08-26 05:41:33.805] @process::amplitude INFO : overlap structure of group 0: [1: [0(2,3)]]
  861. 212.25 s > field value
  862. 212.25 s > span warm_up{integrand.name=se1l_rls_shifted}
  863. 212.25 s > [2026-08-26 05:41:33.811] @process::amplitude WARNING : External state 0 ('g', PDG 21, helicity +) is off shell: p^2 = +2.5e5, expected m^2 = +0e0 (|Δ| = +2.5e5). Fixed-helicity spinor/vector/tensor external states may be ill-defined at this kinematic point.
  864. 212.25 s > field value
  865. 212.25 s > span warm_up{integrand.name=se1l}
  866. 212.25 s > [2026-08-26 05:41:33.811] @process::amplitude WARNING : External state 1 ('g', PDG 21, helicity -) is off shell: p^2 = +2.5e5, expected m^2 = +0e0 (|Δ| = +2.5e5). Fixed-helicity spinor/vector/tensor external states may be ill-defined at this kinematic point.
  867. 212.25 s > field value
  868. 212.25 s > span warm_up{integrand.name=se1l}
  869. 212.25 s > [2026-08-26 05:41:33.811] @process::amplitude INFO : Input is above threshold: 1 existing threshold E-surfaces across 1/1 graph groups
  870. 212.25 s > field value
  871. 212.25 s > existing_esurfaces 1
  872. 212.25 s > group_count 1
  873. 212.25 s > groups_above_threshold 1
  874. 212.25 s > integrand se1l
  875. 212.25 s > span warm_up{integrand.name=se1l}
  876. 212.25 s > threshold_status above threshold
  877. 212.25 s > [2026-08-26 05:41:33.811] @process::amplitude INFO : overlap structure of group 0: [1: [0(2,3)]]
  878. 212.25 s > field value
  879. 212.25 s > span warm_up{integrand.name=se1l}
  880. 212.25 s > [2026-08-26 05:41:33.818] @process::amplitude WARNING : External state 0 ('g', PDG 21, helicity +) is off shell: p^2 = +2.5e5, expected m^2 = +0e0 (|Δ| = +2.5e5). Fixed-helicity spinor/vector/tensor external states may be ill-defined at this kinematic point.
  881. 212.25 s > field value
  882. 212.25 s > span warm_up{integrand.name=se1l_rls_shifted}
  883. 212.25 s > [2026-08-26 05:41:33.818] @process::amplitude WARNING : External state 1 ('g', PDG 21, helicity -) is off shell: p^2 = +2.5e5, expected m^2 = +0e0 (|Δ| = +2.5e5). Fixed-helicity spinor/vector/tensor external states may be ill-defined at this kinematic point.
  884. 212.25 s > field value
  885. 212.25 s > span warm_up{integrand.name=se1l_rls_shifted}
  886. 212.25 s > [2026-08-26 05:41:33.818] @process::amplitude INFO : Input is above threshold: 1 existing threshold E-surfaces across 1/1 graph groups
  887. 212.25 s > field value
  888. 212.25 s > existing_esurfaces 1
  889. 212.25 s > group_count 1
  890. 212.25 s > groups_above_threshold 1
  891. 212.25 s > integrand se1l_rls_shifted
  892. 212.25 s > span warm_up{integrand.name=se1l_rls_shifted}
  893. 212.25 s > threshold_status above threshold
  894. 212.25 s > [2026-08-26 05:41:33.818] @process::amplitude INFO : overlap structure of group 0: [1: [0(2,3)]]
  895. 212.25 s > field value
  896. 212.25 s > span warm_up{integrand.name=se1l_rls_shifted}
  897. 212.25 s > [2026-08-26 05:41:33.824] @process::amplitude WARNING : External state 0 ('g', PDG 21, helicity +) is off shell: p^2 = +2.5e5, expected m^2 = +0e0 (|Δ| = +2.5e5). Fixed-helicity spinor/vector/tensor external states may be ill-defined at this kinematic point.
  898. 212.25 s > field value
  899. 212.25 s > span warm_up{integrand.name=se1l}
  900. 212.25 s > [2026-08-26 05:41:33.824] @process::amplitude WARNING : External state 1 ('g', PDG 21, helicity -) is off shell: p^2 = +2.5e5, expected m^2 = +0e0 (|Δ| = +2.5e5). Fixed-helicity spinor/vector/tensor external states may be ill-defined at this kinematic point.
  901. 212.25 s > field value
  902. 212.25 s > span warm_up{integrand.name=se1l}
  903. 212.25 s > [2026-08-26 05:41:33.824] @process::amplitude INFO : Input is above threshold: 1 existing threshold E-surfaces across 1/1 graph groups
  904. 212.25 s > field value
  905. 212.25 s > existing_esurfaces 1
  906. 212.25 s > group_count 1
  907. 212.25 s > groups_above_threshold 1
  908. 212.25 s > integrand se1l
  909. 212.25 s > span warm_up{integrand.name=se1l}
  910. 212.25 s > threshold_status above threshold
  911. 212.25 s > [2026-08-26 05:41:33.825] @process::amplitude INFO : overlap structure of group 0: [1: [0(2,3)]]
  912. 212.25 s > field value
  913. 212.25 s > span warm_up{integrand.name=se1l}
  914. 212.25 s > [2026-08-26 05:41:33.830] @process::amplitude WARNING : External state 0 ('g', PDG 21, helicity +) is off shell: p^2 = +2.5e5, expected m^2 = +0e0 (|Δ| = +2.5e5). Fixed-helicity spinor/vector/tensor external states may be ill-defined at this kinematic point.
  915. 212.25 s > field value
  916. 212.25 s > span warm_up{integrand.name=se1l_mur_shifted}
  917. 212.25 s > [2026-08-26 05:41:33.831] @process::amplitude WARNING : External state 1 ('g', PDG 21, helicity -) is off shell: p^2 = +2.5e5, expected m^2 = +0e0 (|Δ| = +2.5e5). Fixed-helicity spinor/vector/tensor external states may be ill-defined at this kinematic point.
  918. 212.25 s > field value
  919. 212.25 s > span warm_up{integrand.name=se1l_mur_shifted}
  920. 212.25 s > [2026-08-26 05:41:33.831] @process::amplitude INFO : Input is above threshold: 1 existing threshold E-surfaces across 1/1 graph groups
  921. 212.25 s > field value
  922. 212.25 s > existing_esurfaces 1
  923. 212.25 s > group_count 1
  924. 212.25 s > groups_above_threshold 1
  925. 212.25 s > integrand se1l_mur_shifted
  926. 212.25 s > span warm_up{integrand.name=se1l_mur_shifted}
  927. 212.25 s > threshold_status above threshold
  928. 212.25 s > [2026-08-26 05:41:33.831] @process::amplitude INFO : overlap structure of group 0: [1: [0(2,3)]]
  929. 212.25 s > field value
  930. 212.25 s > span warm_up{integrand.name=se1l_mur_shifted}
  931. 212.25 s > [2026-08-26 05:41:33.837] @process::amplitude WARNING : External state 0 ('g', PDG 21, helicity +) is off shell: p^2 = +2.5e5, expected m^2 = +0e0 (|Δ| = +2.5e5). Fixed-helicity spinor/vector/tensor external states may be ill-defined at this kinematic point.
  932. 212.25 s > field value
  933. 212.25 s > span warm_up{integrand.name=se1l}
  934. 212.25 s > [2026-08-26 05:41:33.837] @process::amplitude WARNING : External state 1 ('g', PDG 21, helicity -) is off shell: p^2 = +2.5e5, expected m^2 = +0e0 (|Δ| = +2.5e5). Fixed-helicity spinor/vector/tensor external states may be ill-defined at this kinematic point.
  935. 212.25 s > field value
  936. 212.25 s > span warm_up{integrand.name=se1l}
  937. 212.25 s > [2026-08-26 05:41:33.837] @process::amplitude INFO : Input is above threshold: 1 existing threshold E-surfaces across 1/1 graph groups
  938. 212.25 s > field value
  939. 212.25 s > existing_esurfaces 1
  940. 212.25 s > group_count 1
  941. 212.25 s > groups_above_threshold 1
  942. 212.25 s > integrand se1l
  943. 212.25 s > span warm_up{integrand.name=se1l}
  944. 212.25 s > threshold_status above threshold
  945. 212.25 s > [2026-08-26 05:41:33.837] @process::amplitude INFO : overlap structure of group 0: [1: [0(2,3)]]
  946. 212.25 s > field value
  947. 212.25 s > span warm_up{integrand.name=se1l}
  948. 212.25 s > [2026-08-26 05:41:33.843] @process::amplitude WARNING : External state 0 ('g', PDG 21, helicity +) is off shell: p^2 = +2.5e5, expected m^2 = +0e0 (|Δ| = +2.5e5). Fixed-helicity spinor/vector/tensor external states may be ill-defined at this kinematic point.
  949. 212.25 s > field value
  950. 212.25 s > span warm_up{integrand.name=se1l_mur_shifted}
  951. 212.25 s > [2026-08-26 05:41:33.843] @process::amplitude WARNING : External state 1 ('g', PDG 21, helicity -) is off shell: p^2 = +2.5e5, expected m^2 = +0e0 (|Δ| = +2.5e5). Fixed-helicity spinor/vector/tensor external states may be ill-defined at this kinematic point.
  952. 212.25 s > field value
  953. 212.25 s > span warm_up{integrand.name=se1l_mur_shifted}
  954. 212.25 s > [2026-08-26 05:41:33.844] @process::amplitude INFO : Input is above threshold: 1 existing threshold E-surfaces across 1/1 graph groups
  955. 212.25 s > field value
  956. 212.25 s > existing_esurfaces 1
  957. 212.25 s > group_count 1
  958. 212.25 s > groups_above_threshold 1
  959. 212.25 s > integrand se1l_mur_shifted
  960. 212.25 s > span warm_up{integrand.name=se1l_mur_shifted}
  961. 212.25 s > threshold_status above threshold
  962. 212.25 s > [2026-08-26 05:41:33.844] @process::amplitude INFO : overlap structure of group 0: [1: [0(2,3)]]
  963. 212.25 s > field value
  964. 212.25 s > span warm_up{integrand.name=se1l_mur_shifted}
  965. 212.25 s > [2026-08-26 05:41:33.850] @process::amplitude WARNING : External state 0 ('g', PDG 21, helicity +) is off shell: p^2 = +2.5e5, expected m^2 = +0e0 (|Δ| = +2.5e5). Fixed-helicity spinor/vector/tensor external states may be ill-defined at this kinematic point.
  966. 212.25 s > field value
  967. 212.25 s > span warm_up{integrand.name=se1l}
  968. 212.25 s > [2026-08-26 05:41:33.850] @process::amplitude WARNING : External state 1 ('g', PDG 21, helicity -) is off shell: p^2 = +2.5e5, expected m^2 = +0e0 (|Δ| = +2.5e5). Fixed-helicity spinor/vector/tensor external states may be ill-defined at this kinematic point.
  969. 212.25 s > field value
  970. 212.25 s > span warm_up{integrand.name=se1l}
  971. 212.25 s > [2026-08-26 05:41:33.850] @process::amplitude INFO : Input is above threshold: 1 existing threshold E-surfaces across 1/1 graph groups
  972. 212.25 s > field value
  973. 212.25 s > existing_esurfaces 1
  974. 212.25 s > group_count 1
  975. 212.25 s > groups_above_threshold 1
  976. 212.25 s > integrand se1l
  977. 212.25 s > span warm_up{integrand.name=se1l}
  978. 212.25 s > threshold_status above threshold
  979. 212.25 s > [2026-08-26 05:41:33.850] @process::amplitude INFO : overlap structure of group 0: [1: [0(2,3)]]
  980. 212.25 s > field value
  981. 212.25 s > span warm_up{integrand.name=se1l}
  982. 212.25 s > [2026-08-26 05:41:33.856] @process::amplitude WARNING : External state 0 ('g', PDG 21, helicity +) is off shell: p^2 = +2.5e5, expected m^2 = +0e0 (|Δ| = +2.5e5). Fixed-helicity spinor/vector/tensor external states may be ill-defined at this kinematic point.
  983. 212.25 s > field value
  984. 212.25 s > span warm_up{integrand.name=se1l_mur_shifted}
  985. 212.25 s > [2026-08-26 05:41:33.856] @process::amplitude WARNING : External state 1 ('g', PDG 21, helicity -) is off shell: p^2 = +2.5e5, expected m^2 = +0e0 (|Δ| = +2.5e5). Fixed-helicity spinor/vector/tensor external states may be ill-defined at this kinematic point.
  986. 212.25 s > field value
  987. 212.25 s > span warm_up{integrand.name=se1l_mur_shifted}
  988. 212.25 s > [2026-08-26 05:41:33.856] @process::amplitude INFO : Input is above threshold: 1 existing threshold E-surfaces across 1/1 graph groups
  989. 212.25 s > field value
  990. 212.25 s > existing_esurfaces 1
  991. 212.25 s > group_count 1
  992. 212.25 s > groups_above_threshold 1
  993. 212.25 s > integrand se1l_mur_shifted
  994. 212.25 s > span warm_up{integrand.name=se1l_mur_shifted}
  995. 212.25 s > threshold_status above threshold
  996. 212.25 s > [2026-08-26 05:41:33.857] @process::amplitude INFO : overlap structure of group 0: [1: [0(2,3)]]
  997. 212.25 s > field value
  998. 212.25 s > span warm_up{integrand.name=se1l_mur_shifted}
  999. 212.25 s > [2026-08-26 05:41:33.863] @process::amplitude WARNING : External state 0 ('g', PDG 21, helicity +) is off shell: p^2 = +2.5e5, expected m^2 = +0e0 (|Δ| = +2.5e5). Fixed-helicity spinor/vector/tensor external states may be ill-defined at this kinematic point.
  1000. 212.25 s > field value
  1001. 212.25 s > span warm_up{integrand.name=se1l}
  1002. 212.25 s > [2026-08-26 05:41:33.863] @process::amplitude WARNING : External state 1 ('g', PDG 21, helicity -) is off shell: p^2 = +2.5e5, expected m^2 = +0e0 (|Δ| = +2.5e5). Fixed-helicity spinor/vector/tensor external states may be ill-defined at this kinematic point.
  1003. 212.25 s > field value
  1004. 212.25 s > span warm_up{integrand.name=se1l}
  1005. 212.25 s > [2026-08-26 05:41:33.863] @process::amplitude INFO : Input is above threshold: 1 existing threshold E-surfaces across 1/1 graph groups
  1006. 212.25 s > field value
  1007. 212.25 s > existing_esurfaces 1
  1008. 212.25 s > group_count 1
  1009. 212.25 s > groups_above_threshold 1
  1010. 212.25 s > integrand se1l
  1011. 212.25 s > span warm_up{integrand.name=se1l}
  1012. 212.25 s > threshold_status above threshold
  1013. 212.25 s > [2026-08-26 05:41:33.863] @process::amplitude INFO : overlap structure of group 0: [1: [0(2,3)]]
  1014. 212.25 s > field value
  1015. 212.25 s > span warm_up{integrand.name=se1l}
  1016. 212.25 s > [2026-08-26 05:41:33.869] @process::amplitude WARNING : External state 0 ('g', PDG 21, helicity +) is off shell: p^2 = +2.5e5, expected m^2 = +0e0 (|Δ| = +2.5e5). Fixed-helicity spinor/vector/tensor external states may be ill-defined at this kinematic point.
  1017. 212.25 s > field value
  1018. 212.25 s > span warm_up{integrand.name=se1l_mur_shifted}
  1019. 212.25 s > [2026-08-26 05:41:33.869] @process::amplitude WARNING : External state 1 ('g', PDG 21, helicity -) is off shell: p^2 = +2.5e5, expected m^2 = +0e0 (|Δ| = +2.5e5). Fixed-helicity spinor/vector/tensor external states may be ill-defined at this kinematic point.
  1020. 212.25 s > field value
  1021. 212.25 s > span warm_up{integrand.name=se1l_mur_shifted}
  1022. 212.25 s > [2026-08-26 05:41:33.870] @process::amplitude INFO : Input is above threshold: 1 existing threshold E-surfaces across 1/1 graph groups
  1023. 212.25 s > field value
  1024. 212.25 s > existing_esurfaces 1
  1025. 212.25 s > group_count 1
  1026. 212.25 s > groups_above_threshold 1
  1027. 212.25 s > integrand se1l_mur_shifted
  1028. 212.25 s > span warm_up{integrand.name=se1l_mur_shifted}
  1029. 212.25 s > threshold_status above threshold
  1030. 212.25 s > [2026-08-26 05:41:33.870] @process::amplitude INFO : overlap structure of group 0: [1: [0(2,3)]]
  1031. 212.25 s > field value
  1032. 212.25 s > span warm_up{integrand.name=se1l_mur_shifted}
  1033. 212.25 s > [2026-08-26 05:41:33.876] @process::amplitude WARNING : External state 0 ('g', PDG 21, helicity +) is off shell: p^2 = +2.5e5, expected m^2 = +0e0 (|Δ| = +2.5e5). Fixed-helicity spinor/vector/tensor external states may be ill-defined at this kinematic point.
  1034. 212.25 s > field value
  1035. 212.25 s > span warm_up{integrand.name=se1l}
  1036. 212.25 s > [2026-08-26 05:41:33.876] @process::amplitude WARNING : External state 1 ('g', PDG 21, helicity -) is off shell: p^2 = +2.5e5, expected m^2 = +0e0 (|Δ| = +2.5e5). Fixed-helicity spinor/vector/tensor external states may be ill-defined at this kinematic point.
  1037. 212.25 s > field value
  1038. 212.25 s > span warm_up{integrand.name=se1l}
  1039. 212.25 s > [2026-08-26 05:41:33.876] @process::amplitude INFO : Input is above threshold: 1 existing threshold E-surfaces across 1/1 graph groups
  1040. 212.25 s > field value
  1041. 212.25 s > existing_esurfaces 1
  1042. 212.25 s > group_count 1
  1043. 212.25 s > groups_above_threshold 1
  1044. 212.25 s > integrand se1l
  1045. 212.25 s > span warm_up{integrand.name=se1l}
  1046. 212.25 s > threshold_status above threshold
  1047. 212.25 s > [2026-08-26 05:41:33.876] @process::amplitude INFO : overlap structure of group 0: [1: [0(2,3)]]
  1048. 212.25 s > field value
  1049. 212.25 s > span warm_up{integrand.name=se1l}
  1050. 212.25 s > [2026-08-26 05:41:33.883] @process::amplitude WARNING : External state 0 ('g', PDG 21, helicity +) is off shell: p^2 = +2.5e5, expected m^2 = +0e0 (|Δ| = +2.5e5). Fixed-helicity spinor/vector/tensor external states may be ill-defined at this kinematic point.
  1051. 212.25 s > field value
  1052. 212.25 s > span warm_up{integrand.name=se1l_mur_shifted}
  1053. 212.25 s > [2026-08-26 05:41:33.883] @process::amplitude WARNING : External state 1 ('g', PDG 21, helicity -) is off shell: p^2 = +2.5e5, expected m^2 = +0e0 (|Δ| = +2.5e5). Fixed-helicity spinor/vector/tensor external states may be ill-defined at this kinematic point.
  1054. 212.25 s > field value
  1055. 212.25 s > span warm_up{integrand.name=se1l_mur_shifted}
  1056. 212.25 s > [2026-08-26 05:41:33.883] @process::amplitude INFO : Input is above threshold: 1 existing threshold E-surfaces across 1/1 graph groups
  1057. 212.25 s > field value
  1058. 212.25 s > existing_esurfaces 1
  1059. 212.25 s > group_count 1
  1060. 212.25 s > groups_above_threshold 1
  1061. 212.25 s > integrand se1l_mur_shifted
  1062. 212.25 s > span warm_up{integrand.name=se1l_mur_shifted}
  1063. 212.25 s > threshold_status above threshold
  1064. 212.25 s > [2026-08-26 05:41:33.883] @process::amplitude INFO : overlap structure of group 0: [1: [0(2,3)]]
  1065. 212.25 s > field value
  1066. 212.25 s > span warm_up{integrand.name=se1l_mur_shifted}
  1067. 212.25 s > [2026-08-26 05:41:33.889] @process::amplitude WARNING : External state 0 ('g', PDG 21, helicity +) is off shell: p^2 = +2.5e5, expected m^2 = +0e0 (|Δ| = +2.5e5). Fixed-helicity spinor/vector/tensor external states may be ill-defined at this kinematic point.
  1068. 212.25 s > field value
  1069. 212.25 s > span warm_up{integrand.name=se1l}
  1070. 212.25 s > [2026-08-26 05:41:33.889] @process::amplitude WARNING : External state 1 ('g', PDG 21, helicity -) is off shell: p^2 = +2.5e5, expected m^2 = +0e0 (|Δ| = +2.5e5). Fixed-helicity spinor/vector/tensor external states may be ill-defined at this kinematic point.
  1071. 212.25 s > field value
  1072. 212.25 s > span warm_up{integrand.name=se1l}
  1073. 212.25 s > [2026-08-26 05:41:33.889] @process::amplitude INFO : Input is above threshold: 1 existing threshold E-surfaces across 1/1 graph groups
  1074. 212.25 s > field value
  1075. 212.25 s > existing_esurfaces 1
  1076. 212.25 s > group_count 1
  1077. 212.25 s > groups_above_threshold 1
  1078. 212.25 s > integrand se1l
  1079. 212.25 s > span warm_up{integrand.name=se1l}
  1080. 212.25 s > threshold_status above threshold
  1081. 212.25 s > [2026-08-26 05:41:33.889] @process::amplitude INFO : overlap structure of group 0: [1: [0(2,3)]]
  1082. 212.25 s > field value
  1083. 212.25 s > span warm_up{integrand.name=se1l}
  1084. 212.25 s > [2026-08-26 05:41:33.895] @process::amplitude WARNING : External state 0 ('g', PDG 21, helicity +) is off shell: p^2 = +2.5e5, expected m^2 = +0e0 (|Δ| = +2.5e5). Fixed-helicity spinor/vector/tensor external states may be ill-defined at this kinematic point.
  1085. 212.25 s > field value
  1086. 212.25 s > span warm_up{integrand.name=se1l_mur_shifted}
  1087. 212.25 s > [2026-08-26 05:41:33.895] @process::amplitude WARNING : External state 1 ('g', PDG 21, helicity -) is off shell: p^2 = +2.5e5, expected m^2 = +0e0 (|Δ| = +2.5e5). Fixed-helicity spinor/vector/tensor external states may be ill-defined at this kinematic point.
  1088. 212.25 s > field value
  1089. 212.25 s > span warm_up{integrand.name=se1l_mur_shifted}
  1090. 212.25 s > [2026-08-26 05:41:33.896] @process::amplitude INFO : Input is above threshold: 1 existing threshold E-surfaces across 1/1 graph groups
  1091. 212.25 s > field value
  1092. 212.25 s > existing_esurfaces 1
  1093. 212.25 s > group_count 1
  1094. 212.25 s > groups_above_threshold 1
  1095. 212.25 s > integrand se1l_mur_shifted
  1096. 212.25 s > span warm_up{integrand.name=se1l_mur_shifted}
  1097. 212.25 s > threshold_status above threshold
  1098. 212.25 s > [2026-08-26 05:41:33.896] @process::amplitude INFO : overlap structure of group 0: [1: [0(2,3)]]
  1099. 212.25 s > field value
  1100. 212.25 s > span warm_up{integrand.name=se1l_mur_shifted}
  1101. 212.25 s > [2026-08-26 05:41:33.902] @process::amplitude WARNING : External state 0 ('g', PDG 21, helicity +) is off shell: p^2 = +2.5e5, expected m^2 = +0e0 (|Δ| = +2.5e5). Fixed-helicity spinor/vector/tensor external states may be ill-defined at this kinematic point.
  1102. 212.25 s > field value
  1103. 212.25 s > span warm_up{integrand.name=se1l}
  1104. 212.25 s > [2026-08-26 05:41:33.902] @process::amplitude WARNING : External state 1 ('g', PDG 21, helicity -) is off shell: p^2 = +2.5e5, expected m^2 = +0e0 (|Δ| = +2.5e5). Fixed-helicity spinor/vector/tensor external states may be ill-defined at this kinematic point.
  1105. 212.25 s > field value
  1106. 212.25 s > span warm_up{integrand.name=se1l}
  1107. 212.25 s > [2026-08-26 05:41:33.902] @process::amplitude INFO : Input is above threshold: 1 existing threshold E-surfaces across 1/1 graph groups
  1108. 212.25 s > field value
  1109. 212.25 s > existing_esurfaces 1
  1110. 212.25 s > group_count 1
  1111. 212.25 s > groups_above_threshold 1
  1112. 212.25 s > integrand se1l
  1113. 212.25 s > span warm_up{integrand.name=se1l}
  1114. 212.25 s > threshold_status above threshold
  1115. 212.25 s > [2026-08-26 05:41:33.902] @process::amplitude INFO : overlap structure of group 0: [1: [0(2,3)]]
  1116. 212.25 s > field value
  1117. 212.25 s > span warm_up{integrand.name=se1l}
  1118. 212.25 s > [2026-08-26 05:41:33.908] @process::amplitude WARNING : External state 0 ('g', PDG 21, helicity +) is off shell: p^2 = +2.5e5, expected m^2 = +0e0 (|Δ| = +2.5e5). Fixed-helicity spinor/vector/tensor external states may be ill-defined at this kinematic point.
  1119. 212.25 s > field value
  1120. 212.25 s > span warm_up{integrand.name=se1l_mur_shifted}
  1121. 212.25 s > [2026-08-26 05:41:33.908] @process::amplitude WARNING : External state 1 ('g', PDG 21, helicity -) is off shell: p^2 = +2.5e5, expected m^2 = +0e0 (|Δ| = +2.5e5). Fixed-helicity spinor/vector/tensor external states may be ill-defined at this kinematic point.
  1122. 212.25 s > field value
  1123. 212.25 s > span warm_up{integrand.name=se1l_mur_shifted}
  1124. 212.25 s > [2026-08-26 05:41:33.909] @process::amplitude INFO : Input is above threshold: 1 existing threshold E-surfaces across 1/1 graph groups
  1125. 212.25 s > field value
  1126. 212.25 s > existing_esurfaces 1
  1127. 212.25 s > group_count 1
  1128. 212.25 s > groups_above_threshold 1
  1129. 212.25 s > integrand se1l_mur_shifted
  1130. 212.25 s > span warm_up{integrand.name=se1l_mur_shifted}
  1131. 212.25 s > threshold_status above threshold
  1132. 212.25 s > [2026-08-26 05:41:33.909] @process::amplitude INFO : overlap structure of group 0: [1: [0(2,3)]]
  1133. 212.25 s > field value
  1134. 212.25 s > span warm_up{integrand.name=se1l_mur_shifted}
  1135. 212.25 s > [2026-08-26 05:41:33.915] @process::amplitude WARNING : External state 0 ('g', PDG 21, helicity +) is off shell: p^2 = +2.5e5, expected m^2 = +0e0 (|Δ| = +2.5e5). Fixed-helicity spinor/vector/tensor external states may be ill-defined at this kinematic point.
  1136. 212.25 s > field value
  1137. 212.25 s > span warm_up{integrand.name=se1l}
  1138. 212.25 s > [2026-08-26 05:41:33.915] @process::amplitude WARNING : External state 1 ('g', PDG 21, helicity -) is off shell: p^2 = +2.5e5, expected m^2 = +0e0 (|Δ| = +2.5e5). Fixed-helicity spinor/vector/tensor external states may be ill-defined at this kinematic point.
  1139. 212.25 s > field value
  1140. 212.25 s > span warm_up{integrand.name=se1l}
  1141. 212.25 s > [2026-08-26 05:41:33.915] @process::amplitude INFO : Input is above threshold: 1 existing threshold E-surfaces across 1/1 graph groups
  1142. 212.25 s > field value
  1143. 212.25 s > existing_esurfaces 1
  1144. 212.25 s > group_count 1
  1145. 212.25 s > groups_above_threshold 1
  1146. 212.25 s > integrand se1l
  1147. 212.25 s > span warm_up{integrand.name=se1l}
  1148. 212.25 s > threshold_status above threshold
  1149. 212.25 s > [2026-08-26 05:41:33.915] @process::amplitude INFO : overlap structure of group 0: [1: [0(2,3)]]
  1150. 212.25 s > field value
  1151. 212.25 s > span warm_up{integrand.name=se1l}
  1152. 212.25 s > [2026-08-26 05:41:33.921] @process::amplitude WARNING : External state 0 ('g', PDG 21, helicity +) is off shell: p^2 = +2.5e5, expected m^2 = +0e0 (|Δ| = +2.5e5). Fixed-helicity spinor/vector/tensor external states may be ill-defined at this kinematic point.
  1153. 212.25 s > field value
  1154. 212.25 s > span warm_up{integrand.name=se1l_mur_shifted}
  1155. 212.25 s > [2026-08-26 05:41:33.921] @process::amplitude WARNING : External state 1 ('g', PDG 21, helicity -) is off shell: p^2 = +2.5e5, expected m^2 = +0e0 (|Δ| = +2.5e5). Fixed-helicity spinor/vector/tensor external states may be ill-defined at this kinematic point.
  1156. 212.25 s > field value
  1157. 212.25 s > span warm_up{integrand.name=se1l_mur_shifted}
  1158. 212.25 s > [2026-08-26 05:41:33.922] @process::amplitude INFO : Input is above threshold: 1 existing threshold E-surfaces across 1/1 graph groups
  1159. 212.25 s > field value
  1160. 212.25 s > existing_esurfaces 1
  1161. 212.25 s > group_count 1
  1162. 212.25 s > groups_above_threshold 1
  1163. 212.25 s > integrand se1l_mur_shifted
  1164. 212.25 s > span warm_up{integrand.name=se1l_mur_shifted}
  1165. 212.25 s > threshold_status above threshold
  1166. 212.25 s > [2026-08-26 05:41:33.922] @process::amplitude INFO : overlap structure of group 0: [1: [0(2,3)]]
  1167. 212.25 s > field value
  1168. 212.25 s > span warm_up{integrand.name=se1l_mur_shifted}
  1169. 212.25 s > [2026-08-26 05:41:33.928] @process::amplitude WARNING : External state 0 ('g', PDG 21, helicity +) is off shell: p^2 = +2.5e5, expected m^2 = +0e0 (|Δ| = +2.5e5). Fixed-helicity spinor/vector/tensor external states may be ill-defined at this kinematic point.
  1170. 212.25 s > field value
  1171. 212.25 s > span warm_up{integrand.name=se1l}
  1172. 212.25 s > [2026-08-26 05:41:33.928] @process::amplitude WARNING : External state 1 ('g', PDG 21, helicity -) is off shell: p^2 = +2.5e5, expected m^2 = +0e0 (|Δ| = +2.5e5). Fixed-helicity spinor/vector/tensor external states may be ill-defined at this kinematic point.
  1173. 212.25 s > field value
  1174. 212.25 s > span warm_up{integrand.name=se1l}
  1175. 212.25 s > [2026-08-26 05:41:33.929] @process::amplitude INFO : Input is above threshold: 1 existing threshold E-surfaces across 1/1 graph groups
  1176. 212.25 s > field value
  1177. 212.25 s > existing_esurfaces 1
  1178. 212.25 s > group_count 1
  1179. 212.25 s > groups_above_threshold 1
  1180. 212.25 s > integrand se1l
  1181. 212.25 s > span warm_up{integrand.name=se1l}
  1182. 212.25 s > threshold_status above threshold
  1183. 212.25 s > [2026-08-26 05:41:33.929] @process::amplitude INFO : overlap structure of group 0: [1: [0(2,3)]]
  1184. 212.25 s > field value
  1185. 212.25 s > span warm_up{integrand.name=se1l}
  1186. 212.25 s > [2026-08-26 05:41:33.935] @process::amplitude WARNING : External state 0 ('g', PDG 21, helicity +) is off shell: p^2 = +2.5e5, expected m^2 = +0e0 (|Δ| = +2.5e5). Fixed-helicity spinor/vector/tensor external states may be ill-defined at this kinematic point.
  1187. 212.25 s > field value
  1188. 212.25 s > span warm_up{integrand.name=se1l_mur_shifted}
  1189. 212.25 s > [2026-08-26 05:41:33.935] @process::amplitude WARNING : External state 1 ('g', PDG 21, helicity -) is off shell: p^2 = +2.5e5, expected m^2 = +0e0 (|Δ| = +2.5e5). Fixed-helicity spinor/vector/tensor external states may be ill-defined at this kinematic point.
  1190. 212.25 s > field value
  1191. 212.25 s > span warm_up{integrand.name=se1l_mur_shifted}
  1192. 212.25 s > [2026-08-26 05:41:33.935] @process::amplitude INFO : Input is above threshold: 1 existing threshold E-surfaces across 1/1 graph groups
  1193. 212.25 s > field value
  1194. 212.25 s > existing_esurfaces 1
  1195. 212.25 s > group_count 1
  1196. 212.25 s > groups_above_threshold 1
  1197. 212.25 s > integrand se1l_mur_shifted
  1198. 212.25 s > span warm_up{integrand.name=se1l_mur_shifted}
  1199. 212.25 s > threshold_status above threshold
  1200. 212.25 s > [2026-08-26 05:41:33.935] @process::amplitude INFO : overlap structure of group 0: [1: [0(2,3)]]
  1201. 212.25 s > field value
  1202. 212.25 s > span warm_up{integrand.name=se1l_mur_shifted}
  1203. 212.25 s > [2026-08-26 05:41:33.942] @process::amplitude WARNING : External state 0 ('g', PDG 21, helicity +) is off shell: p^2 = +2.5e5, expected m^2 = +0e0 (|Δ| = +2.5e5). Fixed-helicity spinor/vector/tensor external states may be ill-defined at this kinematic point.
  1204. 212.25 s > field value
  1205. 212.25 s > span warm_up{integrand.name=se1l}
  1206. 212.25 s > [2026-08-26 05:41:33.942] @process::amplitude WARNING : External state 1 ('g', PDG 21, helicity -) is off shell: p^2 = +2.5e5, expected m^2 = +0e0 (|Δ| = +2.5e5). Fixed-helicity spinor/vector/tensor external states may be ill-defined at this kinematic point.
  1207. 212.25 s > field value
  1208. 212.25 s > span warm_up{integrand.name=se1l}
  1209. 212.25 s > [2026-08-26 05:41:33.942] @process::amplitude INFO : Input is above threshold: 1 existing threshold E-surfaces across 1/1 graph groups
  1210. 212.25 s > field value
  1211. 212.25 s > existing_esurfaces 1
  1212. 212.25 s > group_count 1
  1213. 212.25 s > groups_above_threshold 1
  1214. 212.25 s > integrand se1l
  1215. 212.25 s > span warm_up{integrand.name=se1l}
  1216. 212.25 s > threshold_status above threshold
  1217. 212.25 s > [2026-08-26 05:41:33.942] @process::amplitude INFO : overlap structure of group 0: [1: [0(2,3)]]
  1218. 212.25 s > field value
  1219. 212.25 s > span warm_up{integrand.name=se1l}
  1220. 212.25 s > [2026-08-26 05:41:33.948] @process::amplitude WARNING : External state 0 ('g', PDG 21, helicity +) is off shell: p^2 = +2.5e5, expected m^2 = +0e0 (|Δ| = +2.5e5). Fixed-helicity spinor/vector/tensor external states may be ill-defined at this kinematic point.
  1221. 212.25 s > field value
  1222. 212.25 s > span warm_up{integrand.name=se1l_mur_shifted}
  1223. 212.25 s > [2026-08-26 05:41:33.948] @process::amplitude WARNING : External state 1 ('g', PDG 21, helicity -) is off shell: p^2 = +2.5e5, expected m^2 = +0e0 (|Δ| = +2.5e5). Fixed-helicity spinor/vector/tensor external states may be ill-defined at this kinematic point.
  1224. 212.25 s > field value
  1225. 212.25 s > span warm_up{integrand.name=se1l_mur_shifted}
  1226. 212.25 s > [2026-08-26 05:41:33.949] @process::amplitude INFO : Input is above threshold: 1 existing threshold E-surfaces across 1/1 graph groups
  1227. 212.25 s > field value
  1228. 212.25 s > existing_esurfaces 1
  1229. 212.25 s > group_count 1
  1230. 212.25 s > groups_above_threshold 1
  1231. 212.25 s > integrand se1l_mur_shifted
  1232. 212.25 s > span warm_up{integrand.name=se1l_mur_shifted}
  1233. 212.25 s > threshold_status above threshold
  1234. 212.25 s > [2026-08-26 05:41:33.949] @process::amplitude INFO : overlap structure of group 0: [1: [0(2,3)]]
  1235. 212.25 s > field value
  1236. 212.25 s > span warm_up{integrand.name=se1l_mur_shifted}
  1237. 212.25 s > The application panicked (crashed).
  1238. 212.25 s > Message: Integrated UV case failed: se1l
  1239. 212.25 s > Location: tests/tests/uv.rs:1068
  1240. 212.25 s >
  1241. 212.25 s > ━━━━━━━━━━━━━━━━━━━━━━━━━━━━━━━━━━ BACKTRACE ━━━━━━━━━━━━━━━━━━━━━━━━━━━━━━━━━━━
  1242. 212.25 s > 1: <color_eyre[51793ea62743adbd]::config::PanicHook>::panic_report<unknown>
  1243. 212.25 s > at <unknown source file>:<unknown line>
  1244. 212.25 s > 2: <color_eyre[51793ea62743adbd]::config::PanicHook>::into_panic_hook::{closure#0}<unknown>
  1245. 212.25 s > at <unknown source file>:<unknown line>
  1246. 212.25 s > 3: std[bcb96dfbba0ab899]::panicking::panic_with_hook<unknown>
  1247. 212.25 s > at <unknown source file>:<unknown line>
  1248. 212.25 s > 4: std[bcb96dfbba0ab899]::panicking::panic_handler::{closure#0}<unknown>
  1249. 212.25 s > at <unknown source file>:<unknown line>
  1250. 212.25 s > 5: std[bcb96dfbba0ab899]::sys::backtrace::__rust_end_short_backtrace::<std[bcb96dfbba0ab899]::panicking::panic_handler::{closure#0}, !><unknown>
  1251. 212.25 s > at <unknown source file>:<unknown line>
  1252. 212.25 s > 6: __rustc[6c289b9f9c454d21]::rust_begin_unwind<unknown>
  1253. 212.25 s > at <unknown source file>:<unknown line>
  1254. 212.25 s > 7: core[940e698046960fd5]::panicking::panic_fmt<unknown>
  1255. 212.25 s > at <unknown source file>:<unknown line>
  1256. 212.25 s > 8: uv[52cf2b63f0104e31]::run_single_integrated_uv_case<unknown>
  1257. 212.25 s > at <unknown source file>:<unknown line>
  1258. 212.25 s > 9: <uv[52cf2b63f0104e31]::se1l_uv::{closure#0} as core[940e698046960fd5]::ops::function::FnOnce<()>>::call_once<unknown>
  1259. 212.25 s > at <unknown source file>:<unknown line>
  1260. 212.25 s > 10: test[75d6903177b1d7e9]::__rust_begin_short_backtrace::<core[940e698046960fd5]::result::Result<(), alloc[2ea6bcb46fca0c42]::string::String>, fn() -> core[940e698046960fd5]::result::Result<(), alloc[2ea6bcb46fca0c42]::string::String>><unknown>
  1261. 212.25 s > at <unknown source file>:<unknown line>
  1262. 212.25 s > 11: test[75d6903177b1d7e9]::run_test::{closure#0}<unknown>
  1263. 212.25 s > at <unknown source file>:<unknown line>
  1264. 212.25 s > 12: std[bcb96dfbba0ab899]::sys::backtrace::__rust_begin_short_backtrace::<test[75d6903177b1d7e9]::run_test::{closure#1}, ()><unknown>
  1265. 212.25 s > at <unknown source file>:<unknown line>
  1266. 212.25 s > 13: <std[bcb96dfbba0ab899]::thread::lifecycle::spawn_unchecked<test[75d6903177b1d7e9]::run_test::{closure#1}, ()>::{closure#1} as core[940e698046960fd5]::ops::function::FnOnce<()>>::call_once::{shim:vtable#0}<unknown>
  1267. 212.25 s > at <unknown source file>:<unknown line>
  1268. 212.25 s > 14: <std[bcb96dfbba0ab899]::sys::thread::unix::Thread>::new::thread_start<unknown>
  1269. 212.25 s > at <unknown source file>:<unknown line>
  1270. 212.25 s > 15: start_thread<unknown>
  1271. 212.25 s > at <unknown source file>:<unknown line>
  1272. 212.25 s > 16: __clone3<unknown>
  1273. 212.25 s > at <unknown source file>:<unknown line>
  1274. 212.25 s >
  1275. 212.25 s > Run with COLORBT_SHOW_HIDDEN=1 environment variable to disable frame filtering.
  1276. 212.25 s > Run with RUST_BACKTRACE=full to include source snippets.
  1277. 212.25 s >
  1278. 212.25 s > error: test run failed
  1279. 212.25 s >
  1280. 212.25 s > ========== nextest test summary ==========
  1281. 212.25 s > report: target/nextest/ci_gammaloop/junit.xml
  1282. 212.25 s > tests: 106, failures: 9, errors: 0
  1283. 212.25 s >
  1284. 212.25 s > 1. gammaloop-integration-tests::test_runs::approach::approach_momentum_space_reports_incomplete_triplet_cleanly
  1285. 212.25 s > failure: test failure with exit code 101
  1286. 212.25 s > system-out
  1287. 212.25 s > running 1 test
  1288. 212.25 s > test approach::approach_momentum_space_reports_incomplete_triplet_cleanly ... FAILED
  1289. 212.25 s >
  1290. 212.25 s > failures:
  1291. 212.25 s >
  1292. 212.25 s > failures:
  1293. 212.25 s > approach::approach_momentum_space_reports_incomplete_triplet_cleanly
  1294. 212.25 s >
  1295. 212.25 s > test result: FAILED. 0 passed; 1 failed; 0 ignored; 0 measured; 82 filtered out; finished in 0.73s
  1296. 212.25 s > system-err
  1297. 212.25 s > [2026-08-26 05:39:09.631] @gammaloop_api::se... INFO : Running command import model scalars-default.json
  1298. 212.25 s > [2026-08-26 05:39:09.631] @import::model INFO : Loading built-in JSON model scalars-default
  1299. 212.25 s > [2026-08-26 05:39:09.636] @gammalooprs::model INFO : The following 2 external parameters were forced to zero by the restriction card:
  1300. 212.25 s > width_scalar_1, width_scalar_2
  1301. 212.25 s > [2026-08-26 05:39:09.637] @gammaloop_api::se... INFO : Running command remove processes
  1302. 212.25 s > [2026-08-26 05:39:09.638] @gammaloop_api::se... INFO : Running command generate amp scalar_1 > scalar_0 scalar_0 [{1}] --allowed-vertex-interactions V_3_SCALAR_022 V_3_SCALAR_122 -p triangle -i scalar_tri
  1303. 212.25 s > [2026-08-26 05:39:09.639] @feyngen::diagram_... INFO : 0s | Δ=0s | Starting Feynman graph generation with Symbolica...
  1304. 212.25 s > [2026-08-26 05:39:09.639] @feyngen::diagram_... INFO : 0s | Δ=0s | Number of graphs resulting from Symbolica generation: 1
  1305. 212.25 s > [2026-08-26 05:39:09.640] @feyngen::diagram_... INFO : 0s | Δ=0s | Number of graphs retained after removal of vetoed topologies: 1
  1306. 212.25 s > [2026-08-26 05:39:09.641] @feyngen::diagram_... INFO : 0s | Δ=0s | Number of graphs after vertex info assignment: 1
  1307. 212.25 s > [2026-08-26 05:39:09.641] @feyngen::diagram_... INFO : 0s | Δ=0s | Number of graphs after all complete graphs filters are applied: 1
  1308. 212.25 s > [2026-08-26 05:39:09.644] @feyngen::diagram_... INFO : 0s | Δ=0s | Number of graphs after closed fermion chains analysis: 1
  1309. 212.25 s > [2026-08-26 05:39:09.644] @feyngen::diagram_... INFO : 0s | Δ=0s | Number of graphs after symmetrization of external states: 1
  1310. 212.25 s > [2026-08-26 05:39:09.648] @feyngen::diagram_... INFO : 0s | Δ=0s | Number of graphs after canonization of vertices, edges and flows (graph labels assigned here): 1
  1311. 212.25 s > [2026-08-26 05:39:09.659] @feyngen::diagram_... INFO : 0s | Δ=0s | Number of graphs after numerator-aware grouping with strategy 'up to a scalar rescaling': 1 (1 isomorphically unique graph, 0 color zero, 0 lorentz zero, 0 grouped and 0 cancellation)
  1312. 212.25 s > [2026-08-26 05:39:09.660] @feyngen::diagram_... INFO : ( Sum of the symmetry factors from each graph generated = 1 )
  1313. 212.25 s > [2026-08-26 05:39:09.660] @commands::generate INFO : Generated amplitude 1 graphs.
  1314. 212.25 s > [2026-08-26 05:39:09.683] @settings::runtime WARNING : No external kinematics were provided; using default-generated external momenta and helicities.
  1315. 212.25 s > [2026-08-26 05:39:09.764] @commands::generate INFO :
  1316. 212.25 s > Integrand generation summary
  1317. 212.25 s > peak RAM 65.78 MiB | cores 1
  1318. 212.25 s > ╭────────────┬───────┬─────────┬────────────┬────────────┬────────────────┬─────────────╮
  1319. 212.25 s > │ integrand │ graph │ # evals │ expr build │ spenso │ symbolica eval │ compile │
  1320. 212.25 s > ├────────────┼───────┼─────────┼────────────┼────────────┼────────────────┼─────────────┤
  1321. 212.25 s > │ scalar_tri │ GL0 │ 9 │ 14ms (65%) │ 1ms (8.5%) │ 5ms (26%) │ 0ms (0.00%) │
  1322. 212.25 s > ├────────────┼───────┼─────────┼────────────┼────────────┼────────────────┼─────────────┤
  1323. 212.25 s > │ Total │ │ 9 │ 14ms (65%) │ 1ms (8.5%) │ 5ms (26%) │ 0ms (0.00%) │
  1324. 212.25 s > ╰────────────┴───────┴─────────┴────────────┴────────────┴────────────────┴─────────────╯
  1325. 212.25 s > [2026-08-26 05:39:09.765] @gammaloop_api::se... INFO : Running command generate amp scalar_0 scalar_0 > scalar_0 scalar_0 [{1}] --allowed-vertex-interactions V_3_SCALAR_022 -p box -i scalar_box --select-graphs GL0
  1326. 212.25 s > [2026-08-26 05:39:09.766] @feyngen::diagram_... INFO : 0s | Δ=0s | Starting Feynman graph generation with Symbolica...
  1327. 212.25 s > [2026-08-26 05:39:09.767] @feyngen::diagram_... INFO : 0s | Δ=0s | Number of graphs resulting from Symbolica generation: 3
  1328. 212.25 s > [2026-08-26 05:39:09.768] @feyngen::diagram_... INFO : 0s | Δ=0s | Number of graphs retained after removal of vetoed topologies: 3
  1329. 212.25 s > [2026-08-26 05:39:09.769] @feyngen::diagram_... INFO : 0s | Δ=0s | Number of graphs after vertex info assignment: 3
  1330. 212.25 s > [2026-08-26 05:39:09.769] @feyngen::diagram_... INFO : 0s | Δ=0s | Number of graphs after all complete graphs filters are applied: 3
  1331. 212.25 s > [2026-08-26 05:39:09.772] @feyngen::diagram_... INFO : 0s | Δ=0s | Number of graphs after closed fermion chains analysis: 3
  1332. 212.25 s > [2026-08-26 05:39:09.772] @feyngen::diagram_... INFO : 0s | Δ=0s | Number of graphs after symmetrization of external states: 3
  1333. 212.25 s > [2026-08-26 05:39:09.776] @feyngen::diagram_... INFO : 0s | Δ=0s | Number of graphs after canonization of vertices, edges and flows (graph labels assigned here): 3
  1334. 212.25 s > [2026-08-26 05:39:09.791] @feyngen::diagram_... INFO : 0s | Δ=0s | Number of graphs after numerator-aware grouping with strategy 'up to a scalar rescaling': 1 (1 isomorphically unique graph, 0 color zero, 0 lorentz zero, 0 grouped and 0 cancellation)
  1335. 212.25 s > [2026-08-26 05:39:09.792] @feyngen::diagram_... INFO : ( Sum of the symmetry factors from each graph generated = 1 )
  1336. 212.25 s > [2026-08-26 05:39:09.792] @commands::generate INFO : Generated amplitude 1 graphs.
  1337. 212.25 s > [2026-08-26 05:39:09.879] @settings::runtime WARNING : No external kinematics were provided; using default-generated external momenta and helicities.
  1338. 212.25 s > [2026-08-26 05:39:09.896] @commands::generate INFO :
  1339. 212.25 s > Integrand generation summary
  1340. 212.25 s > peak RAM 68.43 MiB | cores 1
  1341. 212.25 s > ╭────────────┬───────┬─────────┬────────────┬───────────┬────────────────┬─────────────╮
  1342. 212.25 s > │ integrand │ graph │ # evals │ expr build │ spenso │ symbolica eval │ compile │
  1343. 212.25 s > ├────────────┼───────┼─────────┼────────────┼───────────┼────────────────┼─────────────┤
  1344. 212.25 s > │ scalar_box │ GL0 │ 13 │ 42ms (50%) │ 8ms (10%) │ 33ms (39%) │ 0ms (0.00%) │
  1345. 212.25 s > ├────────────┼───────┼─────────┼────────────┼───────────┼────────────────┼─────────────┤
  1346. 212.25 s > │ Total │ │ 13 │ 42ms (50%) │ 8ms (10%) │ 33ms (39%) │ 0ms (0.00%) │
  1347. 212.25 s > ╰────────────┴───────┴─────────┴────────────┴───────────┴────────────────┴─────────────╯
  1348. 212.25 s > [2026-08-26 05:39:09.897] @gammaloop_api::se... INFO : Running command generate
  1349. 212.25 s > [2026-08-26 05:39:10.037] @settings::runtime WARNING : No external kinematics were provided; using default-generated external momenta and helicities.
  1350. 212.25 s > [2026-08-26 05:39:10.151] @settings::runtime WARNING : No external kinematics were provided; using default-generated external momenta and helicities.
  1351. 212.25 s > [2026-08-26 05:39:10.228] @commands::generate INFO :
  1352. 212.25 s > Integrand generation summary
  1353. 212.25 s > peak RAM 71.93 MiB | cores 1
  1354. 212.25 s > ╭────────────┬───────┬─────────┬─────────────┬─────────────┬────────────────┬─────────────╮
  1355. 212.25 s > │ integrand │ graph │ # evals │ expr build │ spenso │ symbolica eval │ compile │
  1356. 212.25 s > ├────────────┼───────┼─────────┼─────────────┼─────────────┼────────────────┼─────────────┤
  1357. 212.25 s > │ scalar_tri │ GL0 │ 9 │ 19ms (50%) │ 2ms (5.4%) │ 16ms (44%) │ 0ms (0.00%) │
  1358. 212.25 s > │ scalar_box │ GL0 │ 13 │ 89ms (44%) │ 21ms (11%) │ 91ms (45%) │ 0ms (0.00%) │
  1359. 212.25 s > ├────────────┼───────┼─────────┼─────────────┼─────────────┼────────────────┼─────────────┤
  1360. 212.25 s > │ Total │ │ 22 │ 108ms (45%) │ 23ms (9.9%) │ 108ms (45%) │ 0ms (0.00%) │
  1361. 212.25 s > ╰────────────┴───────┴─────────┴─────────────┴─────────────┴────────────────┴─────────────╯
  1362. 212.25 s > [2026-08-26 05:39:10.229] @gammaloop_api::se... INFO : Running command set model mass_scalar_2=2.0
  1363. 212.25 s > [2026-08-26 05:39:10.230] @gammaloop_api::se... INFO : Running command set model mass_scalar_1=1.0
  1364. 212.25 s > [2026-08-26 05:39:10.230] @gammaloop_api::se... INFO : Running command set process -p triangle -i scalar_tri string '
  1365. 212.25 s > [kinematics.externals]
  1366. 212.25 s > type = "constant"
  1367. 212.25 s >
  1368. 212.25 s > [kinematics.externals.data]
  1369. 212.25 s > [...]
  1370. 212.25 s > [2026-08-26 05:39:10.235] @gammaloop_api::se... INFO : Running command set process -p box -i scalar_box string '
  1371. 212.25 s > [kinematics.externals]
  1372. 212.25 s > type = "constant"
  1373. 212.25 s >
  1374. 212.25 s > [kinematics.externals.data]
  1375. 212.25 s > [...]
  1376. 212.25 s > [2026-08-26 05:39:10.236] @gammaloop_api::se... INFO : Running command approach -x 1.0000000000000001e-1,2.0000000000000001e-1,2.9999999999999999e-1,4.0000000000000002e-1 --approach-axis 1.0000000000000000e-3,0.0000000000000000e0,0.0000000000000000e0,0.0000000000000000e0 --n-points 1 --n-cores 1 --output-results /build/source/tests/artifacts/scalar_box_invalid_momentum_approach/approach_momentum.json --momentum-space --graph-id 0
  1377. 212.25 s > The application panicked (crashed).
  1378. 212.25 s > Message: There are 2 processes available. Please specify a process.
  1379. 212.25 s > Location: tests/tests/test_runs/approach.rs:332
  1380. 212.25 s >
  1381. 212.25 s > ━━━━━━━━━━━━━━━━━━━━━━━━━━━━━━━━━━ BACKTRACE ━━━━━━━━━━━━━━━━━━━━━━━━━━━━━━━━━━━
  1382. 212.25 s > 1: <color_eyre[51793ea62743adbd]::config::PanicHook>::panic_report<unknown>
  1383. 212.25 s > at <unknown source file>:<unknown line>
  1384. 212.25 s > 2: <color_eyre[51793ea62743adbd]::config::PanicHook>::into_panic_hook::{closure#0}<unknown>
  1385. 212.25 s > at <unknown source file>:<unknown line>
  1386. 212.25 s > 3: std[bcb96dfbba0ab899]::panicking::panic_with_hook<unknown>
  1387. 212.25 s > at <unknown source file>:<unknown line>
  1388. 212.25 s > 4: std[bcb96dfbba0ab899]::panicking::panic_handler::{closure#0}<unknown>
  1389. 212.25 s > at <unknown source file>:<unknown line>
  1390. 212.25 s > 5: std[bcb96dfbba0ab899]::sys::backtrace::__rust_end_short_backtrace::<std[bcb96dfbba0ab899]::panicking::panic_handler::{closure#0}, !><unknown>
  1391. 212.25 s > at <unknown source file>:<unknown line>
  1392. 212.25 s > 6: __rustc[6c289b9f9c454d21]::rust_begin_unwind<unknown>
  1393. 212.25 s > at <unknown source file>:<unknown line>
  1394. 212.25 s > 7: core[940e698046960fd5]::panicking::panic_fmt<unknown>
  1395. 212.25 s > at <unknown source file>:<unknown line>
  1396. 212.25 s > 8: test_runs[3e7a390caee4e338]::approach::approach_momentum_space_reports_incomplete_triplet_cleanly<unknown>
  1397. 212.25 s > at <unknown source file>:<unknown line>
  1398. 212.25 s > 9: <test_runs[3e7a390caee4e338]::approach::approach_momentum_space_reports_incomplete_triplet_cleanly::{closure#0} as core[940e698046960fd5]::ops::function::FnOnce<()>>::call_once<unknown>
  1399. 212.25 s > at <unknown source file>:<unknown line>
  1400. 212.25 s > 10: test[75d6903177b1d7e9]::__rust_begin_short_backtrace::<core[940e698046960fd5]::result::Result<(), alloc[2ea6bcb46fca0c42]::string::String>, fn() -> core[940e698046960fd5]::result::Result<(), alloc[2ea6bcb46fca0c42]::string::String>><unknown>
  1401. 212.25 s > at <unknown source file>:<unknown line>
  1402. 212.25 s > 11: test[75d6903177b1d7e9]::run_test::{closure#0}<unknown>
  1403. 212.25 s > at <unknown source file>:<unknown line>
  1404. 212.25 s > 12: std[bcb96dfbba0ab899]::sys::backtrace::__rust_begin_short_backtrace::<test[75d6903177b1d7e9]::run_test::{closure#1}, ()><unknown>
  1405. 212.25 s > at <unknown source file>:<unknown line>
  1406. 212.25 s > 13: <std[bcb96dfbba0ab899]::thread::lifecycle::spawn_unchecked<test[75d6903177b1d7e9]::run_test::{closure#1}, ()>::{closure#1} as core[940e698046960fd5]::ops::function::FnOnce<()>>::call_once::{shim:vtable#0}<unknown>
  1407. 212.25 s > at <unknown source file>:<unknown line>
  1408. 212.25 s > 14: <std[bcb96dfbba0ab899]::sys::thread::unix::Thread>::new::thread_start<unknown>
  1409. 212.25 s > at <unknown source file>:<unknown line>
  1410. 212.25 s > 15: start_thread<unknown>
  1411. 212.25 s > at <unknown source file>:<unknown line>
  1412. 212.25 s > 16: __clone3<unknown>
  1413. 212.25 s > at <unknown source file>:<unknown line>
  1414. 212.25 s >
  1415. 212.25 s > Run with COLORBT_SHOW_HIDDEN=1 environment variable to disable frame filtering.
  1416. 212.25 s > ... omitted 1 more lines; see full nextest output above
  1417. 212.25 s >
  1418. 212.25 s > 2. gammaloop-integration-tests::test_runs::profile_bulk::double_dotted_bubble_amp_bulk_profile_passes
  1419. 212.25 s > failure: test failure with exit code 101
  1420. 212.25 s > Error:
  1421. 212.25 s > 0: IR profiling requested arbitrary precision but received a quad-precision result
  1422. 212.25 s >
  1423. 212.25 s > Location:
  1424. 212.25 s > crates/gammalooprs/src/integrands/process/ir.rs:2123
  1425. 212.25 s >
  1426. 212.25 s > ━━━━━━━━━━━━━━━━━━━━━━━━━━━━━━━━━━ BACKTRACE ━━━━━━━━━━━━━━━━━━━━━━━━━━━━━━━━━━━
  1427. 212.25 s > 1: <color_eyre[51793ea62743adbd]::config::EyreHook>::into_eyre_hook::{closure#0}<unknown>
  1428. 212.25 s > at <unknown source file>:<unknown line>
  1429. 212.25 s > 2: eyre[cb2fd339c0c40fca]::capture_handler<unknown>
  1430. 212.25 s > at <unknown source file>:<unknown line>
  1431. 212.25 s > 3: eyre[cb2fd339c0c40fca]::private::format_err<unknown>
  1432. 212.25 s > at <unknown source file>:<unknown line>
  1433. 212.25 s > 4: gammalooprs[d7a7c067ebd19583]::integrands::process::ir::evaluate_profile_momentum_point_arb::<gammalooprs[d7a7c067ebd19583]::integrands::process::amplitude::AmplitudeIntegrand><unknown>
  1434. 212.25 s > at <unknown source file>:<unknown line>
  1435. 212.25 s > 5: <gammalooprs[d7a7c067ebd19583]::integrands::process::amplitude::AmplitudeIntegrand>::test_single_ir_limit_impl<unknown>
  1436. 212.25 s > at <unknown source file>:<unknown line>
  1437. 212.25 s > 6: gammalooprs[d7a7c067ebd19583]::integrands::process::ir::run_ir_profile::<gammalooprs[d7a7c067ebd19583]::integrands::process::amplitude::AmplitudeIntegrand, <gammalooprs[d7a7c067ebd19583]::integrands::process::amplitude::AmplitudeIntegrand>::enumerate_ir_limits, <gammalooprs[d7a7c067ebd19583]::integrands::process::amplitude::AmplitudeIntegrand>::graph_cut_definitions, <gammalooprs[d7a7c067ebd19583]::integrands::process::amplitude::AmplitudeIntegrand>::test_single_ir_limit_impl><unknown>
  1438. 212.25 s > at <unknown source file>:<unknown line>
  1439. 212.25 s > 7: <gammalooprs[d7a7c067ebd19583]::integrands::process::amplitude::AmplitudeIntegrand>::test_ir<unknown>
  1440. 212.25 s > at <unknown source file>:<unknown line>
  1441. 212.25 s > 8: <gammaloop_api[92ae732909e47e14]::commands::profile::Profile>::run<unknown>
  1442. 212.25 s > at <unknown source file>:<unknown line>
  1443. 212.25 s > 9: test_runs[3e7a390caee4e338]::profile_bulk::double_dotted_bubble_amp_bulk_profile_passes<unknown>
  1444. 212.25 s > at <unknown source file>:<unknown line>
  1445. 212.25 s > 10: <test_runs[3e7a390caee4e338]::profile_bulk::double_dotted_bubble_amp_bulk_profile_passes::{closure#0} as core[940e698046960fd5]::ops::function::FnOnce<()>>::call_once<unknown>
  1446. 212.25 s > at <unknown source file>:<unknown line>
  1447. 212.25 s > 11: test[75d6903177b1d7e9]::__rust_begin_short_backtrace::<core[940e698046960fd5]::result::Result<(), alloc[2ea6bcb46fca0c42]::string::String>, fn() -> core[940e698046960fd5]::result::Result<(), alloc[2ea6bcb46fca0c42]::string::String>><unknown>
  1448. 212.25 s > at <unknown source file>:<unknown line>
  1449. 212.25 s > 12: test[75d6903177b1d7e9]::run_test::{closure#0}<unknown>
  1450. 212.25 s > at <unknown source file>:<unknown line>
  1451. 212.25 s > 13: std[bcb96dfbba0ab899]::sys::backtrace::__rust_begin_short_backtrace::<test[75d6903177b1d7e9]::run_test::{closure#1}, ()><unknown>
  1452. 212.25 s > at <unknown source file>:<unknown line>
  1453. 212.25 s > 14: <std[bcb96dfbba0ab899]::thread::lifecycle::spawn_unchecked<test[75d6903177b1d7e9]::run_test::{closure#1}, ()>::{closure#1} as core[940e698046960fd5]::ops::function::FnOnce<()>>::call_once::{shim:vtable#0}<unknown>
  1454. 212.25 s > at <unknown source file>:<unknown line>
  1455. 212.25 s > 15: <std[bcb96dfbba0ab899]::sys::thread::unix::Thread>::new::thread_start<unknown>
  1456. 212.25 s > at <unknown source file>:<unknown line>
  1457. 212.25 s > 16: start_thread<unknown>
  1458. 212.25 s > at <unknown source file>:<unknown line>
  1459. 212.25 s > 17: __clone3<unknown>
  1460. 212.25 s > at <unknown source file>:<unknown line>
  1461. 212.25 s >
  1462. 212.25 s > Run with COLORBT_SHOW_HIDDEN=1 environment variable to disable frame filtering.
  1463. 212.25 s > Run with RUST_BACKTRACE=full to include source snippets.
  1464. 212.25 s > Warning: SpanTrace capture is Unsupported.
  1465. 212.25 s > Ensure that you've setup a tracing-error ErrorLayer and the semver versions are compatible
  1466. 212.25 s > system-out
  1467. 212.25 s > running 1 test
  1468. 212.25 s > test profile_bulk::double_dotted_bubble_amp_bulk_profile_passes ... FAILED
  1469. 212.25 s >
  1470. 212.25 s > failures:
  1471. 212.25 s >
  1472. 212.25 s > failures:
  1473. 212.25 s > profile_bulk::double_dotted_bubble_amp_bulk_profile_passes
  1474. 212.25 s >
  1475. 212.25 s > test result: FAILED. 0 passed; 1 failed; 0 ignored; 0 measured; 82 filtered out; finished in 0.37s
  1476. 212.25 s > system-err
  1477. 212.25 s > [2026-08-26 05:39:11.768] @gammaloop_api::se... INFO : Running command import model ./assets/models/json/scalars/scalars_2p_3p.json
  1478. 212.25 s > [2026-08-26 05:39:11.768] @import::model INFO : Loading JSON model scalars_2p_3p-default from /build/source/assets/models/json/scalars/scalars_2p_3p
  1479. 212.25 s > [2026-08-26 05:39:11.769] @gammaloop_api::se... INFO : Running command import graphs ./tests/resources/graphs/double_dotted_bubble_amp.dot
  1480. 212.25 s > [2026-08-26 05:39:11.769] @commands::import INFO : Loading graphs from '/build/source/tests/resources/graphs/double_dotted_bubble_amp.dot'
  1481. 212.25 s > [2026-08-26 05:39:11.773] @gammaloop_api::se... INFO : Running command generate
  1482. 212.25 s > [2026-08-26 05:39:11.882] @commands::generate INFO :
  1483. 212.25 s > Integrand generation summary
  1484. 212.25 s > peak RAM 62.97 MiB | cores 1
  1485. 212.25 s > ╭───────────┬──────────────────────────┬─────────┬────────────┬────────────┬────────────────┬─────────────╮
  1486. 212.25 s > │ integrand │ graph │ # evals │ expr build │ spenso │ symbolica eval │ compile │
  1487. 212.25 s > ├───────────┼──────────────────────────┼─────────┼────────────┼────────────┼────────────────┼─────────────┤
  1488. 212.25 s > │ default │ double_dotted_bubble_amp │ 11 │ 19ms (55%) │ 2ms (7.5%) │ 13ms (37%) │ 0ms (0.00%) │
  1489. 212.25 s > ├───────────┼──────────────────────────┼─────────┼────────────┼────────────┼────────────────┼─────────────┤
  1490. 212.25 s > │ Total │ │ 11 │ 19ms (55%) │ 2ms (7.5%) │ 13ms (37%) │ 0ms (0.00%) │
  1491. 212.25 s > ╰───────────┴──────────────────────────┴─────────┴────────────┴────────────┴────────────────┴─────────────╯
  1492. 212.25 s > [2026-08-26 05:39:11.884] @process::amplitude INFO : Input is above threshold: 1 existing threshold E-surfaces across 1/1 graph groups
  1493. 212.25 s > [2026-08-26 05:39:11.884] @process::amplitude INFO : overlap structure of group 0: [1: [1(1,4)]]
  1494. 212.25 s > Error:
  1495. 212.25 s > 0: IR profiling requested arbitrary precision but received a quad-precision result
  1496. 212.25 s >
  1497. 212.25 s > Location:
  1498. 212.25 s > crates/gammalooprs/src/integrands/process/ir.rs:2123
  1499. 212.25 s >
  1500. 212.25 s > ━━━━━━━━━━━━━━━━━━━━━━━━━━━━━━━━━━ BACKTRACE ━━━━━━━━━━━━━━━━━━━━━━━━━━━━━━━━━━━
  1501. 212.25 s > 1: <color_eyre[51793ea62743adbd]::config::EyreHook>::into_eyre_hook::{closure#0}<unknown>
  1502. 212.25 s > at <unknown source file>:<unknown line>
  1503. 212.25 s > 2: eyre[cb2fd339c0c40fca]::capture_handler<unknown>
  1504. 212.25 s > at <unknown source file>:<unknown line>
  1505. 212.25 s > 3: eyre[cb2fd339c0c40fca]::private::format_err<unknown>
  1506. 212.25 s > at <unknown source file>:<unknown line>
  1507. 212.25 s > 4: gammalooprs[d7a7c067ebd19583]::integrands::process::ir::evaluate_profile_momentum_point_arb::<gammalooprs[d7a7c067ebd19583]::integrands::process::amplitude::AmplitudeIntegrand><unknown>
  1508. 212.25 s > at <unknown source file>:<unknown line>
  1509. 212.25 s > 5: <gammalooprs[d7a7c067ebd19583]::integrands::process::amplitude::AmplitudeIntegrand>::test_single_ir_limit_impl<unknown>
  1510. 212.25 s > at <unknown source file>:<unknown line>
  1511. 212.25 s > 6: gammalooprs[d7a7c067ebd19583]::integrands::process::ir::run_ir_profile::<gammalooprs[d7a7c067ebd19583]::integrands::process::amplitude::AmplitudeIntegrand, <gammalooprs[d7a7c067ebd19583]::integrands::process::amplitude::AmplitudeIntegrand>::enumerate_ir_limits, <gammalooprs[d7a7c067ebd19583]::integrands::process::amplitude::AmplitudeIntegrand>::graph_cut_definitions, <gammalooprs[d7a7c067ebd19583]::integrands::process::amplitude::AmplitudeIntegrand>::test_single_ir_limit_impl><unknown>
  1512. 212.25 s > at <unknown source file>:<unknown line>
  1513. 212.25 s > 7: <gammalooprs[d7a7c067ebd19583]::integrands::process::amplitude::AmplitudeIntegrand>::test_ir<unknown>
  1514. 212.25 s > at <unknown source file>:<unknown line>
  1515. 212.25 s > 8: <gammaloop_api[92ae732909e47e14]::commands::profile::Profile>::run<unknown>
  1516. 212.25 s > at <unknown source file>:<unknown line>
  1517. 212.25 s > 9: test_runs[3e7a390caee4e338]::profile_bulk::double_dotted_bubble_amp_bulk_profile_passes<unknown>
  1518. 212.25 s > at <unknown source file>:<unknown line>
  1519. 212.25 s > 10: <test_runs[3e7a390caee4e338]::profile_bulk::double_dotted_bubble_amp_bulk_profile_passes::{closure#0} as core[940e698046960fd5]::ops::function::FnOnce<()>>::call_once<unknown>
  1520. 212.25 s > at <unknown source file>:<unknown line>
  1521. 212.25 s > 11: test[75d6903177b1d7e9]::__rust_begin_short_backtrace::<core[940e698046960fd5]::result::Result<(), alloc[2ea6bcb46fca0c42]::string::String>, fn() -> core[940e698046960fd5]::result::Result<(), alloc[2ea6bcb46fca0c42]::string::String>><unknown>
  1522. 212.25 s > at <unknown source file>:<unknown line>
  1523. 212.25 s > 12: test[75d6903177b1d7e9]::run_test::{closure#0}<unknown>
  1524. 212.25 s > at <unknown source file>:<unknown line>
  1525. 212.25 s > 13: std[bcb96dfbba0ab899]::sys::backtrace::__rust_begin_short_backtrace::<test[75d6903177b1d7e9]::run_test::{closure#1}, ()><unknown>
  1526. 212.25 s > at <unknown source file>:<unknown line>
  1527. 212.25 s > 14: <std[bcb96dfbba0ab899]::thread::lifecycle::spawn_unchecked<test[75d6903177b1d7e9]::run_test::{closure#1}, ()>::{closure#1} as core[940e698046960fd5]::ops::function::FnOnce<()>>::call_once::{shim:vtable#0}<unknown>
  1528. 212.25 s > at <unknown source file>:<unknown line>
  1529. 212.25 s > 15: <std[bcb96dfbba0ab899]::sys::thread::unix::Thread>::new::thread_start<unknown>
  1530. 212.25 s > at <unknown source file>:<unknown line>
  1531. 212.25 s > 16: start_thread<unknown>
  1532. 212.25 s > at <unknown source file>:<unknown line>
  1533. 212.25 s > 17: __clone3<unknown>
  1534. 212.25 s > at <unknown source file>:<unknown line>
  1535. 212.25 s >
  1536. 212.25 s > Run with COLORBT_SHOW_HIDDEN=1 environment variable to disable frame filtering.
  1537. 212.25 s > Run with RUST_BACKTRACE=full to include source snippets.
  1538. 212.25 s > Warning: SpanTrace capture is Unsupported.
  1539. 212.25 s > Ensure that you've setup a tracing-error ErrorLayer and the semver versions are compatible
  1540. 212.25 s >
  1541. 212.25 s > 3. gammaloop-integration-tests::test_runs::profile_bulk::box_4e_bulk_profile_passes
  1542. 212.25 s > failure: test failure with exit code 101
  1543. 212.25 s > Error:
  1544. 212.25 s > 0: IR profiling requested arbitrary precision but received a quad-precision result
  1545. 212.25 s >
  1546. 212.25 s > Location:
  1547. 212.25 s > crates/gammalooprs/src/integrands/process/ir.rs:2123
  1548. 212.25 s >
  1549. 212.25 s > ━━━━━━━━━━━━━━━━━━━━━━━━━━━━━━━━━━ BACKTRACE ━━━━━━━━━━━━━━━━━━━━━━━━━━━━━━━━━━━
  1550. 212.25 s > 1: <color_eyre[51793ea62743adbd]::config::EyreHook>::into_eyre_hook::{closure#0}<unknown>
  1551. 212.25 s > at <unknown source file>:<unknown line>
  1552. 212.25 s > 2: eyre[cb2fd339c0c40fca]::capture_handler<unknown>
  1553. 212.25 s > at <unknown source file>:<unknown line>
  1554. 212.25 s > 3: eyre[cb2fd339c0c40fca]::private::format_err<unknown>
  1555. 212.25 s > at <unknown source file>:<unknown line>
  1556. 212.25 s > 4: gammalooprs[d7a7c067ebd19583]::integrands::process::ir::evaluate_profile_momentum_point_arb::<gammalooprs[d7a7c067ebd19583]::integrands::process::amplitude::AmplitudeIntegrand><unknown>
  1557. 212.25 s > at <unknown source file>:<unknown line>
  1558. 212.25 s > 5: <gammalooprs[d7a7c067ebd19583]::integrands::process::amplitude::AmplitudeIntegrand>::test_single_ir_limit_impl<unknown>
  1559. 212.25 s > at <unknown source file>:<unknown line>
  1560. 212.25 s > 6: gammalooprs[d7a7c067ebd19583]::integrands::process::ir::run_ir_profile::<gammalooprs[d7a7c067ebd19583]::integrands::process::amplitude::AmplitudeIntegrand, <gammalooprs[d7a7c067ebd19583]::integrands::process::amplitude::AmplitudeIntegrand>::enumerate_ir_limits, <gammalooprs[d7a7c067ebd19583]::integrands::process::amplitude::AmplitudeIntegrand>::graph_cut_definitions, <gammalooprs[d7a7c067ebd19583]::integrands::process::amplitude::AmplitudeIntegrand>::test_single_ir_limit_impl><unknown>
  1561. 212.25 s > at <unknown source file>:<unknown line>
  1562. 212.25 s > 7: <gammalooprs[d7a7c067ebd19583]::integrands::process::amplitude::AmplitudeIntegrand>::test_ir<unknown>
  1563. 212.25 s > at <unknown source file>:<unknown line>
  1564. 212.25 s > 8: <gammaloop_api[92ae732909e47e14]::commands::profile::Profile>::run<unknown>
  1565. 212.25 s > at <unknown source file>:<unknown line>
  1566. 212.25 s > 9: test_runs[3e7a390caee4e338]::profile_bulk::box_4e_bulk_profile_passes<unknown>
  1567. 212.25 s > at <unknown source file>:<unknown line>
  1568. 212.25 s > 10: <test_runs[3e7a390caee4e338]::profile_bulk::box_4e_bulk_profile_passes::{closure#0} as core[940e698046960fd5]::ops::function::FnOnce<()>>::call_once<unknown>
  1569. 212.25 s > at <unknown source file>:<unknown line>
  1570. 212.25 s > 11: test[75d6903177b1d7e9]::__rust_begin_short_backtrace::<core[940e698046960fd5]::result::Result<(), alloc[2ea6bcb46fca0c42]::string::String>, fn() -> core[940e698046960fd5]::result::Result<(), alloc[2ea6bcb46fca0c42]::string::String>><unknown>
  1571. 212.25 s > at <unknown source file>:<unknown line>
  1572. 212.25 s > 12: test[75d6903177b1d7e9]::run_test::{closure#0}<unknown>
  1573. 212.25 s > at <unknown source file>:<unknown line>
  1574. 212.25 s > 13: std[bcb96dfbba0ab899]::sys::backtrace::__rust_begin_short_backtrace::<test[75d6903177b1d7e9]::run_test::{closure#1}, ()><unknown>
  1575. 212.25 s > at <unknown source file>:<unknown line>
  1576. 212.25 s > 14: <std[bcb96dfbba0ab899]::thread::lifecycle::spawn_unchecked<test[75d6903177b1d7e9]::run_test::{closure#1}, ()>::{closure#1} as core[940e698046960fd5]::ops::function::FnOnce<()>>::call_once::{shim:vtable#0}<unknown>
  1577. 212.25 s > at <unknown source file>:<unknown line>
  1578. 212.25 s > 15: <std[bcb96dfbba0ab899]::sys::thread::unix::Thread>::new::thread_start<unknown>
  1579. 212.25 s > at <unknown source file>:<unknown line>
  1580. 212.25 s > 16: start_thread<unknown>
  1581. 212.25 s > at <unknown source file>:<unknown line>
  1582. 212.25 s > 17: __clone3<unknown>
  1583. 212.25 s > at <unknown source file>:<unknown line>
  1584. 212.25 s >
  1585. 212.25 s > Run with COLORBT_SHOW_HIDDEN=1 environment variable to disable frame filtering.
  1586. 212.25 s > Run with RUST_BACKTRACE=full to include source snippets.
  1587. 212.25 s > Warning: SpanTrace capture is Unsupported.
  1588. 212.25 s > Ensure that you've setup a tracing-error ErrorLayer and the semver versions are compatible
  1589. 212.25 s > system-out
  1590. 212.25 s > running 1 test
  1591. 212.25 s > test profile_bulk::box_4e_bulk_profile_passes ... FAILED
  1592. 212.25 s >
  1593. 212.25 s > failures:
  1594. 212.25 s >
  1595. 212.25 s > failures:
  1596. 212.25 s > profile_bulk::box_4e_bulk_profile_passes
  1597. 212.25 s >
  1598. 212.25 s > test result: FAILED. 0 passed; 1 failed; 0 ignored; 0 measured; 82 filtered out; finished in 0.52s
  1599. 212.25 s > system-err
  1600. 212.25 s > [2026-08-26 05:39:11.523] @gammaloop_api::se... INFO : Running command import model ./assets/models/json/scalars/scalars.json
  1601. 212.25 s > [2026-08-26 05:39:11.523] @import::model INFO : Loading JSON model scalars-default from /build/source/assets/models/json/scalars/scalars
  1602. 212.25 s > [2026-08-26 05:39:11.527] @gammalooprs::model INFO : The following 2 external parameters were forced to zero by the restriction card:
  1603. 212.25 s > width_scalar_1, width_scalar_2
  1604. 212.25 s > [2026-08-26 05:39:11.528] @gammaloop_api::se... INFO : Running command import graphs ./tests/resources/graphs/massless_box.dot
  1605. 212.25 s > [2026-08-26 05:39:11.528] @commands::import INFO : Loading graphs from '/build/source/tests/resources/graphs/massless_box.dot'
  1606. 212.25 s > [2026-08-26 05:39:11.536] @gammaloop_api::se... INFO : Running command generate
  1607. 212.25 s > [2026-08-26 05:39:11.874] @commands::generate INFO :
  1608. 212.25 s > Integrand generation summary
  1609. 212.25 s > peak RAM 68.07 MiB | cores 1
  1610. 212.25 s > ╭───────────┬────────────────┬─────────┬─────────────┬────────────┬────────────────┬─────────────╮
  1611. 212.25 s > │ integrand │ graph │ # evals │ expr build │ spenso │ symbolica eval │ compile │
  1612. 212.25 s > ├───────────┼────────────────┼─────────┼─────────────┼────────────┼────────────────┼─────────────┤
  1613. 212.25 s > │ default │ massless_box_0 │ 14 │ 180ms (83%) │ 23ms (11%) │ 14ms (6.6%) │ 0ms (0.00%) │
  1614. 212.25 s > ├───────────┼────────────────┼─────────┼─────────────┼────────────┼────────────────┼─────────────┤
  1615. 212.25 s > │ Total │ │ 14 │ 180ms (83%) │ 23ms (11%) │ 14ms (6.6%) │ 0ms (0.00%) │
  1616. 212.25 s > ╰───────────┴────────────────┴─────────┴─────────────┴────────────┴────────────────┴─────────────╯
  1617. 212.25 s > [2026-08-26 05:39:11.877] @process::amplitude INFO : Input is above threshold: 4 existing threshold E-surfaces across 1/1 graph groups
  1618. 212.25 s > [2026-08-26 05:39:11.881] @process::amplitude INFO : overlap structure of group 0: [2: [9(3,5), 11(5,6)], 2: [4(3,4), 9(3,5)], 2: [4(3,4), 8(4,6)], 2: [8(4,6), 11(5,6)]]
  1619. 212.25 s > Error:
  1620. 212.25 s > 0: IR profiling requested arbitrary precision but received a quad-precision result
  1621. 212.25 s >
  1622. 212.25 s > Location:
  1623. 212.25 s > crates/gammalooprs/src/integrands/process/ir.rs:2123
  1624. 212.25 s >
  1625. 212.25 s > ━━━━━━━━━━━━━━━━━━━━━━━━━━━━━━━━━━ BACKTRACE ━━━━━━━━━━━━━━━━━━━━━━━━━━━━━━━━━━━
  1626. 212.25 s > 1: <color_eyre[51793ea62743adbd]::config::EyreHook>::into_eyre_hook::{closure#0}<unknown>
  1627. 212.25 s > at <unknown source file>:<unknown line>
  1628. 212.25 s > 2: eyre[cb2fd339c0c40fca]::capture_handler<unknown>
  1629. 212.25 s > at <unknown source file>:<unknown line>
  1630. 212.25 s > 3: eyre[cb2fd339c0c40fca]::private::format_err<unknown>
  1631. 212.25 s > at <unknown source file>:<unknown line>
  1632. 212.25 s > 4: gammalooprs[d7a7c067ebd19583]::integrands::process::ir::evaluate_profile_momentum_point_arb::<gammalooprs[d7a7c067ebd19583]::integrands::process::amplitude::AmplitudeIntegrand><unknown>
  1633. 212.25 s > at <unknown source file>:<unknown line>
  1634. 212.25 s > 5: <gammalooprs[d7a7c067ebd19583]::integrands::process::amplitude::AmplitudeIntegrand>::test_single_ir_limit_impl<unknown>
  1635. 212.25 s > at <unknown source file>:<unknown line>
  1636. 212.25 s > 6: gammalooprs[d7a7c067ebd19583]::integrands::process::ir::run_ir_profile::<gammalooprs[d7a7c067ebd19583]::integrands::process::amplitude::AmplitudeIntegrand, <gammalooprs[d7a7c067ebd19583]::integrands::process::amplitude::AmplitudeIntegrand>::enumerate_ir_limits, <gammalooprs[d7a7c067ebd19583]::integrands::process::amplitude::AmplitudeIntegrand>::graph_cut_definitions, <gammalooprs[d7a7c067ebd19583]::integrands::process::amplitude::AmplitudeIntegrand>::test_single_ir_limit_impl><unknown>
  1637. 212.25 s > at <unknown source file>:<unknown line>
  1638. 212.25 s > 7: <gammalooprs[d7a7c067ebd19583]::integrands::process::amplitude::AmplitudeIntegrand>::test_ir<unknown>
  1639. 212.25 s > at <unknown source file>:<unknown line>
  1640. 212.25 s > 8: <gammaloop_api[92ae732909e47e14]::commands::profile::Profile>::run<unknown>
  1641. 212.25 s > at <unknown source file>:<unknown line>
  1642. 212.25 s > 9: test_runs[3e7a390caee4e338]::profile_bulk::box_4e_bulk_profile_passes<unknown>
  1643. 212.25 s > at <unknown source file>:<unknown line>
  1644. 212.25 s > 10: <test_runs[3e7a390caee4e338]::profile_bulk::box_4e_bulk_profile_passes::{closure#0} as core[940e698046960fd5]::ops::function::FnOnce<()>>::call_once<unknown>
  1645. 212.25 s > at <unknown source file>:<unknown line>
  1646. 212.25 s > 11: test[75d6903177b1d7e9]::__rust_begin_short_backtrace::<core[940e698046960fd5]::result::Result<(), alloc[2ea6bcb46fca0c42]::string::String>, fn() -> core[940e698046960fd5]::result::Result<(), alloc[2ea6bcb46fca0c42]::string::String>><unknown>
  1647. 212.25 s > at <unknown source file>:<unknown line>
  1648. 212.25 s > 12: test[75d6903177b1d7e9]::run_test::{closure#0}<unknown>
  1649. 212.25 s > at <unknown source file>:<unknown line>
  1650. 212.25 s > 13: std[bcb96dfbba0ab899]::sys::backtrace::__rust_begin_short_backtrace::<test[75d6903177b1d7e9]::run_test::{closure#1}, ()><unknown>
  1651. 212.25 s > at <unknown source file>:<unknown line>
  1652. 212.25 s > 14: <std[bcb96dfbba0ab899]::thread::lifecycle::spawn_unchecked<test[75d6903177b1d7e9]::run_test::{closure#1}, ()>::{closure#1} as core[940e698046960fd5]::ops::function::FnOnce<()>>::call_once::{shim:vtable#0}<unknown>
  1653. 212.25 s > at <unknown source file>:<unknown line>
  1654. 212.25 s > 15: <std[bcb96dfbba0ab899]::sys::thread::unix::Thread>::new::thread_start<unknown>
  1655. 212.25 s > at <unknown source file>:<unknown line>
  1656. 212.25 s > 16: start_thread<unknown>
  1657. 212.25 s > at <unknown source file>:<unknown line>
  1658. 212.25 s > 17: __clone3<unknown>
  1659. 212.25 s > at <unknown source file>:<unknown line>
  1660. 212.25 s >
  1661. 212.25 s > Run with COLORBT_SHOW_HIDDEN=1 environment variable to disable frame filtering.
  1662. 212.25 s > Run with RUST_BACKTRACE=full to include source snippets.
  1663. 212.25 s > Warning: SpanTrace capture is Unsupported.
  1664. 212.25 s > Ensure that you've setup a tracing-error ErrorLayer and the semver versions are compatible
  1665. 212.25 s >
  1666. 212.25 s > 4. gammaloop-integration-tests::test_runs::profile_bulk::dotted_bubble_amp_bulk_profile_passes
  1667. 212.25 s > failure: test failure with exit code 101
  1668. 212.25 s > Error:
  1669. 212.25 s > 0: IR profiling requested arbitrary precision but received a quad-precision result
  1670. 212.25 s >
  1671. 212.25 s > Location:
  1672. 212.25 s > crates/gammalooprs/src/integrands/process/ir.rs:2123
  1673. 212.25 s >
  1674. 212.25 s > ━━━━━━━━━━━━━━━━━━━━━━━━━━━━━━━━━━ BACKTRACE ━━━━━━━━━━━━━━━━━━━━━━━━━━━━━━━━━━━
  1675. 212.25 s > 1: <color_eyre[51793ea62743adbd]::config::EyreHook>::into_eyre_hook::{closure#0}<unknown>
  1676. 212.25 s > at <unknown source file>:<unknown line>
  1677. 212.25 s > 2: eyre[cb2fd339c0c40fca]::capture_handler<unknown>
  1678. 212.25 s > at <unknown source file>:<unknown line>
  1679. 212.25 s > 3: eyre[cb2fd339c0c40fca]::private::format_err<unknown>
  1680. 212.25 s > at <unknown source file>:<unknown line>
  1681. 212.25 s > 4: gammalooprs[d7a7c067ebd19583]::integrands::process::ir::evaluate_profile_momentum_point_arb::<gammalooprs[d7a7c067ebd19583]::integrands::process::amplitude::AmplitudeIntegrand><unknown>
  1682. 212.25 s > at <unknown source file>:<unknown line>
  1683. 212.25 s > 5: <gammalooprs[d7a7c067ebd19583]::integrands::process::amplitude::AmplitudeIntegrand>::test_single_ir_limit_impl<unknown>
  1684. 212.25 s > at <unknown source file>:<unknown line>
  1685. 212.25 s > 6: gammalooprs[d7a7c067ebd19583]::integrands::process::ir::run_ir_profile::<gammalooprs[d7a7c067ebd19583]::integrands::process::amplitude::AmplitudeIntegrand, <gammalooprs[d7a7c067ebd19583]::integrands::process::amplitude::AmplitudeIntegrand>::enumerate_ir_limits, <gammalooprs[d7a7c067ebd19583]::integrands::process::amplitude::AmplitudeIntegrand>::graph_cut_definitions, <gammalooprs[d7a7c067ebd19583]::integrands::process::amplitude::AmplitudeIntegrand>::test_single_ir_limit_impl><unknown>
  1686. 212.25 s > at <unknown source file>:<unknown line>
  1687. 212.25 s > 7: <gammalooprs[d7a7c067ebd19583]::integrands::process::amplitude::AmplitudeIntegrand>::test_ir<unknown>
  1688. 212.25 s > at <unknown source file>:<unknown line>
  1689. 212.25 s > 8: <gammaloop_api[92ae732909e47e14]::commands::profile::Profile>::run<unknown>
  1690. 212.25 s > at <unknown source file>:<unknown line>
  1691. 212.25 s > 9: test_runs[3e7a390caee4e338]::profile_bulk::dotted_bubble_amp_bulk_profile_passes<unknown>
  1692. 212.25 s > at <unknown source file>:<unknown line>
  1693. 212.25 s > 10: <test_runs[3e7a390caee4e338]::profile_bulk::dotted_bubble_amp_bulk_profile_passes::{closure#0} as core[940e698046960fd5]::ops::function::FnOnce<()>>::call_once<unknown>
  1694. 212.25 s > at <unknown source file>:<unknown line>
  1695. 212.25 s > 11: test[75d6903177b1d7e9]::__rust_begin_short_backtrace::<core[940e698046960fd5]::result::Result<(), alloc[2ea6bcb46fca0c42]::string::String>, fn() -> core[940e698046960fd5]::result::Result<(), alloc[2ea6bcb46fca0c42]::string::String>><unknown>
  1696. 212.25 s > at <unknown source file>:<unknown line>
  1697. 212.25 s > 12: test[75d6903177b1d7e9]::run_test::{closure#0}<unknown>
  1698. 212.25 s > at <unknown source file>:<unknown line>
  1699. 212.25 s > 13: std[bcb96dfbba0ab899]::sys::backtrace::__rust_begin_short_backtrace::<test[75d6903177b1d7e9]::run_test::{closure#1}, ()><unknown>
  1700. 212.25 s > at <unknown source file>:<unknown line>
  1701. 212.25 s > 14: <std[bcb96dfbba0ab899]::thread::lifecycle::spawn_unchecked<test[75d6903177b1d7e9]::run_test::{closure#1}, ()>::{closure#1} as core[940e698046960fd5]::ops::function::FnOnce<()>>::call_once::{shim:vtable#0}<unknown>
  1702. 212.25 s > at <unknown source file>:<unknown line>
  1703. 212.25 s > 15: <std[bcb96dfbba0ab899]::sys::thread::unix::Thread>::new::thread_start<unknown>
  1704. 212.25 s > at <unknown source file>:<unknown line>
  1705. 212.25 s > 16: start_thread<unknown>
  1706. 212.25 s > at <unknown source file>:<unknown line>
  1707. 212.25 s > 17: __clone3<unknown>
  1708. 212.25 s > at <unknown source file>:<unknown line>
  1709. 212.25 s >
  1710. 212.25 s > Run with COLORBT_SHOW_HIDDEN=1 environment variable to disable frame filtering.
  1711. 212.25 s > Run with RUST_BACKTRACE=full to include source snippets.
  1712. 212.25 s > Warning: SpanTrace capture is Unsupported.
  1713. 212.25 s > Ensure that you've setup a tracing-error ErrorLayer and the semver versions are compatible
  1714. 212.25 s > system-out
  1715. 212.25 s > running 1 test
  1716. 212.25 s > test profile_bulk::dotted_bubble_amp_bulk_profile_passes ... FAILED
  1717. 212.25 s >
  1718. 212.25 s > failures:
  1719. 212.25 s >
  1720. 212.25 s > failures:
  1721. 212.25 s > profile_bulk::dotted_bubble_amp_bulk_profile_passes
  1722. 212.25 s >
  1723. 212.25 s > test result: FAILED. 0 passed; 1 failed; 0 ignored; 0 measured; 82 filtered out; finished in 0.43s
  1724. 212.25 s > system-err
  1725. 212.25 s > [2026-08-26 05:39:11.773] @gammaloop_api::se... INFO : Running command import model ./assets/models/json/scalars/scalars_2p_3p.json
  1726. 212.25 s > [2026-08-26 05:39:11.773] @import::model INFO : Loading JSON model scalars_2p_3p-default from /build/source/assets/models/json/scalars/scalars_2p_3p
  1727. 212.25 s > [2026-08-26 05:39:11.775] @gammaloop_api::se... INFO : Running command import graphs ./tests/resources/graphs/dotted_bubble_amp.dot
  1728. 212.25 s > [2026-08-26 05:39:11.775] @commands::import INFO : Loading graphs from '/build/source/tests/resources/graphs/dotted_bubble_amp.dot'
  1729. 212.25 s > [2026-08-26 05:39:11.783] @gammaloop_api::se... INFO : Running command generate
  1730. 212.25 s > [2026-08-26 05:39:11.908] @commands::generate INFO :
  1731. 212.25 s > Integrand generation summary
  1732. 212.25 s > peak RAM 64.36 MiB | cores 1
  1733. 212.25 s > ╭───────────┬───────────────────┬─────────┬────────────┬────────────┬────────────────┬─────────────╮
  1734. 212.25 s > │ integrand │ graph │ # evals │ expr build │ spenso │ symbolica eval │ compile │
  1735. 212.25 s > ├───────────┼───────────────────┼─────────┼────────────┼────────────┼────────────────┼─────────────┤
  1736. 212.25 s > │ default │ dotted_bubble_amp │ 8 │ 37ms (76%) │ 1ms (2.3%) │ 10ms (21%) │ 0ms (0.00%) │
  1737. 212.25 s > ├───────────┼───────────────────┼─────────┼────────────┼────────────┼────────────────┼─────────────┤
  1738. 212.25 s > │ Total │ │ 8 │ 37ms (76%) │ 1ms (2.3%) │ 10ms (21%) │ 0ms (0.00%) │
  1739. 212.25 s > ╰───────────┴───────────────────┴─────────┴────────────┴────────────┴────────────────┴─────────────╯
  1740. 212.25 s > [2026-08-26 05:39:11.911] @process::amplitude INFO : Input is above threshold: 1 existing threshold E-surfaces across 1/1 graph groups
  1741. 212.25 s > [2026-08-26 05:39:11.911] @process::amplitude INFO : overlap structure of group 0: [1: [1(1,3)]]
  1742. 212.25 s > Error:
  1743. 212.25 s > 0: IR profiling requested arbitrary precision but received a quad-precision result
  1744. 212.25 s >
  1745. 212.25 s > Location:
  1746. 212.25 s > crates/gammalooprs/src/integrands/process/ir.rs:2123
  1747. 212.25 s >
  1748. 212.25 s > ━━━━━━━━━━━━━━━━━━━━━━━━━━━━━━━━━━ BACKTRACE ━━━━━━━━━━━━━━━━━━━━━━━━━━━━━━━━━━━
  1749. 212.25 s > 1: <color_eyre[51793ea62743adbd]::config::EyreHook>::into_eyre_hook::{closure#0}<unknown>
  1750. 212.25 s > at <unknown source file>:<unknown line>
  1751. 212.25 s > 2: eyre[cb2fd339c0c40fca]::capture_handler<unknown>
  1752. 212.25 s > at <unknown source file>:<unknown line>
  1753. 212.25 s > 3: eyre[cb2fd339c0c40fca]::private::format_err<unknown>
  1754. 212.25 s > at <unknown source file>:<unknown line>
  1755. 212.25 s > 4: gammalooprs[d7a7c067ebd19583]::integrands::process::ir::evaluate_profile_momentum_point_arb::<gammalooprs[d7a7c067ebd19583]::integrands::process::amplitude::AmplitudeIntegrand><unknown>
  1756. 212.25 s > at <unknown source file>:<unknown line>
  1757. 212.25 s > 5: <gammalooprs[d7a7c067ebd19583]::integrands::process::amplitude::AmplitudeIntegrand>::test_single_ir_limit_impl<unknown>
  1758. 212.25 s > at <unknown source file>:<unknown line>
  1759. 212.25 s > 6: gammalooprs[d7a7c067ebd19583]::integrands::process::ir::run_ir_profile::<gammalooprs[d7a7c067ebd19583]::integrands::process::amplitude::AmplitudeIntegrand, <gammalooprs[d7a7c067ebd19583]::integrands::process::amplitude::AmplitudeIntegrand>::enumerate_ir_limits, <gammalooprs[d7a7c067ebd19583]::integrands::process::amplitude::AmplitudeIntegrand>::graph_cut_definitions, <gammalooprs[d7a7c067ebd19583]::integrands::process::amplitude::AmplitudeIntegrand>::test_single_ir_limit_impl><unknown>
  1760. 212.25 s > at <unknown source file>:<unknown line>
  1761. 212.25 s > 7: <gammalooprs[d7a7c067ebd19583]::integrands::process::amplitude::AmplitudeIntegrand>::test_ir<unknown>
  1762. 212.25 s > at <unknown source file>:<unknown line>
  1763. 212.25 s > 8: <gammaloop_api[92ae732909e47e14]::commands::profile::Profile>::run<unknown>
  1764. 212.25 s > at <unknown source file>:<unknown line>
  1765. 212.25 s > 9: test_runs[3e7a390caee4e338]::profile_bulk::dotted_bubble_amp_bulk_profile_passes<unknown>
  1766. 212.25 s > at <unknown source file>:<unknown line>
  1767. 212.25 s > 10: <test_runs[3e7a390caee4e338]::profile_bulk::dotted_bubble_amp_bulk_profile_passes::{closure#0} as core[940e698046960fd5]::ops::function::FnOnce<()>>::call_once<unknown>
  1768. 212.25 s > at <unknown source file>:<unknown line>
  1769. 212.25 s > 11: test[75d6903177b1d7e9]::__rust_begin_short_backtrace::<core[940e698046960fd5]::result::Result<(), alloc[2ea6bcb46fca0c42]::string::String>, fn() -> core[940e698046960fd5]::result::Result<(), alloc[2ea6bcb46fca0c42]::string::String>><unknown>
  1770. 212.25 s > at <unknown source file>:<unknown line>
  1771. 212.25 s > 12: test[75d6903177b1d7e9]::run_test::{closure#0}<unknown>
  1772. 212.25 s > at <unknown source file>:<unknown line>
  1773. 212.25 s > 13: std[bcb96dfbba0ab899]::sys::backtrace::__rust_begin_short_backtrace::<test[75d6903177b1d7e9]::run_test::{closure#1}, ()><unknown>
  1774. 212.25 s > at <unknown source file>:<unknown line>
  1775. 212.25 s > 14: <std[bcb96dfbba0ab899]::thread::lifecycle::spawn_unchecked<test[75d6903177b1d7e9]::run_test::{closure#1}, ()>::{closure#1} as core[940e698046960fd5]::ops::function::FnOnce<()>>::call_once::{shim:vtable#0}<unknown>
  1776. 212.25 s > at <unknown source file>:<unknown line>
  1777. 212.25 s > 15: <std[bcb96dfbba0ab899]::sys::thread::unix::Thread>::new::thread_start<unknown>
  1778. 212.25 s > at <unknown source file>:<unknown line>
  1779. 212.25 s > 16: start_thread<unknown>
  1780. 212.25 s > at <unknown source file>:<unknown line>
  1781. 212.25 s > 17: __clone3<unknown>
  1782. 212.25 s > at <unknown source file>:<unknown line>
  1783. 212.25 s >
  1784. 212.25 s > Run with COLORBT_SHOW_HIDDEN=1 environment variable to disable frame filtering.
  1785. 212.25 s > Run with RUST_BACKTRACE=full to include source snippets.
  1786. 212.25 s > Warning: SpanTrace capture is Unsupported.
  1787. 212.25 s > Ensure that you've setup a tracing-error ErrorLayer and the semver versions are compatible
  1788. 212.25 s >
  1789. 212.25 s > 5. gammaloop-integration-tests::test_runs::profile_bulk::massless_triangle_bulk_profile_passes
  1790. 212.25 s > failure: test failure with exit code 101
  1791. 212.25 s > Error:
  1792. 212.25 s > 0: IR profiling requested arbitrary precision but received a quad-precision result
  1793. 212.25 s >
  1794. 212.25 s > Location:
  1795. 212.25 s > crates/gammalooprs/src/integrands/process/ir.rs:2123
  1796. 212.25 s >
  1797. 212.25 s > ━━━━━━━━━━━━━━━━━━━━━━━━━━━━━━━━━━ BACKTRACE ━━━━━━━━━━━━━━━━━━━━━━━━━━━━━━━━━━━
  1798. 212.25 s > 1: <color_eyre[51793ea62743adbd]::config::EyreHook>::into_eyre_hook::{closure#0}<unknown>
  1799. 212.25 s > at <unknown source file>:<unknown line>
  1800. 212.25 s > 2: eyre[cb2fd339c0c40fca]::capture_handler<unknown>
  1801. 212.25 s > at <unknown source file>:<unknown line>
  1802. 212.25 s > 3: eyre[cb2fd339c0c40fca]::private::format_err<unknown>
  1803. 212.25 s > at <unknown source file>:<unknown line>
  1804. 212.25 s > 4: gammalooprs[d7a7c067ebd19583]::integrands::process::ir::evaluate_profile_momentum_point_arb::<gammalooprs[d7a7c067ebd19583]::integrands::process::amplitude::AmplitudeIntegrand><unknown>
  1805. 212.25 s > at <unknown source file>:<unknown line>
  1806. 212.25 s > 5: <gammalooprs[d7a7c067ebd19583]::integrands::process::amplitude::AmplitudeIntegrand>::test_single_ir_limit_impl<unknown>
  1807. 212.25 s > at <unknown source file>:<unknown line>
  1808. 212.25 s > 6: gammalooprs[d7a7c067ebd19583]::integrands::process::ir::run_ir_profile::<gammalooprs[d7a7c067ebd19583]::integrands::process::amplitude::AmplitudeIntegrand, <gammalooprs[d7a7c067ebd19583]::integrands::process::amplitude::AmplitudeIntegrand>::enumerate_ir_limits, <gammalooprs[d7a7c067ebd19583]::integrands::process::amplitude::AmplitudeIntegrand>::graph_cut_definitions, <gammalooprs[d7a7c067ebd19583]::integrands::process::amplitude::AmplitudeIntegrand>::test_single_ir_limit_impl><unknown>
  1809. 212.25 s > at <unknown source file>:<unknown line>
  1810. 212.25 s > 7: <gammalooprs[d7a7c067ebd19583]::integrands::process::amplitude::AmplitudeIntegrand>::test_ir<unknown>
  1811. 212.25 s > at <unknown source file>:<unknown line>
  1812. 212.25 s > 8: <gammaloop_api[92ae732909e47e14]::commands::profile::Profile>::run<unknown>
  1813. 212.25 s > at <unknown source file>:<unknown line>
  1814. 212.25 s > 9: test_runs[3e7a390caee4e338]::profile_bulk::massless_triangle_bulk_profile_passes<unknown>
  1815. 212.25 s > at <unknown source file>:<unknown line>
  1816. 212.25 s > 10: <test_runs[3e7a390caee4e338]::profile_bulk::massless_triangle_bulk_profile_passes::{closure#0} as core[940e698046960fd5]::ops::function::FnOnce<()>>::call_once<unknown>
  1817. 212.25 s > at <unknown source file>:<unknown line>
  1818. 212.25 s > 11: test[75d6903177b1d7e9]::__rust_begin_short_backtrace::<core[940e698046960fd5]::result::Result<(), alloc[2ea6bcb46fca0c42]::string::String>, fn() -> core[940e698046960fd5]::result::Result<(), alloc[2ea6bcb46fca0c42]::string::String>><unknown>
  1819. 212.25 s > at <unknown source file>:<unknown line>
  1820. 212.25 s > 12: test[75d6903177b1d7e9]::run_test::{closure#0}<unknown>
  1821. 212.25 s > at <unknown source file>:<unknown line>
  1822. 212.25 s > 13: std[bcb96dfbba0ab899]::sys::backtrace::__rust_begin_short_backtrace::<test[75d6903177b1d7e9]::run_test::{closure#1}, ()><unknown>
  1823. 212.25 s > at <unknown source file>:<unknown line>
  1824. 212.25 s > 14: <std[bcb96dfbba0ab899]::thread::lifecycle::spawn_unchecked<test[75d6903177b1d7e9]::run_test::{closure#1}, ()>::{closure#1} as core[940e698046960fd5]::ops::function::FnOnce<()>>::call_once::{shim:vtable#0}<unknown>
  1825. 212.25 s > at <unknown source file>:<unknown line>
  1826. 212.25 s > 15: <std[bcb96dfbba0ab899]::sys::thread::unix::Thread>::new::thread_start<unknown>
  1827. 212.25 s > at <unknown source file>:<unknown line>
  1828. 212.25 s > 16: start_thread<unknown>
  1829. 212.25 s > at <unknown source file>:<unknown line>
  1830. 212.25 s > 17: __clone3<unknown>
  1831. 212.25 s > at <unknown source file>:<unknown line>
  1832. 212.25 s >
  1833. 212.25 s > Run with COLORBT_SHOW_HIDDEN=1 environment variable to disable frame filtering.
  1834. 212.25 s > Run with RUST_BACKTRACE=full to include source snippets.
  1835. 212.25 s > Warning: SpanTrace capture is Unsupported.
  1836. 212.25 s > Ensure that you've setup a tracing-error ErrorLayer and the semver versions are compatible
  1837. 212.25 s > system-out
  1838. 212.25 s > running 1 test
  1839. 212.25 s > test profile_bulk::massless_triangle_bulk_profile_passes ... FAILED
  1840. 212.25 s >
  1841. 212.25 s > failures:
  1842. 212.25 s >
  1843. 212.25 s > failures:
  1844. 212.25 s > profile_bulk::massless_triangle_bulk_profile_passes
  1845. 212.25 s >
  1846. 212.25 s > test result: FAILED. 0 passed; 1 failed; 0 ignored; 0 measured; 82 filtered out; finished in 0.53s
  1847. 212.25 s > system-err
  1848. 212.25 s > [2026-08-26 05:39:12.015] @gammaloop_api::se... INFO : Running command import model scalars
  1849. 212.25 s > [2026-08-26 05:39:12.015] @import::model INFO : Loading built-in JSON model scalars-default
  1850. 212.25 s > [2026-08-26 05:39:12.025] @gammalooprs::model INFO : The following 2 external parameters were forced to zero by the restriction card:
  1851. 212.25 s > width_scalar_1, width_scalar_2
  1852. 212.25 s > [2026-08-26 05:39:12.026] @gammaloop_api::se... INFO : Running command import graphs ./tests/resources/graphs/massless_triangle.dot
  1853. 212.25 s > [2026-08-26 05:39:12.026] @commands::import INFO : Loading graphs from '/build/source/tests/resources/graphs/massless_triangle.dot'
  1854. 212.25 s > [2026-08-26 05:39:12.038] @gammaloop_api::se... INFO : Running command generate
  1855. 212.25 s > [2026-08-26 05:39:12.172] @commands::generate INFO :
  1856. 212.25 s > Integrand generation summary
  1857. 212.25 s > peak RAM 65.64 MiB | cores 1
  1858. 212.25 s > ╭───────────┬─────────────────────┬─────────┬────────────┬────────────┬────────────────┬─────────────╮
  1859. 212.25 s > │ integrand │ graph │ # evals │ expr build │ spenso │ symbolica eval │ compile │
  1860. 212.25 s > ├───────────┼─────────────────────┼─────────┼────────────┼────────────┼────────────────┼─────────────┤
  1861. 212.25 s > │ default │ massless_triangle_0 │ 9 │ 29ms (70%) │ 3ms (7.9%) │ 9ms (22%) │ 0ms (0.00%) │
  1862. 212.25 s > ├───────────┼─────────────────────┼─────────┼────────────┼────────────┼────────────────┼─────────────┤
  1863. 212.25 s > │ Total │ │ 9 │ 29ms (70%) │ 3ms (7.9%) │ 9ms (22%) │ 0ms (0.00%) │
  1864. 212.25 s > ╰───────────┴─────────────────────┴─────────┴────────────┴────────────┴────────────────┴─────────────╯
  1865. 212.25 s > [2026-08-26 05:39:12.174] @process::amplitude INFO : Input is above threshold: 2 existing threshold E-surfaces across 1/1 graph groups
  1866. 212.25 s > [2026-08-26 05:39:12.174] @process::amplitude INFO : overlap structure of group 0: [2: [0(1,5), 1(1,3)]]
  1867. 212.25 s > Error:
  1868. 212.25 s > 0: IR profiling requested arbitrary precision but received a quad-precision result
  1869. 212.25 s >
  1870. 212.25 s > Location:
  1871. 212.25 s > crates/gammalooprs/src/integrands/process/ir.rs:2123
  1872. 212.25 s >
  1873. 212.25 s > ━━━━━━━━━━━━━━━━━━━━━━━━━━━━━━━━━━ BACKTRACE ━━━━━━━━━━━━━━━━━━━━━━━━━━━━━━━━━━━
  1874. 212.25 s > 1: <color_eyre[51793ea62743adbd]::config::EyreHook>::into_eyre_hook::{closure#0}<unknown>
  1875. 212.25 s > at <unknown source file>:<unknown line>
  1876. 212.25 s > 2: eyre[cb2fd339c0c40fca]::capture_handler<unknown>
  1877. 212.25 s > at <unknown source file>:<unknown line>
  1878. 212.25 s > 3: eyre[cb2fd339c0c40fca]::private::format_err<unknown>
  1879. 212.25 s > at <unknown source file>:<unknown line>
  1880. 212.25 s > 4: gammalooprs[d7a7c067ebd19583]::integrands::process::ir::evaluate_profile_momentum_point_arb::<gammalooprs[d7a7c067ebd19583]::integrands::process::amplitude::AmplitudeIntegrand><unknown>
  1881. 212.25 s > at <unknown source file>:<unknown line>
  1882. 212.25 s > 5: <gammalooprs[d7a7c067ebd19583]::integrands::process::amplitude::AmplitudeIntegrand>::test_single_ir_limit_impl<unknown>
  1883. 212.25 s > at <unknown source file>:<unknown line>
  1884. 212.25 s > 6: gammalooprs[d7a7c067ebd19583]::integrands::process::ir::run_ir_profile::<gammalooprs[d7a7c067ebd19583]::integrands::process::amplitude::AmplitudeIntegrand, <gammalooprs[d7a7c067ebd19583]::integrands::process::amplitude::AmplitudeIntegrand>::enumerate_ir_limits, <gammalooprs[d7a7c067ebd19583]::integrands::process::amplitude::AmplitudeIntegrand>::graph_cut_definitions, <gammalooprs[d7a7c067ebd19583]::integrands::process::amplitude::AmplitudeIntegrand>::test_single_ir_limit_impl><unknown>
  1885. 212.25 s > at <unknown source file>:<unknown line>
  1886. 212.25 s > 7: <gammalooprs[d7a7c067ebd19583]::integrands::process::amplitude::AmplitudeIntegrand>::test_ir<unknown>
  1887. 212.25 s > at <unknown source file>:<unknown line>
  1888. 212.25 s > 8: <gammaloop_api[92ae732909e47e14]::commands::profile::Profile>::run<unknown>
  1889. 212.25 s > at <unknown source file>:<unknown line>
  1890. 212.25 s > 9: test_runs[3e7a390caee4e338]::profile_bulk::massless_triangle_bulk_profile_passes<unknown>
  1891. 212.25 s > at <unknown source file>:<unknown line>
  1892. 212.25 s > 10: <test_runs[3e7a390caee4e338]::profile_bulk::massless_triangle_bulk_profile_passes::{closure#0} as core[940e698046960fd5]::ops::function::FnOnce<()>>::call_once<unknown>
  1893. 212.25 s > at <unknown source file>:<unknown line>
  1894. 212.25 s > 11: test[75d6903177b1d7e9]::__rust_begin_short_backtrace::<core[940e698046960fd5]::result::Result<(), alloc[2ea6bcb46fca0c42]::string::String>, fn() -> core[940e698046960fd5]::result::Result<(), alloc[2ea6bcb46fca0c42]::string::String>><unknown>
  1895. 212.25 s > at <unknown source file>:<unknown line>
  1896. 212.25 s > 12: test[75d6903177b1d7e9]::run_test::{closure#0}<unknown>
  1897. 212.25 s > at <unknown source file>:<unknown line>
  1898. 212.25 s > 13: std[bcb96dfbba0ab899]::sys::backtrace::__rust_begin_short_backtrace::<test[75d6903177b1d7e9]::run_test::{closure#1}, ()><unknown>
  1899. 212.25 s > at <unknown source file>:<unknown line>
  1900. 212.25 s > 14: <std[bcb96dfbba0ab899]::thread::lifecycle::spawn_unchecked<test[75d6903177b1d7e9]::run_test::{closure#1}, ()>::{closure#1} as core[940e698046960fd5]::ops::function::FnOnce<()>>::call_once::{shim:vtable#0}<unknown>
  1901. 212.25 s > at <unknown source file>:<unknown line>
  1902. 212.25 s > 15: <std[bcb96dfbba0ab899]::sys::thread::unix::Thread>::new::thread_start<unknown>
  1903. 212.25 s > at <unknown source file>:<unknown line>
  1904. 212.25 s > 16: start_thread<unknown>
  1905. 212.25 s > at <unknown source file>:<unknown line>
  1906. 212.25 s > 17: __clone3<unknown>
  1907. 212.25 s > at <unknown source file>:<unknown line>
  1908. 212.25 s >
  1909. 212.25 s > Run with COLORBT_SHOW_HIDDEN=1 environment variable to disable frame filtering.
  1910. 212.25 s > Run with RUST_BACKTRACE=full to include source snippets.
  1911. 212.25 s > Warning: SpanTrace capture is Unsupported.
  1912. 212.25 s > Ensure that you've setup a tracing-error ErrorLayer and the semver versions are compatible
  1913. 212.25 s >
  1914. 212.25 s > 6. gammaloop-integration-tests::test_runs::profile_bulk::scalar_self_energy_amp_bulk_profile_passes
  1915. 212.25 s > failure: test failure with exit code 101
  1916. 212.25 s > Error:
  1917. 212.25 s > 0: IR profiling requested arbitrary precision but received a quad-precision result
  1918. 212.25 s >
  1919. 212.25 s > Location:
  1920. 212.25 s > crates/gammalooprs/src/integrands/process/ir.rs:2123
  1921. 212.25 s >
  1922. 212.25 s > ━━━━━━━━━━━━━━━━━━━━━━━━━━━━━━━━━━ BACKTRACE ━━━━━━━━━━━━━━━━━━━━━━━━━━━━━━━━━━━
  1923. 212.25 s > 1: <color_eyre[51793ea62743adbd]::config::EyreHook>::into_eyre_hook::{closure#0}<unknown>
  1924. 212.25 s > at <unknown source file>:<unknown line>
  1925. 212.25 s > 2: eyre[cb2fd339c0c40fca]::capture_handler<unknown>
  1926. 212.25 s > at <unknown source file>:<unknown line>
  1927. 212.25 s > 3: eyre[cb2fd339c0c40fca]::private::format_err<unknown>
  1928. 212.25 s > at <unknown source file>:<unknown line>
  1929. 212.25 s > 4: gammalooprs[d7a7c067ebd19583]::integrands::process::ir::evaluate_profile_momentum_point_arb::<gammalooprs[d7a7c067ebd19583]::integrands::process::amplitude::AmplitudeIntegrand><unknown>
  1930. 212.25 s > at <unknown source file>:<unknown line>
  1931. 212.25 s > 5: <gammalooprs[d7a7c067ebd19583]::integrands::process::amplitude::AmplitudeIntegrand>::test_single_ir_limit_impl<unknown>
  1932. 212.25 s > at <unknown source file>:<unknown line>
  1933. 212.25 s > 6: gammalooprs[d7a7c067ebd19583]::integrands::process::ir::run_ir_profile::<gammalooprs[d7a7c067ebd19583]::integrands::process::amplitude::AmplitudeIntegrand, <gammalooprs[d7a7c067ebd19583]::integrands::process::amplitude::AmplitudeIntegrand>::enumerate_ir_limits, <gammalooprs[d7a7c067ebd19583]::integrands::process::amplitude::AmplitudeIntegrand>::graph_cut_definitions, <gammalooprs[d7a7c067ebd19583]::integrands::process::amplitude::AmplitudeIntegrand>::test_single_ir_limit_impl><unknown>
  1934. 212.25 s > at <unknown source file>:<unknown line>
  1935. 212.25 s > 7: <gammalooprs[d7a7c067ebd19583]::integrands::process::amplitude::AmplitudeIntegrand>::test_ir<unknown>
  1936. 212.25 s > at <unknown source file>:<unknown line>
  1937. 212.25 s > 8: <gammaloop_api[92ae732909e47e14]::commands::profile::Profile>::run<unknown>
  1938. 212.25 s > at <unknown source file>:<unknown line>
  1939. 212.25 s > 9: test_runs[3e7a390caee4e338]::profile_bulk::scalar_self_energy_amp_bulk_profile_passes<unknown>
  1940. 212.25 s > at <unknown source file>:<unknown line>
  1941. 212.25 s > 10: <test_runs[3e7a390caee4e338]::profile_bulk::scalar_self_energy_amp_bulk_profile_passes::{closure#0} as core[940e698046960fd5]::ops::function::FnOnce<()>>::call_once<unknown>
  1942. 212.25 s > at <unknown source file>:<unknown line>
  1943. 212.25 s > 11: test[75d6903177b1d7e9]::__rust_begin_short_backtrace::<core[940e698046960fd5]::result::Result<(), alloc[2ea6bcb46fca0c42]::string::String>, fn() -> core[940e698046960fd5]::result::Result<(), alloc[2ea6bcb46fca0c42]::string::String>><unknown>
  1944. 212.25 s > at <unknown source file>:<unknown line>
  1945. 212.25 s > 12: test[75d6903177b1d7e9]::run_test::{closure#0}<unknown>
  1946. 212.25 s > at <unknown source file>:<unknown line>
  1947. 212.25 s > 13: std[bcb96dfbba0ab899]::sys::backtrace::__rust_begin_short_backtrace::<test[75d6903177b1d7e9]::run_test::{closure#1}, ()><unknown>
  1948. 212.25 s > at <unknown source file>:<unknown line>
  1949. 212.25 s > 14: <std[bcb96dfbba0ab899]::thread::lifecycle::spawn_unchecked<test[75d6903177b1d7e9]::run_test::{closure#1}, ()>::{closure#1} as core[940e698046960fd5]::ops::function::FnOnce<()>>::call_once::{shim:vtable#0}<unknown>
  1950. 212.25 s > at <unknown source file>:<unknown line>
  1951. 212.25 s > 15: <std[bcb96dfbba0ab899]::sys::thread::unix::Thread>::new::thread_start<unknown>
  1952. 212.25 s > at <unknown source file>:<unknown line>
  1953. 212.25 s > 16: start_thread<unknown>
  1954. 212.25 s > at <unknown source file>:<unknown line>
  1955. 212.25 s > 17: __clone3<unknown>
  1956. 212.25 s > at <unknown source file>:<unknown line>
  1957. 212.25 s >
  1958. 212.25 s > Run with COLORBT_SHOW_HIDDEN=1 environment variable to disable frame filtering.
  1959. 212.25 s > Run with RUST_BACKTRACE=full to include source snippets.
  1960. 212.25 s > Warning: SpanTrace capture is Unsupported.
  1961. 212.25 s > Ensure that you've setup a tracing-error ErrorLayer and the semver versions are compatible
  1962. 212.25 s > system-out
  1963. 212.25 s > running 1 test
  1964. 212.25 s > test profile_bulk::scalar_self_energy_amp_bulk_profile_passes ... FAILED
  1965. 212.25 s >
  1966. 212.25 s > failures:
  1967. 212.25 s >
  1968. 212.25 s > failures:
  1969. 212.25 s > profile_bulk::scalar_self_energy_amp_bulk_profile_passes
  1970. 212.25 s >
  1971. 212.25 s > test result: FAILED. 0 passed; 1 failed; 0 ignored; 0 measured; 82 filtered out; finished in 0.47s
  1972. 212.25 s > system-err
  1973. 212.25 s > [2026-08-26 05:39:12.033] @gammaloop_api::se... INFO : Running command import model ./assets/models/json/scalars/scalars.json
  1974. 212.25 s > [2026-08-26 05:39:12.033] @import::model INFO : Loading JSON model scalars-default from /build/source/assets/models/json/scalars/scalars
  1975. 212.25 s > [2026-08-26 05:39:12.037] @gammalooprs::model INFO : The following 2 external parameters were forced to zero by the restriction card:
  1976. 212.25 s > width_scalar_1, width_scalar_2
  1977. 212.25 s > [2026-08-26 05:39:12.037] @gammaloop_api::se... INFO : Running command import graphs ./tests/resources/graphs/scalar_self_energy_amp.dot
  1978. 212.25 s > [2026-08-26 05:39:12.037] @commands::import INFO : Loading graphs from '/build/source/tests/resources/graphs/scalar_self_energy_amp.dot'
  1979. 212.25 s > [2026-08-26 05:39:12.041] @gammaloop_api::se... INFO : Running command generate
  1980. 212.25 s > [2026-08-26 05:39:12.365] @commands::generate INFO :
  1981. 212.25 s > Integrand generation summary
  1982. 212.25 s > peak RAM 70.69 MiB | cores 1
  1983. 212.25 s > ╭───────────┬────────────────────────┬─────────┬─────────────┬────────────┬────────────────┬─────────────╮
  1984. 212.25 s > │ integrand │ graph │ # evals │ expr build │ spenso │ symbolica eval │ compile │
  1985. 212.25 s > ├───────────┼────────────────────────┼─────────┼─────────────┼────────────┼────────────────┼─────────────┤
  1986. 212.25 s > │ default │ scalar_self_energy_amp │ 6 │ 212ms (92%) │ 9ms (4.3%) │ 7ms (3.5%) │ 0ms (0.00%) │
  1987. 212.25 s > ├───────────┼────────────────────────┼─────────┼─────────────┼────────────┼────────────────┼─────────────┤
  1988. 212.25 s > │ Total │ │ 6 │ 212ms (92%) │ 9ms (4.3%) │ 7ms (3.5%) │ 0ms (0.00%) │
  1989. 212.25 s > ╰───────────┴────────────────────────┴─────────┴─────────────┴────────────┴────────────────┴─────────────╯
  1990. 212.25 s > [2026-08-26 05:39:12.367] @process::amplitude INFO : Input is above threshold: 2 existing threshold E-surfaces across 1/1 graph groups
  1991. 212.25 s > [2026-08-26 05:39:12.367] @process::amplitude INFO : overlap structure of group 0: [2: [2(1,5), 4(2,3,5)]]
  1992. 212.25 s > Error:
  1993. 212.25 s > 0: IR profiling requested arbitrary precision but received a quad-precision result
  1994. 212.25 s >
  1995. 212.25 s > Location:
  1996. 212.25 s > crates/gammalooprs/src/integrands/process/ir.rs:2123
  1997. 212.25 s >
  1998. 212.25 s > ━━━━━━━━━━━━━━━━━━━━━━━━━━━━━━━━━━ BACKTRACE ━━━━━━━━━━━━━━━━━━━━━━━━━━━━━━━━━━━
  1999. 212.25 s > 1: <color_eyre[51793ea62743adbd]::config::EyreHook>::into_eyre_hook::{closure#0}<unknown>
  2000. 212.25 s > at <unknown source file>:<unknown line>
  2001. 212.25 s > 2: eyre[cb2fd339c0c40fca]::capture_handler<unknown>
  2002. 212.25 s > at <unknown source file>:<unknown line>
  2003. 212.25 s > 3: eyre[cb2fd339c0c40fca]::private::format_err<unknown>
  2004. 212.25 s > at <unknown source file>:<unknown line>
  2005. 212.25 s > 4: gammalooprs[d7a7c067ebd19583]::integrands::process::ir::evaluate_profile_momentum_point_arb::<gammalooprs[d7a7c067ebd19583]::integrands::process::amplitude::AmplitudeIntegrand><unknown>
  2006. 212.25 s > at <unknown source file>:<unknown line>
  2007. 212.25 s > 5: <gammalooprs[d7a7c067ebd19583]::integrands::process::amplitude::AmplitudeIntegrand>::test_single_ir_limit_impl<unknown>
  2008. 212.25 s > at <unknown source file>:<unknown line>
  2009. 212.25 s > 6: gammalooprs[d7a7c067ebd19583]::integrands::process::ir::run_ir_profile::<gammalooprs[d7a7c067ebd19583]::integrands::process::amplitude::AmplitudeIntegrand, <gammalooprs[d7a7c067ebd19583]::integrands::process::amplitude::AmplitudeIntegrand>::enumerate_ir_limits, <gammalooprs[d7a7c067ebd19583]::integrands::process::amplitude::AmplitudeIntegrand>::graph_cut_definitions, <gammalooprs[d7a7c067ebd19583]::integrands::process::amplitude::AmplitudeIntegrand>::test_single_ir_limit_impl><unknown>
  2010. 212.25 s > at <unknown source file>:<unknown line>
  2011. 212.25 s > 7: <gammalooprs[d7a7c067ebd19583]::integrands::process::amplitude::AmplitudeIntegrand>::test_ir<unknown>
  2012. 212.25 s > at <unknown source file>:<unknown line>
  2013. 212.25 s > 8: <gammaloop_api[92ae732909e47e14]::commands::profile::Profile>::run<unknown>
  2014. 212.25 s > at <unknown source file>:<unknown line>
  2015. 212.25 s > 9: test_runs[3e7a390caee4e338]::profile_bulk::scalar_self_energy_amp_bulk_profile_passes<unknown>
  2016. 212.25 s > at <unknown source file>:<unknown line>
  2017. 212.25 s > 10: <test_runs[3e7a390caee4e338]::profile_bulk::scalar_self_energy_amp_bulk_profile_passes::{closure#0} as core[940e698046960fd5]::ops::function::FnOnce<()>>::call_once<unknown>
  2018. 212.25 s > at <unknown source file>:<unknown line>
  2019. 212.25 s > 11: test[75d6903177b1d7e9]::__rust_begin_short_backtrace::<core[940e698046960fd5]::result::Result<(), alloc[2ea6bcb46fca0c42]::string::String>, fn() -> core[940e698046960fd5]::result::Result<(), alloc[2ea6bcb46fca0c42]::string::String>><unknown>
  2020. 212.25 s > at <unknown source file>:<unknown line>
  2021. 212.25 s > 12: test[75d6903177b1d7e9]::run_test::{closure#0}<unknown>
  2022. 212.25 s > at <unknown source file>:<unknown line>
  2023. 212.25 s > 13: std[bcb96dfbba0ab899]::sys::backtrace::__rust_begin_short_backtrace::<test[75d6903177b1d7e9]::run_test::{closure#1}, ()><unknown>
  2024. 212.25 s > at <unknown source file>:<unknown line>
  2025. 212.25 s > 14: <std[bcb96dfbba0ab899]::thread::lifecycle::spawn_unchecked<test[75d6903177b1d7e9]::run_test::{closure#1}, ()>::{closure#1} as core[940e698046960fd5]::ops::function::FnOnce<()>>::call_once::{shim:vtable#0}<unknown>
  2026. 212.25 s > at <unknown source file>:<unknown line>
  2027. 212.25 s > 15: <std[bcb96dfbba0ab899]::sys::thread::unix::Thread>::new::thread_start<unknown>
  2028. 212.25 s > at <unknown source file>:<unknown line>
  2029. 212.25 s > 16: start_thread<unknown>
  2030. 212.25 s > at <unknown source file>:<unknown line>
  2031. 212.25 s > 17: __clone3<unknown>
  2032. 212.25 s > at <unknown source file>:<unknown line>
  2033. 212.25 s >
  2034. 212.25 s > Run with COLORBT_SHOW_HIDDEN=1 environment variable to disable frame filtering.
  2035. 212.25 s > Run with RUST_BACKTRACE=full to include source snippets.
  2036. 212.25 s > Warning: SpanTrace capture is Unsupported.
  2037. 212.25 s > Ensure that you've setup a tracing-error ErrorLayer and the semver versions are compatible
  2038. 212.25 s >
  2039. 212.25 s > 7. gammaloop-integration-tests::uv::dod2_bubble_uv
  2040. 212.25 s > failure: test failure with exit code 101
  2041. 212.25 s > system-out
  2042. 212.25 s > running 1 test
  2043. 212.25 s > +-------------+-----------------+---------+--------+----------+-----------------------------------------------------------------------------------------------------------------------+-------+
  2044. 212.25 s > | case | check | graph | status | sigma | threshold | error |
  2045. 212.25 s > +-------------+-----------------+---------+--------+----------+-----------------------------------------------------------------------------------------------------------------------+-------+
  2046. 212.25 s > | dod2_bubble | uv_profile | - | FAIL | - | - | - |
  2047. 212.25 s > +-------------+-----------------+---------+--------+----------+-----------------------------------------------------------------------------------------------------------------------+-------+
  2048. 212.25 s > | dod2_bubble | m_uv.inspect | inspect | pass | - | best inspect relative delta 1.000e0 >= 1000*accuracy 1.000e-7 (accuracy=1.000e-10, exponent=+8.0, seed=0, probes=10) | - |
  2049. 212.25 s > +-------------+-----------------+---------+--------+----------+-----------------------------------------------------------------------------------------------------------------------+-------+
  2050. 212.25 s > | dod2_bubble | m_uv.integrated | GL0 | pass | 0.0sigma | compatible within 2sigma | - |
  2051. 212.25 s > +-------------+-----------------+---------+--------+----------+-----------------------------------------------------------------------------------------------------------------------+-------+
  2052. 212.25 s > | dod2_bubble | rls.inspect | inspect | pass | - | best inspect relative delta 2.822e-3 >= 1000*accuracy 1.000e-7 (accuracy=1.000e-10, exponent=+2.0, seed=1, probes=10) | - |
  2053. 212.25 s > +-------------+-----------------+---------+--------+----------+-----------------------------------------------------------------------------------------------------------------------+-------+
  2054. 212.25 s > | dod2_bubble | rls.integrated | GL0 | pass | 0.0sigma | compatible within 2sigma | - |
  2055. 212.25 s > +-------------+-----------------+---------+--------+----------+-----------------------------------------------------------------------------------------------------------------------+-------+
  2056. 212.25 s > | dod2_bubble | mu_r.inspect | inspect | pass | - | best inspect relative delta 6.951e-1 >= 1000*accuracy 1.000e-7 (accuracy=1.000e-10, exponent=+0.0, seed=0, probes=10) | - |
  2057. 212.25 s > +-------------+-----------------+---------+--------+----------+-----------------------------------------------------------------------------------------------------------------------+-------+
  2058. 212.25 s > | dod2_bubble | target | - | pass | - | 2sigma | - |
  2059. 212.25 s > +-------------+-----------------+---------+--------+----------+-----------------------------------------------------------------------------------------------------------------------+-------+
  2060. 212.25 s > test dod2_bubble_uv ... FAILED
  2061. 212.25 s >
  2062. 212.25 s > failures:
  2063. 212.25 s >
  2064. 212.25 s > failures:
  2065. 212.25 s > dod2_bubble_uv
  2066. 212.25 s >
  2067. 212.25 s > test result: FAILED. 0 passed; 1 failed; 0 ignored; 0 measured; 24 filtered out; finished in 49.54s
  2068. 212.25 s > system-err
  2069. 212.25 s > [2026-08-26 05:39:13.726] @gammaloop_api::se... INFO : Running command run generate
  2070. 212.25 s > [2026-08-26 05:39:13.726] @gammaloop_api::se... INFO : Starting command block generate
  2071. 212.25 s > [2026-08-26 05:39:13.726] @gammaloop_api::se... INFO : Running command import model scalars-default.json
  2072. 212.25 s > [2026-08-26 05:39:13.726] @import::model INFO : Loading built-in JSON model scalars-default
  2073. 212.25 s > [2026-08-26 05:39:13.730] @gammalooprs::model INFO : The following 2 external parameters were forced to zero by the restriction card:
  2074. 212.25 s > width_scalar_1, width_scalar_2
  2075. 212.25 s > [2026-08-26 05:39:13.730] @gammaloop_api::se... INFO : Running command remove processes
  2076. 212.25 s > [2026-08-26 05:39:13.730] @gammaloop_api::se... INFO : Running command set global kv global.generation.uv.generate_integrated=true
  2077. 212.25 s > [2026-08-26 05:39:13.731] @gammaloop_api::se... INFO : Running command import graphs ./tests/resources/graphs/scalar/dod2_bubble.dot -p bubble_dod2 -i scalar_bubble_below_thres
  2078. 212.25 s > [2026-08-26 05:39:13.731] @commands::import INFO : Loading graphs from '/build/source/tests/resources/graphs/scalar/dod2_bubble.dot'
  2079. 212.25 s > [2026-08-26 05:39:13.733] @gammaloop_api::se... INFO : Running command generate existing -p bubble_dod2 -i scalar_bubble_below_thres
  2080. 212.25 s > [2026-08-26 05:39:13.734] @approx::local_4d [{#uv, #inspect, #integrated}] DEBUG : Rescaled momenta expanded
  2081. 212.25 s > field value
  2082. 212.25 s > res n-terms: 1, byte size: 3,expr:
  2083. 212.25 s > 1
  2084. 212.25 s > [2026-08-26 05:39:13.735] @approx::local_4d [{#uv, #inspect, #integrated}] DEBUG : Rescaled momenta expanded
  2085. 212.25 s > field value
  2086. 212.25 s > res n-terms: 1, byte size: 585,expr:
  2087. 212.25 s > -SCALAR_COUPLING²·q₀(αᵉ².¹)·q₀(αᵉ³.¹)·q₂(αᵉ².¹)·q₂(αᵉ³.¹)
  2088. 212.25 s > /(t²·denom(3,-q₀-q₂/t,mass_scalar_2²,-mass_scalar_2²+2·(q₀.q₂)/t+(q₂.q₂)/t²+(q₀.q₀))
  2089. 212.25 s > ·denom(2,q₂/t,mass_scalar_2²,-mass_scalar_2²+(q₂.q₂)/t²))
  2090. 212.25 s > [2026-08-26 05:39:13.736] @approx::final_integrand[{#generation, #profile, #uv, #graph, #summary}] DEBUG : Computed global numerator
  2091. 212.25 s > field value
  2092. 212.25 s > global_num n-terms: 1, byte size: 4,expr:
  2093. 212.25 s > 1/2
  2094. 212.25 s > span build_3d{span_context=true graph=GL0 current=subgraph=0, topo_order=0, dod=0}
  2095. 212.25 s > [2026-08-26 05:39:13.738] @uv::approx [{#generation, #uv, #fourd}] DEBUG : Computing 4D
  2096. 212.25 s > field value
  2097. 212.25 s > simple subgraph(S_11,S_y)*Approx(subgraph(S_y,0)) of GL0
  2098. 212.25 s > span compute_4d{span_context=true graph=GL0 current=subgraph=y, topo_order=1, dod=2 given=subgraph=0, topo_order=0, dod=0 reduced=SubSet { set: BitVec<usize, bitvec::order::Lsb0> { addr: 0x7fffec027530, head: 000000, bits: 6, capacity: 64 } [0, 0, 1, 1, 1, 1], id: PhantomData<linnet::half_edge::involution::Hedge> }}
  2099. 212.25 s > [2026-08-26 05:39:13.739] @approx::local_4d [{#uv, #algebra, #integrated, #start}] DEBUG :
  2100. 212.25 s > field value
  2101. 212.25 s > integrand n-terms: 1, byte size: 409,expr:
  2102. 212.25 s > SCALAR_COUPLING²·(q₀(αᵉ³.¹)+q₃(αᵉ³.¹))·q₀(αᵉ².¹)·q₀(αᵉ³.¹)·q₂(αᵉ².¹)
  2103. 212.25 s > /(denom(2,q₂,mass_scalar_2²,-mass_scalar_2²+(q₂.q₂))·denom(3,q₃,mass_scalar_2²,-mass_scalar_2²+(q₃.q₃)))
  2104. 212.25 s > reduced y
  2105. 212.25 s > span grow{span_context=true current=subgraph=y, topo_order=1, dod=2 given=subgraph=0, topo_order=0, dod=0}
  2106. 212.25 s > [2026-08-26 05:39:13.739] @approx::local_4d [{#uv, #inspect, #integrated}] DEBUG : Rescaled momenta expanded
  2107. 212.25 s > field value
  2108. 212.25 s > res n-terms: 1, byte size: 585,expr:
  2109. 212.25 s > -SCALAR_COUPLING²·q₀(αᵉ².¹)·q₀(αᵉ³.¹)·q₂(αᵉ².¹)·q₂(αᵉ³.¹)
  2110. 212.25 s > /(t²·denom(3,-q₀-q₂/t,mass_scalar_2²,-mass_scalar_2²+2·(q₀.q₂)/t+(q₂.q₂)/t²+(q₀.q₀))
  2111. 212.25 s > ·denom(2,q₂/t,mass_scalar_2²,-mass_scalar_2²+(q₂.q₂)/t²))
  2112. 212.25 s > span t{span_context=true current=subgraph=y, topo_order=1, dod=2 given=subgraph=0, topo_order=0, dod=0}
  2113. 212.25 s > [2026-08-26 05:39:13.739] @approx::local_4d [{#uv, #integrated, #rescaled}] DEBUG : Rescaled expanded
  2114. 212.25 s > field value
  2115. 212.25 s > n_loops 1
  2116. 212.25 s > res n-terms: 1, byte size: 707,expr:
  2117. 212.25 s > -SCALAR_COUPLING²·q₀(αᵉ².¹)·q₀(αᵉ³.¹)·q₂(αᵉ².¹)·q₂(αᵉ³.¹)
  2118. 212.25 s > /(t²·denom(3,-q₂,mUVexp²+t²·mass_scalar_2²,-mUV²+t²·(-mass_scalar_2²+2·(q₀.q₂)/t+(q₂.q₂)/t²+(q₀.q₀))+t²·mUVexp²)
  2119. 212.25 s > ·denom(2,q₂,mUVexp²+t²·mass_scalar_2²,-mUV²+t²·(-mass_scalar_2²+(q₂.q₂)/t²)+t²·mUVexp²))
  2120. 212.26 s > span t{span_context=true current=subgraph=y, topo_order=1, dod=2 given=subgraph=0, topo_order=0, dod=0}
  2121. 212.26 s > [2026-08-26 05:39:13.740] @approx::local_4d [{#uv, #integrated, #series}] DEBUG : Series expanded
  2122. 212.26 s > field value
  2123. 212.26 s > res n-terms: 3, byte size: 1896,expr:
  2124. 212.26 s > (1/2·SCALAR_COUPLING²·(2·mUVexp²-2·mass_scalar_2²)/(denom(2,q₂,mUVexp²,-mUV²+(q₂.q₂))²·denom(3,-q₂,mUVexp²,-mUV²+(q₂.q₂)))
  2125. 212.26 s > -SCALAR_COUPLING²
  2126. 212.26 s > ·(-1/2·(2·mUVexp²-2·mass_scalar_2²+2·(q₀.q₀))/denom(3,-q₂,mUVexp²,-mUV²+(q₂.q₂))
  2127. 212.26 s > +4·(q₀.q₂)²/denom(3,-q₂,mUVexp²,-mUV²+(q₂.q₂))²
  2128. 212.26 s > )/(denom(2,q₂,mUVexp²,-mUV²+(q₂.q₂))·denom(3,-q₂,mUVexp²,-mUV²+(q₂.q₂)))
  2129. 212.26 s > )·q₀(αᵉ².¹)·q₀(αᵉ³.¹)·q₂(αᵉ².¹)·q₂(αᵉ³.¹)
  2130. 212.26 s > +2·SCALAR_COUPLING²·(q₀.q₂)·q₀(αᵉ².¹)·q₀(αᵉ³.¹)·q₂(αᵉ².¹)·q₂(αᵉ³.¹)
  2131. 212.26 s > /(t·denom(2,q₂,mUVexp²,-mUV²+(q₂.q₂))·denom(3,-q₂,mUVexp²,-mUV²+(q₂.q₂))²)
  2132. 212.26 s > -SCALAR_COUPLING²·q₀(αᵉ².¹)·q₀(αᵉ³.¹)·q₂(αᵉ².¹)·q₂(αᵉ³.¹)
  2133. 212.26 s > /(t²·denom(2,q₂,mUVexp²,-mUV²+(q₂.q₂))·denom(3,-q₂,mUVexp²,-mUV²+(q₂.q₂)))
  2134. 212.26 s > span t{span_context=true current=subgraph=y, topo_order=1, dod=2 given=subgraph=0, topo_order=0, dod=0}
  2135. 212.26 s > [2026-08-26 05:39:13.740] @approx::local_4d [{#uv, #integrated, #series}] DEBUG : Evaluated at t = 1
  2136. 212.26 s > field value
  2137. 212.26 s > res n-terms: 3, byte size: 1880,expr:
  2138. 212.26 s > (1/2·SCALAR_COUPLING²·(2·mUVexp²-2·mass_scalar_2²)/(denom(2,q₂,mUVexp²,-mUV²+(q₂.q₂))²·denom(3,-q₂,mUVexp²,-mUV²+(q₂.q₂)))
  2139. 212.26 s > -SCALAR_COUPLING²
  2140. 212.26 s > ·(-1/2·(2·mUVexp²-2·mass_scalar_2²+2·(q₀.q₀))/denom(3,-q₂,mUVexp²,-mUV²+(q₂.q₂))
  2141. 212.26 s > +4·(q₀.q₂)²/denom(3,-q₂,mUVexp²,-mUV²+(q₂.q₂))²
  2142. 212.26 s > )/(denom(2,q₂,mUVexp²,-mUV²+(q₂.q₂))·denom(3,-q₂,mUVexp²,-mUV²+(q₂.q₂)))
  2143. 212.26 s > )·q₀(αᵉ².¹)·q₀(αᵉ³.¹)·q₂(αᵉ².¹)·q₂(αᵉ³.¹)
  2144. 212.26 s > -SCALAR_COUPLING²·q₀(αᵉ².¹)·q₀(αᵉ³.¹)·q₂(αᵉ².¹)·q₂(αᵉ³.¹)
  2145. 212.26 s > /(denom(2,q₂,mUVexp²,-mUV²+(q₂.q₂))·denom(3,-q₂,mUVexp²,-mUV²+(q₂.q₂)))
  2146. 212.26 s > +2·SCALAR_COUPLING²·(q₀.q₂)·q₀(αᵉ².¹)·q₀(αᵉ³.¹)·q₂(αᵉ².¹)·q₂(αᵉ³.¹)
  2147. 212.26 s > /(denom(2,q₂,mUVexp²,-mUV²+(q₂.q₂))·denom(3,-q₂,mUVexp²,-mUV²+(q₂.q₂))²)
  2148. 212.26 s > span t{span_context=true current=subgraph=y, topo_order=1, dod=2 given=subgraph=0, topo_order=0, dod=0}
  2149. 212.26 s > [2026-08-26 05:39:13.741] @approx::local_4d [{#uv, #collect, #integrated}] DEBUG : After gamma chain collection
  2150. 212.26 s > field value
  2151. 212.26 s > expr n-terms: 3, byte size: 1880,expr:
  2152. 212.26 s > (1/2·SCALAR_COUPLING²·(2·mUVexp²-2·mass_scalar_2²)/(denom(2,q₂,mUVexp²,-mUV²+(q₂.q₂))²·denom(3,-q₂,mUVexp²,-mUV²+(q₂.q₂)))
  2153. 212.26 s > -SCALAR_COUPLING²
  2154. 212.26 s > ·(-1/2·(2·mUVexp²-2·mass_scalar_2²+2·(q₀.q₀))/denom(3,-q₂,mUVexp²,-mUV²+(q₂.q₂))
  2155. 212.26 s > +4·(q₀.q₂)²/denom(3,-q₂,mUVexp²,-mUV²+(q₂.q₂))²
  2156. 212.26 s > )/(denom(2,q₂,mUVexp²,-mUV²+(q₂.q₂))·denom(3,-q₂,mUVexp²,-mUV²+(q₂.q₂)))
  2157. 212.26 s > )·q₀(αᵉ².¹)·q₀(αᵉ³.¹)·q₂(αᵉ².¹)·q₂(αᵉ³.¹)
  2158. 212.26 s > -SCALAR_COUPLING²·q₀(αᵉ².¹)·q₀(αᵉ³.¹)·q₂(αᵉ².¹)·q₂(αᵉ³.¹)
  2159. 212.26 s > /(denom(2,q₂,mUVexp²,-mUV²+(q₂.q₂))·denom(3,-q₂,mUVexp²,-mUV²+(q₂.q₂)))
  2160. 212.26 s > +2·SCALAR_COUPLING²·(q₀.q₂)·q₀(αᵉ².¹)·q₀(αᵉ³.¹)·q₂(αᵉ².¹)·q₂(αᵉ³.¹)
  2161. 212.26 s > /(denom(2,q₂,mUVexp²,-mUV²+(q₂.q₂))·denom(3,-q₂,mUVexp²,-mUV²+(q₂.q₂))²)
  2162. 212.26 s > span t{span_context=true current=subgraph=y, topo_order=1, dod=2 given=subgraph=0, topo_order=0, dod=0}
  2163. 212.26 s > [2026-08-26 05:39:13.743] @approx::local_4d [{#profile, #uv, #collect, #integrated, #start, #trace}] DEBUG : After gamma schoonschip
  2164. 212.26 s > field value
  2165. 212.26 s > expr n-terms: 3, byte size: 1631,expr:
  2166. 212.26 s > (1/2·SCALAR_COUPLING²·(2·mUVexp²-2·mass_scalar_2²)/(denom(2,q₂,mUVexp²,-mUV²+(q₂.q₂))²·denom(3,-q₂,mUVexp²,-mUV²+(q₂.q₂)))
  2167. 212.26 s > -SCALAR_COUPLING²
  2168. 212.26 s > ·(-1/2·(2·mUVexp²-2·mass_scalar_2²+2·(q₀.q₀))/denom(3,-q₂,mUVexp²,-mUV²+(q₂.q₂))
  2169. 212.26 s > +4·(q₀.q₂)²/denom(3,-q₂,mUVexp²,-mUV²+(q₂.q₂))²
  2170. 212.26 s > )/(denom(2,q₂,mUVexp²,-mUV²+(q₂.q₂))·denom(3,-q₂,mUVexp²,-mUV²+(q₂.q₂)))
  2171. 212.26 s > )·(q₀.q₂)²
  2172. 212.26 s > -SCALAR_COUPLING²·(q₀.q₂)²/(denom(2,q₂,mUVexp²,-mUV²+(q₂.q₂))·denom(3,-q₂,mUVexp²,-mUV²+(q₂.q₂)))
  2173. 212.26 s > +2·SCALAR_COUPLING²·(q₀.q₂)·(q₀.q₂)²
  2174. 212.26 s > /(denom(2,q₂,mUVexp²,-mUV²+(q₂.q₂))·denom(3,-q₂,mUVexp²,-mUV²+(q₂.q₂))²)
  2175. 212.26 s > span t{span_context=true current=subgraph=y, topo_order=1, dod=2 given=subgraph=0, topo_order=0, dod=0}
  2176. 212.26 s > [2026-08-26 05:39:13.744] @approx::local_4d [{#profile, #uv, #collect, #integrated, #start, #trace}] DEBUG : After gamma collection
  2177. 212.26 s > field value
  2178. 212.26 s > expr n-terms: 1, byte size: 1347,expr:
  2179. 212.26 s > SCALAR_COUPLING²
  2180. 212.26 s > ·(-denom(2,q₂,mUVexp²,-mUV²+(q₂.q₂))·denom(3,-q₂,mUVexp²,-mUV²+(q₂.q₂))²
  2181. 212.26 s > +1/2·(2·mUVexp²-2·mass_scalar_2²)·denom(3,-q₂,mUVexp²,-mUV²+(q₂.q₂))²
  2182. 212.26 s > -(-1/2·(2·mUVexp²-2·mass_scalar_2²+2·(q₀.q₀))·denom(3,-q₂,mUVexp²,-mUV²+(q₂.q₂))+4·(q₀.q₂)²)
  2183. 212.26 s > ·denom(2,q₂,mUVexp²,-mUV²+(q₂.q₂))
  2184. 212.26 s > +2·(q₀.q₂)·denom(2,q₂,mUVexp²,-mUV²+(q₂.q₂))·denom(3,-q₂,mUVexp²,-mUV²+(q₂.q₂))
  2185. 212.26 s > )·(q₀.q₂)²/(denom(2,q₂,mUVexp²,-mUV²+(q₂.q₂))²·denom(3,-q₂,mUVexp²,-mUV²+(q₂.q₂))³)
  2186. 212.26 s > span t{span_context=true current=subgraph=y, topo_order=1, dod=2 given=subgraph=0, topo_order=0, dod=0}
  2187. 212.26 s > [2026-08-26 05:39:13.745] @approx::local_4d [{#profile, #uv, #gamma, #integrated, #start, #trace, #vakint}] DEBUG : After gamma simplification
  2188. 212.26 s > ... omitted 3263 more lines; see full nextest output above
  2189. 212.26 s >
  2190. 212.26 s > 8. gammaloop-integration-tests::uv::sunrise_scalar_1_uv
  2191. 212.26 s > failure: test failure with exit code 101
  2192. 212.26 s > system-out
  2193. 212.26 s > running 1 test
  2194. 212.26 s > test sunrise_scalar_1_uv has been running for over 60 seconds
  2195. 212.26 s > +------------------+------------------------+--------------+--------+----------+----------------------------------------------------------------------------------------------------------------------+-------+
  2196. 212.26 s > | case | check | graph | status | sigma | threshold | error |
  2197. 212.26 s > +------------------+------------------------+--------------+--------+----------+----------------------------------------------------------------------------------------------------------------------+-------+
  2198. 212.26 s > | sunrise_scalar_1 | uv_profile | - | FAIL | - | - | - |
  2199. 212.26 s > +------------------+------------------------+--------------+--------+----------+----------------------------------------------------------------------------------------------------------------------+-------+
  2200. 212.26 s > | sunrise_scalar_1 | m_uv.inspect | inspect | pass | - | best inspect relative delta 1.624e0 >= 1000*accuracy 1.000e-3 (accuracy=1.000e-6, exponent=+1.0, seed=1, probes=10) | - |
  2201. 212.26 s > +------------------+------------------------+--------------+--------+----------+----------------------------------------------------------------------------------------------------------------------+-------+
  2202. 212.26 s > | sunrise_scalar_1 | m_uv.integrated | sunrise | pass | 0.1sigma | compatible within 2sigma | - |
  2203. 212.26 s > +------------------+------------------------+--------------+--------+----------+----------------------------------------------------------------------------------------------------------------------+-------+
  2204. 212.26 s > | sunrise_scalar_1 | rls.inspect | inspect | pass | - | best inspect relative delta 8.682e-1 >= 1000*accuracy 1.000e-3 (accuracy=1.000e-6, exponent=+1.0, seed=1, probes=10) | - |
  2205. 212.26 s > +------------------+------------------------+--------------+--------+----------+----------------------------------------------------------------------------------------------------------------------+-------+
  2206. 212.26 s > | sunrise_scalar_1 | rls.integrated | sunrise | pass | 0.0sigma | compatible within 2sigma | - |
  2207. 212.26 s > +------------------+------------------------+--------------+--------+----------+----------------------------------------------------------------------------------------------------------------------+-------+
  2208. 212.26 s > | sunrise_scalar_1 | mu_r.inspect | inspect | pass | - | best inspect relative delta 1.752e0 >= 1000*accuracy 1.000e-3 (accuracy=1.000e-6, exponent=+1.0, seed=1, probes=10) | - |
  2209. 212.26 s > +------------------+------------------------+--------------+--------+----------+----------------------------------------------------------------------------------------------------------------------+-------+
  2210. 212.26 s > | sunrise_scalar_1 | integrated.relerr | integrated | pass | - | relative error 9.20% <= 10.00% | - |
  2211. 212.26 s > +------------------+------------------------+--------------+--------+----------+----------------------------------------------------------------------------------------------------------------------+-------+
  2212. 212.26 s > | sunrise_scalar_1 | m_uv.integrated.relerr | m_uv-shifted | pass | - | relative error 5.89% <= 10.00% | - |
  2213. 212.26 s > +------------------+------------------------+--------------+--------+----------+----------------------------------------------------------------------------------------------------------------------+-------+
  2214. 212.26 s > | sunrise_scalar_1 | target | - | pass | - | 2sigma | - |
  2215. 212.26 s > +------------------+------------------------+--------------+--------+----------+----------------------------------------------------------------------------------------------------------------------+-------+
  2216. 212.26 s > test sunrise_scalar_1_uv ... FAILED
  2217. 212.26 s >
  2218. 212.26 s > failures:
  2219. 212.26 s >
  2220. 212.26 s > failures:
  2221. 212.26 s > sunrise_scalar_1_uv
  2222. 212.26 s >
  2223. 212.26 s > test result: FAILED. 0 passed; 1 failed; 0 ignored; 0 measured; 24 filtered out; finished in 117.83s
  2224. 212.26 s > system-err
  2225. 212.26 s > [2026-08-26 05:39:18.338] @gammaloop_api::se... INFO : Running command run generate
  2226. 212.26 s > [2026-08-26 05:39:18.338] @gammaloop_api::se... INFO : Starting command block generate
  2227. 212.26 s > [2026-08-26 05:39:18.339] @gammaloop_api::se... INFO : Running command import model scalars-default.json
  2228. 212.26 s > [2026-08-26 05:39:18.339] @import::model INFO : Loading built-in JSON model scalars-default
  2229. 212.26 s > [2026-08-26 05:39:18.342] @gammalooprs::model INFO : The following 2 external parameters were forced to zero by the restriction card:
  2230. 212.26 s > width_scalar_1, width_scalar_2
  2231. 212.26 s > [2026-08-26 05:39:18.343] @gammaloop_api::se... INFO : Running command remove processes
  2232. 212.26 s > [2026-08-26 05:39:18.343] @gammaloop_api::se... INFO : Running command set global kv global.generation.uv.generate_integrated=true
  2233. 212.26 s > [2026-08-26 05:39:18.343] @gammaloop_api::se... INFO : Running command import graphs ./tests/resources/graphs/scalar_sunrise.dot -p sunrise_scalar_1 -i scalar_sunrise
  2234. 212.26 s > [2026-08-26 05:39:18.343] @commands::import INFO : Loading graphs from '/build/source/tests/resources/graphs/scalar_sunrise.dot'
  2235. 212.26 s > [2026-08-26 05:39:18.346] @gammaloop_api::se... INFO : Running command generate existing -p sunrise_scalar_1 -i scalar_sunrise
  2236. 212.26 s > [2026-08-26 05:39:18.348] @approx::local_4d [{#uv, #inspect, #integrated}] DEBUG : Rescaled momenta expanded
  2237. 212.26 s > field value
  2238. 212.26 s > res n-terms: 1, byte size: 777,expr:
  2239. 212.26 s > 1/(denom(0,q₀/t,mass_scalar_1²,-mass_scalar_1²+(q₀.q₀)/t²)·denom(1,q₁/t,mass_scalar_1²,-mass_scalar_1²+(q₁.q₁)/t²)
  2240. 212.26 s > ·denom(2,q₄-q₀/t-q₁/t,mass_scalar_1²,
  2241. 212.26 s > -mass_scalar_1²-2·(q₀.q₄)/t-2·(q₁.q₄)/t+(q₀.q₀)/t²+2·(q₀.q₁)/t²
  2242. 212.26 s > +(q₁.q₁)/t²+(q₄.q₄)
  2243. 212.26 s > ))
  2244. 212.26 s > [2026-08-26 05:39:18.351] @approx::local_4d [{#uv, #inspect, #integrated}] DEBUG : Rescaled momenta expanded
  2245. 212.26 s > field value
  2246. 212.26 s > res n-terms: 1, byte size: 3,expr:
  2247. 212.26 s > 1
  2248. 212.26 s > [2026-08-26 05:39:18.352] @approx::local_4d [{#uv, #inspect, #integrated}] DEBUG : Rescaled momenta expanded
  2249. 212.26 s > field value
  2250. 212.26 s > res n-terms: 1, byte size: 611,expr:
  2251. 212.26 s > 1/(denom(0,q₀/t,mass_scalar_1²,-mass_scalar_1²+(q₀.q₀)/t²)
  2252. 212.26 s > ·denom(1,-q₂+q₃-q₀/t,mass_scalar_1²,
  2253. 212.26 s > -mass_scalar_1²+2·(q₀.q₂)/t-2·(q₀.q₃)/t+(q₀.q₀)/t²+(q₂.q₂)
  2254. 212.26 s > -2·(q₂.q₃)+(q₃.q₃)
  2255. 212.26 s > ))
  2256. 212.26 s > [2026-08-26 05:39:18.354] @approx::local_4d [{#uv, #inspect, #integrated}] DEBUG : Rescaled momenta expanded
  2257. 212.26 s > field value
  2258. 212.26 s > res n-terms: 1, byte size: 611,expr:
  2259. 212.26 s > 1/(denom(1,q₁/t,mass_scalar_1²,-mass_scalar_1²+(q₁.q₁)/t²)
  2260. 212.26 s > ·denom(2,-q₀+q₃-q₁/t,mass_scalar_1²,
  2261. 212.26 s > -mass_scalar_1²+2·(q₀.q₁)/t-2·(q₁.q₃)/t+(q₁.q₁)/t²+(q₀.q₀)
  2262. 212.26 s > -2·(q₀.q₃)+(q₃.q₃)
  2263. 212.26 s > ))
  2264. 212.26 s > [2026-08-26 05:39:18.355] @approx::local_4d [{#uv, #inspect, #integrated}] DEBUG : Rescaled momenta expanded
  2265. 212.26 s > field value
  2266. 212.26 s > res n-terms: 1, byte size: 611,expr:
  2267. 212.26 s > 1/(denom(0,q₀/t,mass_scalar_1²,-mass_scalar_1²+(q₀.q₀)/t²)
  2268. 212.26 s > ·denom(2,-q₁+q₃-q₀/t,mass_scalar_1²,
  2269. 212.26 s > -mass_scalar_1²+2·(q₀.q₁)/t-2·(q₀.q₃)/t+(q₀.q₀)/t²+(q₁.q₁)
  2270. 212.26 s > -2·(q₁.q₃)+(q₃.q₃)
  2271. 212.26 s > ))
  2272. 212.26 s > [2026-08-26 05:39:18.356] @approx::final_integrand[{#generation, #profile, #uv, #graph, #summary}] DEBUG : Computed global numerator
  2273. 212.26 s > field value
  2274. 212.26 s > global_num n-terms: 1, byte size: 3,expr:
  2275. 212.26 s > 1
  2276. 212.26 s > span build_3d{span_context=true graph=sunrise current=subgraph=0, topo_order=0, dod=0}
  2277. 212.26 s > [2026-08-26 05:39:18.357] @uv::approx [{#generation, #uv, #fourd}] DEBUG : Computing 4D
  2278. 212.26 s > field value
  2279. 212.26 s > simple subgraph(S_47,S_44)*Approx(subgraph(S_44,0)) of sunrise
  2280. 212.26 s > span compute_4d{span_context=true graph=sunrise current=subgraph=44, topo_order=1, dod=2 given=subgraph=0, topo_order=0, dod=0 reduced=SubSet { set: BitVec<usize, bitvec::order::Lsb0> { addr: 0x7fffec012f40, head: 000000, bits: 8, capacity: 64 } [0, 0, 1, 1, 1, 1, 1, 1], id: PhantomData<linnet::half_edge::involution::Hedge> }}
  2281. 212.26 s > [2026-08-26 05:39:18.358] @approx::local_4d [{#uv, #algebra, #integrated, #start}] DEBUG :
  2282. 212.26 s > field value
  2283. 212.26 s > integrand n-terms: 1, byte size: 322,expr:
  2284. 212.26 s > 1/(denom(0,q₀,mass_scalar_1²,-mass_scalar_1²+(q₀.q₀))·denom(1,q₁,mass_scalar_1²,-mass_scalar_1²+(q₁.q₁))
  2285. 212.26 s > ·denom(2,q₂,mass_scalar_1²,-mass_scalar_1²+(q₂.q₂)))
  2286. 212.26 s > reduced 44
  2287. 212.26 s > span grow{span_context=true current=subgraph=44, topo_order=1, dod=2 given=subgraph=0, topo_order=0, dod=0}
  2288. 212.26 s > [2026-08-26 05:39:18.358] @approx::local_4d [{#uv, #inspect, #integrated}] DEBUG : Rescaled momenta expanded
  2289. 212.26 s > field value
  2290. 212.26 s > res n-terms: 1, byte size: 777,expr:
  2291. 212.26 s > 1/(denom(0,q₀/t,mass_scalar_1²,-mass_scalar_1²+(q₀.q₀)/t²)·denom(1,q₁/t,mass_scalar_1²,-mass_scalar_1²+(q₁.q₁)/t²)
  2292. 212.26 s > ·denom(2,q₄-q₀/t-q₁/t,mass_scalar_1²,
  2293. 212.26 s > -mass_scalar_1²-2·(q₀.q₄)/t-2·(q₁.q₄)/t+(q₀.q₀)/t²+2·(q₀.q₁)/t²
  2294. 212.26 s > +(q₁.q₁)/t²+(q₄.q₄)
  2295. 212.26 s > ))
  2296. 212.26 s > span t{span_context=true current=subgraph=44, topo_order=1, dod=2 given=subgraph=0, topo_order=0, dod=0}
  2297. 212.26 s > [2026-08-26 05:39:18.358] @approx::local_4d [{#uv, #integrated, #rescaled}] DEBUG : Rescaled expanded
  2298. 212.26 s > field value
  2299. 212.26 s > n_loops 2
  2300. 212.26 s > res n-terms: 1, byte size: 982,expr:
  2301. 212.26 s > 1/(t²
  2302. 212.26 s > ·denom(2,-q₀-q₁,mUVexp²+t²·mass_scalar_1²,
  2303. 212.26 s > -mUV²
  2304. 212.26 s > +t²
  2305. 212.26 s > ·(-mass_scalar_1²-2·(q₀.q₄)/t-2·(q₁.q₄)/t+(q₀.q₀)/t²+2·(q₀.q₁)/t²
  2306. 212.26 s > +(q₁.q₁)/t²+(q₄.q₄)
  2307. 212.26 s > )
  2308. 212.26 s > +t²·mUVexp²
  2309. 212.26 s > )
  2310. 212.26 s > ·denom(0,q₀,mUVexp²+t²·mass_scalar_1²,-mUV²+t²·(-mass_scalar_1²+(q₀.q₀)/t²)+t²·mUVexp²)
  2311. 212.26 s > ·denom(1,q₁,mUVexp²+t²·mass_scalar_1²,-mUV²+t²·(-mass_scalar_1²+(q₁.q₁)/t²)+t²·mUVexp²))
  2312. 212.26 s > span t{span_context=true current=subgraph=44, topo_order=1, dod=2 given=subgraph=0, topo_order=0, dod=0}
  2313. 212.26 s > [2026-08-26 05:39:18.359] @approx::local_4d [{#uv, #integrated, #series}] DEBUG : Series expanded
  2314. 212.26 s > field value
  2315. 212.26 s > res n-terms: 4, byte size: 3187,expr:
  2316. 212.26 s > -1/2·(2·mUVexp²-2·mass_scalar_1²)
  2317. 212.26 s > /(denom(0,q₀,mUVexp²,-mUV²+(q₀.q₀))·denom(1,q₁,mUVexp²,-mUV²+(q₁.q₁))²
  2318. 212.26 s > ·denom(2,-q₀-q₁,mUVexp²,-mUV²+(q₀.q₀)+2·(q₀.q₁)+(q₁.q₁)))
  2319. 212.26 s > +(-1/2·(2·mUVexp²-2·mass_scalar_1²)
  2320. 212.26 s > /(denom(0,q₀,mUVexp²,-mUV²+(q₀.q₀))²
  2321. 212.26 s > ·denom(2,-q₀-q₁,mUVexp²,-mUV²+(q₀.q₀)+2·(q₀.q₁)+(q₁.q₁)))
  2322. 212.26 s > +(-1/2·(2·mUVexp²-2·mass_scalar_1²+2·(q₄.q₄))
  2323. 212.26 s > /denom(2,-q₀-q₁,mUVexp²,-mUV²+(q₀.q₀)+2·(q₀.q₁)+(q₁.q₁))
  2324. 212.26 s > +(-2·(q₀.q₄)-2·(q₁.q₄))²
  2325. 212.26 s > /denom(2,-q₀-q₁,mUVexp²,-mUV²+(q₀.q₀)+2·(q₀.q₁)+(q₁.q₁))²
  2326. 212.26 s > )
  2327. 212.26 s > /(denom(0,q₀,mUVexp²,-mUV²+(q₀.q₀))
  2328. 212.26 s > ·denom(2,-q₀-q₁,mUVexp²,-mUV²+(q₀.q₀)+2·(q₀.q₁)+(q₁.q₁)))
  2329. 212.26 s > )/denom(1,q₁,mUVexp²,-mUV²+(q₁.q₁))
  2330. 212.26 s > -(-2·(q₀.q₄)-2·(q₁.q₄))
  2331. 212.26 s > /(t·denom(0,q₀,mUVexp²,-mUV²+(q₀.q₀))·denom(1,q₁,mUVexp²,-mUV²+(q₁.q₁))
  2332. 212.26 s > ·denom(2,-q₀-q₁,mUVexp²,-mUV²+(q₀.q₀)+2·(q₀.q₁)+(q₁.q₁))²)
  2333. 212.26 s > +1/(t²·denom(0,q₀,mUVexp²,-mUV²+(q₀.q₀))·denom(1,q₁,mUVexp²,-mUV²+(q₁.q₁))
  2334. 212.26 s > ·denom(2,-q₀-q₁,mUVexp²,-mUV²+(q₀.q₀)+2·(q₀.q₁)+(q₁.q₁)))
  2335. 212.26 s > span t{span_context=true current=subgraph=44, topo_order=1, dod=2 given=subgraph=0, topo_order=0, dod=0}
  2336. 212.26 s > [2026-08-26 05:39:18.360] @approx::local_4d [{#uv, #integrated, #series}] DEBUG : Evaluated at t = 1
  2337. 212.26 s > field value
  2338. 212.26 s > res n-terms: 4, byte size: 3171,expr:
  2339. 212.26 s > -1/2·(2·mUVexp²-2·mass_scalar_1²)
  2340. 212.26 s > /(denom(0,q₀,mUVexp²,-mUV²+(q₀.q₀))·denom(1,q₁,mUVexp²,-mUV²+(q₁.q₁))²
  2341. 212.26 s > ·denom(2,-q₀-q₁,mUVexp²,-mUV²+(q₀.q₀)+2·(q₀.q₁)+(q₁.q₁)))
  2342. 212.26 s > -(-2·(q₀.q₄)-2·(q₁.q₄))
  2343. 212.26 s > /(denom(0,q₀,mUVexp²,-mUV²+(q₀.q₀))·denom(1,q₁,mUVexp²,-mUV²+(q₁.q₁))
  2344. 212.26 s > ... omitted 20090 more lines; see full nextest output above
  2345. 212.26 s >
  2346. 212.26 s > 9. gammaloop-integration-tests::uv::se1l_uv
  2347. 212.26 s > failure: test failure with exit code 101
  2348. 212.26 s > system-out
  2349. 212.26 s > running 1 test
  2350. 212.26 s > test se1l_uv has been running for over 60 seconds
  2351. 212.26 s > +------+-----------------+---------+--------+----------+-----------------------------------------------------------------------------------------------------------------------+-------+
  2352. 212.26 s > | case | check | graph | status | sigma | threshold | error |
  2353. 212.26 s > +------+-----------------+---------+--------+----------+-----------------------------------------------------------------------------------------------------------------------+-------+
  2354. 212.26 s > | se1l | uv_profile | - | FAIL | - | - | - |
  2355. 212.26 s > +------+-----------------+---------+--------+----------+-----------------------------------------------------------------------------------------------------------------------+-------+
  2356. 212.26 s > | se1l | m_uv.inspect | inspect | pass | - | best inspect relative delta 1.097e-1 >= 1000*accuracy 1.000e-7 (accuracy=1.000e-10, exponent=+2.0, seed=1, probes=10) | - |
  2357. 212.26 s > +------+-----------------+---------+--------+----------+-----------------------------------------------------------------------------------------------------------------------+-------+
  2358. 212.26 s > | se1l | m_uv.integrated | se1l | pass | 0.1sigma | compatible within 2sigma | - |
  2359. 212.26 s > +------+-----------------+---------+--------+----------+-----------------------------------------------------------------------------------------------------------------------+-------+
  2360. 212.26 s > | se1l | rls.inspect | inspect | pass | - | best inspect relative delta 4.499e-2 >= 1000*accuracy 1.000e-7 (accuracy=1.000e-10, exponent=+2.0, seed=1, probes=10) | - |
  2361. 212.26 s > +------+-----------------+---------+--------+----------+-----------------------------------------------------------------------------------------------------------------------+-------+
  2362. 212.26 s > | se1l | rls.integrated | se1l | pass | 0.0sigma | compatible within 2sigma | - |
  2363. 212.26 s > +------+-----------------+---------+--------+----------+-----------------------------------------------------------------------------------------------------------------------+-------+
  2364. 212.26 s > | se1l | mu_r.inspect | inspect | pass | - | best inspect relative delta 1.424e-1 >= 1000*accuracy 1.000e-7 (accuracy=1.000e-10, exponent=+2.0, seed=1, probes=10) | - |
  2365. 212.26 s > +------+-----------------+---------+--------+----------+-----------------------------------------------------------------------------------------------------------------------+-------+
  2366. 212.26 s > | se1l | target | - | pass | - | 2sigma | - |
  2367. 212.26 s > +------+-----------------+---------+--------+----------+-----------------------------------------------------------------------------------------------------------------------+-------+
  2368. 212.26 s > test se1l_uv ... FAILED
  2369. 212.26 s >
  2370. 212.26 s > failures:
  2371. 212.26 s >
  2372. 212.26 s > failures:
  2373. 212.26 s > se1l_uv
  2374. 212.26 s >
  2375. 212.26 s > test result: FAILED. 0 passed; 1 failed; 0 ignored; 0 measured; 24 filtered out; finished in 136.02s
  2376. 212.26 s > system-err
  2377. 212.26 s > [2026-08-26 05:39:18.119] @gammaloop_api::se... INFO : Running command run generate
  2378. 212.26 s > [2026-08-26 05:39:18.119] @gammaloop_api::se... INFO : Starting command block generate
  2379. 212.26 s > [2026-08-26 05:39:18.119] @gammaloop_api::se... INFO : Running command import model sm-default
  2380. 212.26 s > [2026-08-26 05:39:18.120] @import::model INFO : Loading built-in JSON model sm-default
  2381. 212.26 s > [2026-08-26 05:39:18.158] @gammalooprs::model INFO : The following 11 external parameters were forced to zero by the restriction card:
  2382. 212.26 s > lamWS, AWS, rhoWS, etaWS, ymc, yme, ymm, MC, Me, MM, WTau
  2383. 212.26 s > [2026-08-26 05:39:18.158] @gammalooprs::model INFO : The following 34 vertex rules were removed by the restriction card:
  2384. 212.26 s > V_82 -> (c~, d, G+) | V_83 -> (t~, d, G+) | V_84 -> (c~, s, G+) | V_85 -> (t~, s, G+) | V_86 -> (u~, b, G+) | V_87 -> (c~, b, G+) | V_90 -> (c~, d, W+) | V_91 -> (t~, d, W+) | V_92 -> (u~, s, W+) | V_94 -> (t~, s, W+) | V_95 -> (u~, b, W+) | V_96 -> (c~, b, W+) | V_101 -> (e+, e-, G0) | V_102 -> (mu+, mu-, G0) | V_104 -> (e+, e-, H) | V_105 -> (mu+, mu-, H) | V_110 -> (ve~, e-, G+) | V_111 -> (vm~, mu-, G+) | V_116 -> (b~, u, G-) | V_117 -> (d~, c, G-) | V_118 -> (s~, c, G-) | V_119 -> (b~, c, G-) | V_120 -> (d~, t, G-) | V_121 -> (s~, t, G-) | V_124 -> (s~, u, W-) | V_125 -> (b~, u, W-) | V_126 -> (d~, c, W-) | V_128 -> (b~, c, W-) | V_129 -> (d~, t, W-) | V_130 -> (s~, t, W-) | V_138 -> (c~, c, G0) | V_140 -> (c~, c, H) | V_145 -> (e+, ve, G-) | V_146 -> (mu+, vm, G-)
  2385. 212.26 s > [2026-08-26 05:39:18.158] @gammalooprs::model INFO : The following 36 couplings were removed by the restriction card:
  2386. 212.26 s > GC_13, GC_14, GC_16, GC_17, GC_18, GC_19, GC_20, GC_22, GC_23, GC_24, GC_25, GC_26, GC_28, GC_29, GC_42, GC_43, GC_44, GC_46, GC_47, GC_48, GC_84, GC_85, GC_86, GC_87, GC_88, GC_89, GC_90, GC_91, GC_92, GC_93, GC_101, GC_102, GC_103, GC_105, GC_106, GC_107
  2387. 212.26 s > [2026-08-26 05:39:18.158] @gammaloop_api::se... INFO : Running command remove processes
  2388. 212.26 s > [2026-08-26 05:39:18.162] @gammaloop_api::se... INFO : Running command set global kv global.generation.uv.generate_integrated=true
  2389. 212.26 s > [2026-08-26 05:39:18.162] @gammaloop_api::se... INFO : Running command import graphs ./tests/resources/graphs/uv_tests/se1l.dot -p se1l -i se1l
  2390. 212.26 s > [2026-08-26 05:39:18.162] @commands::import INFO : Loading graphs from '/build/source/tests/resources/graphs/uv_tests/se1l.dot'
  2391. 212.26 s > [2026-08-26 05:39:18.168] @gammaloop_api::se... INFO : Running command generate existing -p se1l -i se1l
  2392. 212.26 s > [2026-08-26 05:39:19.017] @commands::generate INFO :
  2393. 212.26 s > Integrand generation summary
  2394. 212.26 s > peak RAM 88.47 MiB | cores 1
  2395. 212.26 s > ╭───────────┬───────┬─────────┬─────────────┬─────────────┬────────────────┬─────────────╮
  2396. 212.26 s > │ integrand │ graph │ # evals │ expr build │ spenso │ symbolica eval │ compile │
  2397. 212.26 s > ├───────────┼───────┼─────────┼─────────────┼─────────────┼────────────────┼─────────────┤
  2398. 212.26 s > │ se1l │ se1l │ 5 │ 704ms (88%) │ 36ms (4.5%) │ 58ms (7.3%) │ 0ms (0.00%) │
  2399. 212.26 s > ├───────────┼───────┼─────────┼─────────────┼─────────────┼────────────────┼─────────────┤
  2400. 212.26 s > │ Total │ │ 5 │ 704ms (88%) │ 36ms (4.5%) │ 58ms (7.3%) │ 0ms (0.00%) │
  2401. 212.26 s > ╰───────────┴───────┴─────────┴─────────────┴─────────────┴────────────────┴─────────────╯
  2402. 212.26 s > [2026-08-26 05:39:19.018] @gammaloop_api::se... INFO : Running command set process -p se1l -i se1l kv general.m_uv=0.2
  2403. 212.26 s > [2026-08-26 05:39:19.020] @gammaloop_api::se... INFO : Running command set process -p se1l -i se1l kv general.mu_r=0.2
  2404. 212.26 s > [2026-08-26 05:39:19.021] @gammaloop_api::se... INFO : Running command set process -p se1l -i se1l kv general.renormalization_localization_scale=0.2
  2405. 212.26 s > [2026-08-26 05:39:19.022] @gammaloop_api::se... INFO : Running command duplicate integrand -p se1l -i se1l --output_process_name se1l --output_integrand_name se1l_muv_shifted
  2406. 212.26 s > [2026-08-26 05:39:19.024] @gammaloop_api::se... INFO : Running command set process -p se1l -i se1l_muv_shifted kv general.m_uv=0.5
  2407. 212.26 s > [2026-08-26 05:39:19.025] @gammaloop_api::se... INFO : Running command duplicate integrand -p se1l -i se1l --output_process_name se1l --output_integrand_name se1l_rls_shifted
  2408. 212.26 s > [2026-08-26 05:39:19.028] @gammaloop_api::se... INFO : Running command set process -p se1l -i se1l_rls_shifted kv general.renormalization_localization_scale=1
  2409. 212.26 s > [2026-08-26 05:39:19.029] @gammaloop_api::se... INFO : Running command duplicate integrand -p se1l -i se1l --output_process_name se1l --output_integrand_name se1l_mur_shifted
  2410. 212.26 s > [2026-08-26 05:39:19.032] @gammaloop_api::se... INFO : Running command set process -p se1l -i se1l_mur_shifted kv general.mu_r=0.8
  2411. 212.26 s > [2026-08-26 05:39:19.040] @process::amplitude WARNING : External state 0 ('g', PDG 21, helicity +) is off shell: p^2 = +2.5e5, expected m^2 = +0e0 (|Δ| = +2.5e5). Fixed-helicity spinor/vector/tensor external states may be ill-defined at this kinematic point.
  2412. 212.26 s > field value
  2413. 212.26 s > span warm_up{integrand.name=se1l}
  2414. 212.26 s > [2026-08-26 05:39:19.040] @process::amplitude WARNING : External state 1 ('g', PDG 21, helicity -) is off shell: p^2 = +2.5e5, expected m^2 = +0e0 (|Δ| = +2.5e5). Fixed-helicity spinor/vector/tensor external states may be ill-defined at this kinematic point.
  2415. 212.26 s > field value
  2416. 212.26 s > span warm_up{integrand.name=se1l}
  2417. 212.26 s > [2026-08-26 05:39:19.041] @process::amplitude INFO : Input is above threshold: 1 existing threshold E-surfaces across 1/1 graph groups
  2418. 212.26 s > field value
  2419. 212.26 s > existing_esurfaces 1
  2420. 212.26 s > group_count 1
  2421. 212.26 s > groups_above_threshold 1
  2422. 212.26 s > integrand se1l
  2423. 212.26 s > span warm_up{integrand.name=se1l}
  2424. 212.26 s > threshold_status above threshold
  2425. 212.26 s > [2026-08-26 05:39:19.041] @process::amplitude INFO : overlap structure of group 0: [1: [0(2,3)]]
  2426. 212.26 s > field value
  2427. 212.26 s > span warm_up{integrand.name=se1l}
  2428. 212.26 s > [2026-08-26 05:39:19.181] @commands::profile INFO :
  2429. 212.26 s > ╭───────┬──────┬──────────┬───────┬─────┬──────────┬───────────╮
  2430. 212.26 s > │ fixed │ → ∞ │ slope │ r2 │ DOD │ bare DOD │ inspect │
  2431. 212.26 s > ├───────┼──────┼──────────┼───────┼─────┼──────────┼───────────┤
  2432. 212.26 s > │ {} │ {e3} │ 1.639236 │ 0.904 │ 2 │ 2 │ arb retry │
  2433. 212.26 s > │ {} │ {e2} │ 1.698834 │ 0.902 │ 2 │ 2 │ arb retry │
  2434. 212.26 s > ╰───────┴──────┴──────────┴───────┴─────┴──────────┴───────────╯
  2435. 212.26 s > [2026-08-26 05:39:19.181] @commands::profile INFO :
  2436. 212.26 s > ╭───────┬──────┬─────────────┬──────────┬───────┬─────┬──────────┬───────────╮
  2437. 212.26 s > │ fixed │ → ∞ │ orientation │ slope │ r2 │ DOD │ bare DOD │ inspect │
  2438. 212.26 s > ├───────┼──────┼─────────────┼──────────┼───────┼─────┼──────────┼───────────┤
  2439. 212.26 s > │ {} │ {e3} │ 00-+ │ 0.343429 │ 0.145 │ 0 │ 2 │ arb retry │
  2440. 212.26 s > │ {} │ {e3} │ 00+- │ 0.342577 │ 0.135 │ 0 │ 2 │ arb retry │
  2441. 212.26 s > │ {} │ {e2} │ 00-+ │ 0.385975 │ 0.161 │ 0 │ 2 │ arb retry │
  2442. 212.26 s > │ {} │ {e2} │ 00+- │ 0.384920 │ 0.192 │ 0 │ 2 │ arb retry │
  2443. 212.26 s > ╰───────┴──────┴─────────────┴──────────┴───────┴─────┴──────────┴───────────╯
  2444. 212.26 s > [2026-08-26 05:39:19.182] @gammaloop_api::se... INFO : Running command set process kv integrator.target_relative_accuracy=0.001 integrator.n_increase=0 integrator.n_start=50000 integrator.n_max=400000 integrator.seed=1337
  2445. 212.26 s > [2026-08-26 05:39:19.182] @commands::integrate INFO : Created workspace directory at /build/source/tests/artifacts/se1l/integration_workspace_se1l
  2446. 212.26 s > [2026-08-26 05:39:19.200] @commands::integrate INFO : No integration state found, starting new integration
  2447. 212.26 s > [2026-08-26 05:39:19.200] @commands::integrate INFO : Gammaloop now integrates se1l@se1l, se1l@se1l_muv_shifted, se1l@se1l_rls_shifted
  2448. 212.26 s > [2026-08-26 05:39:19.200] @process::amplitude WARNING : External state 0 ('g', PDG 21, helicity +) is off shell: p^2 = +2.5e5, expected m^2 = +0e0 (|Δ| = +2.5e5). Fixed-helicity spinor/vector/tensor external states may be ill-defined at this kinematic point.
  2449. 212.26 s > field value
  2450. 212.26 s > span warm_up{integrand.name=se1l}
  2451. 212.26 s > [2026-08-26 05:39:19.200] @process::amplitude WARNING : External state 1 ('g', PDG 21, helicity -) is off shell: p^2 = +2.5e5, expected m^2 = +0e0 (|Δ| = +2.5e5). Fixed-helicity spinor/vector/tensor external states may be ill-defined at this kinematic point.
  2452. 212.26 s > field value
  2453. 212.26 s > span warm_up{integrand.name=se1l}
  2454. 212.26 s > [2026-08-26 05:39:19.201] @process::amplitude INFO : Input is above threshold: 1 existing threshold E-surfaces across 1/1 graph groups
  2455. 212.26 s > field value
  2456. 212.26 s > existing_esurfaces 1
  2457. 212.26 s > group_count 1
  2458. 212.26 s > groups_above_threshold 1
  2459. 212.26 s > integrand se1l
  2460. 212.26 s > span warm_up{integrand.name=se1l}
  2461. 212.26 s > threshold_status above threshold
  2462. 212.26 s > [2026-08-26 05:39:19.201] @process::amplitude INFO : overlap structure of group 0: [1: [0(2,3)]]
  2463. 212.26 s > field value
  2464. 212.26 s > span warm_up{integrand.name=se1l}
  2465. 212.26 s > [2026-08-26 05:39:19.202] @process::amplitude WARNING : External state 0 ('g', PDG 21, helicity +) is off shell: p^2 = +2.5e5, expected m^2 = +0e0 (|Δ| = +2.5e5). Fixed-helicity spinor/vector/tensor external states may be ill-defined at this kinematic point.
  2466. 212.26 s > field value
  2467. 212.26 s > span warm_up{integrand.name=se1l_muv_shifted}
  2468. 212.26 s > [2026-08-26 05:39:19.202] @process::amplitude WARNING : External state 1 ('g', PDG 21, helicity -) is off shell: p^2 = +2.5e5, expected m^2 = +0e0 (|Δ| = +2.5e5). Fixed-helicity spinor/vector/tensor external states may be ill-defined at this kinematic point.
  2469. 212.26 s > field value
  2470. 212.26 s > span warm_up{integrand.name=se1l_muv_shifted}
  2471. 212.26 s > [2026-08-26 05:39:19.202] @process::amplitude INFO : Input is above threshold: 1 existing threshold E-surfaces across 1/1 graph groups
  2472. 212.26 s > field value
  2473. 212.26 s > existing_esurfaces 1
  2474. 212.26 s > group_count 1
  2475. 212.26 s > groups_above_threshold 1
  2476. 212.26 s > integrand se1l_muv_shifted
  2477. 212.26 s > span warm_up{integrand.name=se1l_muv_shifted}
  2478. 212.26 s > threshold_status above threshold
  2479. 212.26 s > [2026-08-26 05:39:19.202] @process::amplitude INFO : overlap structure of group 0: [1: [0(2,3)]]
  2480. 212.26 s > field value
  2481. 212.26 s > span warm_up{integrand.name=se1l_muv_shifted}
  2482. 212.26 s > [2026-08-26 05:39:19.203] @process::amplitude WARNING : External state 0 ('g', PDG 21, helicity +) is off shell: p^2 = +2.5e5, expected m^2 = +0e0 (|Δ| = +2.5e5). Fixed-helicity spinor/vector/tensor external states may be ill-defined at this kinematic point.
  2483. 212.26 s > field value
  2484. 212.26 s > span warm_up{integrand.name=se1l_rls_shifted}
  2485. 212.26 s > [2026-08-26 05:39:19.203] @process::amplitude WARNING : External state 1 ('g', PDG 21, helicity -) is off shell: p^2 = +2.5e5, expected m^2 = +0e0 (|Δ| = +2.5e5). Fixed-helicity spinor/vector/tensor external states may be ill-defined at this kinematic point.
  2486. 212.26 s > field value
  2487. 212.26 s > span warm_up{integrand.name=se1l_rls_shifted}
  2488. 212.26 s > [2026-08-26 05:39:19.203] @process::amplitude INFO : Input is above threshold: 1 existing threshold E-surfaces across 1/1 graph groups
  2489. 212.26 s > field value
  2490. 212.26 s > existing_esurfaces 1
  2491. 212.26 s > group_count 1
  2492. 212.26 s > groups_above_threshold 1
  2493. 212.26 s > integrand se1l_rls_shifted
  2494. 212.26 s > span warm_up{integrand.name=se1l_rls_shifted}
  2495. 212.26 s > threshold_status above threshold
  2496. 212.26 s > ... omitted 1410 more lines; see full nextest output above
  2497. 212.26 s > =========================================
  2498. 212.26 s For full logs, run:
  2499. 212.26 s nix log /nix/store/z64pzsmdh7l76572yr3sfrwn8clcnq7n-gammaloop-nextest-integration.drv
  2500. 212.26 s [0 built (1 failed), 0.0Run failed.