0.20 s
$ /nix/store/9ypz3flqsrl5xl495mm8h645gadjsxi1-coreutils-9.11/bin/timeout --kill-after=15s 7200s /nix/store/23zk8sgzamrbmj1fday15szf7f2279s8-nix-2.34.7/bin/nix --extra-experimental-features nix-command --extra-experimental-features flakes flake clone git+https://github.com/alphal00p/gammaloop --dest /tmp/nix-ci-worker/stable-pwd/repo/
0.24 s
Cloning into '/tmp/nix-ci-worker/stable-pwd/repo'...
1.25 s
remote: Enumerating objects: 62303, done.
1.47 s
remote: Counting objects: 0% (1/7657)
remote: Counting objects: 1% (77/7657)
remote: Counting objects: 2% (154/7657)
remote: Counting objects: 3% (230/7657)
remote: Counting objects: 4% (307/7657)
remote: Counting objects: 5% (383/7657)
remote: Counting objects: 6% (460/7657)
remote: Counting objects: 7% (536/7657)
remote: Counting objects: 8% (613/7657)
remote: Counting objects: 9% (690/7657)
remote: Counting objects: 10% (766/7657)
remote: Counting objects: 11% (843/7657)
remote: Counting objects: 12% (919/7657)
remote: Counting objects: 13% (996/7657)
remote: Counting objects: 14% (1072/7657)
remote: Counting objects: 15% (1149/7657)
remote: Counting objects: 16% (1226/7657)
remote: Counting objects: 17% (1302/7657)
remote: Counting objects: 18% (1379/7657)
remote: Counting objects: 19% (1455/7657)
remote: Counting objects: 20% (1532/7657)
remote: Counting objects: 21% (1608/7657)
remote: Counting objects: 22% (1685/7657)
remote: Counting objects: 23% (1762/7657)
remote: Counting objects: 24% (1838/7657)
remote: Counting objects: 25% (1915/7657)
remote: Counting objects: 26% (1991/7657)
remote: Counting objects: 27% (2068/7657)
remote: Counting objects: 28% (2144/7657)
remote: Counting objects: 29% (2221/7657)
remote: Counting objects: 30% (2298/7657)
remote: Counting objects: 31% (2374/7657)
remote: Counting objects: 32% (2451/7657)
remote: Counting objects: 33% (2527/7657)
remote: Counting objects: 34% (2604/7657)
remote: Counting objects: 35% (2680/7657)
remote: Counting objects: 36% (2757/7657)
remote: Counting objects: 37% (2834/7657)
remote: Counting objects: 38% (2910/7657)
remote: Counting objects: 39% (2987/7657)
remote: Counting objects: 40% (3063/7657)
remote: Counting objects: 41% (3140/7657)
remote: Counting objects: 42% (3216/7657)
remote: Counting objects: 43% (3293/7657)
remote: Counting objects: 44% (3370/7657)
remote: Counting objects: 45% (3446/7657)
remote: Counting objects: 46% (3523/7657)
remote: Counting objects: 47% (3599/7657)
remote: Counting objects: 48% (3676/7657)
remote: Counting objects: 49% (3752/7657)
remote: Counting objects: 50% (3829/7657)
remote: Counting objects: 51% (3906/7657)
remote: Counting objects: 52% (3982/7657)
remote: Counting objects: 53% (4059/7657)
remote: Counting objects: 54% (4135/7657)
remote: Counting objects: 55% (4212/7657)
remote: Counting objects: 56% (4288/7657)
remote: Counting objects: 57% (4365/7657)
remote: Counting objects: 58% (4442/7657)
remote: Counting objects: 59% (4518/7657)
remote: Counting objects: 60% (4595/7657)
remote: Counting objects: 61% (4671/7657)
remote: Counting objects: 62% (4748/7657)
remote: Counting objects: 63% (4824/7657)
remote: Counting objects: 64% (4901/7657)
remote: Counting objects: 65% (4978/7657)
remote: Counting objects: 66% (5054/7657)
remote: Counting objects: 67% (5131/7657)
remote: Counting objects: 68% (5207/7657)
remote: Counting objects: 69% (5284/7657)
remote: Counting objects: 70% (5360/7657)
remote: Counting objects: 71% (5437/7657)
remote: Counting objects: 72% (5514/7657)
remote: Counting objects: 73% (5590/7657)
remote: Counting objects: 74% (5667/7657)
remote: Counting objects: 75% (5743/7657)
remote: Counting objects: 76% (5820/7657)
remote: Counting objects: 77% (5896/7657)
remote: Counting objects: 78% (5973/7657)
remote: Counting objects: 79% (6050/7657)
remote: Counting objects: 80% (6126/7657)
remote: Counting objects: 81% (6203/7657)
remote: Counting objects: 82% (6279/7657)
remote: Counting objects: 83% (6356/7657)
remote: Counting objects: 84% (6432/7657)
remote: Counting objects: 85% (6509/7657)
remote: Counting objects: 86% (6586/7657)
remote: Counting objects: 87% (6662/7657)
remote: Counting objects: 88% (6739/7657)
remote: Counting objects: 89% (6815/7657)
remote: Counting objects: 90% (6892/7657)
remote: Counting objects: 91% (6968/7657)
remote: Counting objects: 92% (7045/7657)
remote: Counting objects: 93% (7122/7657)
remote: Counting objects: 94% (7198/7657)
remote: Counting objects: 95% (7275/7657)
remote: Counting objects: 96% (7351/7657)
remote: Counting objects: 97% (7428/7657)
remote: Counting objects: 98% (7504/7657)
remote: Counting objects: 99% (7581/7657)
remote: Counting objects: 100% (7657/7657)
remote: Counting objects: 100% (7657/7657), done.
3.02 s
remote: Compressing objects: 0% (1/1668)
remote: Compressing objects: 1% (17/1668)
remote: Compressing objects: 2% (34/1668)
remote: Compressing objects: 3% (51/1668)
remote: Compressing objects: 4% (67/1668)
remote: Compressing objects: 5% (84/1668)
remote: Compressing objects: 6% (101/1668)
remote: Compressing objects: 7% (117/1668)
remote: Compressing objects: 8% (134/1668)
remote: Compressing objects: 9% (151/1668)
remote: Compressing objects: 10% (167/1668)
remote: Compressing objects: 11% (184/1668)
remote: Compressing objects: 12% (201/1668)
remote: Compressing objects: 13% (217/1668)
remote: Compressing objects: 14% (234/1668)
remote: Compressing objects: 15% (251/1668)
remote: Compressing objects: 16% (267/1668)
remote: Compressing objects: 17% (284/1668)
remote: Compressing objects: 17% (299/1668)
remote: Compressing objects: 18% (301/1668)
remote: Compressing objects: 19% (317/1668)
remote: Compressing objects: 20% (334/1668)
remote: Compressing objects: 21% (351/1668)
remote: Compressing objects: 22% (367/1668)
remote: Compressing objects: 23% (384/1668)
remote: Compressing objects: 24% (401/1668)
remote: Compressing objects: 25% (417/1668)
remote: Compressing objects: 26% (434/1668)
remote: Compressing objects: 27% (451/1668)
remote: Compressing objects: 28% (468/1668)
remote: Compressing objects: 29% (484/1668)
remote: Compressing objects: 30% (501/1668)
remote: Compressing objects: 31% (518/1668)
remote: Compressing objects: 32% (534/1668)
remote: Compressing objects: 33% (551/1668)
remote: Compressing objects: 34% (568/1668)
remote: Compressing objects: 35% (584/1668)
remote: Compressing objects: 36% (601/1668)
remote: Compressing objects: 37% (618/1668)
remote: Compressing objects: 38% (634/1668)
remote: Compressing objects: 39% (651/1668)
remote: Compressing objects: 40% (668/1668)
remote: Compressing objects: 41% (684/1668)
remote: Compressing objects: 42% (701/1668)
remote: Compressing objects: 43% (718/1668)
remote: Compressing objects: 44% (734/1668)
remote: Compressing objects: 45% (751/1668)
remote: Compressing objects: 46% (768/1668)
remote: Compressing objects: 47% (784/1668)
remote: Compressing objects: 48% (801/1668)
remote: Compressing objects: 49% (818/1668)
remote: Compressing objects: 50% (834/1668)
remote: Compressing objects: 51% (851/1668)
remote: Compressing objects: 52% (868/1668)
remote: Compressing objects: 53% (885/1668)
remote: Compressing objects: 54% (901/1668)
remote: Compressing objects: 55% (918/1668)
remote: Compressing objects: 56% (935/1668)
remote: Compressing objects: 57% (951/1668)
remote: Compressing objects: 58% (968/1668)
remote: Compressing objects: 59% (985/1668)
remote: Compressing objects: 60% (1001/1668)
remote: Compressing objects: 61% (1018/1668)
remote: Compressing objects: 62% (1035/1668)
remote: Compressing objects: 63% (1051/1668)
remote: Compressing objects: 64% (1068/1668)
remote: Compressing objects: 65% (1085/1668)
remote: Compressing objects: 66% (1101/1668)
remote: Compressing objects: 67% (1118/1668)
remote: Compressing objects: 68% (1135/1668)
remote: Compressing objects: 69% (1151/1668)
remote: Compressing objects: 70% (1168/1668)
remote: Compressing objects: 71% (1185/1668)
remote: Compressing objects: 72% (1201/1668)
remote: Compressing objects: 73% (1218/1668)
remote: Compressing objects: 74% (1235/1668)
remote: Compressing objects: 75% (1251/1668)
remote: Compressing objects: 76% (1268/1668)
remote: Compressing objects: 77% (1285/1668)
remote: Compressing objects: 78% (1302/1668)
remote: Compressing objects: 79% (1318/1668)
remote: Compressing objects: 80% (1335/1668)
remote: Compressing objects: 81% (1352/1668)
remote: Compressing objects: 82% (1368/1668)
remote: Compressing objects: 83% (1385/1668)
remote: Compressing objects: 84% (1402/1668)
remote: Compressing objects: 85% (1418/1668)
remote: Compressing objects: 86% (1435/1668)
remote: Compressing objects: 87% (1452/1668)
remote: Compressing objects: 88% (1468/1668)
remote: Compressing objects: 89% (1485/1668)
remote: Compressing objects: 90% (1502/1668)
remote: Compressing objects: 91% (1518/1668)
remote: Compressing objects: 92% (1535/1668)
remote: Compressing objects: 93% (1552/1668)
remote: Compressing objects: 94% (1568/1668)
remote: Compressing objects: 95% (1585/1668)
remote: Compressing objects: 96% (1602/1668)
remote: Compressing objects: 97% (1618/1668)
remote: Compressing objects: 98% (1635/1668)
remote: Compressing objects: 99% (1652/1668)
remote: Compressing objects: 100% (1668/1668)
remote: Compressing objects: 100% (1668/1668), done.
6.19 s
Receiving objects: 0% (1/62303)
Receiving objects: 1% (624/62303)
Receiving objects: 2% (1247/62303)
Receiving objects: 3% (1870/62303)
Receiving objects: 4% (2493/62303)
Receiving objects: 5% (3116/62303)
Receiving objects: 6% (3739/62303)
Receiving objects: 7% (4362/62303)
Receiving objects: 8% (4985/62303)
Receiving objects: 9% (5608/62303)
Receiving objects: 10% (6231/62303), 11.15 MiB | 22.29 MiB/s
Receiving objects: 11% (6854/62303), 11.15 MiB | 22.29 MiB/s
Receiving objects: 12% (7477/62303), 11.15 MiB | 22.29 MiB/s
Receiving objects: 13% (8100/62303), 11.15 MiB | 22.29 MiB/s
Receiving objects: 14% (8723/62303), 11.15 MiB | 22.29 MiB/s
Receiving objects: 15% (9346/62303), 11.15 MiB | 22.29 MiB/s
Receiving objects: 16% (9969/62303), 11.15 MiB | 22.29 MiB/s
Receiving objects: 17% (10592/62303), 11.15 MiB | 22.29 MiB/s
Receiving objects: 18% (11215/62303), 11.15 MiB | 22.29 MiB/s
Receiving objects: 19% (11838/62303), 11.15 MiB | 22.29 MiB/s
Receiving objects: 20% (12461/62303), 11.15 MiB | 22.29 MiB/s
Receiving objects: 21% (13084/62303), 11.15 MiB | 22.29 MiB/s
Receiving objects: 22% (13707/62303), 11.15 MiB | 22.29 MiB/s
Receiving objects: 23% (14330/62303), 11.15 MiB | 22.29 MiB/s
Receiving objects: 24% (14953/62303), 11.15 MiB | 22.29 MiB/s
Receiving objects: 25% (15576/62303), 11.15 MiB | 22.29 MiB/s
Receiving objects: 26% (16199/62303), 11.15 MiB | 22.29 MiB/s
Receiving objects: 27% (16822/62303), 11.15 MiB | 22.29 MiB/s
Receiving objects: 28% (17445/62303), 11.15 MiB | 22.29 MiB/s
Receiving objects: 29% (18068/62303), 11.15 MiB | 22.29 MiB/s
Receiving objects: 30% (18691/62303), 11.15 MiB | 22.29 MiB/s
Receiving objects: 31% (19314/62303), 11.15 MiB | 22.29 MiB/s
Receiving objects: 32% (19937/62303), 11.15 MiB | 22.29 MiB/s
Receiving objects: 33% (20560/62303), 11.15 MiB | 22.29 MiB/s
Receiving objects: 34% (21184/62303), 11.15 MiB | 22.29 MiB/s
Receiving objects: 35% (21807/62303), 11.15 MiB | 22.29 MiB/s
Receiving objects: 36% (22430/62303), 11.15 MiB | 22.29 MiB/s
Receiving objects: 37% (23053/62303), 11.15 MiB | 22.29 MiB/s
Receiving objects: 38% (23676/62303), 11.15 MiB | 22.29 MiB/s
Receiving objects: 39% (24299/62303), 11.15 MiB | 22.29 MiB/s
Receiving objects: 40% (24922/62303), 11.15 MiB | 22.29 MiB/s
Receiving objects: 41% (25545/62303), 11.15 MiB | 22.29 MiB/s
Receiving objects: 42% (26168/62303), 11.15 MiB | 22.29 MiB/s
Receiving objects: 43% (26791/62303), 11.15 MiB | 22.29 MiB/s
Receiving objects: 44% (27414/62303), 11.15 MiB | 22.29 MiB/s
Receiving objects: 45% (28037/62303), 11.15 MiB | 22.29 MiB/s
Receiving objects: 46% (28660/62303), 11.15 MiB | 22.29 MiB/s
Receiving objects: 47% (29283/62303), 11.15 MiB | 22.29 MiB/s
Receiving objects: 48% (29906/62303), 11.15 MiB | 22.29 MiB/s
Receiving objects: 49% (30529/62303), 11.15 MiB | 22.29 MiB/s
Receiving objects: 50% (31152/62303), 11.15 MiB | 22.29 MiB/s
Receiving objects: 51% (31775/62303), 11.15 MiB | 22.29 MiB/s
Receiving objects: 52% (32398/62303), 11.15 MiB | 22.29 MiB/s
Receiving objects: 53% (33021/62303), 11.15 MiB | 22.29 MiB/s
Receiving objects: 53% (33085/62303), 30.84 MiB | 30.18 MiB/s
Receiving objects: 54% (33644/62303), 30.84 MiB | 30.18 MiB/s
Receiving objects: 55% (34267/62303), 30.84 MiB | 30.18 MiB/s
Receiving objects: 56% (34890/62303), 30.84 MiB | 30.18 MiB/s
Receiving objects: 57% (35513/62303), 30.84 MiB | 30.18 MiB/s
Receiving objects: 58% (36136/62303), 30.84 MiB | 30.18 MiB/s
Receiving objects: 59% (36759/62303), 30.84 MiB | 30.18 MiB/s
Receiving objects: 60% (37382/62303), 45.37 MiB | 29.81 MiB/s
Receiving objects: 61% (38005/62303), 45.37 MiB | 29.81 MiB/s
Receiving objects: 62% (38628/62303), 45.37 MiB | 29.81 MiB/s
Receiving objects: 63% (39251/62303), 45.37 MiB | 29.81 MiB/s
Receiving objects: 64% (39874/62303), 45.37 MiB | 29.81 MiB/s
Receiving objects: 65% (40497/62303), 45.37 MiB | 29.81 MiB/s
Receiving objects: 66% (41120/62303), 45.37 MiB | 29.81 MiB/s
Receiving objects: 67% (41744/62303), 45.37 MiB | 29.81 MiB/s
Receiving objects: 68% (42367/62303), 45.37 MiB | 29.81 MiB/s
Receiving objects: 68% (42654/62303), 45.37 MiB | 29.81 MiB/s
Receiving objects: 69% (42990/62303), 59.82 MiB | 29.60 MiB/s
Receiving objects: 70% (43613/62303), 59.82 MiB | 29.60 MiB/s
Receiving objects: 71% (44236/62303), 59.82 MiB | 29.60 MiB/s
Receiving objects: 72% (44859/62303), 59.82 MiB | 29.60 MiB/s
Receiving objects: 73% (45482/62303), 59.82 MiB | 29.60 MiB/s
Receiving objects: 74% (46105/62303), 59.82 MiB | 29.60 MiB/s
Receiving objects: 75% (46728/62303), 59.82 MiB | 29.60 MiB/s
Receiving objects: 76% (47351/62303), 59.82 MiB | 29.60 MiB/s
Receiving objects: 77% (47974/62303), 59.82 MiB | 29.60 MiB/s
Receiving objects: 78% (48597/62303), 59.82 MiB | 29.60 MiB/s
Receiving objects: 79% (49220/62303), 59.82 MiB | 29.60 MiB/s
Receiving objects: 80% (49843/62303), 59.82 MiB | 29.60 MiB/s
Receiving objects: 81% (50466/62303), 59.82 MiB | 29.60 MiB/s
Receiving objects: 82% (51089/62303), 59.82 MiB | 29.60 MiB/s
Receiving objects: 83% (51712/62303), 74.47 MiB | 29.54 MiB/s
Receiving objects: 84% (52335/62303), 74.47 MiB | 29.54 MiB/s
Receiving objects: 85% (52958/62303), 74.47 MiB | 29.54 MiB/s
Receiving objects: 86% (53581/62303), 74.47 MiB | 29.54 MiB/s
Receiving objects: 87% (54204/62303), 74.47 MiB | 29.54 MiB/s
Receiving objects: 88% (54827/62303), 74.47 MiB | 29.54 MiB/s
Receiving objects: 89% (55450/62303), 74.47 MiB | 29.54 MiB/s
Receiving objects: 90% (56073/62303), 74.47 MiB | 29.54 MiB/s
Receiving objects: 91% (56696/62303), 74.47 MiB | 29.54 MiB/s
Receiving objects: 92% (57319/62303), 74.47 MiB | 29.54 MiB/s
Receiving objects: 93% (57942/62303), 74.47 MiB | 29.54 MiB/s
Receiving objects: 94% (58565/62303), 74.47 MiB | 29.54 MiB/s
Receiving objects: 94% (58732/62303), 74.47 MiB | 29.54 MiB/s
Receiving objects: 95% (59188/62303), 74.47 MiB | 29.54 MiB/s
Receiving objects: 96% (59811/62303), 74.47 MiB | 29.54 MiB/s
Receiving objects: 97% (60434/62303), 89.68 MiB | 29.69 MiB/s
Receiving objects: 98% (61057/62303), 89.68 MiB | 29.69 MiB/s
Receiving objects: 99% (61680/62303), 89.68 MiB | 29.69 MiB/s
remote: Total 62303 (delta 6509), reused 6175 (delta 5984), pack-reused 54646 (from 3)
6.28 s
Receiving objects: 100% (62303/62303), 89.68 MiB | 29.69 MiB/s
Receiving objects: 100% (62303/62303), 93.15 MiB | 29.73 MiB/s, done.
7.27 s
Resolving deltas: 0% (0/43439)
Resolving deltas: 1% (435/43439)
Resolving deltas: 2% (869/43439)
Resolving deltas: 3% (1304/43439)
Resolving deltas: 4% (1738/43439)
Resolving deltas: 5% (2172/43439)
Resolving deltas: 6% (2607/43439)
Resolving deltas: 7% (3041/43439)
Resolving deltas: 8% (3476/43439)
Resolving deltas: 9% (3910/43439)
Resolving deltas: 10% (4344/43439)
Resolving deltas: 11% (4779/43439)
Resolving deltas: 12% (5213/43439)
Resolving deltas: 13% (5648/43439)
Resolving deltas: 14% (6082/43439)
Resolving deltas: 15% (6516/43439)
Resolving deltas: 16% (6951/43439)
Resolving deltas: 17% (7385/43439)
Resolving deltas: 18% (7820/43439)
Resolving deltas: 19% (8254/43439)
Resolving deltas: 20% (8688/43439)
Resolving deltas: 21% (9124/43439)
Resolving deltas: 22% (9557/43439)
Resolving deltas: 23% (9991/43439)
Resolving deltas: 24% (10426/43439)
Resolving deltas: 25% (10860/43439)
Resolving deltas: 26% (11295/43439)
Resolving deltas: 27% (11729/43439)
Resolving deltas: 28% (12163/43439)
Resolving deltas: 29% (12598/43439)
Resolving deltas: 30% (13032/43439)
Resolving deltas: 31% (13467/43439)
Resolving deltas: 32% (13901/43439)
Resolving deltas: 33% (14335/43439)
Resolving deltas: 34% (14770/43439)
Resolving deltas: 35% (15204/43439)
Resolving deltas: 36% (15639/43439)
Resolving deltas: 37% (16073/43439)
Resolving deltas: 38% (16507/43439)
Resolving deltas: 39% (16942/43439)
Resolving deltas: 40% (17376/43439)
Resolving deltas: 41% (17810/43439)
Resolving deltas: 42% (18245/43439)
Resolving deltas: 43% (18679/43439)
Resolving deltas: 44% (19115/43439)
Resolving deltas: 45% (19548/43439)
Resolving deltas: 46% (19982/43439)
Resolving deltas: 47% (20417/43439)
Resolving deltas: 48% (20851/43439)
Resolving deltas: 49% (21286/43439)
Resolving deltas: 50% (21720/43439)
Resolving deltas: 51% (22154/43439)
Resolving deltas: 52% (22589/43439)
Resolving deltas: 53% (23023/43439)
Resolving deltas: 54% (23458/43439)
Resolving deltas: 55% (23892/43439)
Resolving deltas: 56% (24327/43439)
Resolving deltas: 57% (24762/43439)
Resolving deltas: 58% (25196/43439)
Resolving deltas: 59% (25630/43439)
Resolving deltas: 60% (26064/43439)
Resolving deltas: 61% (26498/43439)
Resolving deltas: 62% (26933/43439)
Resolving deltas: 63% (27367/43439)
Resolving deltas: 64% (27801/43439)
Resolving deltas: 65% (28236/43439)
Resolving deltas: 66% (28670/43439)
Resolving deltas: 67% (29105/43439)
Resolving deltas: 68% (29539/43439)
Resolving deltas: 69% (29973/43439)
Resolving deltas: 70% (30408/43439)
Resolving deltas: 71% (30842/43439)
Resolving deltas: 72% (31277/43439)
Resolving deltas: 73% (31711/43439)
Resolving deltas: 74% (32145/43439)
Resolving deltas: 75% (32580/43439)
Resolving deltas: 76% (33014/43439)
Resolving deltas: 77% (33453/43439)
Resolving deltas: 78% (33883/43439)
Resolving deltas: 79% (34317/43439)
Resolving deltas: 80% (34753/43439)
Resolving deltas: 81% (35186/43439)
Resolving deltas: 82% (35620/43439)
Resolving deltas: 83% (36055/43439)
Resolving deltas: 84% (36489/43439)
Resolving deltas: 85% (36924/43439)
Resolving deltas: 86% (37358/43439)
Resolving deltas: 87% (37792/43439)
Resolving deltas: 88% (38227/43439)
Resolving deltas: 89% (38661/43439)
Resolving deltas: 90% (39096/43439)
Resolving deltas: 91% (39530/43439)
Resolving deltas: 92% (39964/43439)
Resolving deltas: 93% (40399/43439)
Resolving deltas: 93% (40687/43439)
Resolving deltas: 94% (40833/43439)
Resolving deltas: 95% (41268/43439)
Resolving deltas: 96% (41702/43439)
Resolving deltas: 97% (42136/43439)
Resolving deltas: 98% (42571/43439)
Resolving deltas: 99% (43005/43439)
Resolving deltas: 100% (43439/43439)
Resolving deltas: 100% (43439/43439), done.
7.58 s
Fetching commit ed5aa62ad38895524e198db9bbf1214fcd1c94ab for docs ...
7.58 s
$ /nix/store/bcnisk3ydfgv26v2gw3zlky24g00yww2-git-2.54.0/bin/git fetch origin ed5aa62ad38895524e198db9bbf1214fcd1c94ab
8.12 s
From https://github.com/alphal00p/gammaloop
8.12 s
* branch ed5aa62ad38895524e198db9bbf1214fcd1c94ab -> FETCH_HEAD
8.14 s
$ /nix/store/9ypz3flqsrl5xl495mm8h645gadjsxi1-coreutils-9.11/bin/timeout --kill-after=15s 7200s /nix/store/bcnisk3ydfgv26v2gw3zlky24g00yww2-git-2.54.0/bin/git -c advice.detachedHead=false checkout ed5aa62ad38895524e198db9bbf1214fcd1c94ab
8.37 s
HEAD is now at ed5aa62a include About graph fixture in Nix docs source
8.38 s
$ /nix/store/9ypz3flqsrl5xl495mm8h645gadjsxi1-coreutils-9.11/bin/timeout --kill-after=15s 7200s /nix/store/23zk8sgzamrbmj1fday15szf7f2279s8-nix-2.34.7/bin/nix --extra-experimental-features nix-command --extra-experimental-features flakes --log-format internal-json run .#packages.x86_64-linux.nix-ci-check-gammaloop-doctest --print-build-logs
10.99 s
11.17 s
Downloading cached nix-ci-check-gammaloop-doctest from https://cache.nix-ci.com
11.54 s
Downloaded cached nix-ci-check-gammaloop-doctest (1000 B) in 374ms
11.60 s
Progress: 0 of 1 built, 1 of 1 downloaded from cache
15.29 s
evaluating derivation 'g
copying '/nix/store/509j
evaluating derivation 'g
querying gammaloop-works
[0.0 KiB DL]
[0 /1 built, 0.0 KiB DL]
[1 /0 /1 built, 0.0 KiB DLgammaloop-workspace-doctest> Running phase: unpackPhase
15.29 s
gammaloop-workspace-doctest> unpacking source archive /nix/store/zw60sp2yw0jzbn0l3i8p6pynq3h4pivs-source
15.45 s
gammaloop-workspace-doctest> source root is source
15.49 s
gammaloop-workspace-doctest> Running phase: patchPhase
15.49 s
gammaloop-workspace-doctest> Executing configureCargoCommonVars
15.49 s
gammaloop-workspace-doctest> decompressing cargo artifacts from /nix/store/8rkh7d3hq722l839568nhnwihnsx041a-gammaloop-workspace-deps-deps-0.1.0/target.tar.zst to target
18.06 s
gammaloop-workspace-doctest> Running phase: updateAutotoolsGnuConfigScriptsPhase
18.11 s
gammaloop-workspace-doctest> Running phase: configurePhase
18.11 s
gammaloop-workspace-doctest> will append /build/source/.cargo-home/config.toml with contents of /nix/store/xdy1vvhll2bijdplvl9fcc2b9plkxhaa-vendor-cargo-deps/config.toml
18.11 s
gammaloop-workspace-doctest> default configurePhase, nothing to do
18.11 s
gammaloop-workspace-doctest> Running phase: buildPhase
18.11 s
gammaloop-workspace-doctest> +++ command cargo --version
18.11 s
gammaloop-workspace-doctest> cargo 1.97.0 (c980f4866 2026-06-30)
18.14 s
gammaloop-workspace-doctest> +++ command cargo test --profile ci-optim --doc --locked --workspace --features gammaloop-api/cli,gammaloop-tracing-filter/clap,gammaloop-tracing-filter/symbolica,idenso/bincode,idenso/reference-cases,linnet/bincode,linnet/drawing,linnet/nodestore-vec,linnet/rkyv,linnet/serde,linnet/symbolica,spenso-macros/shadowing,spenso/shadowing,symbolica/tracing_max_level_info
18.56 s
gammaloop-workspace-doctest> Compiling target-lexicon v0.13.5
18.57 s
gammaloop-workspace-doctest> Compiling symbolica v2.2.0 (https://github.com/symbolica-dev/symbolica?branch=dev#0441bd7a)
18.57 s
gammaloop-workspace-doctest> Compiling maplit v1.0.2
18.59 s
gammaloop-workspace-doctest> Compiling gammaloop-tracing-filter-macros v0.1.0 (/build/source/crates/gammaloop-tracing-filter-macros)
18.59 s
gammaloop-workspace-doctest> Compiling vakint v0.1.2 (/build/source/crates/vakint)
18.60 s
gammaloop-workspace-doctest> Compiling gammalooprs v0.3.4 (/build/source/crates/gammalooprs)
18.60 s
gammaloop-workspace-doctest> Compiling alphal00p-docs-macros v0.1.0 (/build/source/crates/alphal00p-docs-macros)
18.61 s
gammaloop-workspace-doctest> Compiling alphal00p-docs-schema v0.1.0 (/build/source/crates/alphal00p-docs-schema)
18.61 s
gammaloop-workspace-doctest> Compiling rustc_version v0.4.1
18.61 s
gammaloop-workspace-doctest> Compiling bincode v1.3.3
18.61 s
gammaloop-workspace-doctest> Compiling gungraun-runner v0.18.2
18.61 s
gammaloop-workspace-doctest> Compiling target-triple v1.0.1
18.61 s
gammaloop-workspace-doctest> Compiling iai-callgrind-runner v0.14.2
18.61 s
gammaloop-workspace-doctest> Compiling gammaloop-integration-tests v0.1.0 (/build/source/tests)
18.65 s
gammaloop-workspace-doctest> Compiling test-log-core v0.2.20
18.87 s
gammaloop-workspace-doctest> Compiling wait-timeout v0.2.1
18.90 s
gammaloop-workspace-doctest> Compiling iai-callgrind v0.14.2
18.93 s
gammaloop-workspace-doctest> Compiling quick-error v1.2.3
18.95 s
gammaloop-workspace-doctest> Compiling bit-vec v0.8.0
19.12 s
gammaloop-workspace-doctest> Compiling rusty-fork v0.3.1
19.20 s
gammaloop-workspace-doctest> Compiling iai-callgrind-macros v0.5.1
19.21 s
gammaloop-workspace-doctest> Compiling rand_xorshift v0.4.0
19.30 s
gammaloop-workspace-doctest> Compiling console v0.15.11
19.34 s
gammaloop-workspace-doctest> Compiling unarray v0.1.4
19.41 s
gammaloop-workspace-doctest> Compiling glob v0.3.4
19.45 s
gammaloop-workspace-doctest> Compiling base64 v0.21.7
19.53 s
gammaloop-workspace-doctest> Compiling bit-set v0.8.0
19.62 s
gammaloop-workspace-doctest> Compiling gungraun-macros v0.8.0
19.63 s
gammaloop-workspace-doctest> Compiling termcolor v1.4.1
19.97 s
gammaloop-workspace-doctest> Compiling trybuild v1.0.120
20.26 s
gammaloop-workspace-doctest> Compiling alphal00p-docs-catalogs v0.1.0 (/build/source/crates/alphal00p-docs-catalogs)
20.29 s
gammaloop-workspace-doctest> Compiling ron v0.8.1
20.29 s
gammaloop-workspace-doctest> Compiling similar-asserts v1.7.0
20.37 s
gammaloop-workspace-doctest> Compiling proptest v1.11.0
20.70 s
gammaloop-workspace-doctest> Compiling pyo3-build-config v0.28.3
20.73 s
gammaloop-workspace-doctest> Compiling alphal00p-docs-builder v0.1.0 (/build/source/crates/alphal00p-docs-builder)
20.82 s
gammaloop-workspace-doctest> Compiling kurvst v0.1.0 (/build/source/crates/kurvst)
21.92 s
gammaloop-workspace-doctest> Compiling test-log-macros v0.2.20
25.13 s
gammaloop-workspace-doctest> Compiling test-log v0.2.20
25.62 s
gammaloop-workspace-doctest> Compiling alphal00p-docs-examples v0.1.0 (/build/source/crates/alphal00p-docs-examples)
27.21 s
gammaloop-workspace-doctest> Compiling pyo3-ffi v0.28.3
27.32 s
gammaloop-workspace-doctest> Compiling pyo3-macros-backend v0.28.3
27.66 s
gammaloop-workspace-doctest> Compiling pyo3 v0.28.3
27.67 s
gammaloop-workspace-doctest> Compiling numpy v0.28.0
28.10 s
gammaloop-workspace-doctest> Compiling gammaloop-api v0.1.0 (/build/source/crates/gammaloop-api)
28.12 s
gammaloop-workspace-doctest> Compiling gungraun v0.18.2
36.63 s
gammaloop-workspace-doctest> Compiling pyo3-macros v0.28.3
42.65 s
gammaloop-workspace-doctest> Compiling pyo3-stub-gen v0.17.2
43.45 s
gammaloop-workspace-doctest> Compiling numerica v2.2.0 (https://github.com/symbolica-dev/symbolica?branch=dev#0441bd7a)
46.00 s
gammaloop-workspace-doctest> Compiling graphica v2.1.0 (https://github.com/symbolica-dev/symbolica?branch=dev#0441bd7a)
48.52 s
gammaloop-workspace-doctest> Compiling symbolica-utils v0.1.0 (/build/source/crates/symbolica-utils)
218.71 s
gammaloop-workspace-doctest> Compiling gammaloop-workspace-hack v0.1.0 (/build/source/crates/gammaloop-workspace-hack)
218.76 s
gammaloop-workspace-doctest> Compiling spenso-macros v0.3.2 (/build/source/crates/spenso-macros)
218.86 s
gammaloop-workspace-doctest> Compiling linnet v0.17.0 (/build/source/crates/linnet)
221.69 s
gammaloop-workspace-doctest> Compiling spenso v0.6.0 (/build/source/crates/spenso)
228.05 s
gammaloop-workspace-doctest> Compiling idenso v0.3.0 (/build/source/crates/idenso)
228.09 s
gammaloop-workspace-doctest> Compiling gammaloop-tracing-filter v0.1.0 (/build/source/crates/gammaloop-tracing-filter)
231.14 s
gammaloop-workspace-doctest> Compiling spenso-hep-lib v0.1.7 (/build/source/crates/spenso-hep-lib)
231.33 s
gammaloop-workspace-doctest> Compiling spynso3 v0.1.2 (/build/source/crates/spynso3)
268.97 s
gammaloop-workspace-doctest> Compiling linnest v0.1.0 (/build/source/crates/linnest)
271.33 s
gammaloop-workspace-doctest> Compiling linnet-py v0.1.0 (/build/source/crates/linnet-py)
391.07 s
gammaloop-workspace-doctest> Finished `ci-optim` profile [optimized] target(s) in 6m 12s
391.20 s
gammaloop-workspace-doctest> warning : the following packages contain code that will be rejected by a future version of Rust: proc-macro-error2 v2.0.1
391.20 s
gammaloop-workspace-doctest> note : to see what the problems were, use the option `--future-incompat-report`, or run `cargo report future-incompatibilities --id 1`
391.21 s
gammaloop-workspace-doctest> Doc-tests alphal00p_docs_builder
391.37 s
gammaloop-workspace-doctest>
391.37 s
gammaloop-workspace-doctest> running 0 tests
391.37 s
gammaloop-workspace-doctest>
391.37 s
gammaloop-workspace-doctest> test result: ok. 0 passed; 0 failed; 0 ignored; 0 measured; 0 filtered out; finished in 0.00s
391.37 s
gammaloop-workspace-doctest>
391.37 s
gammaloop-workspace-doctest> Doc-tests alphal00p_docs_catalogs
392.56 s
gammaloop-workspace-doctest>
392.56 s
gammaloop-workspace-doctest> running 0 tests
392.56 s
gammaloop-workspace-doctest>
392.56 s
gammaloop-workspace-doctest> test result: ok. 0 passed; 0 failed; 0 ignored; 0 measured; 0 filtered out; finished in 0.00s
392.56 s
gammaloop-workspace-doctest>
392.56 s
gammaloop-workspace-doctest> Doc-tests alphal00p_docs_examples
392.57 s
gammaloop-workspace-doctest>
392.57 s
gammaloop-workspace-doctest> running 0 tests
392.57 s
gammaloop-workspace-doctest>
392.57 s
gammaloop-workspace-doctest> test result: ok. 0 passed; 0 failed; 0 ignored; 0 measured; 0 filtered out; finished in 0.00s
392.57 s
gammaloop-workspace-doctest>
392.57 s
gammaloop-workspace-doctest> Doc-tests alphal00p_docs
392.63 s
gammaloop-workspace-doctest>
392.63 s
gammaloop-workspace-doctest> running 0 tests
392.63 s
gammaloop-workspace-doctest>
392.63 s
gammaloop-workspace-doctest> test result: ok. 0 passed; 0 failed; 0 ignored; 0 measured; 0 filtered out; finished in 0.00s
392.63 s
gammaloop-workspace-doctest>
392.63 s
gammaloop-workspace-doctest> Doc-tests alphal00p_docs_schema
392.70 s
gammaloop-workspace-doctest>
392.70 s
gammaloop-workspace-doctest> running 0 tests
392.70 s
gammaloop-workspace-doctest>
392.70 s
gammaloop-workspace-doctest> test result: ok. 0 passed; 0 failed; 0 ignored; 0 measured; 0 filtered out; finished in 0.00s
392.70 s
gammaloop-workspace-doctest>
392.70 s
gammaloop-workspace-doctest> Doc-tests gammaloop_api
393.63 s
gammaloop-workspace-doctest>
393.63 s
gammaloop-workspace-doctest> running 16 tests
393.65 s
gammaloop-workspace-doctest> test crates/gammaloop-api/src/python.rs - python::GammaLoopAPI::evaluate_samples (line 3108) ... FAILED
393.65 s
gammaloop-workspace-doctest> test crates/gammaloop-api/src/python.rs - python::GammaLoopAPI::get_active_command_blocks (line 3760) ... FAILED
393.65 s
gammaloop-workspace-doctest> test crates/gammaloop-api/src/python.rs - python::GammaLoopAPI::evaluate_sample (line 2967) ... FAILED
393.65 s
gammaloop-workspace-doctest> test crates/gammaloop-api/src/python.rs - python::GammaLoopAPI::get_default_runtime_settings (line 3796) ... FAILED
393.65 s
gammaloop-workspace-doctest> test crates/gammaloop-api/src/python.rs - python::GammaLoopAPI::get_integrand_settings (line 3647) ... FAILED
393.66 s
gammaloop-workspace-doctest> test crates/gammaloop-api/src/python.rs - python::GammaLoopAPI::get_integrand_info (line 3585) ... FAILED
393.66 s
gammaloop-workspace-doctest> test crates/gammaloop-api/src/python.rs - python::PyHistogramAccumulator (line 871) ... FAILED
393.73 s
gammaloop-workspace-doctest> test crates/gammaloop-api/src/lib.rs - (line 18) - compile ... ok
393.74 s
gammaloop-workspace-doctest> test crates/gammaloop-api/src/python.rs - python::GammaLoopAPI::run_command (line 3901) ... FAILED
393.75 s
gammaloop-workspace-doctest> test crates/gammaloop-api/src/python.rs - python::GammaLoopAPI::get_run_history (line 3711) ... FAILED
393.75 s
gammaloop-workspace-doctest> test crates/gammaloop-api/src/python.rs - python::GammaLoopAPI::get_global_settings (line 3739) ... FAILED
393.76 s
gammaloop-workspace-doctest> test crates/gammaloop-api/src/python.rs - python::GammaLoopAPI::new_python (line 2834) ... FAILED
393.76 s
gammaloop-workspace-doctest> test crates/gammaloop-api/src/python.rs - python::evaluate_graph_overall_factor (line 95) ... FAILED
393.76 s
gammaloop-workspace-doctest> test crates/gammaloop-api/src/python.rs - python::atom_to_canonical_string (line 128) ... FAILED
393.79 s
gammaloop-workspace-doctest> test crates/gammaloop-api/src/python.rs - python::atom_to_dots (line 157) ... FAILED
396.36 s
gammaloop-workspace-doctest> test crates/gammaloop-api/src/commands/evaluate_samples.rs - commands::evaluate_samples::EvaluateSamples (line 50) ... ok
396.43 s
gammaloop-workspace-doctest>
396.43 s
gammaloop-workspace-doctest> failures:
396.43 s
gammaloop-workspace-doctest>
396.43 s
gammaloop-workspace-doctest> ---- crates/gammaloop-api/src/python.rs - python::GammaLoopAPI::evaluate_samples (line 3108) stdout ----
396.43 s
gammaloop-workspace-doctest> error: expected one of `!` or `::`, found `pathlib`
396.43 s
gammaloop-workspace-doctest> --> crates/gammaloop-api/src/python.rs:3109:6
396.43 s
gammaloop-workspace-doctest> |
396.43 s
gammaloop-workspace-doctest> 3109 | from pathlib import Path
396.43 s
gammaloop-workspace-doctest> | ^^^^^^^ expected one of `!` or `::`
396.43 s
gammaloop-workspace-doctest>
396.43 s
gammaloop-workspace-doctest> error: aborting due to 1 previous error
396.43 s
gammaloop-workspace-doctest>
396.43 s
gammaloop-workspace-doctest> Couldn't compile the test.
396.43 s
gammaloop-workspace-doctest> ---- crates/gammaloop-api/src/python.rs - python::GammaLoopAPI::get_active_command_blocks (line 3760) stdout ----
396.43 s
gammaloop-workspace-doctest> error: expected item, found keyword `for`
396.43 s
gammaloop-workspace-doctest> --> crates/gammaloop-api/src/python.rs:3761:1
396.43 s
gammaloop-workspace-doctest> |
396.43 s
gammaloop-workspace-doctest> 3761 | for name, commands in api.get_active_command_blocks().items():
396.43 s
gammaloop-workspace-doctest> | ^^^ expected item
396.43 s
gammaloop-workspace-doctest> |
396.43 s
gammaloop-workspace-doctest> = note: for a full list of items that can appear in modules, see <https://doc.rust-lang.org/reference/items.html>
396.43 s
gammaloop-workspace-doctest>
396.43 s
gammaloop-workspace-doctest> error: aborting due to 1 previous error
396.43 s
gammaloop-workspace-doctest>
396.43 s
gammaloop-workspace-doctest> Couldn't compile the test.
396.43 s
gammaloop-workspace-doctest> ---- crates/gammaloop-api/src/python.rs - python::GammaLoopAPI::evaluate_sample (line 2967) stdout ----
396.43 s
gammaloop-workspace-doctest> error: expected one of `!` or `::`, found `pathlib`
396.43 s
gammaloop-workspace-doctest> --> crates/gammaloop-api/src/python.rs:2968:6
396.43 s
gammaloop-workspace-doctest> |
396.43 s
gammaloop-workspace-doctest> 2968 | from pathlib import Path
396.43 s
gammaloop-workspace-doctest> | ^^^^^^^ expected one of `!` or `::`
396.43 s
gammaloop-workspace-doctest>
396.43 s
gammaloop-workspace-doctest> error: aborting due to 1 previous error
396.43 s
gammaloop-workspace-doctest>
396.43 s
gammaloop-workspace-doctest> Couldn't compile the test.
396.43 s
gammaloop-workspace-doctest> ---- crates/gammaloop-api/src/python.rs - python::GammaLoopAPI::get_default_runtime_settings (line 3796) stdout ----
396.43 s
gammaloop-workspace-doctest> error: expected one of `!` or `::`, found `=`
396.43 s
gammaloop-workspace-doctest> --> crates/gammaloop-api/src/python.rs:3797:9
396.43 s
gammaloop-workspace-doctest> |
396.43 s
gammaloop-workspace-doctest> 3797 | runtime = api.get_default_runtime_settings()
396.43 s
gammaloop-workspace-doctest> | ^ expected one of `!` or `::`
396.43 s
gammaloop-workspace-doctest>
396.43 s
gammaloop-workspace-doctest> error: aborting due to 1 previous error
396.43 s
gammaloop-workspace-doctest>
396.43 s
gammaloop-workspace-doctest> Couldn't compile the test.
396.43 s
gammaloop-workspace-doctest> ---- crates/gammaloop-api/src/python.rs - python::GammaLoopAPI::get_integrand_settings (line 3647) stdout ----
396.43 s
gammaloop-workspace-doctest> error: expected one of `!` or `::`, found `=`
396.43 s
gammaloop-workspace-doctest> --> crates/gammaloop-api/src/python.rs:3648:10
396.43 s
gammaloop-workspace-doctest> |
396.43 s
gammaloop-workspace-doctest> 3648 | settings = api.get_integrand_settings(process_id=0)
396.43 s
gammaloop-workspace-doctest> | ^ expected one of `!` or `::`
396.43 s
gammaloop-workspace-doctest>
396.43 s
gammaloop-workspace-doctest> error: aborting due to 1 previous error
396.43 s
gammaloop-workspace-doctest>
396.43 s
gammaloop-workspace-doctest> Couldn't compile the test.
396.43 s
gammaloop-workspace-doctest> ---- crates/gammaloop-api/src/python.rs - python::GammaLoopAPI::get_integrand_info (line 3585) stdout ----
396.43 s
gammaloop-workspace-doctest> error: expected one of `!` or `::`, found `pathlib`
396.43 s
gammaloop-workspace-doctest> --> crates/gammaloop-api/src/python.rs:3586:6
396.43 s
gammaloop-workspace-doctest> |
396.43 s
gammaloop-workspace-doctest> 3586 | from pathlib import Path
396.43 s
gammaloop-workspace-doctest> | ^^^^^^^ expected one of `!` or `::`
396.43 s
gammaloop-workspace-doctest>
396.43 s
gammaloop-workspace-doctest> error: aborting due to 1 previous error
396.43 s
gammaloop-workspace-doctest>
396.43 s
gammaloop-workspace-doctest> Couldn't compile the test.
396.43 s
gammaloop-workspace-doctest> ---- crates/gammaloop-api/src/python.rs - python::PyHistogramAccumulator (line 871) stdout ----
396.43 s
gammaloop-workspace-doctest> error: expected one of `!` or `::`, found `gammaloop`
396.43 s
gammaloop-workspace-doctest> --> crates/gammaloop-api/src/python.rs:872:6
396.43 s
gammaloop-workspace-doctest> |
396.43 s
gammaloop-workspace-doctest> 872 | from gammaloop import HistogramAccumulator
396.43 s
gammaloop-workspace-doctest> | ^^^^^^^^^ expected one of `!` or `::`
396.43 s
gammaloop-workspace-doctest>
396.43 s
gammaloop-workspace-doctest> error: aborting due to 1 previous error
396.43 s
gammaloop-workspace-doctest>
396.43 s
gammaloop-workspace-doctest> Couldn't compile the test.
396.43 s
gammaloop-workspace-doctest> ---- crates/gammaloop-api/src/python.rs - python::GammaLoopAPI::run_command (line 3901) stdout ----
396.43 s
gammaloop-workspace-doctest> error[E0425] : cannot find value `api` in this scope
396.43 s
gammaloop-workspace-doctest> --> crates/gammaloop-api/src/python.rs:3902:1
396.43 s
gammaloop-workspace-doctest> |
396.43 s
gammaloop-workspace-doctest> 3902 | api.run("display processes")
396.43 s
gammaloop-workspace-doctest> | ^^^ not found in this scope
396.43 s
gammaloop-workspace-doctest>
396.43 s
gammaloop-workspace-doctest> error : aborting due to 1 previous error
396.43 s
gammaloop-workspace-doctest>
396.43 s
gammaloop-workspace-doctest> For more information about this error, try `rustc --explain E0425`.
396.43 s
gammaloop-workspace-doctest> Couldn't compile the test.
396.43 s
gammaloop-workspace-doctest> ---- crates/gammaloop-api/src/python.rs - python::GammaLoopAPI::get_run_history (line 3711) stdout ----
396.43 s
gammaloop-workspace-doctest> error[E0425] : cannot find value `run_card_toml` in this scope
396.43 s
gammaloop-workspace-doctest> --> crates/gammaloop-api/src/python.rs:3712:1
396.43 s
gammaloop-workspace-doctest> |
396.43 s
gammaloop-workspace-doctest> 3712 | run_card_toml = api.get_run_history()
396.43 s
gammaloop-workspace-doctest> | ^^^^^^^^^^^^^
396.43 s
gammaloop-workspace-doctest> |
396.43 s
gammaloop-workspace-doctest> help : you might have meant to introduce a new binding
396.43 s
gammaloop-workspace-doctest> |
396.43 s
gammaloop-workspace-doctest> 3712 | let run_card_toml = api.get_run_history()
396.43 s
gammaloop-workspace-doctest> | +++
396.43 s
gammaloop-workspace-doctest>
396.43 s
gammaloop-workspace-doctest> error[E0425] : cannot find value `api` in this scope
396.43 s
gammaloop-workspace-doctest> --> crates/gammaloop-api/src/python.rs:3712:17
396.43 s
gammaloop-workspace-doctest> |
396.43 s
gammaloop-workspace-doctest> 3712 | run_card_toml = api.get_run_history()
396.43 s
gammaloop-workspace-doctest> | ^^^ not found in this scope
396.43 s
gammaloop-workspace-doctest>
396.43 s
gammaloop-workspace-doctest> error : aborting due to 2 previous errors
396.43 s
gammaloop-workspace-doctest>
396.43 s
gammaloop-workspace-doctest> For more information about this error, try `rustc --explain E0425`.
396.43 s
gammaloop-workspace-doctest> Couldn't compile the test.
396.43 s
gammaloop-workspace-doctest> ---- crates/gammaloop-api/src/python.rs - python::GammaLoopAPI::get_global_settings (line 3739) stdout ----
396.43 s
gammaloop-workspace-doctest> error[E0425] : cannot find value `settings_toml` in this scope
396.43 s
gammaloop-workspace-doctest> --> crates/gammaloop-api/src/python.rs:3740:1
396.43 s
gammaloop-workspace-doctest> |
396.43 s
gammaloop-workspace-doctest> 3740 | settings_toml = api.get_global_settings()
396.43 s
gammaloop-workspace-doctest> | ^^^^^^^^^^^^^
396.43 s
gammaloop-workspace-doctest> |
396.43 s
gammaloop-workspace-doctest> help : you might have meant to introduce a new binding
396.43 s
gammaloop-workspace-doctest> |
396.43 s
gammaloop-workspace-doctest> 3740 | let settings_toml = api.get_global_settings()
396.43 s
gammaloop-workspace-doctest> | +++
396.43 s
gammaloop-workspace-doctest>
396.43 s
gammaloop-workspace-doctest> error[E0425] : cannot find value `api` in this scope
396.43 s
gammaloop-workspace-doctest> --> crates/gammaloop-api/src/python.rs:3740:17
396.43 s
gammaloop-workspace-doctest> |
396.43 s
gammaloop-workspace-doctest> 3740 | settings_toml = api.get_global_settings()
396.43 s
gammaloop-workspace-doctest> | ^^^ not found in this scope
396.43 s
gammaloop-workspace-doctest>
396.43 s
gammaloop-workspace-doctest> error : aborting due to 2 previous errors
396.43 s
gammaloop-workspace-doctest>
396.43 s
gammaloop-workspace-doctest> For more information about this error, try `rustc --explain E0425`.
396.43 s
gammaloop-workspace-doctest> Couldn't compile the test.
396.43 s
gammaloop-workspace-doctest> ---- crates/gammaloop-api/src/python.rs - python::GammaLoopAPI::new_python (line 2834) stdout ----
396.43 s
gammaloop-workspace-doctest> error[E0425] : cannot find value `api` in this scope
396.43 s
gammaloop-workspace-doctest> --> crates/gammaloop-api/src/python.rs:2835:1
396.43 s
gammaloop-workspace-doctest> |
396.43 s
gammaloop-workspace-doctest> 2835 | api = GammaLoopAPI(state_folder="./state", read_only_state=True)
396.43 s
gammaloop-workspace-doctest> | ^^^
396.43 s
gammaloop-workspace-doctest> |
396.43 s
gammaloop-workspace-doctest> help : you might have meant to introduce a new binding
396.43 s
gammaloop-workspace-doctest> |
396.43 s
gammaloop-workspace-doctest> 2835 | let api = GammaLoopAPI(state_folder="./state", read_only_state=True)
396.43 s
gammaloop-workspace-doctest> | +++
396.43 s
gammaloop-workspace-doctest>
396.43 s
gammaloop-workspace-doctest> error[E0425] : cannot find value `state_folder` in this scope
396.43 s
gammaloop-workspace-doctest> --> crates/gammaloop-api/src/python.rs:2835:20
396.43 s
gammaloop-workspace-doctest> |
396.43 s
gammaloop-workspace-doctest> 2835 | api = GammaLoopAPI(state_folder="./state", read_only_state=True)
396.43 s
gammaloop-workspace-doctest> | ^^^^^^^^^^^^ not found in this scope
396.43 s
gammaloop-workspace-doctest>
396.43 s
gammaloop-workspace-doctest> error[E0425] : cannot find value `read_only_state` in this scope
396.43 s
gammaloop-workspace-doctest> --> crates/gammaloop-api/src/python.rs:2835:44
396.43 s
gammaloop-workspace-doctest> |
396.43 s
gammaloop-workspace-doctest> 2835 | api = GammaLoopAPI(state_folder="./state", read_only_state=True)
396.43 s
gammaloop-workspace-doctest> | ^^^^^^^^^^^^^^^ not found in this scope
396.43 s
gammaloop-workspace-doctest>
396.43 s
gammaloop-workspace-doctest> error[E0425] : cannot find value `True` in this scope
396.43 s
gammaloop-workspace-doctest> --> crates/gammaloop-api/src/python.rs:2835:60
396.43 s
gammaloop-workspace-doctest> |
396.43 s
gammaloop-workspace-doctest> 2835 | api = GammaLoopAPI(state_folder="./state", read_only_state=True)
396.43 s
gammaloop-workspace-doctest> | ^^^^ not found in this scope
396.43 s
gammaloop-workspace-doctest> |
396.43 s
gammaloop-workspace-doctest> help : you may want to use a bool value instead
396.43 s
gammaloop-workspace-doctest> |
396.43 s
gammaloop-workspace-doctest> 2835 - api = GammaLoopAPI(state_folder="./state", read_only_state=True )
396.43 s
gammaloop-workspace-doctest> 2835 + api = GammaLoopAPI(state_folder="./state", read_only_state=true )
396.43 s
gammaloop-workspace-doctest> |
396.43 s
gammaloop-workspace-doctest>
396.43 s
gammaloop-workspace-doctest> error[E0425] : cannot find function, tuple struct or tuple variant `GammaLoopAPI` in this scope
396.43 s
gammaloop-workspace-doctest> --> crates/gammaloop-api/src/python.rs:2835:7
396.43 s
gammaloop-workspace-doctest> |
396.43 s
gammaloop-workspace-doctest> 2835 | api = GammaLoopAPI(state_folder="./state", read_only_state=True)
396.43 s
gammaloop-workspace-doctest> | ^^^^^^^^^^^^ not found in this scope
396.43 s
gammaloop-workspace-doctest>
396.43 s
gammaloop-workspace-doctest> error : aborting due to 5 previous errors
396.43 s
gammaloop-workspace-doctest>
396.43 s
gammaloop-workspace-doctest> For more information about this error, try `rustc --explain E0425`.
396.43 s
gammaloop-workspace-doctest> Couldn't compile the test.
396.43 s
gammaloop-workspace-doctest> ---- crates/gammaloop-api/src/python.rs - python::evaluate_graph_overall_factor (line 95) stdout ----
396.43 s
gammaloop-workspace-doctest> error[E0425] : cannot find function `evaluate_graph_overall_factor` in this scope
396.43 s
gammaloop-workspace-doctest> --> crates/gammaloop-api/src/python.rs:96:1
396.43 s
gammaloop-workspace-doctest> |
396.43 s
gammaloop-workspace-doctest> 96 | evaluate_graph_overall_factor(
396.43 s
gammaloop-workspace-doctest> | ^^^^^^^^^^^^^^^^^^^^^^^^^^^^^ not found in this scope
396.43 s
gammaloop-workspace-doctest>
396.43 s
gammaloop-workspace-doctest> error : aborting due to 1 previous error
396.43 s
gammaloop-workspace-doctest>
396.43 s
gammaloop-workspace-doctest> For more information about this error, try `rustc --explain E0425`.
396.43 s
gammaloop-workspace-doctest> Couldn't compile the test.
396.43 s
gammaloop-workspace-doctest> ---- crates/gammaloop-api/src/python.rs - python::atom_to_canonical_string (line 128) stdout ----
396.43 s
gammaloop-workspace-doctest> error[E0425] : cannot find function `atom_to_canonical_string` in this scope
396.43 s
gammaloop-workspace-doctest> --> crates/gammaloop-api/src/python.rs:129:1
396.43 s
gammaloop-workspace-doctest> |
396.43 s
gammaloop-workspace-doctest> 129 | atom_to_canonical_string("x + x")
396.43 s
gammaloop-workspace-doctest> | ^^^^^^^^^^^^^^^^^^^^^^^^ not found in this scope
396.43 s
gammaloop-workspace-doctest>
396.43 s
gammaloop-workspace-doctest> error : aborting due to 1 previous error
396.43 s
gammaloop-workspace-doctest>
396.43 s
gammaloop-workspace-doctest> For more information about this error, try `rustc --explain E0425`.
396.43 s
gammaloop-workspace-doctest> Couldn't compile the test.
396.43 s
gammaloop-workspace-doctest> ---- crates/gammaloop-api/src/python.rs - python::atom_to_dots (line 157) stdout ----
396.43 s
gammaloop-workspace-doctest> error[E0425] : cannot find function `to_dots` in this scope
396.43 s
gammaloop-workspace-doctest> --> crates/gammaloop-api/src/python.rs:158:1
396.43 s
gammaloop-workspace-doctest> |
396.43 s
gammaloop-workspace-doctest> 158 | to_dots("p(mu) * q(mu)")
396.43 s
gammaloop-workspace-doctest> | ^^^^^^^ not found in this scope
396.43 s
gammaloop-workspace-doctest>
396.43 s
gammaloop-workspace-doctest> error : aborting due to 1 previous error
396.43 s
gammaloop-workspace-doctest>
396.43 s
gammaloop-workspace-doctest> For more information about this error, try `rustc --explain E0425`.
396.43 s
gammaloop-workspace-doctest> Couldn't compile the test.
396.43 s
gammaloop-workspace-doctest>
396.43 s
gammaloop-workspace-doctest> failures:
396.43 s
gammaloop-workspace-doctest> crates/gammaloop-api/src/python.rs - python::GammaLoopAPI::evaluate_sample (line 2967)
396.43 s
gammaloop-workspace-doctest> crates/gammaloop-api/src/python.rs - python::GammaLoopAPI::evaluate_samples (line 3108)
396.43 s
gammaloop-workspace-doctest> crates/gammaloop-api/src/python.rs - python::GammaLoopAPI::get_active_command_blocks (line 3760)
396.43 s
gammaloop-workspace-doctest> crates/gammaloop-api/src/python.rs - python::GammaLoopAPI::get_default_runtime_settings (line 3796)
396.43 s
gammaloop-workspace-doctest> crates/gammaloop-api/src/python.rs - python::GammaLoopAPI::get_global_settings (line 3739)
396.43 s
gammaloop-workspace-doctest> crates/gammaloop-api/src/python.rs - python::GammaLoopAPI::get_integrand_info (line 3585)
396.43 s
gammaloop-workspace-doctest> crates/gammaloop-api/src/python.rs - python::GammaLoopAPI::get_integrand_settings (line 3647)
396.43 s
gammaloop-workspace-doctest> crates/gammaloop-api/src/python.rs - python::GammaLoopAPI::get_run_history (line 3711)
396.43 s
gammaloop-workspace-doctest> crates/gammaloop-api/src/python.rs - python::GammaLoopAPI::new_python (line 2834)
396.43 s
gammaloop-workspace-doctest> crates/gammaloop-api/src/python.rs - python::GammaLoopAPI::run_command (line 3901)
396.43 s
gammaloop-workspace-doctest> crates/gammaloop-api/src/python.rs - python::PyHistogramAccumulator (line 871)
396.43 s
gammaloop-workspace-doctest> crates/gammaloop-api/src/python.rs - python::atom_to_canonical_string (line 128)
396.43 s
gammaloop-workspace-doctest> crates/gammaloop-api/src/python.rs - python::atom_to_dots (line 157)
396.43 s
gammaloop-workspace-doctest> crates/gammaloop-api/src/python.rs - python::evaluate_graph_overall_factor (line 95)
396.43 s
gammaloop-workspace-doctest>
396.43 s
gammaloop-workspace-doctest> test result: FAILED. 2 passed; 14 failed; 0 ignored; 0 measured; 0 filtered out; finished in 2.73s
396.43 s
gammaloop-workspace-doctest>
396.43 s
gammaloop-workspace-doctest> error : doctest failed, to rerun pass `-p gammaloop-api --doc`
396.80 s
error: Cannot build '/nix/store/l4jl276bp0050h66nydaswl0yrkqlgr4-gammaloop-workspace-doctest-0.1.0.drv '.
396.80 s
Reason: builder failed with exit code 101 .
396.80 s
Output paths:
396.80 s
/nix/store/hr6yd418rwbi8hzda4zdmla0j713f63m-gammaloop-workspace-doctest-0.1.0
396.80 s
Last 356 log lines:
396.80 s
> Running phase: unpackPhase
396.80 s
> unpacking source archive /nix/store/zw60sp2yw0jzbn0l3i8p6pynq3h4pivs-source
396.80 s
> source root is source
396.80 s
> Running phase: patchPhase
396.80 s
> Executing configureCargoCommonVars
396.80 s
> decompressing cargo artifacts from /nix/store/8rkh7d3hq722l839568nhnwihnsx041a-gammaloop-workspace-deps-deps-0.1.0/target.tar.zst to target
396.80 s
> Running phase: updateAutotoolsGnuConfigScriptsPhase
396.80 s
> Running phase: configurePhase
396.80 s
> will append /build/source/.cargo-home/config.toml with contents of /nix/store/xdy1vvhll2bijdplvl9fcc2b9plkxhaa-vendor-cargo-deps/config.toml
396.80 s
> default configurePhase, nothing to do
396.80 s
> Running phase: buildPhase
396.80 s
> +++ command cargo --version
396.80 s
> cargo 1.97.0 (c980f4866 2026-06-30)
396.80 s
> +++ command cargo test --profile ci-optim --doc --locked --workspace --features gammaloop-api/cli,gammaloop-tracing-filter/clap,gammaloop-tracing-filter/symbolica,idenso/bincode,idenso/reference-cases,linnet/bincode,linnet/drawing,linnet/nodestore-vec,linnet/rkyv,linnet/serde,linnet/symbolica,spenso-macros/shadowing,spenso/shadowing,symbolica/tracing_max_level_info
396.80 s
> Compiling target-lexicon v0.13.5
396.80 s
> Compiling symbolica v2.2.0 (https://github.com/symbolica-dev/symbolica?branch=dev#0441bd7a)
396.80 s
> Compiling maplit v1.0.2
396.80 s
> Compiling gammaloop-tracing-filter-macros v0.1.0 (/build/source/crates/gammaloop-tracing-filter-macros)
396.80 s
> Compiling vakint v0.1.2 (/build/source/crates/vakint)
396.80 s
> Compiling gammalooprs v0.3.4 (/build/source/crates/gammalooprs)
396.80 s
> Compiling alphal00p-docs-macros v0.1.0 (/build/source/crates/alphal00p-docs-macros)
396.80 s
> Compiling alphal00p-docs-schema v0.1.0 (/build/source/crates/alphal00p-docs-schema)
396.80 s
> Compiling rustc_version v0.4.1
396.80 s
> Compiling bincode v1.3.3
396.80 s
> Compiling gungraun-runner v0.18.2
396.80 s
> Compiling target-triple v1.0.1
396.80 s
> Compiling iai-callgrind-runner v0.14.2
396.80 s
> Compiling gammaloop-integration-tests v0.1.0 (/build/source/tests)
396.80 s
> Compiling test-log-core v0.2.20
396.80 s
> Compiling wait-timeout v0.2.1
396.80 s
> Compiling iai-callgrind v0.14.2
396.80 s
> Compiling quick-error v1.2.3
396.80 s
> Compiling bit-vec v0.8.0
396.80 s
> Compiling rusty-fork v0.3.1
396.80 s
> Compiling iai-callgrind-macros v0.5.1
396.80 s
> Compiling rand_xorshift v0.4.0
396.80 s
> Compiling console v0.15.11
396.80 s
> Compiling unarray v0.1.4
396.80 s
> Compiling glob v0.3.4
396.80 s
> Compiling base64 v0.21.7
396.80 s
> Compiling bit-set v0.8.0
396.80 s
> Compiling gungraun-macros v0.8.0
396.80 s
> Compiling termcolor v1.4.1
396.80 s
> Compiling trybuild v1.0.120
396.80 s
> Compiling alphal00p-docs-catalogs v0.1.0 (/build/source/crates/alphal00p-docs-catalogs)
396.80 s
> Compiling ron v0.8.1
396.80 s
> Compiling similar-asserts v1.7.0
396.80 s
> Compiling proptest v1.11.0
396.80 s
> Compiling pyo3-build-config v0.28.3
396.80 s
> Compiling alphal00p-docs-builder v0.1.0 (/build/source/crates/alphal00p-docs-builder)
396.80 s
> Compiling kurvst v0.1.0 (/build/source/crates/kurvst)
396.80 s
> Compiling test-log-macros v0.2.20
396.80 s
> Compiling test-log v0.2.20
396.80 s
> Compiling alphal00p-docs-examples v0.1.0 (/build/source/crates/alphal00p-docs-examples)
396.80 s
> Compiling pyo3-ffi v0.28.3
396.80 s
> Compiling pyo3-macros-backend v0.28.3
396.80 s
> Compiling pyo3 v0.28.3
396.80 s
> Compiling numpy v0.28.0
396.80 s
> Compiling gammaloop-api v0.1.0 (/build/source/crates/gammaloop-api)
396.80 s
> Compiling gungraun v0.18.2
396.80 s
> Compiling pyo3-macros v0.28.3
396.80 s
> Compiling pyo3-stub-gen v0.17.2
396.80 s
> Compiling numerica v2.2.0 (https://github.com/symbolica-dev/symbolica?branch=dev#0441bd7a)
396.80 s
> Compiling graphica v2.1.0 (https://github.com/symbolica-dev/symbolica?branch=dev#0441bd7a)
396.80 s
> Compiling symbolica-utils v0.1.0 (/build/source/crates/symbolica-utils)
396.80 s
> Compiling gammaloop-workspace-hack v0.1.0 (/build/source/crates/gammaloop-workspace-hack)
396.80 s
> Compiling spenso-macros v0.3.2 (/build/source/crates/spenso-macros)
396.80 s
> Compiling linnet v0.17.0 (/build/source/crates/linnet)
396.80 s
> Compiling spenso v0.6.0 (/build/source/crates/spenso)
396.80 s
> Compiling idenso v0.3.0 (/build/source/crates/idenso)
396.80 s
> Compiling gammaloop-tracing-filter v0.1.0 (/build/source/crates/gammaloop-tracing-filter)
396.80 s
> Compiling spenso-hep-lib v0.1.7 (/build/source/crates/spenso-hep-lib)
396.80 s
> Compiling spynso3 v0.1.2 (/build/source/crates/spynso3)
396.80 s
> Compiling linnest v0.1.0 (/build/source/crates/linnest)
396.80 s
> Compiling linnet-py v0.1.0 (/build/source/crates/linnet-py)
396.80 s
> Finished `ci-optim` profile [optimized] target(s) in 6m 12s
396.80 s
> warning : the following packages contain code that will be rejected by a future version of Rust: proc-macro-error2 v2.0.1
396.80 s
> note : to see what the problems were, use the option `--future-incompat-report`, or run `cargo report future-incompatibilities --id 1`
396.80 s
> Doc-tests alphal00p_docs_builder
396.80 s
>
396.80 s
> running 0 tests
396.80 s
>
396.80 s
> test result: ok. 0 passed; 0 failed; 0 ignored; 0 measured; 0 filtered out; finished in 0.00s
396.80 s
>
396.80 s
> Doc-tests alphal00p_docs_catalogs
396.80 s
>
396.80 s
> running 0 tests
396.80 s
>
396.80 s
> test result: ok. 0 passed; 0 failed; 0 ignored; 0 measured; 0 filtered out; finished in 0.00s
396.80 s
>
396.80 s
> Doc-tests alphal00p_docs_examples
396.80 s
>
396.80 s
> running 0 tests
396.80 s
>
396.80 s
> test result: ok. 0 passed; 0 failed; 0 ignored; 0 measured; 0 filtered out; finished in 0.00s
396.80 s
>
396.80 s
> Doc-tests alphal00p_docs
396.80 s
>
396.80 s
> running 0 tests
396.80 s
>
396.80 s
> test result: ok. 0 passed; 0 failed; 0 ignored; 0 measured; 0 filtered out; finished in 0.00s
396.80 s
>
396.80 s
> Doc-tests alphal00p_docs_schema
396.80 s
>
396.80 s
> running 0 tests
396.80 s
>
396.80 s
> test result: ok. 0 passed; 0 failed; 0 ignored; 0 measured; 0 filtered out; finished in 0.00s
396.80 s
>
396.80 s
> Doc-tests gammaloop_api
396.80 s
>
396.80 s
> running 16 tests
396.80 s
> test crates/gammaloop-api/src/python.rs - python::GammaLoopAPI::evaluate_samples (line 3108) ... FAILED
396.80 s
> test crates/gammaloop-api/src/python.rs - python::GammaLoopAPI::get_active_command_blocks (line 3760) ... FAILED
396.80 s
> test crates/gammaloop-api/src/python.rs - python::GammaLoopAPI::evaluate_sample (line 2967) ... FAILED
396.80 s
> test crates/gammaloop-api/src/python.rs - python::GammaLoopAPI::get_default_runtime_settings (line 3796) ... FAILED
396.80 s
> test crates/gammaloop-api/src/python.rs - python::GammaLoopAPI::get_integrand_settings (line 3647) ... FAILED
396.80 s
> test crates/gammaloop-api/src/python.rs - python::GammaLoopAPI::get_integrand_info (line 3585) ... FAILED
396.80 s
> test crates/gammaloop-api/src/python.rs - python::PyHistogramAccumulator (line 871) ... FAILED
396.80 s
> test crates/gammaloop-api/src/lib.rs - (line 18) - compile ... ok
396.80 s
> test crates/gammaloop-api/src/python.rs - python::GammaLoopAPI::run_command (line 3901) ... FAILED
396.80 s
> test crates/gammaloop-api/src/python.rs - python::GammaLoopAPI::get_run_history (line 3711) ... FAILED
396.80 s
> test crates/gammaloop-api/src/python.rs - python::GammaLoopAPI::get_global_settings (line 3739) ... FAILED
396.80 s
> test crates/gammaloop-api/src/python.rs - python::GammaLoopAPI::new_python (line 2834) ... FAILED
396.80 s
> test crates/gammaloop-api/src/python.rs - python::evaluate_graph_overall_factor (line 95) ... FAILED
396.80 s
> test crates/gammaloop-api/src/python.rs - python::atom_to_canonical_string (line 128) ... FAILED
396.80 s
> test crates/gammaloop-api/src/python.rs - python::atom_to_dots (line 157) ... FAILED
396.80 s
> test crates/gammaloop-api/src/commands/evaluate_samples.rs - commands::evaluate_samples::EvaluateSamples (line 50) ... ok
396.80 s
>
396.80 s
> failures:
396.80 s
>
396.80 s
> ---- crates/gammaloop-api/src/python.rs - python::GammaLoopAPI::evaluate_samples (line 3108) stdout ----
396.80 s
> error: expected one of `!` or `::`, found `pathlib`
396.80 s
> --> crates/gammaloop-api/src/python.rs:3109:6
396.80 s
> |
396.80 s
> 3109 | from pathlib import Path
396.80 s
> | ^^^^^^^ expected one of `!` or `::`
396.80 s
>
396.80 s
> error: aborting due to 1 previous error
396.80 s
>
396.80 s
> Couldn't compile the test.
396.80 s
> ---- crates/gammaloop-api/src/python.rs - python::GammaLoopAPI::get_active_command_blocks (line 3760) stdout ----
396.80 s
> error: expected item, found keyword `for`
396.80 s
> --> crates/gammaloop-api/src/python.rs:3761:1
396.80 s
> |
396.80 s
> 3761 | for name, commands in api.get_active_command_blocks().items():
396.80 s
> | ^^^ expected item
396.80 s
> |
396.80 s
> = note: for a full list of items that can appear in modules, see <https://doc.rust-lang.org/reference/items.html>
396.80 s
>
396.80 s
> error: aborting due to 1 previous error
396.80 s
>
396.80 s
> Couldn't compile the test.
396.80 s
> ---- crates/gammaloop-api/src/python.rs - python::GammaLoopAPI::evaluate_sample (line 2967) stdout ----
396.80 s
> error: expected one of `!` or `::`, found `pathlib`
396.80 s
> --> crates/gammaloop-api/src/python.rs:2968:6
396.80 s
> |
396.80 s
> 2968 | from pathlib import Path
396.80 s
> | ^^^^^^^ expected one of `!` or `::`
396.80 s
>
396.80 s
> error: aborting due to 1 previous error
396.80 s
>
396.80 s
> Couldn't compile the test.
396.80 s
> ---- crates/gammaloop-api/src/python.rs - python::GammaLoopAPI::get_default_runtime_settings (line 3796) stdout ----
396.80 s
> error: expected one of `!` or `::`, found `=`
396.80 s
> --> crates/gammaloop-api/src/python.rs:3797:9
396.80 s
> |
396.80 s
> 3797 | runtime = api.get_default_runtime_settings()
396.80 s
> | ^ expected one of `!` or `::`
396.80 s
>
396.80 s
> error: aborting due to 1 previous error
396.80 s
>
396.80 s
> Couldn't compile the test.
396.80 s
> ---- crates/gammaloop-api/src/python.rs - python::GammaLoopAPI::get_integrand_settings (line 3647) stdout ----
396.80 s
> error: expected one of `!` or `::`, found `=`
396.80 s
> --> crates/gammaloop-api/src/python.rs:3648:10
396.80 s
> |
396.80 s
> 3648 | settings = api.get_integrand_settings(process_id=0)
396.80 s
> | ^ expected one of `!` or `::`
396.80 s
>
396.80 s
> error: aborting due to 1 previous error
396.80 s
>
396.80 s
> Couldn't compile the test.
396.80 s
> ---- crates/gammaloop-api/src/python.rs - python::GammaLoopAPI::get_integrand_info (line 3585) stdout ----
396.80 s
> error: expected one of `!` or `::`, found `pathlib`
396.80 s
> --> crates/gammaloop-api/src/python.rs:3586:6
396.80 s
> |
396.80 s
> 3586 | from pathlib import Path
396.80 s
> | ^^^^^^^ expected one of `!` or `::`
396.80 s
>
396.80 s
> error: aborting due to 1 previous error
396.80 s
>
396.80 s
> Couldn't compile the test.
396.80 s
> ---- crates/gammaloop-api/src/python.rs - python::PyHistogramAccumulator (line 871) stdout ----
396.80 s
> error: expected one of `!` or `::`, found `gammaloop`
396.80 s
> --> crates/gammaloop-api/src/python.rs:872:6
396.80 s
> |
396.80 s
> 872 | from gammaloop import HistogramAccumulator
396.80 s
> | ^^^^^^^^^ expected one of `!` or `::`
396.80 s
>
396.80 s
> error: aborting due to 1 previous error
396.80 s
>
396.80 s
> Couldn't compile the test.
396.80 s
> ---- crates/gammaloop-api/src/python.rs - python::GammaLoopAPI::run_command (line 3901) stdout ----
396.80 s
> error[E0425] : cannot find value `api` in this scope
396.80 s
> --> crates/gammaloop-api/src/python.rs:3902:1
396.80 s
> |
396.80 s
> 3902 | api.run("display processes")
396.80 s
> | ^^^ not found in this scope
396.80 s
>
396.80 s
> error : aborting due to 1 previous error
396.80 s
>
396.80 s
> For more information about this error, try `rustc --explain E0425`.
396.80 s
> Couldn't compile the test.
396.80 s
> ---- crates/gammaloop-api/src/python.rs - python::GammaLoopAPI::get_run_history (line 3711) stdout ----
396.80 s
> error[E0425] : cannot find value `run_card_toml` in this scope
396.80 s
> --> crates/gammaloop-api/src/python.rs:3712:1
396.80 s
> |
396.80 s
> 3712 | run_card_toml = api.get_run_history()
396.80 s
> | ^^^^^^^^^^^^^
396.80 s
> |
396.80 s
> help : you might have meant to introduce a new binding
396.80 s
> |
396.80 s
> 3712 | let run_card_toml = api.get_run_history()
396.80 s
> | +++
396.80 s
>
396.80 s
> error[E0425] : cannot find value `api` in this scope
396.80 s
> --> crates/gammaloop-api/src/python.rs:3712:17
396.80 s
> |
396.80 s
> 3712 | run_card_toml = api.get_run_history()
396.80 s
> | ^^^ not found in this scope
396.80 s
>
396.80 s
> error : aborting due to 2 previous errors
396.80 s
>
396.80 s
> For more information about this error, try `rustc --explain E0425`.
396.80 s
> Couldn't compile the test.
396.80 s
> ---- crates/gammaloop-api/src/python.rs - python::GammaLoopAPI::get_global_settings (line 3739) stdout ----
396.80 s
> error[E0425] : cannot find value `settings_toml` in this scope
396.80 s
> --> crates/gammaloop-api/src/python.rs:3740:1
396.80 s
> |
396.80 s
> 3740 | settings_toml = api.get_global_settings()
396.80 s
> | ^^^^^^^^^^^^^
396.80 s
> |
396.80 s
> help : you might have meant to introduce a new binding
396.80 s
> |
396.80 s
> 3740 | let settings_toml = api.get_global_settings()
396.80 s
> | +++
396.80 s
>
396.80 s
> error[E0425] : cannot find value `api` in this scope
396.80 s
> --> crates/gammaloop-api/src/python.rs:3740:17
396.80 s
> |
396.80 s
> 3740 | settings_toml = api.get_global_settings()
396.80 s
> | ^^^ not found in this scope
396.80 s
>
396.80 s
> error : aborting due to 2 previous errors
396.80 s
>
396.80 s
> For more information about this error, try `rustc --explain E0425`.
396.80 s
> Couldn't compile the test.
396.80 s
> ---- crates/gammaloop-api/src/python.rs - python::GammaLoopAPI::new_python (line 2834) stdout ----
396.80 s
> error[E0425] : cannot find value `api` in this scope
396.80 s
> --> crates/gammaloop-api/src/python.rs:2835:1
396.80 s
> |
396.80 s
> 2835 | api = GammaLoopAPI(state_folder="./state", read_only_state=True)
396.80 s
> | ^^^
396.80 s
> |
396.80 s
> help : you might have meant to introduce a new binding
396.80 s
> |
396.80 s
> 2835 | let api = GammaLoopAPI(state_folder="./state", read_only_state=True)
396.80 s
> | +++
396.80 s
>
396.80 s
> error[E0425] : cannot find value `state_folder` in this scope
396.80 s
> --> crates/gammaloop-api/src/python.rs:2835:20
396.80 s
> |
396.80 s
> 2835 | api = GammaLoopAPI(state_folder="./state", read_only_state=True)
396.80 s
> | ^^^^^^^^^^^^ not found in this scope
396.80 s
>
396.80 s
> error[E0425] : cannot find value `read_only_state` in this scope
396.80 s
> --> crates/gammaloop-api/src/python.rs:2835:44
396.80 s
> |
396.80 s
> 2835 | api = GammaLoopAPI(state_folder="./state", read_only_state=True)
396.80 s
> | ^^^^^^^^^^^^^^^ not found in this scope
396.80 s
>
396.80 s
> error[E0425] : cannot find value `True` in this scope
396.80 s
> --> crates/gammaloop-api/src/python.rs:2835:60
396.80 s
> |
396.80 s
> 2835 | api = GammaLoopAPI(state_folder="./state", read_only_state=True)
396.80 s
> | ^^^^ not found in this scope
396.80 s
> |
396.80 s
> help : you may want to use a bool value instead
396.80 s
> |
396.80 s
> 2835 - api = GammaLoopAPI(state_folder="./state", read_only_state=True )
396.80 s
> 2835 + api = GammaLoopAPI(state_folder="./state", read_only_state=true )
396.80 s
> |
396.80 s
>
396.80 s
> error[E0425] : cannot find function, tuple struct or tuple variant `GammaLoopAPI` in this scope
396.80 s
> --> crates/gammaloop-api/src/python.rs:2835:7
396.80 s
> |
396.80 s
> 2835 | api = GammaLoopAPI(state_folder="./state", read_only_state=True)
396.80 s
> | ^^^^^^^^^^^^ not found in this scope
396.80 s
>
396.80 s
> error : aborting due to 5 previous errors
396.80 s
>
396.80 s
> For more information about this error, try `rustc --explain E0425`.
396.80 s
> Couldn't compile the test.
396.80 s
> ---- crates/gammaloop-api/src/python.rs - python::evaluate_graph_overall_factor (line 95) stdout ----
396.80 s
> error[E0425] : cannot find function `evaluate_graph_overall_factor` in this scope
396.80 s
> --> crates/gammaloop-api/src/python.rs:96:1
396.80 s
> |
396.80 s
> 96 | evaluate_graph_overall_factor(
396.80 s
> | ^^^^^^^^^^^^^^^^^^^^^^^^^^^^^ not found in this scope
396.80 s
>
396.80 s
> error : aborting due to 1 previous error
396.80 s
>
396.80 s
> For more information about this error, try `rustc --explain E0425`.
396.80 s
> Couldn't compile the test.
396.80 s
> ---- crates/gammaloop-api/src/python.rs - python::atom_to_canonical_string (line 128) stdout ----
396.80 s
> error[E0425] : cannot find function `atom_to_canonical_string` in this scope
396.80 s
> --> crates/gammaloop-api/src/python.rs:129:1
396.80 s
> |
396.80 s
> 129 | atom_to_canonical_string("x + x")
396.80 s
> | ^^^^^^^^^^^^^^^^^^^^^^^^ not found in this scope
396.80 s
>
396.80 s
> error : aborting due to 1 previous error
396.80 s
>
396.80 s
> For more information about this error, try `rustc --explain E0425`.
396.80 s
> Couldn't compile the test.
396.80 s
> ---- crates/gammaloop-api/src/python.rs - python::atom_to_dots (line 157) stdout ----
396.80 s
> error[E0425] : cannot find function `to_dots` in this scope
396.80 s
> --> crates/gammaloop-api/src/python.rs:158:1
396.80 s
> |
396.80 s
> 158 | to_dots("p(mu) * q(mu)")
396.80 s
> | ^^^^^^^ not found in this scope
396.80 s
>
396.80 s
> error : aborting due to 1 previous error
396.80 s
>
396.80 s
> For more information about this error, try `rustc --explain E0425`.
396.80 s
> Couldn't compile the test.
396.80 s
>
396.80 s
> failures:
396.80 s
> crates/gammaloop-api/src/python.rs - python::GammaLoopAPI::evaluate_sample (line 2967)
396.80 s
> crates/gammaloop-api/src/python.rs - python::GammaLoopAPI::evaluate_samples (line 3108)
396.80 s
> crates/gammaloop-api/src/python.rs - python::GammaLoopAPI::get_active_command_blocks (line 3760)
396.80 s
> crates/gammaloop-api/src/python.rs - python::GammaLoopAPI::get_default_runtime_settings (line 3796)
396.80 s
> crates/gammaloop-api/src/python.rs - python::GammaLoopAPI::get_global_settings (line 3739)
396.80 s
> crates/gammaloop-api/src/python.rs - python::GammaLoopAPI::get_integrand_info (line 3585)
396.80 s
> crates/gammaloop-api/src/python.rs - python::GammaLoopAPI::get_integrand_settings (line 3647)
396.80 s
> crates/gammaloop-api/src/python.rs - python::GammaLoopAPI::get_run_history (line 3711)
396.80 s
> crates/gammaloop-api/src/python.rs - python::GammaLoopAPI::new_python (line 2834)
396.80 s
> crates/gammaloop-api/src/python.rs - python::GammaLoopAPI::run_command (line 3901)
396.80 s
> crates/gammaloop-api/src/python.rs - python::PyHistogramAccumulator (line 871)
396.80 s
> crates/gammaloop-api/src/python.rs - python::atom_to_canonical_string (line 128)
396.80 s
> crates/gammaloop-api/src/python.rs - python::atom_to_dots (line 157)
396.80 s
> crates/gammaloop-api/src/python.rs - python::evaluate_graph_overall_factor (line 95)
396.80 s
>
396.80 s
> test result: FAILED. 2 passed; 14 failed; 0 ignored; 0 measured; 0 filtered out; finished in 2.73s
396.80 s
>
396.80 s
> error : doctest failed, to rerun pass `-p gammaloop-api --doc`
396.80 s
For full logs, run:
396.80 s
nix log /nix/store/l4jl276bp0050h66nydaswl0yrkqlgr4-gammaloop-workspace-doctest-0.1.0.drv
396.88 s
[0 built (1 failed ), 0.0 Run failed.