test packages.x86_64-linux.nix-ci-check-gammaloop-doctest

Reproduce this run
Retry Run
  1. 0.20 s $ /nix/store/9ypz3flqsrl5xl495mm8h645gadjsxi1-coreutils-9.11/bin/timeout --kill-after=15s 7200s /nix/store/23zk8sgzamrbmj1fday15szf7f2279s8-nix-2.34.7/bin/nix --extra-experimental-features nix-command --extra-experimental-features flakes flake clone git+https://github.com/alphal00p/gammaloop --dest /tmp/nix-ci-worker/stable-pwd/repo/
  2. 0.24 s Cloning into '/tmp/nix-ci-worker/stable-pwd/repo'...
  3. 1.25 s remote: Enumerating objects: 62303, done.
  4. 1.47 s remote: Counting objects: 0% (1/7657) remote: Counting objects: 1% (77/7657) remote: Counting objects: 2% (154/7657) remote: Counting objects: 3% (230/7657) remote: Counting objects: 4% (307/7657) remote: Counting objects: 5% (383/7657) remote: Counting objects: 6% (460/7657) remote: Counting objects: 7% (536/7657) remote: Counting objects: 8% (613/7657) remote: Counting objects: 9% (690/7657) remote: Counting objects: 10% (766/7657) remote: Counting objects: 11% (843/7657) remote: Counting objects: 12% (919/7657) remote: Counting objects: 13% (996/7657) remote: Counting objects: 14% (1072/7657) remote: Counting objects: 15% (1149/7657) remote: Counting objects: 16% (1226/7657) remote: Counting objects: 17% (1302/7657) remote: Counting objects: 18% (1379/7657) remote: Counting objects: 19% (1455/7657) remote: Counting objects: 20% (1532/7657) remote: Counting objects: 21% (1608/7657) remote: Counting objects: 22% (1685/7657) remote: Counting objects: 23% (1762/7657) remote: Counting objects: 24% (1838/7657) remote: Counting objects: 25% (1915/7657) remote: Counting objects: 26% (1991/7657) remote: Counting objects: 27% (2068/7657) remote: Counting objects: 28% (2144/7657) remote: Counting objects: 29% (2221/7657) remote: Counting objects: 30% (2298/7657) remote: Counting objects: 31% (2374/7657) remote: Counting objects: 32% (2451/7657) remote: Counting objects: 33% (2527/7657) remote: Counting objects: 34% (2604/7657) remote: Counting objects: 35% (2680/7657) remote: Counting objects: 36% (2757/7657) remote: Counting objects: 37% (2834/7657) remote: Counting objects: 38% (2910/7657) remote: Counting objects: 39% (2987/7657) remote: Counting objects: 40% (3063/7657) remote: Counting objects: 41% (3140/7657) remote: Counting objects: 42% (3216/7657) remote: Counting objects: 43% (3293/7657) remote: Counting objects: 44% (3370/7657) remote: Counting objects: 45% (3446/7657) remote: Counting objects: 46% (3523/7657) remote: Counting objects: 47% (3599/7657) remote: Counting objects: 48% (3676/7657) remote: Counting objects: 49% (3752/7657) remote: Counting objects: 50% (3829/7657) remote: Counting objects: 51% (3906/7657) remote: Counting objects: 52% (3982/7657) remote: Counting objects: 53% (4059/7657) remote: Counting objects: 54% (4135/7657) remote: Counting objects: 55% (4212/7657) remote: Counting objects: 56% (4288/7657) remote: Counting objects: 57% (4365/7657) remote: Counting objects: 58% (4442/7657) remote: Counting objects: 59% (4518/7657) remote: Counting objects: 60% (4595/7657) remote: Counting objects: 61% (4671/7657) remote: Counting objects: 62% (4748/7657) remote: Counting objects: 63% (4824/7657) remote: Counting objects: 64% (4901/7657) remote: Counting objects: 65% (4978/7657) remote: Counting objects: 66% (5054/7657) remote: Counting objects: 67% (5131/7657) remote: Counting objects: 68% (5207/7657) remote: Counting objects: 69% (5284/7657) remote: Counting objects: 70% (5360/7657) remote: Counting objects: 71% (5437/7657) remote: Counting objects: 72% (5514/7657) remote: Counting objects: 73% (5590/7657) remote: Counting objects: 74% (5667/7657) remote: Counting objects: 75% (5743/7657) remote: Counting objects: 76% (5820/7657) remote: Counting objects: 77% (5896/7657) remote: Counting objects: 78% (5973/7657) remote: Counting objects: 79% (6050/7657) remote: Counting objects: 80% (6126/7657) remote: Counting objects: 81% (6203/7657) remote: Counting objects: 82% (6279/7657) remote: Counting objects: 83% (6356/7657) remote: Counting objects: 84% (6432/7657) remote: Counting objects: 85% (6509/7657) remote: Counting objects: 86% (6586/7657) remote: Counting objects: 87% (6662/7657) remote: Counting objects: 88% (6739/7657) remote: Counting objects: 89% (6815/7657) remote: Counting objects: 90% (6892/7657) remote: Counting objects: 91% (6968/7657) remote: Counting objects: 92% (7045/7657) remote: Counting objects: 93% (7122/7657) remote: Counting objects: 94% (7198/7657) remote: Counting objects: 95% (7275/7657) remote: Counting objects: 96% (7351/7657) remote: Counting objects: 97% (7428/7657) remote: Counting objects: 98% (7504/7657) remote: Counting objects: 99% (7581/7657) remote: Counting objects: 100% (7657/7657) remote: Counting objects: 100% (7657/7657), done.
  5. 3.02 s remote: Compressing objects: 0% (1/1668) remote: Compressing objects: 1% (17/1668) remote: Compressing objects: 2% (34/1668) remote: Compressing objects: 3% (51/1668) remote: Compressing objects: 4% (67/1668) remote: Compressing objects: 5% (84/1668) remote: Compressing objects: 6% (101/1668) remote: Compressing objects: 7% (117/1668) remote: Compressing objects: 8% (134/1668) remote: Compressing objects: 9% (151/1668) remote: Compressing objects: 10% (167/1668) remote: Compressing objects: 11% (184/1668) remote: Compressing objects: 12% (201/1668) remote: Compressing objects: 13% (217/1668) remote: Compressing objects: 14% (234/1668) remote: Compressing objects: 15% (251/1668) remote: Compressing objects: 16% (267/1668) remote: Compressing objects: 17% (284/1668) remote: Compressing objects: 17% (299/1668) remote: Compressing objects: 18% (301/1668) remote: Compressing objects: 19% (317/1668) remote: Compressing objects: 20% (334/1668) remote: Compressing objects: 21% (351/1668) remote: Compressing objects: 22% (367/1668) remote: Compressing objects: 23% (384/1668) remote: Compressing objects: 24% (401/1668) remote: Compressing objects: 25% (417/1668) remote: Compressing objects: 26% (434/1668) remote: Compressing objects: 27% (451/1668) remote: Compressing objects: 28% (468/1668) remote: Compressing objects: 29% (484/1668) remote: Compressing objects: 30% (501/1668) remote: Compressing objects: 31% (518/1668) remote: Compressing objects: 32% (534/1668) remote: Compressing objects: 33% (551/1668) remote: Compressing objects: 34% (568/1668) remote: Compressing objects: 35% (584/1668) remote: Compressing objects: 36% (601/1668) remote: Compressing objects: 37% (618/1668) remote: Compressing objects: 38% (634/1668) remote: Compressing objects: 39% (651/1668) remote: Compressing objects: 40% (668/1668) remote: Compressing objects: 41% (684/1668) remote: Compressing objects: 42% (701/1668) remote: Compressing objects: 43% (718/1668) remote: Compressing objects: 44% (734/1668) remote: Compressing objects: 45% (751/1668) remote: Compressing objects: 46% (768/1668) remote: Compressing objects: 47% (784/1668) remote: Compressing objects: 48% (801/1668) remote: Compressing objects: 49% (818/1668) remote: Compressing objects: 50% (834/1668) remote: Compressing objects: 51% (851/1668) remote: Compressing objects: 52% (868/1668) remote: Compressing objects: 53% (885/1668) remote: Compressing objects: 54% (901/1668) remote: Compressing objects: 55% (918/1668) remote: Compressing objects: 56% (935/1668) remote: Compressing objects: 57% (951/1668) remote: Compressing objects: 58% (968/1668) remote: Compressing objects: 59% (985/1668) remote: Compressing objects: 60% (1001/1668) remote: Compressing objects: 61% (1018/1668) remote: Compressing objects: 62% (1035/1668) remote: Compressing objects: 63% (1051/1668) remote: Compressing objects: 64% (1068/1668) remote: Compressing objects: 65% (1085/1668) remote: Compressing objects: 66% (1101/1668) remote: Compressing objects: 67% (1118/1668) remote: Compressing objects: 68% (1135/1668) remote: Compressing objects: 69% (1151/1668) remote: Compressing objects: 70% (1168/1668) remote: Compressing objects: 71% (1185/1668) remote: Compressing objects: 72% (1201/1668) remote: Compressing objects: 73% (1218/1668) remote: Compressing objects: 74% (1235/1668) remote: Compressing objects: 75% (1251/1668) remote: Compressing objects: 76% (1268/1668) remote: Compressing objects: 77% (1285/1668) remote: Compressing objects: 78% (1302/1668) remote: Compressing objects: 79% (1318/1668) remote: Compressing objects: 80% (1335/1668) remote: Compressing objects: 81% (1352/1668) remote: Compressing objects: 82% (1368/1668) remote: Compressing objects: 83% (1385/1668) remote: Compressing objects: 84% (1402/1668) remote: Compressing objects: 85% (1418/1668) remote: Compressing objects: 86% (1435/1668) remote: Compressing objects: 87% (1452/1668) remote: Compressing objects: 88% (1468/1668) remote: Compressing objects: 89% (1485/1668) remote: Compressing objects: 90% (1502/1668) remote: Compressing objects: 91% (1518/1668) remote: Compressing objects: 92% (1535/1668) remote: Compressing objects: 93% (1552/1668) remote: Compressing objects: 94% (1568/1668) remote: Compressing objects: 95% (1585/1668) remote: Compressing objects: 96% (1602/1668) remote: Compressing objects: 97% (1618/1668) remote: Compressing objects: 98% (1635/1668) remote: Compressing objects: 99% (1652/1668) remote: Compressing objects: 100% (1668/1668) remote: Compressing objects: 100% (1668/1668), done.
  6. 6.19 s Receiving objects: 0% (1/62303) Receiving objects: 1% (624/62303) Receiving objects: 2% (1247/62303) Receiving objects: 3% (1870/62303) Receiving objects: 4% (2493/62303) Receiving objects: 5% (3116/62303) Receiving objects: 6% (3739/62303) Receiving objects: 7% (4362/62303) Receiving objects: 8% (4985/62303) Receiving objects: 9% (5608/62303) Receiving objects: 10% (6231/62303), 11.15 MiB | 22.29 MiB/s Receiving objects: 11% (6854/62303), 11.15 MiB | 22.29 MiB/s Receiving objects: 12% (7477/62303), 11.15 MiB | 22.29 MiB/s Receiving objects: 13% (8100/62303), 11.15 MiB | 22.29 MiB/s Receiving objects: 14% (8723/62303), 11.15 MiB | 22.29 MiB/s Receiving objects: 15% (9346/62303), 11.15 MiB | 22.29 MiB/s Receiving objects: 16% (9969/62303), 11.15 MiB | 22.29 MiB/s Receiving objects: 17% (10592/62303), 11.15 MiB | 22.29 MiB/s Receiving objects: 18% (11215/62303), 11.15 MiB | 22.29 MiB/s Receiving objects: 19% (11838/62303), 11.15 MiB | 22.29 MiB/s Receiving objects: 20% (12461/62303), 11.15 MiB | 22.29 MiB/s Receiving objects: 21% (13084/62303), 11.15 MiB | 22.29 MiB/s Receiving objects: 22% (13707/62303), 11.15 MiB | 22.29 MiB/s Receiving objects: 23% (14330/62303), 11.15 MiB | 22.29 MiB/s Receiving objects: 24% (14953/62303), 11.15 MiB | 22.29 MiB/s Receiving objects: 25% (15576/62303), 11.15 MiB | 22.29 MiB/s Receiving objects: 26% (16199/62303), 11.15 MiB | 22.29 MiB/s Receiving objects: 27% (16822/62303), 11.15 MiB | 22.29 MiB/s Receiving objects: 28% (17445/62303), 11.15 MiB | 22.29 MiB/s Receiving objects: 29% (18068/62303), 11.15 MiB | 22.29 MiB/s Receiving objects: 30% (18691/62303), 11.15 MiB | 22.29 MiB/s Receiving objects: 31% (19314/62303), 11.15 MiB | 22.29 MiB/s Receiving objects: 32% (19937/62303), 11.15 MiB | 22.29 MiB/s Receiving objects: 33% (20560/62303), 11.15 MiB | 22.29 MiB/s Receiving objects: 34% (21184/62303), 11.15 MiB | 22.29 MiB/s Receiving objects: 35% (21807/62303), 11.15 MiB | 22.29 MiB/s Receiving objects: 36% (22430/62303), 11.15 MiB | 22.29 MiB/s Receiving objects: 37% (23053/62303), 11.15 MiB | 22.29 MiB/s Receiving objects: 38% (23676/62303), 11.15 MiB | 22.29 MiB/s Receiving objects: 39% (24299/62303), 11.15 MiB | 22.29 MiB/s Receiving objects: 40% (24922/62303), 11.15 MiB | 22.29 MiB/s Receiving objects: 41% (25545/62303), 11.15 MiB | 22.29 MiB/s Receiving objects: 42% (26168/62303), 11.15 MiB | 22.29 MiB/s Receiving objects: 43% (26791/62303), 11.15 MiB | 22.29 MiB/s Receiving objects: 44% (27414/62303), 11.15 MiB | 22.29 MiB/s Receiving objects: 45% (28037/62303), 11.15 MiB | 22.29 MiB/s Receiving objects: 46% (28660/62303), 11.15 MiB | 22.29 MiB/s Receiving objects: 47% (29283/62303), 11.15 MiB | 22.29 MiB/s Receiving objects: 48% (29906/62303), 11.15 MiB | 22.29 MiB/s Receiving objects: 49% (30529/62303), 11.15 MiB | 22.29 MiB/s Receiving objects: 50% (31152/62303), 11.15 MiB | 22.29 MiB/s Receiving objects: 51% (31775/62303), 11.15 MiB | 22.29 MiB/s Receiving objects: 52% (32398/62303), 11.15 MiB | 22.29 MiB/s Receiving objects: 53% (33021/62303), 11.15 MiB | 22.29 MiB/s Receiving objects: 53% (33085/62303), 30.84 MiB | 30.18 MiB/s Receiving objects: 54% (33644/62303), 30.84 MiB | 30.18 MiB/s Receiving objects: 55% (34267/62303), 30.84 MiB | 30.18 MiB/s Receiving objects: 56% (34890/62303), 30.84 MiB | 30.18 MiB/s Receiving objects: 57% (35513/62303), 30.84 MiB | 30.18 MiB/s Receiving objects: 58% (36136/62303), 30.84 MiB | 30.18 MiB/s Receiving objects: 59% (36759/62303), 30.84 MiB | 30.18 MiB/s Receiving objects: 60% (37382/62303), 45.37 MiB | 29.81 MiB/s Receiving objects: 61% (38005/62303), 45.37 MiB | 29.81 MiB/s Receiving objects: 62% (38628/62303), 45.37 MiB | 29.81 MiB/s Receiving objects: 63% (39251/62303), 45.37 MiB | 29.81 MiB/s Receiving objects: 64% (39874/62303), 45.37 MiB | 29.81 MiB/s Receiving objects: 65% (40497/62303), 45.37 MiB | 29.81 MiB/s Receiving objects: 66% (41120/62303), 45.37 MiB | 29.81 MiB/s Receiving objects: 67% (41744/62303), 45.37 MiB | 29.81 MiB/s Receiving objects: 68% (42367/62303), 45.37 MiB | 29.81 MiB/s Receiving objects: 68% (42654/62303), 45.37 MiB | 29.81 MiB/s Receiving objects: 69% (42990/62303), 59.82 MiB | 29.60 MiB/s Receiving objects: 70% (43613/62303), 59.82 MiB | 29.60 MiB/s Receiving objects: 71% (44236/62303), 59.82 MiB | 29.60 MiB/s Receiving objects: 72% (44859/62303), 59.82 MiB | 29.60 MiB/s Receiving objects: 73% (45482/62303), 59.82 MiB | 29.60 MiB/s Receiving objects: 74% (46105/62303), 59.82 MiB | 29.60 MiB/s Receiving objects: 75% (46728/62303), 59.82 MiB | 29.60 MiB/s Receiving objects: 76% (47351/62303), 59.82 MiB | 29.60 MiB/s Receiving objects: 77% (47974/62303), 59.82 MiB | 29.60 MiB/s Receiving objects: 78% (48597/62303), 59.82 MiB | 29.60 MiB/s Receiving objects: 79% (49220/62303), 59.82 MiB | 29.60 MiB/s Receiving objects: 80% (49843/62303), 59.82 MiB | 29.60 MiB/s Receiving objects: 81% (50466/62303), 59.82 MiB | 29.60 MiB/s Receiving objects: 82% (51089/62303), 59.82 MiB | 29.60 MiB/s Receiving objects: 83% (51712/62303), 74.47 MiB | 29.54 MiB/s Receiving objects: 84% (52335/62303), 74.47 MiB | 29.54 MiB/s Receiving objects: 85% (52958/62303), 74.47 MiB | 29.54 MiB/s Receiving objects: 86% (53581/62303), 74.47 MiB | 29.54 MiB/s Receiving objects: 87% (54204/62303), 74.47 MiB | 29.54 MiB/s Receiving objects: 88% (54827/62303), 74.47 MiB | 29.54 MiB/s Receiving objects: 89% (55450/62303), 74.47 MiB | 29.54 MiB/s Receiving objects: 90% (56073/62303), 74.47 MiB | 29.54 MiB/s Receiving objects: 91% (56696/62303), 74.47 MiB | 29.54 MiB/s Receiving objects: 92% (57319/62303), 74.47 MiB | 29.54 MiB/s Receiving objects: 93% (57942/62303), 74.47 MiB | 29.54 MiB/s Receiving objects: 94% (58565/62303), 74.47 MiB | 29.54 MiB/s Receiving objects: 94% (58732/62303), 74.47 MiB | 29.54 MiB/s Receiving objects: 95% (59188/62303), 74.47 MiB | 29.54 MiB/s Receiving objects: 96% (59811/62303), 74.47 MiB | 29.54 MiB/s Receiving objects: 97% (60434/62303), 89.68 MiB | 29.69 MiB/s Receiving objects: 98% (61057/62303), 89.68 MiB | 29.69 MiB/s Receiving objects: 99% (61680/62303), 89.68 MiB | 29.69 MiB/s remote: Total 62303 (delta 6509), reused 6175 (delta 5984), pack-reused 54646 (from 3)
  7. 6.28 s Receiving objects: 100% (62303/62303), 89.68 MiB | 29.69 MiB/s Receiving objects: 100% (62303/62303), 93.15 MiB | 29.73 MiB/s, done.
  8. 7.27 s Resolving deltas: 0% (0/43439) Resolving deltas: 1% (435/43439) Resolving deltas: 2% (869/43439) Resolving deltas: 3% (1304/43439) Resolving deltas: 4% (1738/43439) Resolving deltas: 5% (2172/43439) Resolving deltas: 6% (2607/43439) Resolving deltas: 7% (3041/43439) Resolving deltas: 8% (3476/43439) Resolving deltas: 9% (3910/43439) Resolving deltas: 10% (4344/43439) Resolving deltas: 11% (4779/43439) Resolving deltas: 12% (5213/43439) Resolving deltas: 13% (5648/43439) Resolving deltas: 14% (6082/43439) Resolving deltas: 15% (6516/43439) Resolving deltas: 16% (6951/43439) Resolving deltas: 17% (7385/43439) Resolving deltas: 18% (7820/43439) Resolving deltas: 19% (8254/43439) Resolving deltas: 20% (8688/43439) Resolving deltas: 21% (9124/43439) Resolving deltas: 22% (9557/43439) Resolving deltas: 23% (9991/43439) Resolving deltas: 24% (10426/43439) Resolving deltas: 25% (10860/43439) Resolving deltas: 26% (11295/43439) Resolving deltas: 27% (11729/43439) Resolving deltas: 28% (12163/43439) Resolving deltas: 29% (12598/43439) Resolving deltas: 30% (13032/43439) Resolving deltas: 31% (13467/43439) Resolving deltas: 32% (13901/43439) Resolving deltas: 33% (14335/43439) Resolving deltas: 34% (14770/43439) Resolving deltas: 35% (15204/43439) Resolving deltas: 36% (15639/43439) Resolving deltas: 37% (16073/43439) Resolving deltas: 38% (16507/43439) Resolving deltas: 39% (16942/43439) Resolving deltas: 40% (17376/43439) Resolving deltas: 41% (17810/43439) Resolving deltas: 42% (18245/43439) Resolving deltas: 43% (18679/43439) Resolving deltas: 44% (19115/43439) Resolving deltas: 45% (19548/43439) Resolving deltas: 46% (19982/43439) Resolving deltas: 47% (20417/43439) Resolving deltas: 48% (20851/43439) Resolving deltas: 49% (21286/43439) Resolving deltas: 50% (21720/43439) Resolving deltas: 51% (22154/43439) Resolving deltas: 52% (22589/43439) Resolving deltas: 53% (23023/43439) Resolving deltas: 54% (23458/43439) Resolving deltas: 55% (23892/43439) Resolving deltas: 56% (24327/43439) Resolving deltas: 57% (24762/43439) Resolving deltas: 58% (25196/43439) Resolving deltas: 59% (25630/43439) Resolving deltas: 60% (26064/43439) Resolving deltas: 61% (26498/43439) Resolving deltas: 62% (26933/43439) Resolving deltas: 63% (27367/43439) Resolving deltas: 64% (27801/43439) Resolving deltas: 65% (28236/43439) Resolving deltas: 66% (28670/43439) Resolving deltas: 67% (29105/43439) Resolving deltas: 68% (29539/43439) Resolving deltas: 69% (29973/43439) Resolving deltas: 70% (30408/43439) Resolving deltas: 71% (30842/43439) Resolving deltas: 72% (31277/43439) Resolving deltas: 73% (31711/43439) Resolving deltas: 74% (32145/43439) Resolving deltas: 75% (32580/43439) Resolving deltas: 76% (33014/43439) Resolving deltas: 77% (33453/43439) Resolving deltas: 78% (33883/43439) Resolving deltas: 79% (34317/43439) Resolving deltas: 80% (34753/43439) Resolving deltas: 81% (35186/43439) Resolving deltas: 82% (35620/43439) Resolving deltas: 83% (36055/43439) Resolving deltas: 84% (36489/43439) Resolving deltas: 85% (36924/43439) Resolving deltas: 86% (37358/43439) Resolving deltas: 87% (37792/43439) Resolving deltas: 88% (38227/43439) Resolving deltas: 89% (38661/43439) Resolving deltas: 90% (39096/43439) Resolving deltas: 91% (39530/43439) Resolving deltas: 92% (39964/43439) Resolving deltas: 93% (40399/43439) Resolving deltas: 93% (40687/43439) Resolving deltas: 94% (40833/43439) Resolving deltas: 95% (41268/43439) Resolving deltas: 96% (41702/43439) Resolving deltas: 97% (42136/43439) Resolving deltas: 98% (42571/43439) Resolving deltas: 99% (43005/43439) Resolving deltas: 100% (43439/43439) Resolving deltas: 100% (43439/43439), done.
  9. 7.58 s Fetching commit ed5aa62ad38895524e198db9bbf1214fcd1c94ab for docs ...
  10. 7.58 s $ /nix/store/bcnisk3ydfgv26v2gw3zlky24g00yww2-git-2.54.0/bin/git fetch origin ed5aa62ad38895524e198db9bbf1214fcd1c94ab
  11. 8.12 s From https://github.com/alphal00p/gammaloop
  12. 8.12 s * branch ed5aa62ad38895524e198db9bbf1214fcd1c94ab -> FETCH_HEAD
  13. 8.14 s $ /nix/store/9ypz3flqsrl5xl495mm8h645gadjsxi1-coreutils-9.11/bin/timeout --kill-after=15s 7200s /nix/store/bcnisk3ydfgv26v2gw3zlky24g00yww2-git-2.54.0/bin/git -c advice.detachedHead=false checkout ed5aa62ad38895524e198db9bbf1214fcd1c94ab
  14. 8.37 s HEAD is now at ed5aa62a include About graph fixture in Nix docs source
  15. 8.38 s $ /nix/store/9ypz3flqsrl5xl495mm8h645gadjsxi1-coreutils-9.11/bin/timeout --kill-after=15s 7200s /nix/store/23zk8sgzamrbmj1fday15szf7f2279s8-nix-2.34.7/bin/nix --extra-experimental-features nix-command --extra-experimental-features flakes --log-format internal-json run .#packages.x86_64-linux.nix-ci-check-gammaloop-doctest --print-build-logs
  16. 10.99 s
  17. 11.17 s Downloading cached nix-ci-check-gammaloop-doctest from https://cache.nix-ci.com
  18. 11.54 s Downloaded cached nix-ci-check-gammaloop-doctest (1000 B) in 374ms
  19. 11.60 s Progress: 0 of 1 built, 1 of 1 downloaded from cache
  20. 15.29 s evaluating derivation 'g copying '/nix/store/509j evaluating derivation 'g querying gammaloop-works [0.0 KiB DL] [0/1 built, 0.0 KiB DL] [1/0/1 built, 0.0 KiB DLgammaloop-workspace-doctest> Running phase: unpackPhase
  21. 15.29 s gammaloop-workspace-doctest> unpacking source archive /nix/store/zw60sp2yw0jzbn0l3i8p6pynq3h4pivs-source
  22. 15.45 s gammaloop-workspace-doctest> source root is source
  23. 15.49 s gammaloop-workspace-doctest> Running phase: patchPhase
  24. 15.49 s gammaloop-workspace-doctest> Executing configureCargoCommonVars
  25. 15.49 s gammaloop-workspace-doctest> decompressing cargo artifacts from /nix/store/8rkh7d3hq722l839568nhnwihnsx041a-gammaloop-workspace-deps-deps-0.1.0/target.tar.zst to target
  26. 18.06 s gammaloop-workspace-doctest> Running phase: updateAutotoolsGnuConfigScriptsPhase
  27. 18.11 s gammaloop-workspace-doctest> Running phase: configurePhase
  28. 18.11 s gammaloop-workspace-doctest> will append /build/source/.cargo-home/config.toml with contents of /nix/store/xdy1vvhll2bijdplvl9fcc2b9plkxhaa-vendor-cargo-deps/config.toml
  29. 18.11 s gammaloop-workspace-doctest> default configurePhase, nothing to do
  30. 18.11 s gammaloop-workspace-doctest> Running phase: buildPhase
  31. 18.11 s gammaloop-workspace-doctest> +++ command cargo --version
  32. 18.11 s gammaloop-workspace-doctest> cargo 1.97.0 (c980f4866 2026-06-30)
  33. 18.14 s gammaloop-workspace-doctest> +++ command cargo test --profile ci-optim --doc --locked --workspace --features gammaloop-api/cli,gammaloop-tracing-filter/clap,gammaloop-tracing-filter/symbolica,idenso/bincode,idenso/reference-cases,linnet/bincode,linnet/drawing,linnet/nodestore-vec,linnet/rkyv,linnet/serde,linnet/symbolica,spenso-macros/shadowing,spenso/shadowing,symbolica/tracing_max_level_info
  34. 18.56 s gammaloop-workspace-doctest> Compiling target-lexicon v0.13.5
  35. 18.57 s gammaloop-workspace-doctest> Compiling symbolica v2.2.0 (https://github.com/symbolica-dev/symbolica?branch=dev#0441bd7a)
  36. 18.57 s gammaloop-workspace-doctest> Compiling maplit v1.0.2
  37. 18.59 s gammaloop-workspace-doctest> Compiling gammaloop-tracing-filter-macros v0.1.0 (/build/source/crates/gammaloop-tracing-filter-macros)
  38. 18.59 s gammaloop-workspace-doctest> Compiling vakint v0.1.2 (/build/source/crates/vakint)
  39. 18.60 s gammaloop-workspace-doctest> Compiling gammalooprs v0.3.4 (/build/source/crates/gammalooprs)
  40. 18.60 s gammaloop-workspace-doctest> Compiling alphal00p-docs-macros v0.1.0 (/build/source/crates/alphal00p-docs-macros)
  41. 18.61 s gammaloop-workspace-doctest> Compiling alphal00p-docs-schema v0.1.0 (/build/source/crates/alphal00p-docs-schema)
  42. 18.61 s gammaloop-workspace-doctest> Compiling rustc_version v0.4.1
  43. 18.61 s gammaloop-workspace-doctest> Compiling bincode v1.3.3
  44. 18.61 s gammaloop-workspace-doctest> Compiling gungraun-runner v0.18.2
  45. 18.61 s gammaloop-workspace-doctest> Compiling target-triple v1.0.1
  46. 18.61 s gammaloop-workspace-doctest> Compiling iai-callgrind-runner v0.14.2
  47. 18.61 s gammaloop-workspace-doctest> Compiling gammaloop-integration-tests v0.1.0 (/build/source/tests)
  48. 18.65 s gammaloop-workspace-doctest> Compiling test-log-core v0.2.20
  49. 18.87 s gammaloop-workspace-doctest> Compiling wait-timeout v0.2.1
  50. 18.90 s gammaloop-workspace-doctest> Compiling iai-callgrind v0.14.2
  51. 18.93 s gammaloop-workspace-doctest> Compiling quick-error v1.2.3
  52. 18.95 s gammaloop-workspace-doctest> Compiling bit-vec v0.8.0
  53. 19.12 s gammaloop-workspace-doctest> Compiling rusty-fork v0.3.1
  54. 19.20 s gammaloop-workspace-doctest> Compiling iai-callgrind-macros v0.5.1
  55. 19.21 s gammaloop-workspace-doctest> Compiling rand_xorshift v0.4.0
  56. 19.30 s gammaloop-workspace-doctest> Compiling console v0.15.11
  57. 19.34 s gammaloop-workspace-doctest> Compiling unarray v0.1.4
  58. 19.41 s gammaloop-workspace-doctest> Compiling glob v0.3.4
  59. 19.45 s gammaloop-workspace-doctest> Compiling base64 v0.21.7
  60. 19.53 s gammaloop-workspace-doctest> Compiling bit-set v0.8.0
  61. 19.62 s gammaloop-workspace-doctest> Compiling gungraun-macros v0.8.0
  62. 19.63 s gammaloop-workspace-doctest> Compiling termcolor v1.4.1
  63. 19.97 s gammaloop-workspace-doctest> Compiling trybuild v1.0.120
  64. 20.26 s gammaloop-workspace-doctest> Compiling alphal00p-docs-catalogs v0.1.0 (/build/source/crates/alphal00p-docs-catalogs)
  65. 20.29 s gammaloop-workspace-doctest> Compiling ron v0.8.1
  66. 20.29 s gammaloop-workspace-doctest> Compiling similar-asserts v1.7.0
  67. 20.37 s gammaloop-workspace-doctest> Compiling proptest v1.11.0
  68. 20.70 s gammaloop-workspace-doctest> Compiling pyo3-build-config v0.28.3
  69. 20.73 s gammaloop-workspace-doctest> Compiling alphal00p-docs-builder v0.1.0 (/build/source/crates/alphal00p-docs-builder)
  70. 20.82 s gammaloop-workspace-doctest> Compiling kurvst v0.1.0 (/build/source/crates/kurvst)
  71. 21.92 s gammaloop-workspace-doctest> Compiling test-log-macros v0.2.20
  72. 25.13 s gammaloop-workspace-doctest> Compiling test-log v0.2.20
  73. 25.62 s gammaloop-workspace-doctest> Compiling alphal00p-docs-examples v0.1.0 (/build/source/crates/alphal00p-docs-examples)
  74. 27.21 s gammaloop-workspace-doctest> Compiling pyo3-ffi v0.28.3
  75. 27.32 s gammaloop-workspace-doctest> Compiling pyo3-macros-backend v0.28.3
  76. 27.66 s gammaloop-workspace-doctest> Compiling pyo3 v0.28.3
  77. 27.67 s gammaloop-workspace-doctest> Compiling numpy v0.28.0
  78. 28.10 s gammaloop-workspace-doctest> Compiling gammaloop-api v0.1.0 (/build/source/crates/gammaloop-api)
  79. 28.12 s gammaloop-workspace-doctest> Compiling gungraun v0.18.2
  80. 36.63 s gammaloop-workspace-doctest> Compiling pyo3-macros v0.28.3
  81. 42.65 s gammaloop-workspace-doctest> Compiling pyo3-stub-gen v0.17.2
  82. 43.45 s gammaloop-workspace-doctest> Compiling numerica v2.2.0 (https://github.com/symbolica-dev/symbolica?branch=dev#0441bd7a)
  83. 46.00 s gammaloop-workspace-doctest> Compiling graphica v2.1.0 (https://github.com/symbolica-dev/symbolica?branch=dev#0441bd7a)
  84. 48.52 s gammaloop-workspace-doctest> Compiling symbolica-utils v0.1.0 (/build/source/crates/symbolica-utils)
  85. 218.71 s gammaloop-workspace-doctest> Compiling gammaloop-workspace-hack v0.1.0 (/build/source/crates/gammaloop-workspace-hack)
  86. 218.76 s gammaloop-workspace-doctest> Compiling spenso-macros v0.3.2 (/build/source/crates/spenso-macros)
  87. 218.86 s gammaloop-workspace-doctest> Compiling linnet v0.17.0 (/build/source/crates/linnet)
  88. 221.69 s gammaloop-workspace-doctest> Compiling spenso v0.6.0 (/build/source/crates/spenso)
  89. 228.05 s gammaloop-workspace-doctest> Compiling idenso v0.3.0 (/build/source/crates/idenso)
  90. 228.09 s gammaloop-workspace-doctest> Compiling gammaloop-tracing-filter v0.1.0 (/build/source/crates/gammaloop-tracing-filter)
  91. 231.14 s gammaloop-workspace-doctest> Compiling spenso-hep-lib v0.1.7 (/build/source/crates/spenso-hep-lib)
  92. 231.33 s gammaloop-workspace-doctest> Compiling spynso3 v0.1.2 (/build/source/crates/spynso3)
  93. 268.97 s gammaloop-workspace-doctest> Compiling linnest v0.1.0 (/build/source/crates/linnest)
  94. 271.33 s gammaloop-workspace-doctest> Compiling linnet-py v0.1.0 (/build/source/crates/linnet-py)
  95. 391.07 s gammaloop-workspace-doctest> Finished `ci-optim` profile [optimized] target(s) in 6m 12s
  96. 391.20 s gammaloop-workspace-doctest> warning: the following packages contain code that will be rejected by a future version of Rust: proc-macro-error2 v2.0.1
  97. 391.20 s gammaloop-workspace-doctest> note: to see what the problems were, use the option `--future-incompat-report`, or run `cargo report future-incompatibilities --id 1`
  98. 391.21 s gammaloop-workspace-doctest> Doc-tests alphal00p_docs_builder
  99. 391.37 s gammaloop-workspace-doctest>
  100. 391.37 s gammaloop-workspace-doctest> running 0 tests
  101. 391.37 s gammaloop-workspace-doctest>
  102. 391.37 s gammaloop-workspace-doctest> test result: ok. 0 passed; 0 failed; 0 ignored; 0 measured; 0 filtered out; finished in 0.00s
  103. 391.37 s gammaloop-workspace-doctest>
  104. 391.37 s gammaloop-workspace-doctest> Doc-tests alphal00p_docs_catalogs
  105. 392.56 s gammaloop-workspace-doctest>
  106. 392.56 s gammaloop-workspace-doctest> running 0 tests
  107. 392.56 s gammaloop-workspace-doctest>
  108. 392.56 s gammaloop-workspace-doctest> test result: ok. 0 passed; 0 failed; 0 ignored; 0 measured; 0 filtered out; finished in 0.00s
  109. 392.56 s gammaloop-workspace-doctest>
  110. 392.56 s gammaloop-workspace-doctest> Doc-tests alphal00p_docs_examples
  111. 392.57 s gammaloop-workspace-doctest>
  112. 392.57 s gammaloop-workspace-doctest> running 0 tests
  113. 392.57 s gammaloop-workspace-doctest>
  114. 392.57 s gammaloop-workspace-doctest> test result: ok. 0 passed; 0 failed; 0 ignored; 0 measured; 0 filtered out; finished in 0.00s
  115. 392.57 s gammaloop-workspace-doctest>
  116. 392.57 s gammaloop-workspace-doctest> Doc-tests alphal00p_docs
  117. 392.63 s gammaloop-workspace-doctest>
  118. 392.63 s gammaloop-workspace-doctest> running 0 tests
  119. 392.63 s gammaloop-workspace-doctest>
  120. 392.63 s gammaloop-workspace-doctest> test result: ok. 0 passed; 0 failed; 0 ignored; 0 measured; 0 filtered out; finished in 0.00s
  121. 392.63 s gammaloop-workspace-doctest>
  122. 392.63 s gammaloop-workspace-doctest> Doc-tests alphal00p_docs_schema
  123. 392.70 s gammaloop-workspace-doctest>
  124. 392.70 s gammaloop-workspace-doctest> running 0 tests
  125. 392.70 s gammaloop-workspace-doctest>
  126. 392.70 s gammaloop-workspace-doctest> test result: ok. 0 passed; 0 failed; 0 ignored; 0 measured; 0 filtered out; finished in 0.00s
  127. 392.70 s gammaloop-workspace-doctest>
  128. 392.70 s gammaloop-workspace-doctest> Doc-tests gammaloop_api
  129. 393.63 s gammaloop-workspace-doctest>
  130. 393.63 s gammaloop-workspace-doctest> running 16 tests
  131. 393.65 s gammaloop-workspace-doctest> test crates/gammaloop-api/src/python.rs - python::GammaLoopAPI::evaluate_samples (line 3108) ... FAILED
  132. 393.65 s gammaloop-workspace-doctest> test crates/gammaloop-api/src/python.rs - python::GammaLoopAPI::get_active_command_blocks (line 3760) ... FAILED
  133. 393.65 s gammaloop-workspace-doctest> test crates/gammaloop-api/src/python.rs - python::GammaLoopAPI::evaluate_sample (line 2967) ... FAILED
  134. 393.65 s gammaloop-workspace-doctest> test crates/gammaloop-api/src/python.rs - python::GammaLoopAPI::get_default_runtime_settings (line 3796) ... FAILED
  135. 393.65 s gammaloop-workspace-doctest> test crates/gammaloop-api/src/python.rs - python::GammaLoopAPI::get_integrand_settings (line 3647) ... FAILED
  136. 393.66 s gammaloop-workspace-doctest> test crates/gammaloop-api/src/python.rs - python::GammaLoopAPI::get_integrand_info (line 3585) ... FAILED
  137. 393.66 s gammaloop-workspace-doctest> test crates/gammaloop-api/src/python.rs - python::PyHistogramAccumulator (line 871) ... FAILED
  138. 393.73 s gammaloop-workspace-doctest> test crates/gammaloop-api/src/lib.rs - (line 18) - compile ... ok
  139. 393.74 s gammaloop-workspace-doctest> test crates/gammaloop-api/src/python.rs - python::GammaLoopAPI::run_command (line 3901) ... FAILED
  140. 393.75 s gammaloop-workspace-doctest> test crates/gammaloop-api/src/python.rs - python::GammaLoopAPI::get_run_history (line 3711) ... FAILED
  141. 393.75 s gammaloop-workspace-doctest> test crates/gammaloop-api/src/python.rs - python::GammaLoopAPI::get_global_settings (line 3739) ... FAILED
  142. 393.76 s gammaloop-workspace-doctest> test crates/gammaloop-api/src/python.rs - python::GammaLoopAPI::new_python (line 2834) ... FAILED
  143. 393.76 s gammaloop-workspace-doctest> test crates/gammaloop-api/src/python.rs - python::evaluate_graph_overall_factor (line 95) ... FAILED
  144. 393.76 s gammaloop-workspace-doctest> test crates/gammaloop-api/src/python.rs - python::atom_to_canonical_string (line 128) ... FAILED
  145. 393.79 s gammaloop-workspace-doctest> test crates/gammaloop-api/src/python.rs - python::atom_to_dots (line 157) ... FAILED
  146. 396.36 s gammaloop-workspace-doctest> test crates/gammaloop-api/src/commands/evaluate_samples.rs - commands::evaluate_samples::EvaluateSamples (line 50) ... ok
  147. 396.43 s gammaloop-workspace-doctest>
  148. 396.43 s gammaloop-workspace-doctest> failures:
  149. 396.43 s gammaloop-workspace-doctest>
  150. 396.43 s gammaloop-workspace-doctest> ---- crates/gammaloop-api/src/python.rs - python::GammaLoopAPI::evaluate_samples (line 3108) stdout ----
  151. 396.43 s gammaloop-workspace-doctest> error: expected one of `!` or `::`, found `pathlib`
  152. 396.43 s gammaloop-workspace-doctest> --> crates/gammaloop-api/src/python.rs:3109:6
  153. 396.43 s gammaloop-workspace-doctest> |
  154. 396.43 s gammaloop-workspace-doctest> 3109 | from pathlib import Path
  155. 396.43 s gammaloop-workspace-doctest> | ^^^^^^^ expected one of `!` or `::`
  156. 396.43 s gammaloop-workspace-doctest>
  157. 396.43 s gammaloop-workspace-doctest> error: aborting due to 1 previous error
  158. 396.43 s gammaloop-workspace-doctest>
  159. 396.43 s gammaloop-workspace-doctest> Couldn't compile the test.
  160. 396.43 s gammaloop-workspace-doctest> ---- crates/gammaloop-api/src/python.rs - python::GammaLoopAPI::get_active_command_blocks (line 3760) stdout ----
  161. 396.43 s gammaloop-workspace-doctest> error: expected item, found keyword `for`
  162. 396.43 s gammaloop-workspace-doctest> --> crates/gammaloop-api/src/python.rs:3761:1
  163. 396.43 s gammaloop-workspace-doctest> |
  164. 396.43 s gammaloop-workspace-doctest> 3761 | for name, commands in api.get_active_command_blocks().items():
  165. 396.43 s gammaloop-workspace-doctest> | ^^^ expected item
  166. 396.43 s gammaloop-workspace-doctest> |
  167. 396.43 s gammaloop-workspace-doctest> = note: for a full list of items that can appear in modules, see <https://doc.rust-lang.org/reference/items.html>
  168. 396.43 s gammaloop-workspace-doctest>
  169. 396.43 s gammaloop-workspace-doctest> error: aborting due to 1 previous error
  170. 396.43 s gammaloop-workspace-doctest>
  171. 396.43 s gammaloop-workspace-doctest> Couldn't compile the test.
  172. 396.43 s gammaloop-workspace-doctest> ---- crates/gammaloop-api/src/python.rs - python::GammaLoopAPI::evaluate_sample (line 2967) stdout ----
  173. 396.43 s gammaloop-workspace-doctest> error: expected one of `!` or `::`, found `pathlib`
  174. 396.43 s gammaloop-workspace-doctest> --> crates/gammaloop-api/src/python.rs:2968:6
  175. 396.43 s gammaloop-workspace-doctest> |
  176. 396.43 s gammaloop-workspace-doctest> 2968 | from pathlib import Path
  177. 396.43 s gammaloop-workspace-doctest> | ^^^^^^^ expected one of `!` or `::`
  178. 396.43 s gammaloop-workspace-doctest>
  179. 396.43 s gammaloop-workspace-doctest> error: aborting due to 1 previous error
  180. 396.43 s gammaloop-workspace-doctest>
  181. 396.43 s gammaloop-workspace-doctest> Couldn't compile the test.
  182. 396.43 s gammaloop-workspace-doctest> ---- crates/gammaloop-api/src/python.rs - python::GammaLoopAPI::get_default_runtime_settings (line 3796) stdout ----
  183. 396.43 s gammaloop-workspace-doctest> error: expected one of `!` or `::`, found `=`
  184. 396.43 s gammaloop-workspace-doctest> --> crates/gammaloop-api/src/python.rs:3797:9
  185. 396.43 s gammaloop-workspace-doctest> |
  186. 396.43 s gammaloop-workspace-doctest> 3797 | runtime = api.get_default_runtime_settings()
  187. 396.43 s gammaloop-workspace-doctest> | ^ expected one of `!` or `::`
  188. 396.43 s gammaloop-workspace-doctest>
  189. 396.43 s gammaloop-workspace-doctest> error: aborting due to 1 previous error
  190. 396.43 s gammaloop-workspace-doctest>
  191. 396.43 s gammaloop-workspace-doctest> Couldn't compile the test.
  192. 396.43 s gammaloop-workspace-doctest> ---- crates/gammaloop-api/src/python.rs - python::GammaLoopAPI::get_integrand_settings (line 3647) stdout ----
  193. 396.43 s gammaloop-workspace-doctest> error: expected one of `!` or `::`, found `=`
  194. 396.43 s gammaloop-workspace-doctest> --> crates/gammaloop-api/src/python.rs:3648:10
  195. 396.43 s gammaloop-workspace-doctest> |
  196. 396.43 s gammaloop-workspace-doctest> 3648 | settings = api.get_integrand_settings(process_id=0)
  197. 396.43 s gammaloop-workspace-doctest> | ^ expected one of `!` or `::`
  198. 396.43 s gammaloop-workspace-doctest>
  199. 396.43 s gammaloop-workspace-doctest> error: aborting due to 1 previous error
  200. 396.43 s gammaloop-workspace-doctest>
  201. 396.43 s gammaloop-workspace-doctest> Couldn't compile the test.
  202. 396.43 s gammaloop-workspace-doctest> ---- crates/gammaloop-api/src/python.rs - python::GammaLoopAPI::get_integrand_info (line 3585) stdout ----
  203. 396.43 s gammaloop-workspace-doctest> error: expected one of `!` or `::`, found `pathlib`
  204. 396.43 s gammaloop-workspace-doctest> --> crates/gammaloop-api/src/python.rs:3586:6
  205. 396.43 s gammaloop-workspace-doctest> |
  206. 396.43 s gammaloop-workspace-doctest> 3586 | from pathlib import Path
  207. 396.43 s gammaloop-workspace-doctest> | ^^^^^^^ expected one of `!` or `::`
  208. 396.43 s gammaloop-workspace-doctest>
  209. 396.43 s gammaloop-workspace-doctest> error: aborting due to 1 previous error
  210. 396.43 s gammaloop-workspace-doctest>
  211. 396.43 s gammaloop-workspace-doctest> Couldn't compile the test.
  212. 396.43 s gammaloop-workspace-doctest> ---- crates/gammaloop-api/src/python.rs - python::PyHistogramAccumulator (line 871) stdout ----
  213. 396.43 s gammaloop-workspace-doctest> error: expected one of `!` or `::`, found `gammaloop`
  214. 396.43 s gammaloop-workspace-doctest> --> crates/gammaloop-api/src/python.rs:872:6
  215. 396.43 s gammaloop-workspace-doctest> |
  216. 396.43 s gammaloop-workspace-doctest> 872 | from gammaloop import HistogramAccumulator
  217. 396.43 s gammaloop-workspace-doctest> | ^^^^^^^^^ expected one of `!` or `::`
  218. 396.43 s gammaloop-workspace-doctest>
  219. 396.43 s gammaloop-workspace-doctest> error: aborting due to 1 previous error
  220. 396.43 s gammaloop-workspace-doctest>
  221. 396.43 s gammaloop-workspace-doctest> Couldn't compile the test.
  222. 396.43 s gammaloop-workspace-doctest> ---- crates/gammaloop-api/src/python.rs - python::GammaLoopAPI::run_command (line 3901) stdout ----
  223. 396.43 s gammaloop-workspace-doctest> error[E0425]: cannot find value `api` in this scope
  224. 396.43 s gammaloop-workspace-doctest> --> crates/gammaloop-api/src/python.rs:3902:1
  225. 396.43 s gammaloop-workspace-doctest> |
  226. 396.43 s gammaloop-workspace-doctest> 3902 | api.run("display processes")
  227. 396.43 s gammaloop-workspace-doctest> | ^^^ not found in this scope
  228. 396.43 s gammaloop-workspace-doctest>
  229. 396.43 s gammaloop-workspace-doctest> error: aborting due to 1 previous error
  230. 396.43 s gammaloop-workspace-doctest>
  231. 396.43 s gammaloop-workspace-doctest> For more information about this error, try `rustc --explain E0425`.
  232. 396.43 s gammaloop-workspace-doctest> Couldn't compile the test.
  233. 396.43 s gammaloop-workspace-doctest> ---- crates/gammaloop-api/src/python.rs - python::GammaLoopAPI::get_run_history (line 3711) stdout ----
  234. 396.43 s gammaloop-workspace-doctest> error[E0425]: cannot find value `run_card_toml` in this scope
  235. 396.43 s gammaloop-workspace-doctest> --> crates/gammaloop-api/src/python.rs:3712:1
  236. 396.43 s gammaloop-workspace-doctest> |
  237. 396.43 s gammaloop-workspace-doctest> 3712 | run_card_toml = api.get_run_history()
  238. 396.43 s gammaloop-workspace-doctest> | ^^^^^^^^^^^^^
  239. 396.43 s gammaloop-workspace-doctest> |
  240. 396.43 s gammaloop-workspace-doctest> help: you might have meant to introduce a new binding
  241. 396.43 s gammaloop-workspace-doctest> |
  242. 396.43 s gammaloop-workspace-doctest> 3712 | let run_card_toml = api.get_run_history()
  243. 396.43 s gammaloop-workspace-doctest> | +++
  244. 396.43 s gammaloop-workspace-doctest>
  245. 396.43 s gammaloop-workspace-doctest> error[E0425]: cannot find value `api` in this scope
  246. 396.43 s gammaloop-workspace-doctest> --> crates/gammaloop-api/src/python.rs:3712:17
  247. 396.43 s gammaloop-workspace-doctest> |
  248. 396.43 s gammaloop-workspace-doctest> 3712 | run_card_toml = api.get_run_history()
  249. 396.43 s gammaloop-workspace-doctest> | ^^^ not found in this scope
  250. 396.43 s gammaloop-workspace-doctest>
  251. 396.43 s gammaloop-workspace-doctest> error: aborting due to 2 previous errors
  252. 396.43 s gammaloop-workspace-doctest>
  253. 396.43 s gammaloop-workspace-doctest> For more information about this error, try `rustc --explain E0425`.
  254. 396.43 s gammaloop-workspace-doctest> Couldn't compile the test.
  255. 396.43 s gammaloop-workspace-doctest> ---- crates/gammaloop-api/src/python.rs - python::GammaLoopAPI::get_global_settings (line 3739) stdout ----
  256. 396.43 s gammaloop-workspace-doctest> error[E0425]: cannot find value `settings_toml` in this scope
  257. 396.43 s gammaloop-workspace-doctest> --> crates/gammaloop-api/src/python.rs:3740:1
  258. 396.43 s gammaloop-workspace-doctest> |
  259. 396.43 s gammaloop-workspace-doctest> 3740 | settings_toml = api.get_global_settings()
  260. 396.43 s gammaloop-workspace-doctest> | ^^^^^^^^^^^^^
  261. 396.43 s gammaloop-workspace-doctest> |
  262. 396.43 s gammaloop-workspace-doctest> help: you might have meant to introduce a new binding
  263. 396.43 s gammaloop-workspace-doctest> |
  264. 396.43 s gammaloop-workspace-doctest> 3740 | let settings_toml = api.get_global_settings()
  265. 396.43 s gammaloop-workspace-doctest> | +++
  266. 396.43 s gammaloop-workspace-doctest>
  267. 396.43 s gammaloop-workspace-doctest> error[E0425]: cannot find value `api` in this scope
  268. 396.43 s gammaloop-workspace-doctest> --> crates/gammaloop-api/src/python.rs:3740:17
  269. 396.43 s gammaloop-workspace-doctest> |
  270. 396.43 s gammaloop-workspace-doctest> 3740 | settings_toml = api.get_global_settings()
  271. 396.43 s gammaloop-workspace-doctest> | ^^^ not found in this scope
  272. 396.43 s gammaloop-workspace-doctest>
  273. 396.43 s gammaloop-workspace-doctest> error: aborting due to 2 previous errors
  274. 396.43 s gammaloop-workspace-doctest>
  275. 396.43 s gammaloop-workspace-doctest> For more information about this error, try `rustc --explain E0425`.
  276. 396.43 s gammaloop-workspace-doctest> Couldn't compile the test.
  277. 396.43 s gammaloop-workspace-doctest> ---- crates/gammaloop-api/src/python.rs - python::GammaLoopAPI::new_python (line 2834) stdout ----
  278. 396.43 s gammaloop-workspace-doctest> error[E0425]: cannot find value `api` in this scope
  279. 396.43 s gammaloop-workspace-doctest> --> crates/gammaloop-api/src/python.rs:2835:1
  280. 396.43 s gammaloop-workspace-doctest> |
  281. 396.43 s gammaloop-workspace-doctest> 2835 | api = GammaLoopAPI(state_folder="./state", read_only_state=True)
  282. 396.43 s gammaloop-workspace-doctest> | ^^^
  283. 396.43 s gammaloop-workspace-doctest> |
  284. 396.43 s gammaloop-workspace-doctest> help: you might have meant to introduce a new binding
  285. 396.43 s gammaloop-workspace-doctest> |
  286. 396.43 s gammaloop-workspace-doctest> 2835 | let api = GammaLoopAPI(state_folder="./state", read_only_state=True)
  287. 396.43 s gammaloop-workspace-doctest> | +++
  288. 396.43 s gammaloop-workspace-doctest>
  289. 396.43 s gammaloop-workspace-doctest> error[E0425]: cannot find value `state_folder` in this scope
  290. 396.43 s gammaloop-workspace-doctest> --> crates/gammaloop-api/src/python.rs:2835:20
  291. 396.43 s gammaloop-workspace-doctest> |
  292. 396.43 s gammaloop-workspace-doctest> 2835 | api = GammaLoopAPI(state_folder="./state", read_only_state=True)
  293. 396.43 s gammaloop-workspace-doctest> | ^^^^^^^^^^^^ not found in this scope
  294. 396.43 s gammaloop-workspace-doctest>
  295. 396.43 s gammaloop-workspace-doctest> error[E0425]: cannot find value `read_only_state` in this scope
  296. 396.43 s gammaloop-workspace-doctest> --> crates/gammaloop-api/src/python.rs:2835:44
  297. 396.43 s gammaloop-workspace-doctest> |
  298. 396.43 s gammaloop-workspace-doctest> 2835 | api = GammaLoopAPI(state_folder="./state", read_only_state=True)
  299. 396.43 s gammaloop-workspace-doctest> | ^^^^^^^^^^^^^^^ not found in this scope
  300. 396.43 s gammaloop-workspace-doctest>
  301. 396.43 s gammaloop-workspace-doctest> error[E0425]: cannot find value `True` in this scope
  302. 396.43 s gammaloop-workspace-doctest> --> crates/gammaloop-api/src/python.rs:2835:60
  303. 396.43 s gammaloop-workspace-doctest> |
  304. 396.43 s gammaloop-workspace-doctest> 2835 | api = GammaLoopAPI(state_folder="./state", read_only_state=True)
  305. 396.43 s gammaloop-workspace-doctest> | ^^^^ not found in this scope
  306. 396.43 s gammaloop-workspace-doctest> |
  307. 396.43 s gammaloop-workspace-doctest> help: you may want to use a bool value instead
  308. 396.43 s gammaloop-workspace-doctest> |
  309. 396.43 s gammaloop-workspace-doctest> 2835 - api = GammaLoopAPI(state_folder="./state", read_only_state=True)
  310. 396.43 s gammaloop-workspace-doctest> 2835 + api = GammaLoopAPI(state_folder="./state", read_only_state=true)
  311. 396.43 s gammaloop-workspace-doctest> |
  312. 396.43 s gammaloop-workspace-doctest>
  313. 396.43 s gammaloop-workspace-doctest> error[E0425]: cannot find function, tuple struct or tuple variant `GammaLoopAPI` in this scope
  314. 396.43 s gammaloop-workspace-doctest> --> crates/gammaloop-api/src/python.rs:2835:7
  315. 396.43 s gammaloop-workspace-doctest> |
  316. 396.43 s gammaloop-workspace-doctest> 2835 | api = GammaLoopAPI(state_folder="./state", read_only_state=True)
  317. 396.43 s gammaloop-workspace-doctest> | ^^^^^^^^^^^^ not found in this scope
  318. 396.43 s gammaloop-workspace-doctest>
  319. 396.43 s gammaloop-workspace-doctest> error: aborting due to 5 previous errors
  320. 396.43 s gammaloop-workspace-doctest>
  321. 396.43 s gammaloop-workspace-doctest> For more information about this error, try `rustc --explain E0425`.
  322. 396.43 s gammaloop-workspace-doctest> Couldn't compile the test.
  323. 396.43 s gammaloop-workspace-doctest> ---- crates/gammaloop-api/src/python.rs - python::evaluate_graph_overall_factor (line 95) stdout ----
  324. 396.43 s gammaloop-workspace-doctest> error[E0425]: cannot find function `evaluate_graph_overall_factor` in this scope
  325. 396.43 s gammaloop-workspace-doctest> --> crates/gammaloop-api/src/python.rs:96:1
  326. 396.43 s gammaloop-workspace-doctest> |
  327. 396.43 s gammaloop-workspace-doctest> 96 | evaluate_graph_overall_factor(
  328. 396.43 s gammaloop-workspace-doctest> | ^^^^^^^^^^^^^^^^^^^^^^^^^^^^^ not found in this scope
  329. 396.43 s gammaloop-workspace-doctest>
  330. 396.43 s gammaloop-workspace-doctest> error: aborting due to 1 previous error
  331. 396.43 s gammaloop-workspace-doctest>
  332. 396.43 s gammaloop-workspace-doctest> For more information about this error, try `rustc --explain E0425`.
  333. 396.43 s gammaloop-workspace-doctest> Couldn't compile the test.
  334. 396.43 s gammaloop-workspace-doctest> ---- crates/gammaloop-api/src/python.rs - python::atom_to_canonical_string (line 128) stdout ----
  335. 396.43 s gammaloop-workspace-doctest> error[E0425]: cannot find function `atom_to_canonical_string` in this scope
  336. 396.43 s gammaloop-workspace-doctest> --> crates/gammaloop-api/src/python.rs:129:1
  337. 396.43 s gammaloop-workspace-doctest> |
  338. 396.43 s gammaloop-workspace-doctest> 129 | atom_to_canonical_string("x + x")
  339. 396.43 s gammaloop-workspace-doctest> | ^^^^^^^^^^^^^^^^^^^^^^^^ not found in this scope
  340. 396.43 s gammaloop-workspace-doctest>
  341. 396.43 s gammaloop-workspace-doctest> error: aborting due to 1 previous error
  342. 396.43 s gammaloop-workspace-doctest>
  343. 396.43 s gammaloop-workspace-doctest> For more information about this error, try `rustc --explain E0425`.
  344. 396.43 s gammaloop-workspace-doctest> Couldn't compile the test.
  345. 396.43 s gammaloop-workspace-doctest> ---- crates/gammaloop-api/src/python.rs - python::atom_to_dots (line 157) stdout ----
  346. 396.43 s gammaloop-workspace-doctest> error[E0425]: cannot find function `to_dots` in this scope
  347. 396.43 s gammaloop-workspace-doctest> --> crates/gammaloop-api/src/python.rs:158:1
  348. 396.43 s gammaloop-workspace-doctest> |
  349. 396.43 s gammaloop-workspace-doctest> 158 | to_dots("p(mu) * q(mu)")
  350. 396.43 s gammaloop-workspace-doctest> | ^^^^^^^ not found in this scope
  351. 396.43 s gammaloop-workspace-doctest>
  352. 396.43 s gammaloop-workspace-doctest> error: aborting due to 1 previous error
  353. 396.43 s gammaloop-workspace-doctest>
  354. 396.43 s gammaloop-workspace-doctest> For more information about this error, try `rustc --explain E0425`.
  355. 396.43 s gammaloop-workspace-doctest> Couldn't compile the test.
  356. 396.43 s gammaloop-workspace-doctest>
  357. 396.43 s gammaloop-workspace-doctest> failures:
  358. 396.43 s gammaloop-workspace-doctest> crates/gammaloop-api/src/python.rs - python::GammaLoopAPI::evaluate_sample (line 2967)
  359. 396.43 s gammaloop-workspace-doctest> crates/gammaloop-api/src/python.rs - python::GammaLoopAPI::evaluate_samples (line 3108)
  360. 396.43 s gammaloop-workspace-doctest> crates/gammaloop-api/src/python.rs - python::GammaLoopAPI::get_active_command_blocks (line 3760)
  361. 396.43 s gammaloop-workspace-doctest> crates/gammaloop-api/src/python.rs - python::GammaLoopAPI::get_default_runtime_settings (line 3796)
  362. 396.43 s gammaloop-workspace-doctest> crates/gammaloop-api/src/python.rs - python::GammaLoopAPI::get_global_settings (line 3739)
  363. 396.43 s gammaloop-workspace-doctest> crates/gammaloop-api/src/python.rs - python::GammaLoopAPI::get_integrand_info (line 3585)
  364. 396.43 s gammaloop-workspace-doctest> crates/gammaloop-api/src/python.rs - python::GammaLoopAPI::get_integrand_settings (line 3647)
  365. 396.43 s gammaloop-workspace-doctest> crates/gammaloop-api/src/python.rs - python::GammaLoopAPI::get_run_history (line 3711)
  366. 396.43 s gammaloop-workspace-doctest> crates/gammaloop-api/src/python.rs - python::GammaLoopAPI::new_python (line 2834)
  367. 396.43 s gammaloop-workspace-doctest> crates/gammaloop-api/src/python.rs - python::GammaLoopAPI::run_command (line 3901)
  368. 396.43 s gammaloop-workspace-doctest> crates/gammaloop-api/src/python.rs - python::PyHistogramAccumulator (line 871)
  369. 396.43 s gammaloop-workspace-doctest> crates/gammaloop-api/src/python.rs - python::atom_to_canonical_string (line 128)
  370. 396.43 s gammaloop-workspace-doctest> crates/gammaloop-api/src/python.rs - python::atom_to_dots (line 157)
  371. 396.43 s gammaloop-workspace-doctest> crates/gammaloop-api/src/python.rs - python::evaluate_graph_overall_factor (line 95)
  372. 396.43 s gammaloop-workspace-doctest>
  373. 396.43 s gammaloop-workspace-doctest> test result: FAILED. 2 passed; 14 failed; 0 ignored; 0 measured; 0 filtered out; finished in 2.73s
  374. 396.43 s gammaloop-workspace-doctest>
  375. 396.43 s gammaloop-workspace-doctest> error: doctest failed, to rerun pass `-p gammaloop-api --doc`
  376. 396.80 s error: Cannot build '/nix/store/l4jl276bp0050h66nydaswl0yrkqlgr4-gammaloop-workspace-doctest-0.1.0.drv'.
  377. 396.80 s Reason: builder failed with exit code 101.
  378. 396.80 s Output paths:
  379. 396.80 s /nix/store/hr6yd418rwbi8hzda4zdmla0j713f63m-gammaloop-workspace-doctest-0.1.0
  380. 396.80 s Last 356 log lines:
  381. 396.80 s > Running phase: unpackPhase
  382. 396.80 s > unpacking source archive /nix/store/zw60sp2yw0jzbn0l3i8p6pynq3h4pivs-source
  383. 396.80 s > source root is source
  384. 396.80 s > Running phase: patchPhase
  385. 396.80 s > Executing configureCargoCommonVars
  386. 396.80 s > decompressing cargo artifacts from /nix/store/8rkh7d3hq722l839568nhnwihnsx041a-gammaloop-workspace-deps-deps-0.1.0/target.tar.zst to target
  387. 396.80 s > Running phase: updateAutotoolsGnuConfigScriptsPhase
  388. 396.80 s > Running phase: configurePhase
  389. 396.80 s > will append /build/source/.cargo-home/config.toml with contents of /nix/store/xdy1vvhll2bijdplvl9fcc2b9plkxhaa-vendor-cargo-deps/config.toml
  390. 396.80 s > default configurePhase, nothing to do
  391. 396.80 s > Running phase: buildPhase
  392. 396.80 s > +++ command cargo --version
  393. 396.80 s > cargo 1.97.0 (c980f4866 2026-06-30)
  394. 396.80 s > +++ command cargo test --profile ci-optim --doc --locked --workspace --features gammaloop-api/cli,gammaloop-tracing-filter/clap,gammaloop-tracing-filter/symbolica,idenso/bincode,idenso/reference-cases,linnet/bincode,linnet/drawing,linnet/nodestore-vec,linnet/rkyv,linnet/serde,linnet/symbolica,spenso-macros/shadowing,spenso/shadowing,symbolica/tracing_max_level_info
  395. 396.80 s > Compiling target-lexicon v0.13.5
  396. 396.80 s > Compiling symbolica v2.2.0 (https://github.com/symbolica-dev/symbolica?branch=dev#0441bd7a)
  397. 396.80 s > Compiling maplit v1.0.2
  398. 396.80 s > Compiling gammaloop-tracing-filter-macros v0.1.0 (/build/source/crates/gammaloop-tracing-filter-macros)
  399. 396.80 s > Compiling vakint v0.1.2 (/build/source/crates/vakint)
  400. 396.80 s > Compiling gammalooprs v0.3.4 (/build/source/crates/gammalooprs)
  401. 396.80 s > Compiling alphal00p-docs-macros v0.1.0 (/build/source/crates/alphal00p-docs-macros)
  402. 396.80 s > Compiling alphal00p-docs-schema v0.1.0 (/build/source/crates/alphal00p-docs-schema)
  403. 396.80 s > Compiling rustc_version v0.4.1
  404. 396.80 s > Compiling bincode v1.3.3
  405. 396.80 s > Compiling gungraun-runner v0.18.2
  406. 396.80 s > Compiling target-triple v1.0.1
  407. 396.80 s > Compiling iai-callgrind-runner v0.14.2
  408. 396.80 s > Compiling gammaloop-integration-tests v0.1.0 (/build/source/tests)
  409. 396.80 s > Compiling test-log-core v0.2.20
  410. 396.80 s > Compiling wait-timeout v0.2.1
  411. 396.80 s > Compiling iai-callgrind v0.14.2
  412. 396.80 s > Compiling quick-error v1.2.3
  413. 396.80 s > Compiling bit-vec v0.8.0
  414. 396.80 s > Compiling rusty-fork v0.3.1
  415. 396.80 s > Compiling iai-callgrind-macros v0.5.1
  416. 396.80 s > Compiling rand_xorshift v0.4.0
  417. 396.80 s > Compiling console v0.15.11
  418. 396.80 s > Compiling unarray v0.1.4
  419. 396.80 s > Compiling glob v0.3.4
  420. 396.80 s > Compiling base64 v0.21.7
  421. 396.80 s > Compiling bit-set v0.8.0
  422. 396.80 s > Compiling gungraun-macros v0.8.0
  423. 396.80 s > Compiling termcolor v1.4.1
  424. 396.80 s > Compiling trybuild v1.0.120
  425. 396.80 s > Compiling alphal00p-docs-catalogs v0.1.0 (/build/source/crates/alphal00p-docs-catalogs)
  426. 396.80 s > Compiling ron v0.8.1
  427. 396.80 s > Compiling similar-asserts v1.7.0
  428. 396.80 s > Compiling proptest v1.11.0
  429. 396.80 s > Compiling pyo3-build-config v0.28.3
  430. 396.80 s > Compiling alphal00p-docs-builder v0.1.0 (/build/source/crates/alphal00p-docs-builder)
  431. 396.80 s > Compiling kurvst v0.1.0 (/build/source/crates/kurvst)
  432. 396.80 s > Compiling test-log-macros v0.2.20
  433. 396.80 s > Compiling test-log v0.2.20
  434. 396.80 s > Compiling alphal00p-docs-examples v0.1.0 (/build/source/crates/alphal00p-docs-examples)
  435. 396.80 s > Compiling pyo3-ffi v0.28.3
  436. 396.80 s > Compiling pyo3-macros-backend v0.28.3
  437. 396.80 s > Compiling pyo3 v0.28.3
  438. 396.80 s > Compiling numpy v0.28.0
  439. 396.80 s > Compiling gammaloop-api v0.1.0 (/build/source/crates/gammaloop-api)
  440. 396.80 s > Compiling gungraun v0.18.2
  441. 396.80 s > Compiling pyo3-macros v0.28.3
  442. 396.80 s > Compiling pyo3-stub-gen v0.17.2
  443. 396.80 s > Compiling numerica v2.2.0 (https://github.com/symbolica-dev/symbolica?branch=dev#0441bd7a)
  444. 396.80 s > Compiling graphica v2.1.0 (https://github.com/symbolica-dev/symbolica?branch=dev#0441bd7a)
  445. 396.80 s > Compiling symbolica-utils v0.1.0 (/build/source/crates/symbolica-utils)
  446. 396.80 s > Compiling gammaloop-workspace-hack v0.1.0 (/build/source/crates/gammaloop-workspace-hack)
  447. 396.80 s > Compiling spenso-macros v0.3.2 (/build/source/crates/spenso-macros)
  448. 396.80 s > Compiling linnet v0.17.0 (/build/source/crates/linnet)
  449. 396.80 s > Compiling spenso v0.6.0 (/build/source/crates/spenso)
  450. 396.80 s > Compiling idenso v0.3.0 (/build/source/crates/idenso)
  451. 396.80 s > Compiling gammaloop-tracing-filter v0.1.0 (/build/source/crates/gammaloop-tracing-filter)
  452. 396.80 s > Compiling spenso-hep-lib v0.1.7 (/build/source/crates/spenso-hep-lib)
  453. 396.80 s > Compiling spynso3 v0.1.2 (/build/source/crates/spynso3)
  454. 396.80 s > Compiling linnest v0.1.0 (/build/source/crates/linnest)
  455. 396.80 s > Compiling linnet-py v0.1.0 (/build/source/crates/linnet-py)
  456. 396.80 s > Finished `ci-optim` profile [optimized] target(s) in 6m 12s
  457. 396.80 s > warning: the following packages contain code that will be rejected by a future version of Rust: proc-macro-error2 v2.0.1
  458. 396.80 s > note: to see what the problems were, use the option `--future-incompat-report`, or run `cargo report future-incompatibilities --id 1`
  459. 396.80 s > Doc-tests alphal00p_docs_builder
  460. 396.80 s >
  461. 396.80 s > running 0 tests
  462. 396.80 s >
  463. 396.80 s > test result: ok. 0 passed; 0 failed; 0 ignored; 0 measured; 0 filtered out; finished in 0.00s
  464. 396.80 s >
  465. 396.80 s > Doc-tests alphal00p_docs_catalogs
  466. 396.80 s >
  467. 396.80 s > running 0 tests
  468. 396.80 s >
  469. 396.80 s > test result: ok. 0 passed; 0 failed; 0 ignored; 0 measured; 0 filtered out; finished in 0.00s
  470. 396.80 s >
  471. 396.80 s > Doc-tests alphal00p_docs_examples
  472. 396.80 s >
  473. 396.80 s > running 0 tests
  474. 396.80 s >
  475. 396.80 s > test result: ok. 0 passed; 0 failed; 0 ignored; 0 measured; 0 filtered out; finished in 0.00s
  476. 396.80 s >
  477. 396.80 s > Doc-tests alphal00p_docs
  478. 396.80 s >
  479. 396.80 s > running 0 tests
  480. 396.80 s >
  481. 396.80 s > test result: ok. 0 passed; 0 failed; 0 ignored; 0 measured; 0 filtered out; finished in 0.00s
  482. 396.80 s >
  483. 396.80 s > Doc-tests alphal00p_docs_schema
  484. 396.80 s >
  485. 396.80 s > running 0 tests
  486. 396.80 s >
  487. 396.80 s > test result: ok. 0 passed; 0 failed; 0 ignored; 0 measured; 0 filtered out; finished in 0.00s
  488. 396.80 s >
  489. 396.80 s > Doc-tests gammaloop_api
  490. 396.80 s >
  491. 396.80 s > running 16 tests
  492. 396.80 s > test crates/gammaloop-api/src/python.rs - python::GammaLoopAPI::evaluate_samples (line 3108) ... FAILED
  493. 396.80 s > test crates/gammaloop-api/src/python.rs - python::GammaLoopAPI::get_active_command_blocks (line 3760) ... FAILED
  494. 396.80 s > test crates/gammaloop-api/src/python.rs - python::GammaLoopAPI::evaluate_sample (line 2967) ... FAILED
  495. 396.80 s > test crates/gammaloop-api/src/python.rs - python::GammaLoopAPI::get_default_runtime_settings (line 3796) ... FAILED
  496. 396.80 s > test crates/gammaloop-api/src/python.rs - python::GammaLoopAPI::get_integrand_settings (line 3647) ... FAILED
  497. 396.80 s > test crates/gammaloop-api/src/python.rs - python::GammaLoopAPI::get_integrand_info (line 3585) ... FAILED
  498. 396.80 s > test crates/gammaloop-api/src/python.rs - python::PyHistogramAccumulator (line 871) ... FAILED
  499. 396.80 s > test crates/gammaloop-api/src/lib.rs - (line 18) - compile ... ok
  500. 396.80 s > test crates/gammaloop-api/src/python.rs - python::GammaLoopAPI::run_command (line 3901) ... FAILED
  501. 396.80 s > test crates/gammaloop-api/src/python.rs - python::GammaLoopAPI::get_run_history (line 3711) ... FAILED
  502. 396.80 s > test crates/gammaloop-api/src/python.rs - python::GammaLoopAPI::get_global_settings (line 3739) ... FAILED
  503. 396.80 s > test crates/gammaloop-api/src/python.rs - python::GammaLoopAPI::new_python (line 2834) ... FAILED
  504. 396.80 s > test crates/gammaloop-api/src/python.rs - python::evaluate_graph_overall_factor (line 95) ... FAILED
  505. 396.80 s > test crates/gammaloop-api/src/python.rs - python::atom_to_canonical_string (line 128) ... FAILED
  506. 396.80 s > test crates/gammaloop-api/src/python.rs - python::atom_to_dots (line 157) ... FAILED
  507. 396.80 s > test crates/gammaloop-api/src/commands/evaluate_samples.rs - commands::evaluate_samples::EvaluateSamples (line 50) ... ok
  508. 396.80 s >
  509. 396.80 s > failures:
  510. 396.80 s >
  511. 396.80 s > ---- crates/gammaloop-api/src/python.rs - python::GammaLoopAPI::evaluate_samples (line 3108) stdout ----
  512. 396.80 s > error: expected one of `!` or `::`, found `pathlib`
  513. 396.80 s > --> crates/gammaloop-api/src/python.rs:3109:6
  514. 396.80 s > |
  515. 396.80 s > 3109 | from pathlib import Path
  516. 396.80 s > | ^^^^^^^ expected one of `!` or `::`
  517. 396.80 s >
  518. 396.80 s > error: aborting due to 1 previous error
  519. 396.80 s >
  520. 396.80 s > Couldn't compile the test.
  521. 396.80 s > ---- crates/gammaloop-api/src/python.rs - python::GammaLoopAPI::get_active_command_blocks (line 3760) stdout ----
  522. 396.80 s > error: expected item, found keyword `for`
  523. 396.80 s > --> crates/gammaloop-api/src/python.rs:3761:1
  524. 396.80 s > |
  525. 396.80 s > 3761 | for name, commands in api.get_active_command_blocks().items():
  526. 396.80 s > | ^^^ expected item
  527. 396.80 s > |
  528. 396.80 s > = note: for a full list of items that can appear in modules, see <https://doc.rust-lang.org/reference/items.html>
  529. 396.80 s >
  530. 396.80 s > error: aborting due to 1 previous error
  531. 396.80 s >
  532. 396.80 s > Couldn't compile the test.
  533. 396.80 s > ---- crates/gammaloop-api/src/python.rs - python::GammaLoopAPI::evaluate_sample (line 2967) stdout ----
  534. 396.80 s > error: expected one of `!` or `::`, found `pathlib`
  535. 396.80 s > --> crates/gammaloop-api/src/python.rs:2968:6
  536. 396.80 s > |
  537. 396.80 s > 2968 | from pathlib import Path
  538. 396.80 s > | ^^^^^^^ expected one of `!` or `::`
  539. 396.80 s >
  540. 396.80 s > error: aborting due to 1 previous error
  541. 396.80 s >
  542. 396.80 s > Couldn't compile the test.
  543. 396.80 s > ---- crates/gammaloop-api/src/python.rs - python::GammaLoopAPI::get_default_runtime_settings (line 3796) stdout ----
  544. 396.80 s > error: expected one of `!` or `::`, found `=`
  545. 396.80 s > --> crates/gammaloop-api/src/python.rs:3797:9
  546. 396.80 s > |
  547. 396.80 s > 3797 | runtime = api.get_default_runtime_settings()
  548. 396.80 s > | ^ expected one of `!` or `::`
  549. 396.80 s >
  550. 396.80 s > error: aborting due to 1 previous error
  551. 396.80 s >
  552. 396.80 s > Couldn't compile the test.
  553. 396.80 s > ---- crates/gammaloop-api/src/python.rs - python::GammaLoopAPI::get_integrand_settings (line 3647) stdout ----
  554. 396.80 s > error: expected one of `!` or `::`, found `=`
  555. 396.80 s > --> crates/gammaloop-api/src/python.rs:3648:10
  556. 396.80 s > |
  557. 396.80 s > 3648 | settings = api.get_integrand_settings(process_id=0)
  558. 396.80 s > | ^ expected one of `!` or `::`
  559. 396.80 s >
  560. 396.80 s > error: aborting due to 1 previous error
  561. 396.80 s >
  562. 396.80 s > Couldn't compile the test.
  563. 396.80 s > ---- crates/gammaloop-api/src/python.rs - python::GammaLoopAPI::get_integrand_info (line 3585) stdout ----
  564. 396.80 s > error: expected one of `!` or `::`, found `pathlib`
  565. 396.80 s > --> crates/gammaloop-api/src/python.rs:3586:6
  566. 396.80 s > |
  567. 396.80 s > 3586 | from pathlib import Path
  568. 396.80 s > | ^^^^^^^ expected one of `!` or `::`
  569. 396.80 s >
  570. 396.80 s > error: aborting due to 1 previous error
  571. 396.80 s >
  572. 396.80 s > Couldn't compile the test.
  573. 396.80 s > ---- crates/gammaloop-api/src/python.rs - python::PyHistogramAccumulator (line 871) stdout ----
  574. 396.80 s > error: expected one of `!` or `::`, found `gammaloop`
  575. 396.80 s > --> crates/gammaloop-api/src/python.rs:872:6
  576. 396.80 s > |
  577. 396.80 s > 872 | from gammaloop import HistogramAccumulator
  578. 396.80 s > | ^^^^^^^^^ expected one of `!` or `::`
  579. 396.80 s >
  580. 396.80 s > error: aborting due to 1 previous error
  581. 396.80 s >
  582. 396.80 s > Couldn't compile the test.
  583. 396.80 s > ---- crates/gammaloop-api/src/python.rs - python::GammaLoopAPI::run_command (line 3901) stdout ----
  584. 396.80 s > error[E0425]: cannot find value `api` in this scope
  585. 396.80 s > --> crates/gammaloop-api/src/python.rs:3902:1
  586. 396.80 s > |
  587. 396.80 s > 3902 | api.run("display processes")
  588. 396.80 s > | ^^^ not found in this scope
  589. 396.80 s >
  590. 396.80 s > error: aborting due to 1 previous error
  591. 396.80 s >
  592. 396.80 s > For more information about this error, try `rustc --explain E0425`.
  593. 396.80 s > Couldn't compile the test.
  594. 396.80 s > ---- crates/gammaloop-api/src/python.rs - python::GammaLoopAPI::get_run_history (line 3711) stdout ----
  595. 396.80 s > error[E0425]: cannot find value `run_card_toml` in this scope
  596. 396.80 s > --> crates/gammaloop-api/src/python.rs:3712:1
  597. 396.80 s > |
  598. 396.80 s > 3712 | run_card_toml = api.get_run_history()
  599. 396.80 s > | ^^^^^^^^^^^^^
  600. 396.80 s > |
  601. 396.80 s > help: you might have meant to introduce a new binding
  602. 396.80 s > |
  603. 396.80 s > 3712 | let run_card_toml = api.get_run_history()
  604. 396.80 s > | +++
  605. 396.80 s >
  606. 396.80 s > error[E0425]: cannot find value `api` in this scope
  607. 396.80 s > --> crates/gammaloop-api/src/python.rs:3712:17
  608. 396.80 s > |
  609. 396.80 s > 3712 | run_card_toml = api.get_run_history()
  610. 396.80 s > | ^^^ not found in this scope
  611. 396.80 s >
  612. 396.80 s > error: aborting due to 2 previous errors
  613. 396.80 s >
  614. 396.80 s > For more information about this error, try `rustc --explain E0425`.
  615. 396.80 s > Couldn't compile the test.
  616. 396.80 s > ---- crates/gammaloop-api/src/python.rs - python::GammaLoopAPI::get_global_settings (line 3739) stdout ----
  617. 396.80 s > error[E0425]: cannot find value `settings_toml` in this scope
  618. 396.80 s > --> crates/gammaloop-api/src/python.rs:3740:1
  619. 396.80 s > |
  620. 396.80 s > 3740 | settings_toml = api.get_global_settings()
  621. 396.80 s > | ^^^^^^^^^^^^^
  622. 396.80 s > |
  623. 396.80 s > help: you might have meant to introduce a new binding
  624. 396.80 s > |
  625. 396.80 s > 3740 | let settings_toml = api.get_global_settings()
  626. 396.80 s > | +++
  627. 396.80 s >
  628. 396.80 s > error[E0425]: cannot find value `api` in this scope
  629. 396.80 s > --> crates/gammaloop-api/src/python.rs:3740:17
  630. 396.80 s > |
  631. 396.80 s > 3740 | settings_toml = api.get_global_settings()
  632. 396.80 s > | ^^^ not found in this scope
  633. 396.80 s >
  634. 396.80 s > error: aborting due to 2 previous errors
  635. 396.80 s >
  636. 396.80 s > For more information about this error, try `rustc --explain E0425`.
  637. 396.80 s > Couldn't compile the test.
  638. 396.80 s > ---- crates/gammaloop-api/src/python.rs - python::GammaLoopAPI::new_python (line 2834) stdout ----
  639. 396.80 s > error[E0425]: cannot find value `api` in this scope
  640. 396.80 s > --> crates/gammaloop-api/src/python.rs:2835:1
  641. 396.80 s > |
  642. 396.80 s > 2835 | api = GammaLoopAPI(state_folder="./state", read_only_state=True)
  643. 396.80 s > | ^^^
  644. 396.80 s > |
  645. 396.80 s > help: you might have meant to introduce a new binding
  646. 396.80 s > |
  647. 396.80 s > 2835 | let api = GammaLoopAPI(state_folder="./state", read_only_state=True)
  648. 396.80 s > | +++
  649. 396.80 s >
  650. 396.80 s > error[E0425]: cannot find value `state_folder` in this scope
  651. 396.80 s > --> crates/gammaloop-api/src/python.rs:2835:20
  652. 396.80 s > |
  653. 396.80 s > 2835 | api = GammaLoopAPI(state_folder="./state", read_only_state=True)
  654. 396.80 s > | ^^^^^^^^^^^^ not found in this scope
  655. 396.80 s >
  656. 396.80 s > error[E0425]: cannot find value `read_only_state` in this scope
  657. 396.80 s > --> crates/gammaloop-api/src/python.rs:2835:44
  658. 396.80 s > |
  659. 396.80 s > 2835 | api = GammaLoopAPI(state_folder="./state", read_only_state=True)
  660. 396.80 s > | ^^^^^^^^^^^^^^^ not found in this scope
  661. 396.80 s >
  662. 396.80 s > error[E0425]: cannot find value `True` in this scope
  663. 396.80 s > --> crates/gammaloop-api/src/python.rs:2835:60
  664. 396.80 s > |
  665. 396.80 s > 2835 | api = GammaLoopAPI(state_folder="./state", read_only_state=True)
  666. 396.80 s > | ^^^^ not found in this scope
  667. 396.80 s > |
  668. 396.80 s > help: you may want to use a bool value instead
  669. 396.80 s > |
  670. 396.80 s > 2835 - api = GammaLoopAPI(state_folder="./state", read_only_state=True)
  671. 396.80 s > 2835 + api = GammaLoopAPI(state_folder="./state", read_only_state=true)
  672. 396.80 s > |
  673. 396.80 s >
  674. 396.80 s > error[E0425]: cannot find function, tuple struct or tuple variant `GammaLoopAPI` in this scope
  675. 396.80 s > --> crates/gammaloop-api/src/python.rs:2835:7
  676. 396.80 s > |
  677. 396.80 s > 2835 | api = GammaLoopAPI(state_folder="./state", read_only_state=True)
  678. 396.80 s > | ^^^^^^^^^^^^ not found in this scope
  679. 396.80 s >
  680. 396.80 s > error: aborting due to 5 previous errors
  681. 396.80 s >
  682. 396.80 s > For more information about this error, try `rustc --explain E0425`.
  683. 396.80 s > Couldn't compile the test.
  684. 396.80 s > ---- crates/gammaloop-api/src/python.rs - python::evaluate_graph_overall_factor (line 95) stdout ----
  685. 396.80 s > error[E0425]: cannot find function `evaluate_graph_overall_factor` in this scope
  686. 396.80 s > --> crates/gammaloop-api/src/python.rs:96:1
  687. 396.80 s > |
  688. 396.80 s > 96 | evaluate_graph_overall_factor(
  689. 396.80 s > | ^^^^^^^^^^^^^^^^^^^^^^^^^^^^^ not found in this scope
  690. 396.80 s >
  691. 396.80 s > error: aborting due to 1 previous error
  692. 396.80 s >
  693. 396.80 s > For more information about this error, try `rustc --explain E0425`.
  694. 396.80 s > Couldn't compile the test.
  695. 396.80 s > ---- crates/gammaloop-api/src/python.rs - python::atom_to_canonical_string (line 128) stdout ----
  696. 396.80 s > error[E0425]: cannot find function `atom_to_canonical_string` in this scope
  697. 396.80 s > --> crates/gammaloop-api/src/python.rs:129:1
  698. 396.80 s > |
  699. 396.80 s > 129 | atom_to_canonical_string("x + x")
  700. 396.80 s > | ^^^^^^^^^^^^^^^^^^^^^^^^ not found in this scope
  701. 396.80 s >
  702. 396.80 s > error: aborting due to 1 previous error
  703. 396.80 s >
  704. 396.80 s > For more information about this error, try `rustc --explain E0425`.
  705. 396.80 s > Couldn't compile the test.
  706. 396.80 s > ---- crates/gammaloop-api/src/python.rs - python::atom_to_dots (line 157) stdout ----
  707. 396.80 s > error[E0425]: cannot find function `to_dots` in this scope
  708. 396.80 s > --> crates/gammaloop-api/src/python.rs:158:1
  709. 396.80 s > |
  710. 396.80 s > 158 | to_dots("p(mu) * q(mu)")
  711. 396.80 s > | ^^^^^^^ not found in this scope
  712. 396.80 s >
  713. 396.80 s > error: aborting due to 1 previous error
  714. 396.80 s >
  715. 396.80 s > For more information about this error, try `rustc --explain E0425`.
  716. 396.80 s > Couldn't compile the test.
  717. 396.80 s >
  718. 396.80 s > failures:
  719. 396.80 s > crates/gammaloop-api/src/python.rs - python::GammaLoopAPI::evaluate_sample (line 2967)
  720. 396.80 s > crates/gammaloop-api/src/python.rs - python::GammaLoopAPI::evaluate_samples (line 3108)
  721. 396.80 s > crates/gammaloop-api/src/python.rs - python::GammaLoopAPI::get_active_command_blocks (line 3760)
  722. 396.80 s > crates/gammaloop-api/src/python.rs - python::GammaLoopAPI::get_default_runtime_settings (line 3796)
  723. 396.80 s > crates/gammaloop-api/src/python.rs - python::GammaLoopAPI::get_global_settings (line 3739)
  724. 396.80 s > crates/gammaloop-api/src/python.rs - python::GammaLoopAPI::get_integrand_info (line 3585)
  725. 396.80 s > crates/gammaloop-api/src/python.rs - python::GammaLoopAPI::get_integrand_settings (line 3647)
  726. 396.80 s > crates/gammaloop-api/src/python.rs - python::GammaLoopAPI::get_run_history (line 3711)
  727. 396.80 s > crates/gammaloop-api/src/python.rs - python::GammaLoopAPI::new_python (line 2834)
  728. 396.80 s > crates/gammaloop-api/src/python.rs - python::GammaLoopAPI::run_command (line 3901)
  729. 396.80 s > crates/gammaloop-api/src/python.rs - python::PyHistogramAccumulator (line 871)
  730. 396.80 s > crates/gammaloop-api/src/python.rs - python::atom_to_canonical_string (line 128)
  731. 396.80 s > crates/gammaloop-api/src/python.rs - python::atom_to_dots (line 157)
  732. 396.80 s > crates/gammaloop-api/src/python.rs - python::evaluate_graph_overall_factor (line 95)
  733. 396.80 s >
  734. 396.80 s > test result: FAILED. 2 passed; 14 failed; 0 ignored; 0 measured; 0 filtered out; finished in 2.73s
  735. 396.80 s >
  736. 396.80 s > error: doctest failed, to rerun pass `-p gammaloop-api --doc`
  737. 396.80 s For full logs, run:
  738. 396.80 s nix log /nix/store/l4jl276bp0050h66nydaswl0yrkqlgr4-gammaloop-workspace-doctest-0.1.0.drv
  739. 396.88 s [0 built (1 failed), 0.0Run failed.