1. 0.90 s $ /nix/store/9ypz3flqsrl5xl495mm8h645gadjsxi1-coreutils-9.11/bin/timeout --kill-after=15s 7200s /nix/store/23zk8sgzamrbmj1fday15szf7f2279s8-nix-2.34.7/bin/nix --extra-experimental-features nix-command --extra-experimental-features flakes flake clone git+https://github.com/alphal00p/gammaloop --dest /tmp/nix-ci-worker/stable-pwd/repo/
  2. 0.95 s Cloning into '/tmp/nix-ci-worker/stable-pwd/repo'...
  3. 0.95 s remote: Enumerating objects: 63012, done.
  4. 0.95 s remote: Counting objects: 0% (1/8378) remote: Counting objects: 1% (84/8378) remote: Counting objects: 2% (168/8378) remote: Counting objects: 3% (252/8378) remote: Counting objects: 4% (336/8378) remote: Counting objects: 5% (419/8378) remote: Counting objects: 6% (503/8378) remote: Counting objects: 7% (587/8378) remote: Counting objects: 8% (671/8378) remote: Counting objects: 9% (755/8378) remote: Counting objects: 10% (838/8378) remote: Counting objects: 11% (922/8378) remote: Counting objects: 12% (1006/8378) remote: Counting objects: 13% (1090/8378) remote: Counting objects: 14% (1173/8378) remote: Counting objects: 15% (1257/8378) remote: Counting objects: 16% (1341/8378) remote: Counting objects: 17% (1425/8378) remote: Counting objects: 18% (1509/8378) remote: Counting objects: 19% (1592/8378) remote: Counting objects: 20% (1676/8378) remote: Counting objects: 21% (1760/8378) remote: Counting objects: 22% (1844/8378) remote: Counting objects: 23% (1927/8378) remote: Counting objects: 24% (2011/8378) remote: Counting objects: 25% (2095/8378) remote: Counting objects: 26% (2179/8378) remote: Counting objects: 27% (2263/8378) remote: Counting objects: 28% (2346/8378) remote: Counting objects: 29% (2430/8378) remote: Counting objects: 30% (2514/8378) remote: Counting objects: 31% (2598/8378) remote: Counting objects: 32% (2681/8378) remote: Counting objects: 33% (2765/8378) remote: Counting objects: 34% (2849/8378) remote: Counting objects: 35% (2933/8378) remote: Counting objects: 36% (3017/8378) remote: Counting objects: 37% (3100/8378) remote: Counting objects: 38% (3184/8378) remote: Counting objects: 39% (3268/8378) remote: Counting objects: 40% (3352/8378) remote: Counting objects: 41% (3435/8378) remote: Counting objects: 42% (3519/8378) remote: Counting objects: 43% (3603/8378) remote: Counting objects: 44% (3687/8378) remote: Counting objects: 45% (3771/8378) remote: Counting objects: 46% (3854/8378) remote: Counting objects: 47% (3938/8378) remote: Counting objects: 48% (4022/8378) remote: Counting objects: 49% (4106/8378) remote: Counting objects: 50% (4189/8378) remote: Counting objects: 51% (4273/8378) remote: Counting objects: 52% (4357/8378) remote: Counting objects: 53% (4441/8378) remote: Counting objects: 54% (4525/8378) remote: Counting objects: 55% (4608/8378) remote: Counting objects: 56% (4692/8378) remote: Counting objects: 57% (4776/8378) remote: Counting objects: 58% (4860/8378) remote: Counting objects: 59% (4944/8378) remote: Counting objects: 60% (5027/8378) remote: Counting objects: 61% (5111/8378) remote: Counting objects: 62% (5195/8378) remote: Counting objects: 63% (5279/8378) remote: Counting objects: 64% (5362/8378) remote: Counting objects: 65% (5446/8378) remote: Counting objects: 66% (5530/8378) remote: Counting objects: 67% (5614/8378) remote: Counting objects: 68% (5698/8378) remote: Counting objects: 69% (5781/8378) remote: Counting objects: 70% (5865/8378) remote: Counting objects: 71% (5949/8378) remote: Counting objects: 72% (6033/8378) remote: Counting objects: 73% (6116/8378) remote: Counting objects: 74% (6200/8378) remote: Counting objects: 75% (6284/8378) remote: Counting objects: 76% (6368/8378) remote: Counting objects: 77% (6452/8378) remote: Counting objects: 78% (6535/8378) remote: Counting objects: 79% (6619/8378) remote: Counting objects: 80% (6703/8378) remote: Counting objects: 81% (6787/8378) remote: Counting objects: 82% (6870/8378) remote: Counting objects: 83% (6954/8378) remote: Counting objects: 84% (7038/8378) remote: Counting objects: 85% (7122/8378) remote: Counting objects: 86% (7206/8378) remote: Counting objects: 87% (7289/8378) remote: Counting objects: 88% (7373/8378) remote: Counting objects: 89% (7457/8378) remote: Counting objects: 90% (7541/8378) remote: Counting objects: 91% (7624/8378) remote: Counting objects: 92% (7708/8378) remote: Counting objects: 93% (7792/8378) remote: Counting objects: 94% (7876/8378) remote: Counting objects: 95% (7960/8378) remote: Counting objects: 96% (8043/8378) remote: Counting objects: 97% (8127/8378) remote: Counting objects: 98% (8211/8378) remote: Counting objects: 99% (8295/8378) remote: Counting objects: 100% (8378/8378) remote: Counting objects: 100% (8378/8378), done.
  5. 2.75 s remote: Compressing objects: 0% (1/1901) remote: Compressing objects: 1% (20/1901) remote: Compressing objects: 2% (39/1901) remote: Compressing objects: 3% (58/1901) remote: Compressing objects: 4% (77/1901) remote: Compressing objects: 5% (96/1901) remote: Compressing objects: 6% (115/1901) remote: Compressing objects: 7% (134/1901) remote: Compressing objects: 8% (153/1901) remote: Compressing objects: 9% (172/1901) remote: Compressing objects: 10% (191/1901) remote: Compressing objects: 11% (210/1901) remote: Compressing objects: 12% (229/1901) remote: Compressing objects: 13% (248/1901) remote: Compressing objects: 14% (267/1901) remote: Compressing objects: 15% (286/1901) remote: Compressing objects: 16% (305/1901) remote: Compressing objects: 17% (324/1901) remote: Compressing objects: 18% (343/1901) remote: Compressing objects: 19% (362/1901) remote: Compressing objects: 20% (381/1901) remote: Compressing objects: 21% (400/1901) remote: Compressing objects: 21% (412/1901) remote: Compressing objects: 22% (419/1901) remote: Compressing objects: 23% (438/1901) remote: Compressing objects: 24% (457/1901) remote: Compressing objects: 25% (476/1901) remote: Compressing objects: 26% (495/1901) remote: Compressing objects: 27% (514/1901) remote: Compressing objects: 28% (533/1901) remote: Compressing objects: 29% (552/1901) remote: Compressing objects: 30% (571/1901) remote: Compressing objects: 31% (590/1901) remote: Compressing objects: 32% (609/1901) remote: Compressing objects: 33% (628/1901) remote: Compressing objects: 34% (647/1901) remote: Compressing objects: 35% (666/1901) remote: Compressing objects: 36% (685/1901) remote: Compressing objects: 37% (704/1901) remote: Compressing objects: 38% (723/1901) remote: Compressing objects: 39% (742/1901) remote: Compressing objects: 40% (761/1901) remote: Compressing objects: 41% (780/1901) remote: Compressing objects: 42% (799/1901) remote: Compressing objects: 43% (818/1901) remote: Compressing objects: 44% (837/1901) remote: Compressing objects: 45% (856/1901) remote: Compressing objects: 46% (875/1901) remote: Compressing objects: 47% (894/1901) remote: Compressing objects: 48% (913/1901) remote: Compressing objects: 49% (932/1901) remote: Compressing objects: 50% (951/1901) remote: Compressing objects: 51% (970/1901) remote: Compressing objects: 52% (989/1901) remote: Compressing objects: 53% (1008/1901) remote: Compressing objects: 54% (1027/1901) remote: Compressing objects: 55% (1046/1901) remote: Compressing objects: 56% (1065/1901) remote: Compressing objects: 57% (1084/1901) remote: Compressing objects: 58% (1103/1901) remote: Compressing objects: 59% (1122/1901) remote: Compressing objects: 60% (1141/1901) remote: Compressing objects: 61% (1160/1901) remote: Compressing objects: 62% (1179/1901) remote: Compressing objects: 63% (1198/1901) remote: Compressing objects: 64% (1217/1901) remote: Compressing objects: 65% (1236/1901) remote: Compressing objects: 66% (1255/1901) remote: Compressing objects: 67% (1274/1901) remote: Compressing objects: 68% (1293/1901) remote: Compressing objects: 69% (1312/1901) remote: Compressing objects: 70% (1331/1901) remote: Compressing objects: 71% (1350/1901) remote: Compressing objects: 72% (1369/1901) remote: Compressing objects: 73% (1388/1901) remote: Compressing objects: 74% (1407/1901) remote: Compressing objects: 75% (1426/1901) remote: Compressing objects: 76% (1445/1901) remote: Compressing objects: 77% (1464/1901) remote: Compressing objects: 78% (1483/1901) remote: Compressing objects: 79% (1502/1901) remote: Compressing objects: 80% (1521/1901) remote: Compressing objects: 81% (1540/1901) remote: Compressing objects: 82% (1559/1901) remote: Compressing objects: 83% (1578/1901) remote: Compressing objects: 84% (1597/1901) remote: Compressing objects: 85% (1616/1901) remote: Compressing objects: 86% (1635/1901) remote: Compressing objects: 87% (1654/1901) remote: Compressing objects: 88% (1673/1901) remote: Compressing objects: 89% (1692/1901) remote: Compressing objects: 90% (1711/1901) remote: Compressing objects: 91% (1730/1901) remote: Compressing objects: 92% (1749/1901) remote: Compressing objects: 93% (1768/1901) remote: Compressing objects: 94% (1787/1901) remote: Compressing objects: 95% (1806/1901) remote: Compressing objects: 96% (1825/1901) remote: Compressing objects: 97% (1844/1901) remote: Compressing objects: 98% (1863/1901) remote: Compressing objects: 99% (1882/1901) remote: Compressing objects: 100% (1901/1901) remote: Compressing objects: 100% (1901/1901), done.
  6. 6.49 s Receiving objects: 0% (1/63012) Receiving objects: 1% (631/63012) Receiving objects: 2% (1261/63012) Receiving objects: 3% (1891/63012) Receiving objects: 4% (2521/63012) Receiving objects: 5% (3151/63012) Receiving objects: 6% (3781/63012) Receiving objects: 7% (4411/63012) Receiving objects: 8% (5041/63012) Receiving objects: 9% (5672/63012) Receiving objects: 10% (6302/63012), 10.39 MiB | 20.60 MiB/s Receiving objects: 11% (6932/63012), 10.39 MiB | 20.60 MiB/s Receiving objects: 12% (7562/63012), 10.39 MiB | 20.60 MiB/s Receiving objects: 13% (8192/63012), 10.39 MiB | 20.60 MiB/s Receiving objects: 14% (8822/63012), 10.39 MiB | 20.60 MiB/s Receiving objects: 15% (9452/63012), 10.39 MiB | 20.60 MiB/s Receiving objects: 16% (10082/63012), 10.39 MiB | 20.60 MiB/s Receiving objects: 17% (10713/63012), 10.39 MiB | 20.60 MiB/s Receiving objects: 18% (11343/63012), 10.39 MiB | 20.60 MiB/s Receiving objects: 19% (11973/63012), 10.39 MiB | 20.60 MiB/s Receiving objects: 20% (12603/63012), 10.39 MiB | 20.60 MiB/s Receiving objects: 21% (13233/63012), 10.39 MiB | 20.60 MiB/s Receiving objects: 22% (13863/63012), 10.39 MiB | 20.60 MiB/s Receiving objects: 23% (14493/63012), 10.39 MiB | 20.60 MiB/s Receiving objects: 24% (15123/63012), 10.39 MiB | 20.60 MiB/s Receiving objects: 25% (15753/63012), 10.39 MiB | 20.60 MiB/s Receiving objects: 26% (16384/63012), 10.39 MiB | 20.60 MiB/s Receiving objects: 27% (17014/63012), 10.39 MiB | 20.60 MiB/s Receiving objects: 28% (17644/63012), 10.39 MiB | 20.60 MiB/s Receiving objects: 29% (18274/63012), 10.39 MiB | 20.60 MiB/s Receiving objects: 30% (18904/63012), 10.39 MiB | 20.60 MiB/s Receiving objects: 31% (19534/63012), 10.39 MiB | 20.60 MiB/s Receiving objects: 31% (19538/63012), 18.40 MiB | 18.29 MiB/s Receiving objects: 32% (20164/63012), 18.40 MiB | 18.29 MiB/s Receiving objects: 33% (20794/63012), 18.40 MiB | 18.29 MiB/s Receiving objects: 34% (21425/63012), 18.40 MiB | 18.29 MiB/s Receiving objects: 35% (22055/63012), 18.40 MiB | 18.29 MiB/s Receiving objects: 36% (22685/63012), 18.40 MiB | 18.29 MiB/s Receiving objects: 37% (23315/63012), 18.40 MiB | 18.29 MiB/s Receiving objects: 38% (23945/63012), 18.40 MiB | 18.29 MiB/s Receiving objects: 39% (24575/63012), 18.40 MiB | 18.29 MiB/s Receiving objects: 40% (25205/63012), 18.40 MiB | 18.29 MiB/s Receiving objects: 41% (25835/63012), 18.40 MiB | 18.29 MiB/s Receiving objects: 42% (26466/63012), 18.40 MiB | 18.29 MiB/s Receiving objects: 43% (27096/63012), 18.40 MiB | 18.29 MiB/s Receiving objects: 44% (27726/63012), 18.40 MiB | 18.29 MiB/s Receiving objects: 45% (28356/63012), 18.40 MiB | 18.29 MiB/s Receiving objects: 46% (28986/63012), 18.40 MiB | 18.29 MiB/s Receiving objects: 47% (29616/63012), 18.40 MiB | 18.29 MiB/s Receiving objects: 48% (30246/63012), 18.40 MiB | 18.29 MiB/s Receiving objects: 49% (30876/63012), 18.40 MiB | 18.29 MiB/s Receiving objects: 50% (31506/63012), 18.40 MiB | 18.29 MiB/s Receiving objects: 51% (32137/63012), 18.40 MiB | 18.29 MiB/s Receiving objects: 52% (32767/63012), 28.46 MiB | 18.90 MiB/s Receiving objects: 53% (33397/63012), 28.46 MiB | 18.90 MiB/s Receiving objects: 54% (34027/63012), 28.46 MiB | 18.90 MiB/s Receiving objects: 55% (34657/63012), 28.46 MiB | 18.90 MiB/s Receiving objects: 56% (35287/63012), 28.46 MiB | 18.90 MiB/s Receiving objects: 57% (35917/63012), 28.46 MiB | 18.90 MiB/s Receiving objects: 58% (36547/63012), 28.46 MiB | 18.90 MiB/s Receiving objects: 58% (36700/63012), 28.46 MiB | 18.90 MiB/s Receiving objects: 59% (37178/63012), 40.95 MiB | 20.41 MiB/s Receiving objects: 60% (37808/63012), 40.95 MiB | 20.41 MiB/s Receiving objects: 61% (38438/63012), 40.95 MiB | 20.41 MiB/s Receiving objects: 62% (39068/63012), 40.95 MiB | 20.41 MiB/s Receiving objects: 63% (39698/63012), 40.95 MiB | 20.41 MiB/s Receiving objects: 64% (40328/63012), 40.95 MiB | 20.41 MiB/s Receiving objects: 65% (40958/63012), 40.95 MiB | 20.41 MiB/s Receiving objects: 66% (41588/63012), 40.95 MiB | 20.41 MiB/s Receiving objects: 67% (42219/63012), 40.95 MiB | 20.41 MiB/s Receiving objects: 68% (42849/63012), 40.95 MiB | 20.41 MiB/s Receiving objects: 69% (43479/63012), 40.95 MiB | 20.41 MiB/s Receiving objects: 70% (44109/63012), 40.95 MiB | 20.41 MiB/s Receiving objects: 71% (44739/63012), 40.95 MiB | 20.41 MiB/s Receiving objects: 72% (45369/63012), 40.95 MiB | 20.41 MiB/s Receiving objects: 73% (45999/63012), 55.01 MiB | 21.94 MiB/s Receiving objects: 74% (46629/63012), 55.01 MiB | 21.94 MiB/s Receiving objects: 75% (47259/63012), 55.01 MiB | 21.94 MiB/s Receiving objects: 76% (47890/63012), 55.01 MiB | 21.94 MiB/s Receiving objects: 77% (48520/63012), 55.01 MiB | 21.94 MiB/s Receiving objects: 78% (49150/63012), 55.01 MiB | 21.94 MiB/s Receiving objects: 78% (49483/63012), 70.98 MiB | 23.61 MiB/s Receiving objects: 79% (49780/63012), 70.98 MiB | 23.61 MiB/s Receiving objects: 80% (50410/63012), 70.98 MiB | 23.61 MiB/s Receiving objects: 81% (51040/63012), 70.98 MiB | 23.61 MiB/s Receiving objects: 82% (51670/63012), 70.98 MiB | 23.61 MiB/s Receiving objects: 83% (52300/63012), 70.98 MiB | 23.61 MiB/s Receiving objects: 84% (52931/63012), 70.98 MiB | 23.61 MiB/s Receiving objects: 85% (53561/63012), 70.98 MiB | 23.61 MiB/s Receiving objects: 86% (54191/63012), 70.98 MiB | 23.61 MiB/s Receiving objects: 87% (54821/63012), 70.98 MiB | 23.61 MiB/s Receiving objects: 88% (55451/63012), 70.98 MiB | 23.61 MiB/s Receiving objects: 89% (56081/63012), 70.98 MiB | 23.61 MiB/s Receiving objects: 90% (56711/63012), 70.98 MiB | 23.61 MiB/s Receiving objects: 91% (57341/63012), 70.98 MiB | 23.61 MiB/s Receiving objects: 92% (57972/63012), 70.98 MiB | 23.61 MiB/s Receiving objects: 93% (58602/63012), 88.77 MiB | 25.32 MiB/s Receiving objects: 94% (59232/63012), 88.77 MiB | 25.32 MiB/s Receiving objects: 95% (59862/63012), 88.77 MiB | 25.32 MiB/s Receiving objects: 96% (60492/63012), 88.77 MiB | 25.32 MiB/s Receiving objects: 97% (61122/63012), 88.77 MiB | 25.32 MiB/s Receiving objects: 98% (61752/63012), 88.77 MiB | 25.32 MiB/s Receiving objects: 99% (62382/63012), 88.77 MiB | 25.32 MiB/s remote: Total 63012 (delta 6797), reused 6802 (delta 6207), pack-reused 54634 (from 3)
  7. 6.59 s Receiving objects: 100% (63012/63012), 88.77 MiB | 25.32 MiB/s Receiving objects: 100% (63012/63012), 96.18 MiB | 25.94 MiB/s, done.
  8. 7.14 s Resolving deltas: 0% (0/43716) Resolving deltas: 1% (438/43716) Resolving deltas: 2% (876/43716) Resolving deltas: 3% (1312/43716) Resolving deltas: 4% (1749/43716) Resolving deltas: 5% (2186/43716) Resolving deltas: 6% (2624/43716) Resolving deltas: 7% (3061/43716) Resolving deltas: 8% (3499/43716) Resolving deltas: 9% (3936/43716) Resolving deltas: 10% (4372/43716) Resolving deltas: 11% (4809/43716) Resolving deltas: 12% (5246/43716) Resolving deltas: 13% (5684/43716) Resolving deltas: 14% (6122/43716) Resolving deltas: 15% (6559/43716) Resolving deltas: 16% (6995/43716) Resolving deltas: 17% (7433/43716) Resolving deltas: 18% (7869/43716) Resolving deltas: 19% (8307/43716) Resolving deltas: 20% (8744/43716) Resolving deltas: 21% (9181/43716) Resolving deltas: 22% (9618/43716) Resolving deltas: 23% (10055/43716) Resolving deltas: 24% (10492/43716) Resolving deltas: 25% (10930/43716) Resolving deltas: 26% (11368/43716) Resolving deltas: 27% (11806/43716) Resolving deltas: 28% (12242/43716) Resolving deltas: 29% (12678/43716) Resolving deltas: 30% (13116/43716) Resolving deltas: 31% (13552/43716) Resolving deltas: 32% (13990/43716) Resolving deltas: 33% (14427/43716) Resolving deltas: 34% (14865/43716) Resolving deltas: 35% (15303/43716) Resolving deltas: 36% (15739/43716) Resolving deltas: 37% (16175/43716) Resolving deltas: 38% (16613/43716) Resolving deltas: 39% (17050/43716) Resolving deltas: 40% (17487/43716) Resolving deltas: 41% (17924/43716) Resolving deltas: 42% (18361/43716) Resolving deltas: 43% (18798/43716) Resolving deltas: 44% (19236/43716) Resolving deltas: 45% (19673/43716) Resolving deltas: 46% (20111/43716) Resolving deltas: 47% (20547/43716) Resolving deltas: 48% (20984/43716) Resolving deltas: 49% (21421/43716) Resolving deltas: 50% (21858/43716) Resolving deltas: 51% (22296/43716) Resolving deltas: 52% (22733/43716) Resolving deltas: 53% (23170/43716) Resolving deltas: 54% (23607/43716) Resolving deltas: 55% (24044/43716) Resolving deltas: 56% (24482/43716) Resolving deltas: 57% (24919/43716) Resolving deltas: 58% (25358/43716) Resolving deltas: 59% (25793/43716) Resolving deltas: 60% (26230/43716) Resolving deltas: 61% (26667/43716) Resolving deltas: 62% (27105/43716) Resolving deltas: 63% (27542/43716) Resolving deltas: 64% (27979/43716) Resolving deltas: 65% (28416/43716) Resolving deltas: 66% (28853/43716) Resolving deltas: 67% (29290/43716) Resolving deltas: 68% (29727/43716) Resolving deltas: 69% (30165/43716) Resolving deltas: 70% (30602/43716) Resolving deltas: 71% (31039/43716) Resolving deltas: 72% (31476/43716) Resolving deltas: 73% (31913/43716) Resolving deltas: 74% (32350/43716) Resolving deltas: 75% (32788/43716) Resolving deltas: 76% (33225/43716) Resolving deltas: 77% (33663/43716) Resolving deltas: 78% (34099/43716) Resolving deltas: 79% (34536/43716) Resolving deltas: 80% (34973/43716) Resolving deltas: 81% (35411/43716) Resolving deltas: 82% (35849/43716) Resolving deltas: 83% (36285/43716) Resolving deltas: 84% (36722/43716) Resolving deltas: 85% (37159/43716) Resolving deltas: 86% (37596/43716) Resolving deltas: 87% (38033/43716) Resolving deltas: 88% (38471/43716) Resolving deltas: 89% (38908/43716) Resolving deltas: 90% (39345/43716) Resolving deltas: 91% (39782/43716) Resolving deltas: 92% (40219/43716) Resolving deltas: 93% (40656/43716) Resolving deltas: 94% (41095/43716) Resolving deltas: 95% (41531/43716) Resolving deltas: 96% (41968/43716) Resolving deltas: 97% (42405/43716) Resolving deltas: 98% (42842/43716) Resolving deltas: 99% (43280/43716) Resolving deltas: 100% (43716/43716) Resolving deltas: 100% (43716/43716), done.
  9. 7.40 s Fetching commit ed5aa62ad38895524e198db9bbf1214fcd1c94ab for docs ...
  10. 7.40 s $ /nix/store/bcnisk3ydfgv26v2gw3zlky24g00yww2-git-2.54.0/bin/git fetch origin ed5aa62ad38895524e198db9bbf1214fcd1c94ab
  11. 7.92 s From https://github.com/alphal00p/gammaloop
  12. 7.92 s * branch ed5aa62ad38895524e198db9bbf1214fcd1c94ab -> FETCH_HEAD
  13. 7.93 s $ /nix/store/9ypz3flqsrl5xl495mm8h645gadjsxi1-coreutils-9.11/bin/timeout --kill-after=15s 7200s /nix/store/bcnisk3ydfgv26v2gw3zlky24g00yww2-git-2.54.0/bin/git -c advice.detachedHead=false checkout ed5aa62ad38895524e198db9bbf1214fcd1c94ab
  14. 8.12 s HEAD is now at ed5aa62a include About graph fixture in Nix docs source
  15. 8.12 s $ /nix/store/9ypz3flqsrl5xl495mm8h645gadjsxi1-coreutils-9.11/bin/timeout --kill-after=15s 7200s /nix/store/23zk8sgzamrbmj1fday15szf7f2279s8-nix-2.34.7/bin/nix --extra-experimental-features nix-command --extra-experimental-features flakes --log-format internal-json run .#packages.x86_64-linux.nix-ci-check-gammaloop-doctest --print-build-logs
  16. 10.13 s
  17. 12.07 s evaluating derivation 'g copying '/nix/store/509j [0/1 built] [1/0/1 built] building ggammaloop-workspace-doctest> Running phase: unpackPhase
  18. 12.12 s gammaloop-workspace-doctest> unpacking source archive /nix/store/zw60sp2yw0jzbn0l3i8p6pynq3h4pivs-source
  19. 12.20 s gammaloop-workspace-doctest> source root is source
  20. 12.22 s gammaloop-workspace-doctest> Running phase: patchPhase
  21. 12.23 s gammaloop-workspace-doctest> Executing configureCargoCommonVars
  22. 12.23 s gammaloop-workspace-doctest> decompressing cargo artifacts from /nix/store/8rkh7d3hq722l839568nhnwihnsx041a-gammaloop-workspace-deps-deps-0.1.0/target.tar.zst to target
  23. 13.46 s gammaloop-workspace-doctest> Running phase: updateAutotoolsGnuConfigScriptsPhase
  24. 13.49 s gammaloop-workspace-doctest> Running phase: configurePhase
  25. 13.49 s gammaloop-workspace-doctest> will append /build/source/.cargo-home/config.toml with contents of /nix/store/xdy1vvhll2bijdplvl9fcc2b9plkxhaa-vendor-cargo-deps/config.toml
  26. 13.50 s gammaloop-workspace-doctest> default configurePhase, nothing to do
  27. 13.50 s gammaloop-workspace-doctest> Running phase: buildPhase
  28. 13.50 s gammaloop-workspace-doctest> +++ command cargo --version
  29. 13.50 s gammaloop-workspace-doctest> cargo 1.97.0 (c980f4866 2026-06-30)
  30. 13.53 s gammaloop-workspace-doctest> +++ command cargo test --profile ci-optim --doc --locked --workspace --features gammaloop-api/cli,gammaloop-tracing-filter/clap,gammaloop-tracing-filter/symbolica,idenso/bincode,idenso/reference-cases,linnet/bincode,linnet/drawing,linnet/nodestore-vec,linnet/rkyv,linnet/serde,linnet/symbolica,spenso-macros/shadowing,spenso/shadowing,symbolica/tracing_max_level_info
  31. 13.92 s gammaloop-workspace-doctest> Compiling target-lexicon v0.13.5
  32. 13.93 s gammaloop-workspace-doctest> Compiling symbolica v2.2.0 (https://github.com/symbolica-dev/symbolica?branch=dev#0441bd7a)
  33. 13.93 s gammaloop-workspace-doctest> Compiling maplit v1.0.2
  34. 13.94 s gammaloop-workspace-doctest> Compiling gammaloop-tracing-filter-macros v0.1.0 (/build/source/crates/gammaloop-tracing-filter-macros)
  35. 13.94 s gammaloop-workspace-doctest> Compiling vakint v0.1.2 (/build/source/crates/vakint)
  36. 13.95 s gammaloop-workspace-doctest> Compiling gammalooprs v0.3.4 (/build/source/crates/gammalooprs)
  37. 13.96 s gammaloop-workspace-doctest> Compiling alphal00p-docs-macros v0.1.0 (/build/source/crates/alphal00p-docs-macros)
  38. 13.96 s gammaloop-workspace-doctest> Compiling alphal00p-docs-schema v0.1.0 (/build/source/crates/alphal00p-docs-schema)
  39. 13.96 s gammaloop-workspace-doctest> Compiling rustc_version v0.4.1
  40. 13.96 s gammaloop-workspace-doctest> Compiling bincode v1.3.3
  41. 13.97 s gammaloop-workspace-doctest> Compiling gungraun-runner v0.18.2
  42. 13.97 s gammaloop-workspace-doctest> Compiling iai-callgrind-runner v0.14.2
  43. 13.97 s gammaloop-workspace-doctest> Compiling target-triple v1.0.1
  44. 13.98 s gammaloop-workspace-doctest> Compiling gammaloop-integration-tests v0.1.0 (/build/source/tests)
  45. 13.98 s gammaloop-workspace-doctest> Compiling test-log-core v0.2.20
  46. 14.14 s gammaloop-workspace-doctest> Compiling wait-timeout v0.2.1
  47. 14.17 s gammaloop-workspace-doctest> Compiling bit-vec v0.8.0
  48. 14.20 s gammaloop-workspace-doctest> Compiling quick-error v1.2.3
  49. 14.21 s gammaloop-workspace-doctest> Compiling iai-callgrind v0.14.2
  50. 14.25 s gammaloop-workspace-doctest> Compiling rusty-fork v0.3.1
  51. 14.36 s gammaloop-workspace-doctest> Compiling bit-set v0.8.0
  52. 14.40 s gammaloop-workspace-doctest> Compiling iai-callgrind-macros v0.5.1
  53. 14.40 s gammaloop-workspace-doctest> Compiling rand_xorshift v0.4.0
  54. 14.41 s gammaloop-workspace-doctest> Compiling console v0.15.11
  55. 14.47 s gammaloop-workspace-doctest> Compiling base64 v0.21.7
  56. 14.49 s gammaloop-workspace-doctest> Compiling glob v0.3.4
  57. 14.53 s gammaloop-workspace-doctest> Compiling gungraun-macros v0.8.0
  58. 14.53 s gammaloop-workspace-doctest> Compiling unarray v0.1.4
  59. 14.60 s gammaloop-workspace-doctest> Compiling termcolor v1.4.1
  60. 14.60 s gammaloop-workspace-doctest> Compiling proptest v1.11.0
  61. 14.85 s gammaloop-workspace-doctest> Compiling trybuild v1.0.120
  62. 14.90 s gammaloop-workspace-doctest> Compiling similar-asserts v1.7.0
  63. 15.05 s gammaloop-workspace-doctest> Compiling ron v0.8.1
  64. 15.06 s gammaloop-workspace-doctest> Compiling alphal00p-docs-catalogs v0.1.0 (/build/source/crates/alphal00p-docs-catalogs)
  65. 15.30 s gammaloop-workspace-doctest> Compiling alphal00p-docs-builder v0.1.0 (/build/source/crates/alphal00p-docs-builder)
  66. 15.31 s gammaloop-workspace-doctest> Compiling kurvst v0.1.0 (/build/source/crates/kurvst)
  67. 15.46 s gammaloop-workspace-doctest> Compiling pyo3-build-config v0.28.3
  68. 15.53 s gammaloop-workspace-doctest> Compiling test-log-macros v0.2.20
  69. 17.42 s gammaloop-workspace-doctest> Compiling test-log v0.2.20
  70. 17.48 s gammaloop-workspace-doctest> Compiling alphal00p-docs-examples v0.1.0 (/build/source/crates/alphal00p-docs-examples)
  71. 19.54 s gammaloop-workspace-doctest> Compiling gungraun v0.18.2
  72. 19.60 s gammaloop-workspace-doctest> Compiling pyo3-ffi v0.28.3
  73. 19.95 s gammaloop-workspace-doctest> Compiling pyo3-macros-backend v0.28.3
  74. 20.08 s gammaloop-workspace-doctest> Compiling pyo3 v0.28.3
  75. 20.15 s gammaloop-workspace-doctest> Compiling numpy v0.28.0
  76. 20.24 s gammaloop-workspace-doctest> Compiling gammaloop-api v0.1.0 (/build/source/crates/gammaloop-api)
  77. 24.48 s gammaloop-workspace-doctest> Compiling pyo3-macros v0.28.3
  78. 28.87 s gammaloop-workspace-doctest> Compiling pyo3-stub-gen v0.17.2
  79. 29.52 s gammaloop-workspace-doctest> Compiling numerica v2.2.0 (https://github.com/symbolica-dev/symbolica?branch=dev#0441bd7a)
  80. 31.48 s gammaloop-workspace-doctest> Compiling graphica v2.1.0 (https://github.com/symbolica-dev/symbolica?branch=dev#0441bd7a)
  81. 33.48 s gammaloop-workspace-doctest> Compiling symbolica-utils v0.1.0 (/build/source/crates/symbolica-utils)
  82. 167.71 s gammaloop-workspace-doctest> Compiling gammaloop-workspace-hack v0.1.0 (/build/source/crates/gammaloop-workspace-hack)
  83. 167.76 s gammaloop-workspace-doctest> Compiling spenso-macros v0.3.2 (/build/source/crates/spenso-macros)
  84. 167.85 s gammaloop-workspace-doctest> Compiling linnet v0.17.0 (/build/source/crates/linnet)
  85. 170.64 s gammaloop-workspace-doctest> Compiling spenso v0.6.0 (/build/source/crates/spenso)
  86. 177.07 s gammaloop-workspace-doctest> Compiling idenso v0.3.0 (/build/source/crates/idenso)
  87. 177.13 s gammaloop-workspace-doctest> Compiling gammaloop-tracing-filter v0.1.0 (/build/source/crates/gammaloop-tracing-filter)
  88. 180.30 s gammaloop-workspace-doctest> Compiling spenso-hep-lib v0.1.7 (/build/source/crates/spenso-hep-lib)
  89. 180.50 s gammaloop-workspace-doctest> Compiling spynso3 v0.1.2 (/build/source/crates/spynso3)
  90. 215.92 s gammaloop-workspace-doctest> Compiling linnest v0.1.0 (/build/source/crates/linnest)
  91. 215.98 s gammaloop-workspace-doctest> Compiling linnet-py v0.1.0 (/build/source/crates/linnet-py)
  92. 313.90 s gammaloop-workspace-doctest> Finished `ci-optim` profile [optimized] target(s) in 5m 00s
  93. 313.98 s gammaloop-workspace-doctest> warning: the following packages contain code that will be rejected by a future version of Rust: proc-macro-error2 v2.0.1
  94. 313.98 s gammaloop-workspace-doctest> note: to see what the problems were, use the option `--future-incompat-report`, or run `cargo report future-incompatibilities --id 1`
  95. 314.01 s gammaloop-workspace-doctest> Doc-tests alphal00p_docs_builder
  96. 314.14 s gammaloop-workspace-doctest>
  97. 314.14 s gammaloop-workspace-doctest> running 0 tests
  98. 314.14 s gammaloop-workspace-doctest>
  99. 314.14 s gammaloop-workspace-doctest> test result: ok. 0 passed; 0 failed; 0 ignored; 0 measured; 0 filtered out; finished in 0.00s
  100. 314.14 s gammaloop-workspace-doctest>
  101. 314.14 s gammaloop-workspace-doctest> Doc-tests alphal00p_docs_catalogs
  102. 315.23 s gammaloop-workspace-doctest>
  103. 315.23 s gammaloop-workspace-doctest> running 0 tests
  104. 315.23 s gammaloop-workspace-doctest>
  105. 315.23 s gammaloop-workspace-doctest> test result: ok. 0 passed; 0 failed; 0 ignored; 0 measured; 0 filtered out; finished in 0.00s
  106. 315.23 s gammaloop-workspace-doctest>
  107. 315.23 s gammaloop-workspace-doctest> Doc-tests alphal00p_docs_examples
  108. 315.24 s gammaloop-workspace-doctest>
  109. 315.24 s gammaloop-workspace-doctest> running 0 tests
  110. 315.24 s gammaloop-workspace-doctest>
  111. 315.24 s gammaloop-workspace-doctest> test result: ok. 0 passed; 0 failed; 0 ignored; 0 measured; 0 filtered out; finished in 0.00s
  112. 315.24 s gammaloop-workspace-doctest>
  113. 315.24 s gammaloop-workspace-doctest> Doc-tests alphal00p_docs
  114. 315.29 s gammaloop-workspace-doctest>
  115. 315.29 s gammaloop-workspace-doctest> running 0 tests
  116. 315.29 s gammaloop-workspace-doctest>
  117. 315.29 s gammaloop-workspace-doctest> test result: ok. 0 passed; 0 failed; 0 ignored; 0 measured; 0 filtered out; finished in 0.00s
  118. 315.29 s gammaloop-workspace-doctest>
  119. 315.29 s gammaloop-workspace-doctest> Doc-tests alphal00p_docs_schema
  120. 315.36 s gammaloop-workspace-doctest>
  121. 315.36 s gammaloop-workspace-doctest> running 0 tests
  122. 315.36 s gammaloop-workspace-doctest>
  123. 315.36 s gammaloop-workspace-doctest> test result: ok. 0 passed; 0 failed; 0 ignored; 0 measured; 0 filtered out; finished in 0.00s
  124. 315.36 s gammaloop-workspace-doctest>
  125. 315.36 s gammaloop-workspace-doctest> Doc-tests gammaloop_api
  126. 316.20 s gammaloop-workspace-doctest>
  127. 316.20 s gammaloop-workspace-doctest> running 16 tests
  128. 316.22 s gammaloop-workspace-doctest> test crates/gammaloop-api/src/python.rs - python::GammaLoopAPI::evaluate_samples (line 3108) ... FAILED
  129. 316.22 s gammaloop-workspace-doctest> test crates/gammaloop-api/src/python.rs - python::GammaLoopAPI::evaluate_sample (line 2967) ... FAILED
  130. 316.22 s gammaloop-workspace-doctest> test crates/gammaloop-api/src/python.rs - python::GammaLoopAPI::get_default_runtime_settings (line 3796) ... FAILED
  131. 316.23 s gammaloop-workspace-doctest> test crates/gammaloop-api/src/python.rs - python::GammaLoopAPI::get_integrand_info (line 3585) ... FAILED
  132. 316.23 s gammaloop-workspace-doctest> test crates/gammaloop-api/src/python.rs - python::PyHistogramAccumulator (line 871) ... FAILED
  133. 316.23 s gammaloop-workspace-doctest> test crates/gammaloop-api/src/python.rs - python::GammaLoopAPI::get_integrand_settings (line 3647) ... FAILED
  134. 316.23 s gammaloop-workspace-doctest> test crates/gammaloop-api/src/python.rs - python::GammaLoopAPI::get_active_command_blocks (line 3760) ... FAILED
  135. 316.28 s gammaloop-workspace-doctest> test crates/gammaloop-api/src/lib.rs - (line 18) - compile ... ok
  136. 316.31 s gammaloop-workspace-doctest> test crates/gammaloop-api/src/python.rs - python::GammaLoopAPI::run_command (line 3901) ... FAILED
  137. 316.32 s gammaloop-workspace-doctest> test crates/gammaloop-api/src/python.rs - python::GammaLoopAPI::get_run_history (line 3711) ... FAILED
  138. 316.32 s gammaloop-workspace-doctest> test crates/gammaloop-api/src/python.rs - python::atom_to_canonical_string (line 128) ... FAILED
  139. 316.33 s gammaloop-workspace-doctest> test crates/gammaloop-api/src/python.rs - python::GammaLoopAPI::get_global_settings (line 3739) ... FAILED
  140. 316.33 s gammaloop-workspace-doctest> test crates/gammaloop-api/src/python.rs - python::atom_to_dots (line 157) ... FAILED
  141. 316.33 s gammaloop-workspace-doctest> test crates/gammaloop-api/src/python.rs - python::GammaLoopAPI::new_python (line 2834) ... FAILED
  142. 316.34 s gammaloop-workspace-doctest> test crates/gammaloop-api/src/python.rs - python::evaluate_graph_overall_factor (line 95) ... FAILED
  143. 318.69 s gammaloop-workspace-doctest> test crates/gammaloop-api/src/commands/evaluate_samples.rs - commands::evaluate_samples::EvaluateSamples (line 50) ... ok
  144. 318.69 s gammaloop-workspace-doctest>
  145. 318.69 s gammaloop-workspace-doctest> failures:
  146. 318.69 s gammaloop-workspace-doctest>
  147. 318.69 s gammaloop-workspace-doctest> ---- crates/gammaloop-api/src/python.rs - python::GammaLoopAPI::evaluate_samples (line 3108) stdout ----
  148. 318.69 s gammaloop-workspace-doctest> error: expected one of `!` or `::`, found `pathlib`
  149. 318.69 s gammaloop-workspace-doctest> --> crates/gammaloop-api/src/python.rs:3109:6
  150. 318.69 s gammaloop-workspace-doctest> |
  151. 318.69 s gammaloop-workspace-doctest> 3109 | from pathlib import Path
  152. 318.69 s gammaloop-workspace-doctest> | ^^^^^^^ expected one of `!` or `::`
  153. 318.69 s gammaloop-workspace-doctest>
  154. 318.69 s gammaloop-workspace-doctest> error: aborting due to 1 previous error
  155. 318.69 s gammaloop-workspace-doctest>
  156. 318.69 s gammaloop-workspace-doctest> Couldn't compile the test.
  157. 318.69 s gammaloop-workspace-doctest> ---- crates/gammaloop-api/src/python.rs - python::GammaLoopAPI::evaluate_sample (line 2967) stdout ----
  158. 318.69 s gammaloop-workspace-doctest> error: expected one of `!` or `::`, found `pathlib`
  159. 318.69 s gammaloop-workspace-doctest> --> crates/gammaloop-api/src/python.rs:2968:6
  160. 318.69 s gammaloop-workspace-doctest> |
  161. 318.69 s gammaloop-workspace-doctest> 2968 | from pathlib import Path
  162. 318.69 s gammaloop-workspace-doctest> | ^^^^^^^ expected one of `!` or `::`
  163. 318.69 s gammaloop-workspace-doctest>
  164. 318.69 s gammaloop-workspace-doctest> error: aborting due to 1 previous error
  165. 318.69 s gammaloop-workspace-doctest>
  166. 318.69 s gammaloop-workspace-doctest> Couldn't compile the test.
  167. 318.69 s gammaloop-workspace-doctest> ---- crates/gammaloop-api/src/python.rs - python::GammaLoopAPI::get_default_runtime_settings (line 3796) stdout ----
  168. 318.69 s gammaloop-workspace-doctest> error: expected one of `!` or `::`, found `=`
  169. 318.69 s gammaloop-workspace-doctest> --> crates/gammaloop-api/src/python.rs:3797:9
  170. 318.69 s gammaloop-workspace-doctest> |
  171. 318.69 s gammaloop-workspace-doctest> 3797 | runtime = api.get_default_runtime_settings()
  172. 318.69 s gammaloop-workspace-doctest> | ^ expected one of `!` or `::`
  173. 318.69 s gammaloop-workspace-doctest>
  174. 318.69 s gammaloop-workspace-doctest> error: aborting due to 1 previous error
  175. 318.69 s gammaloop-workspace-doctest>
  176. 318.69 s gammaloop-workspace-doctest> Couldn't compile the test.
  177. 318.69 s gammaloop-workspace-doctest> ---- crates/gammaloop-api/src/python.rs - python::GammaLoopAPI::get_integrand_info (line 3585) stdout ----
  178. 318.69 s gammaloop-workspace-doctest> error: expected one of `!` or `::`, found `pathlib`
  179. 318.69 s gammaloop-workspace-doctest> --> crates/gammaloop-api/src/python.rs:3586:6
  180. 318.69 s gammaloop-workspace-doctest> |
  181. 318.69 s gammaloop-workspace-doctest> 3586 | from pathlib import Path
  182. 318.69 s gammaloop-workspace-doctest> | ^^^^^^^ expected one of `!` or `::`
  183. 318.69 s gammaloop-workspace-doctest>
  184. 318.69 s gammaloop-workspace-doctest> error: aborting due to 1 previous error
  185. 318.69 s gammaloop-workspace-doctest>
  186. 318.69 s gammaloop-workspace-doctest> Couldn't compile the test.
  187. 318.69 s gammaloop-workspace-doctest> ---- crates/gammaloop-api/src/python.rs - python::PyHistogramAccumulator (line 871) stdout ----
  188. 318.69 s gammaloop-workspace-doctest> error: expected one of `!` or `::`, found `gammaloop`
  189. 318.69 s gammaloop-workspace-doctest> --> crates/gammaloop-api/src/python.rs:872:6
  190. 318.69 s gammaloop-workspace-doctest> |
  191. 318.69 s gammaloop-workspace-doctest> 872 | from gammaloop import HistogramAccumulator
  192. 318.69 s gammaloop-workspace-doctest> | ^^^^^^^^^ expected one of `!` or `::`
  193. 318.69 s gammaloop-workspace-doctest>
  194. 318.69 s gammaloop-workspace-doctest> error: aborting due to 1 previous error
  195. 318.69 s gammaloop-workspace-doctest>
  196. 318.69 s gammaloop-workspace-doctest> Couldn't compile the test.
  197. 318.69 s gammaloop-workspace-doctest> ---- crates/gammaloop-api/src/python.rs - python::GammaLoopAPI::get_integrand_settings (line 3647) stdout ----
  198. 318.69 s gammaloop-workspace-doctest> error: expected one of `!` or `::`, found `=`
  199. 318.69 s gammaloop-workspace-doctest> --> crates/gammaloop-api/src/python.rs:3648:10
  200. 318.69 s gammaloop-workspace-doctest> |
  201. 318.69 s gammaloop-workspace-doctest> 3648 | settings = api.get_integrand_settings(process_id=0)
  202. 318.69 s gammaloop-workspace-doctest> | ^ expected one of `!` or `::`
  203. 318.69 s gammaloop-workspace-doctest>
  204. 318.69 s gammaloop-workspace-doctest> error: aborting due to 1 previous error
  205. 318.69 s gammaloop-workspace-doctest>
  206. 318.69 s gammaloop-workspace-doctest> Couldn't compile the test.
  207. 318.69 s gammaloop-workspace-doctest> ---- crates/gammaloop-api/src/python.rs - python::GammaLoopAPI::get_active_command_blocks (line 3760) stdout ----
  208. 318.69 s gammaloop-workspace-doctest> error: expected item, found keyword `for`
  209. 318.69 s gammaloop-workspace-doctest> --> crates/gammaloop-api/src/python.rs:3761:1
  210. 318.69 s gammaloop-workspace-doctest> |
  211. 318.69 s gammaloop-workspace-doctest> 3761 | for name, commands in api.get_active_command_blocks().items():
  212. 318.69 s gammaloop-workspace-doctest> | ^^^ expected item
  213. 318.69 s gammaloop-workspace-doctest> |
  214. 318.69 s gammaloop-workspace-doctest> = note: for a full list of items that can appear in modules, see <https://doc.rust-lang.org/reference/items.html>
  215. 318.69 s gammaloop-workspace-doctest>
  216. 318.69 s gammaloop-workspace-doctest> error: aborting due to 1 previous error
  217. 318.69 s gammaloop-workspace-doctest>
  218. 318.69 s gammaloop-workspace-doctest> Couldn't compile the test.
  219. 318.69 s gammaloop-workspace-doctest> ---- crates/gammaloop-api/src/python.rs - python::GammaLoopAPI::run_command (line 3901) stdout ----
  220. 318.69 s gammaloop-workspace-doctest> error[E0425]: cannot find value `api` in this scope
  221. 318.69 s gammaloop-workspace-doctest> --> crates/gammaloop-api/src/python.rs:3902:1
  222. 318.69 s gammaloop-workspace-doctest> |
  223. 318.69 s gammaloop-workspace-doctest> 3902 | api.run("display processes")
  224. 318.69 s gammaloop-workspace-doctest> | ^^^ not found in this scope
  225. 318.69 s gammaloop-workspace-doctest>
  226. 318.69 s gammaloop-workspace-doctest> error: aborting due to 1 previous error
  227. 318.69 s gammaloop-workspace-doctest>
  228. 318.69 s gammaloop-workspace-doctest> For more information about this error, try `rustc --explain E0425`.
  229. 318.69 s gammaloop-workspace-doctest> Couldn't compile the test.
  230. 318.69 s gammaloop-workspace-doctest> ---- crates/gammaloop-api/src/python.rs - python::GammaLoopAPI::get_run_history (line 3711) stdout ----
  231. 318.69 s gammaloop-workspace-doctest> error[E0425]: cannot find value `run_card_toml` in this scope
  232. 318.69 s gammaloop-workspace-doctest> --> crates/gammaloop-api/src/python.rs:3712:1
  233. 318.69 s gammaloop-workspace-doctest> |
  234. 318.69 s gammaloop-workspace-doctest> 3712 | run_card_toml = api.get_run_history()
  235. 318.69 s gammaloop-workspace-doctest> | ^^^^^^^^^^^^^
  236. 318.69 s gammaloop-workspace-doctest> |
  237. 318.69 s gammaloop-workspace-doctest> help: you might have meant to introduce a new binding
  238. 318.69 s gammaloop-workspace-doctest> |
  239. 318.69 s gammaloop-workspace-doctest> 3712 | let run_card_toml = api.get_run_history()
  240. 318.69 s gammaloop-workspace-doctest> | +++
  241. 318.69 s gammaloop-workspace-doctest>
  242. 318.69 s gammaloop-workspace-doctest> error[E0425]: cannot find value `api` in this scope
  243. 318.69 s gammaloop-workspace-doctest> --> crates/gammaloop-api/src/python.rs:3712:17
  244. 318.69 s gammaloop-workspace-doctest> |
  245. 318.69 s gammaloop-workspace-doctest> 3712 | run_card_toml = api.get_run_history()
  246. 318.69 s gammaloop-workspace-doctest> | ^^^ not found in this scope
  247. 318.69 s gammaloop-workspace-doctest>
  248. 318.69 s gammaloop-workspace-doctest> error: aborting due to 2 previous errors
  249. 318.69 s gammaloop-workspace-doctest>
  250. 318.69 s gammaloop-workspace-doctest> For more information about this error, try `rustc --explain E0425`.
  251. 318.69 s gammaloop-workspace-doctest> Couldn't compile the test.
  252. 318.69 s gammaloop-workspace-doctest> ---- crates/gammaloop-api/src/python.rs - python::atom_to_canonical_string (line 128) stdout ----
  253. 318.69 s gammaloop-workspace-doctest> error[E0425]: cannot find function `atom_to_canonical_string` in this scope
  254. 318.69 s gammaloop-workspace-doctest> --> crates/gammaloop-api/src/python.rs:129:1
  255. 318.69 s gammaloop-workspace-doctest> |
  256. 318.69 s gammaloop-workspace-doctest> 129 | atom_to_canonical_string("x + x")
  257. 318.69 s gammaloop-workspace-doctest> | ^^^^^^^^^^^^^^^^^^^^^^^^ not found in this scope
  258. 318.69 s gammaloop-workspace-doctest>
  259. 318.69 s gammaloop-workspace-doctest> error: aborting due to 1 previous error
  260. 318.69 s gammaloop-workspace-doctest>
  261. 318.69 s gammaloop-workspace-doctest> For more information about this error, try `rustc --explain E0425`.
  262. 318.69 s gammaloop-workspace-doctest> Couldn't compile the test.
  263. 318.69 s gammaloop-workspace-doctest> ---- crates/gammaloop-api/src/python.rs - python::GammaLoopAPI::get_global_settings (line 3739) stdout ----
  264. 318.69 s gammaloop-workspace-doctest> error[E0425]: cannot find value `settings_toml` in this scope
  265. 318.69 s gammaloop-workspace-doctest> --> crates/gammaloop-api/src/python.rs:3740:1
  266. 318.69 s gammaloop-workspace-doctest> |
  267. 318.69 s gammaloop-workspace-doctest> 3740 | settings_toml = api.get_global_settings()
  268. 318.69 s gammaloop-workspace-doctest> | ^^^^^^^^^^^^^
  269. 318.69 s gammaloop-workspace-doctest> |
  270. 318.69 s gammaloop-workspace-doctest> help: you might have meant to introduce a new binding
  271. 318.69 s gammaloop-workspace-doctest> |
  272. 318.69 s gammaloop-workspace-doctest> 3740 | let settings_toml = api.get_global_settings()
  273. 318.69 s gammaloop-workspace-doctest> | +++
  274. 318.69 s gammaloop-workspace-doctest>
  275. 318.69 s gammaloop-workspace-doctest> error[E0425]: cannot find value `api` in this scope
  276. 318.69 s gammaloop-workspace-doctest> --> crates/gammaloop-api/src/python.rs:3740:17
  277. 318.69 s gammaloop-workspace-doctest> |
  278. 318.69 s gammaloop-workspace-doctest> 3740 | settings_toml = api.get_global_settings()
  279. 318.69 s gammaloop-workspace-doctest> | ^^^ not found in this scope
  280. 318.69 s gammaloop-workspace-doctest>
  281. 318.69 s gammaloop-workspace-doctest> error: aborting due to 2 previous errors
  282. 318.69 s gammaloop-workspace-doctest>
  283. 318.69 s gammaloop-workspace-doctest> For more information about this error, try `rustc --explain E0425`.
  284. 318.69 s gammaloop-workspace-doctest> Couldn't compile the test.
  285. 318.69 s gammaloop-workspace-doctest> ---- crates/gammaloop-api/src/python.rs - python::atom_to_dots (line 157) stdout ----
  286. 318.69 s gammaloop-workspace-doctest> error[E0425]: cannot find function `to_dots` in this scope
  287. 318.69 s gammaloop-workspace-doctest> --> crates/gammaloop-api/src/python.rs:158:1
  288. 318.69 s gammaloop-workspace-doctest> |
  289. 318.69 s gammaloop-workspace-doctest> 158 | to_dots("p(mu) * q(mu)")
  290. 318.69 s gammaloop-workspace-doctest> | ^^^^^^^ not found in this scope
  291. 318.69 s gammaloop-workspace-doctest>
  292. 318.69 s gammaloop-workspace-doctest> error: aborting due to 1 previous error
  293. 318.69 s gammaloop-workspace-doctest>
  294. 318.69 s gammaloop-workspace-doctest> For more information about this error, try `rustc --explain E0425`.
  295. 318.69 s gammaloop-workspace-doctest> Couldn't compile the test.
  296. 318.69 s gammaloop-workspace-doctest> ---- crates/gammaloop-api/src/python.rs - python::GammaLoopAPI::new_python (line 2834) stdout ----
  297. 318.69 s gammaloop-workspace-doctest> error[E0425]: cannot find value `api` in this scope
  298. 318.69 s gammaloop-workspace-doctest> --> crates/gammaloop-api/src/python.rs:2835:1
  299. 318.69 s gammaloop-workspace-doctest> |
  300. 318.69 s gammaloop-workspace-doctest> 2835 | api = GammaLoopAPI(state_folder="./state", read_only_state=True)
  301. 318.69 s gammaloop-workspace-doctest> | ^^^
  302. 318.69 s gammaloop-workspace-doctest> |
  303. 318.69 s gammaloop-workspace-doctest> help: you might have meant to introduce a new binding
  304. 318.69 s gammaloop-workspace-doctest> |
  305. 318.69 s gammaloop-workspace-doctest> 2835 | let api = GammaLoopAPI(state_folder="./state", read_only_state=True)
  306. 318.69 s gammaloop-workspace-doctest> | +++
  307. 318.69 s gammaloop-workspace-doctest>
  308. 318.69 s gammaloop-workspace-doctest> error[E0425]: cannot find value `state_folder` in this scope
  309. 318.69 s gammaloop-workspace-doctest> --> crates/gammaloop-api/src/python.rs:2835:20
  310. 318.69 s gammaloop-workspace-doctest> |
  311. 318.69 s gammaloop-workspace-doctest> 2835 | api = GammaLoopAPI(state_folder="./state", read_only_state=True)
  312. 318.69 s gammaloop-workspace-doctest> | ^^^^^^^^^^^^ not found in this scope
  313. 318.69 s gammaloop-workspace-doctest>
  314. 318.69 s gammaloop-workspace-doctest> error[E0425]: cannot find value `read_only_state` in this scope
  315. 318.69 s gammaloop-workspace-doctest> --> crates/gammaloop-api/src/python.rs:2835:44
  316. 318.69 s gammaloop-workspace-doctest> |
  317. 318.69 s gammaloop-workspace-doctest> 2835 | api = GammaLoopAPI(state_folder="./state", read_only_state=True)
  318. 318.69 s gammaloop-workspace-doctest> | ^^^^^^^^^^^^^^^ not found in this scope
  319. 318.69 s gammaloop-workspace-doctest>
  320. 318.69 s gammaloop-workspace-doctest> error[E0425]: cannot find value `True` in this scope
  321. 318.69 s gammaloop-workspace-doctest> --> crates/gammaloop-api/src/python.rs:2835:60
  322. 318.69 s gammaloop-workspace-doctest> |
  323. 318.69 s gammaloop-workspace-doctest> 2835 | api = GammaLoopAPI(state_folder="./state", read_only_state=True)
  324. 318.69 s gammaloop-workspace-doctest> | ^^^^ not found in this scope
  325. 318.69 s gammaloop-workspace-doctest> |
  326. 318.69 s gammaloop-workspace-doctest> help: you may want to use a bool value instead
  327. 318.69 s gammaloop-workspace-doctest> |
  328. 318.69 s gammaloop-workspace-doctest> 2835 - api = GammaLoopAPI(state_folder="./state", read_only_state=True)
  329. 318.69 s gammaloop-workspace-doctest> 2835 + api = GammaLoopAPI(state_folder="./state", read_only_state=true)
  330. 318.69 s gammaloop-workspace-doctest> |
  331. 318.69 s gammaloop-workspace-doctest>
  332. 318.69 s gammaloop-workspace-doctest> error[E0425]: cannot find function, tuple struct or tuple variant `GammaLoopAPI` in this scope
  333. 318.69 s gammaloop-workspace-doctest> --> crates/gammaloop-api/src/python.rs:2835:7
  334. 318.69 s gammaloop-workspace-doctest> |
  335. 318.69 s gammaloop-workspace-doctest> 2835 | api = GammaLoopAPI(state_folder="./state", read_only_state=True)
  336. 318.69 s gammaloop-workspace-doctest> | ^^^^^^^^^^^^ not found in this scope
  337. 318.69 s gammaloop-workspace-doctest>
  338. 318.69 s gammaloop-workspace-doctest> error: aborting due to 5 previous errors
  339. 318.69 s gammaloop-workspace-doctest>
  340. 318.69 s gammaloop-workspace-doctest> For more information about this error, try `rustc --explain E0425`.
  341. 318.69 s gammaloop-workspace-doctest> Couldn't compile the test.
  342. 318.69 s gammaloop-workspace-doctest> ---- crates/gammaloop-api/src/python.rs - python::evaluate_graph_overall_factor (line 95) stdout ----
  343. 318.69 s gammaloop-workspace-doctest> error[E0425]: cannot find function `evaluate_graph_overall_factor` in this scope
  344. 318.69 s gammaloop-workspace-doctest> --> crates/gammaloop-api/src/python.rs:96:1
  345. 318.69 s gammaloop-workspace-doctest> |
  346. 318.69 s gammaloop-workspace-doctest> 96 | evaluate_graph_overall_factor(
  347. 318.69 s gammaloop-workspace-doctest> | ^^^^^^^^^^^^^^^^^^^^^^^^^^^^^ not found in this scope
  348. 318.69 s gammaloop-workspace-doctest>
  349. 318.69 s gammaloop-workspace-doctest> error: aborting due to 1 previous error
  350. 318.69 s gammaloop-workspace-doctest>
  351. 318.69 s gammaloop-workspace-doctest> For more information about this error, try `rustc --explain E0425`.
  352. 318.69 s gammaloop-workspace-doctest> Couldn't compile the test.
  353. 318.69 s gammaloop-workspace-doctest>
  354. 318.69 s gammaloop-workspace-doctest> failures:
  355. 318.69 s gammaloop-workspace-doctest> crates/gammaloop-api/src/python.rs - python::GammaLoopAPI::evaluate_sample (line 2967)
  356. 318.69 s gammaloop-workspace-doctest> crates/gammaloop-api/src/python.rs - python::GammaLoopAPI::evaluate_samples (line 3108)
  357. 318.69 s gammaloop-workspace-doctest> crates/gammaloop-api/src/python.rs - python::GammaLoopAPI::get_active_command_blocks (line 3760)
  358. 318.69 s gammaloop-workspace-doctest> crates/gammaloop-api/src/python.rs - python::GammaLoopAPI::get_default_runtime_settings (line 3796)
  359. 318.69 s gammaloop-workspace-doctest> crates/gammaloop-api/src/python.rs - python::GammaLoopAPI::get_global_settings (line 3739)
  360. 318.69 s gammaloop-workspace-doctest> crates/gammaloop-api/src/python.rs - python::GammaLoopAPI::get_integrand_info (line 3585)
  361. 318.69 s gammaloop-workspace-doctest> crates/gammaloop-api/src/python.rs - python::GammaLoopAPI::get_integrand_settings (line 3647)
  362. 318.69 s gammaloop-workspace-doctest> crates/gammaloop-api/src/python.rs - python::GammaLoopAPI::get_run_history (line 3711)
  363. 318.69 s gammaloop-workspace-doctest> crates/gammaloop-api/src/python.rs - python::GammaLoopAPI::new_python (line 2834)
  364. 318.69 s gammaloop-workspace-doctest> crates/gammaloop-api/src/python.rs - python::GammaLoopAPI::run_command (line 3901)
  365. 318.69 s gammaloop-workspace-doctest> crates/gammaloop-api/src/python.rs - python::PyHistogramAccumulator (line 871)
  366. 318.69 s gammaloop-workspace-doctest> crates/gammaloop-api/src/python.rs - python::atom_to_canonical_string (line 128)
  367. 318.69 s gammaloop-workspace-doctest> crates/gammaloop-api/src/python.rs - python::atom_to_dots (line 157)
  368. 318.69 s gammaloop-workspace-doctest> crates/gammaloop-api/src/python.rs - python::evaluate_graph_overall_factor (line 95)
  369. 318.69 s gammaloop-workspace-doctest>
  370. 318.69 s gammaloop-workspace-doctest> test result: FAILED. 2 passed; 14 failed; 0 ignored; 0 measured; 0 filtered out; finished in 2.49s
  371. 318.69 s gammaloop-workspace-doctest>
  372. 318.70 s gammaloop-workspace-doctest> error: doctest failed, to rerun pass `-p gammaloop-api --doc`
  373. 319.21 s error: Cannot build '/nix/store/l4jl276bp0050h66nydaswl0yrkqlgr4-gammaloop-workspace-doctest-0.1.0.drv'.
  374. 319.32 s Reason: builder failed with exit code 101.
  375. 319.32 s Output paths:
  376. 319.32 s /nix/store/hr6yd418rwbi8hzda4zdmla0j713f63m-gammaloop-workspace-doctest-0.1.0
  377. 319.32 s Last 356 log lines:
  378. 319.32 s > Running phase: unpackPhase
  379. 319.32 s > unpacking source archive /nix/store/zw60sp2yw0jzbn0l3i8p6pynq3h4pivs-source
  380. 319.32 s > source root is source
  381. 319.32 s > Running phase: patchPhase
  382. 319.32 s > Executing configureCargoCommonVars
  383. 319.32 s > decompressing cargo artifacts from /nix/store/8rkh7d3hq722l839568nhnwihnsx041a-gammaloop-workspace-deps-deps-0.1.0/target.tar.zst to target
  384. 319.32 s > Running phase: updateAutotoolsGnuConfigScriptsPhase
  385. 319.32 s > Running phase: configurePhase
  386. 319.32 s > will append /build/source/.cargo-home/config.toml with contents of /nix/store/xdy1vvhll2bijdplvl9fcc2b9plkxhaa-vendor-cargo-deps/config.toml
  387. 319.32 s > default configurePhase, nothing to do
  388. 319.32 s > Running phase: buildPhase
  389. 319.32 s > +++ command cargo --version
  390. 319.32 s > cargo 1.97.0 (c980f4866 2026-06-30)
  391. 319.32 s > +++ command cargo test --profile ci-optim --doc --locked --workspace --features gammaloop-api/cli,gammaloop-tracing-filter/clap,gammaloop-tracing-filter/symbolica,idenso/bincode,idenso/reference-cases,linnet/bincode,linnet/drawing,linnet/nodestore-vec,linnet/rkyv,linnet/serde,linnet/symbolica,spenso-macros/shadowing,spenso/shadowing,symbolica/tracing_max_level_info
  392. 319.32 s > Compiling target-lexicon v0.13.5
  393. 319.32 s > Compiling symbolica v2.2.0 (https://github.com/symbolica-dev/symbolica?branch=dev#0441bd7a)
  394. 319.32 s > Compiling maplit v1.0.2
  395. 319.32 s > Compiling gammaloop-tracing-filter-macros v0.1.0 (/build/source/crates/gammaloop-tracing-filter-macros)
  396. 319.32 s > Compiling vakint v0.1.2 (/build/source/crates/vakint)
  397. 319.32 s > Compiling gammalooprs v0.3.4 (/build/source/crates/gammalooprs)
  398. 319.32 s > Compiling alphal00p-docs-macros v0.1.0 (/build/source/crates/alphal00p-docs-macros)
  399. 319.32 s > Compiling alphal00p-docs-schema v0.1.0 (/build/source/crates/alphal00p-docs-schema)
  400. 319.32 s > Compiling rustc_version v0.4.1
  401. 319.32 s > Compiling bincode v1.3.3
  402. 319.32 s > Compiling gungraun-runner v0.18.2
  403. 319.32 s > Compiling iai-callgrind-runner v0.14.2
  404. 319.32 s > Compiling target-triple v1.0.1
  405. 319.32 s > Compiling gammaloop-integration-tests v0.1.0 (/build/source/tests)
  406. 319.32 s > Compiling test-log-core v0.2.20
  407. 319.32 s > Compiling wait-timeout v0.2.1
  408. 319.32 s > Compiling bit-vec v0.8.0
  409. 319.32 s > Compiling quick-error v1.2.3
  410. 319.32 s > Compiling iai-callgrind v0.14.2
  411. 319.32 s > Compiling rusty-fork v0.3.1
  412. 319.32 s > Compiling bit-set v0.8.0
  413. 319.32 s > Compiling iai-callgrind-macros v0.5.1
  414. 319.32 s > Compiling rand_xorshift v0.4.0
  415. 319.32 s > Compiling console v0.15.11
  416. 319.32 s > Compiling base64 v0.21.7
  417. 319.32 s > Compiling glob v0.3.4
  418. 319.32 s > Compiling gungraun-macros v0.8.0
  419. 319.32 s > Compiling unarray v0.1.4
  420. 319.32 s > Compiling termcolor v1.4.1
  421. 319.32 s > Compiling proptest v1.11.0
  422. 319.32 s > Compiling trybuild v1.0.120
  423. 319.32 s > Compiling similar-asserts v1.7.0
  424. 319.32 s > Compiling ron v0.8.1
  425. 319.32 s > Compiling alphal00p-docs-catalogs v0.1.0 (/build/source/crates/alphal00p-docs-catalogs)
  426. 319.32 s > Compiling alphal00p-docs-builder v0.1.0 (/build/source/crates/alphal00p-docs-builder)
  427. 319.32 s > Compiling kurvst v0.1.0 (/build/source/crates/kurvst)
  428. 319.32 s > Compiling pyo3-build-config v0.28.3
  429. 319.32 s > Compiling test-log-macros v0.2.20
  430. 319.32 s > Compiling test-log v0.2.20
  431. 319.32 s > Compiling alphal00p-docs-examples v0.1.0 (/build/source/crates/alphal00p-docs-examples)
  432. 319.32 s > Compiling gungraun v0.18.2
  433. 319.32 s > Compiling pyo3-ffi v0.28.3
  434. 319.32 s > Compiling pyo3-macros-backend v0.28.3
  435. 319.32 s > Compiling pyo3 v0.28.3
  436. 319.32 s > Compiling numpy v0.28.0
  437. 319.32 s > Compiling gammaloop-api v0.1.0 (/build/source/crates/gammaloop-api)
  438. 319.32 s > Compiling pyo3-macros v0.28.3
  439. 319.32 s > Compiling pyo3-stub-gen v0.17.2
  440. 319.32 s > Compiling numerica v2.2.0 (https://github.com/symbolica-dev/symbolica?branch=dev#0441bd7a)
  441. 319.32 s > Compiling graphica v2.1.0 (https://github.com/symbolica-dev/symbolica?branch=dev#0441bd7a)
  442. 319.32 s > Compiling symbolica-utils v0.1.0 (/build/source/crates/symbolica-utils)
  443. 319.32 s > Compiling gammaloop-workspace-hack v0.1.0 (/build/source/crates/gammaloop-workspace-hack)
  444. 319.32 s > Compiling spenso-macros v0.3.2 (/build/source/crates/spenso-macros)
  445. 319.32 s > Compiling linnet v0.17.0 (/build/source/crates/linnet)
  446. 319.32 s > Compiling spenso v0.6.0 (/build/source/crates/spenso)
  447. 319.32 s > Compiling idenso v0.3.0 (/build/source/crates/idenso)
  448. 319.32 s > Compiling gammaloop-tracing-filter v0.1.0 (/build/source/crates/gammaloop-tracing-filter)
  449. 319.32 s > Compiling spenso-hep-lib v0.1.7 (/build/source/crates/spenso-hep-lib)
  450. 319.32 s > Compiling spynso3 v0.1.2 (/build/source/crates/spynso3)
  451. 319.32 s > Compiling linnest v0.1.0 (/build/source/crates/linnest)
  452. 319.32 s > Compiling linnet-py v0.1.0 (/build/source/crates/linnet-py)
  453. 319.32 s > Finished `ci-optim` profile [optimized] target(s) in 5m 00s
  454. 319.32 s > warning: the following packages contain code that will be rejected by a future version of Rust: proc-macro-error2 v2.0.1
  455. 319.32 s > note: to see what the problems were, use the option `--future-incompat-report`, or run `cargo report future-incompatibilities --id 1`
  456. 319.32 s > Doc-tests alphal00p_docs_builder
  457. 319.32 s >
  458. 319.32 s > running 0 tests
  459. 319.32 s >
  460. 319.32 s > test result: ok. 0 passed; 0 failed; 0 ignored; 0 measured; 0 filtered out; finished in 0.00s
  461. 319.32 s >
  462. 319.32 s > Doc-tests alphal00p_docs_catalogs
  463. 319.32 s >
  464. 319.32 s > running 0 tests
  465. 319.32 s >
  466. 319.32 s > test result: ok. 0 passed; 0 failed; 0 ignored; 0 measured; 0 filtered out; finished in 0.00s
  467. 319.32 s >
  468. 319.32 s > Doc-tests alphal00p_docs_examples
  469. 319.32 s >
  470. 319.32 s > running 0 tests
  471. 319.32 s >
  472. 319.32 s > test result: ok. 0 passed; 0 failed; 0 ignored; 0 measured; 0 filtered out; finished in 0.00s
  473. 319.32 s >
  474. 319.32 s > Doc-tests alphal00p_docs
  475. 319.32 s >
  476. 319.32 s > running 0 tests
  477. 319.32 s >
  478. 319.32 s > test result: ok. 0 passed; 0 failed; 0 ignored; 0 measured; 0 filtered out; finished in 0.00s
  479. 319.32 s >
  480. 319.32 s > Doc-tests alphal00p_docs_schema
  481. 319.32 s >
  482. 319.32 s > running 0 tests
  483. 319.32 s >
  484. 319.32 s > test result: ok. 0 passed; 0 failed; 0 ignored; 0 measured; 0 filtered out; finished in 0.00s
  485. 319.32 s >
  486. 319.32 s > Doc-tests gammaloop_api
  487. 319.32 s >
  488. 319.32 s > running 16 tests
  489. 319.32 s > test crates/gammaloop-api/src/python.rs - python::GammaLoopAPI::evaluate_samples (line 3108) ... FAILED
  490. 319.32 s > test crates/gammaloop-api/src/python.rs - python::GammaLoopAPI::evaluate_sample (line 2967) ... FAILED
  491. 319.32 s > test crates/gammaloop-api/src/python.rs - python::GammaLoopAPI::get_default_runtime_settings (line 3796) ... FAILED
  492. 319.32 s > test crates/gammaloop-api/src/python.rs - python::GammaLoopAPI::get_integrand_info (line 3585) ... FAILED
  493. 319.32 s > test crates/gammaloop-api/src/python.rs - python::PyHistogramAccumulator (line 871) ... FAILED
  494. 319.32 s > test crates/gammaloop-api/src/python.rs - python::GammaLoopAPI::get_integrand_settings (line 3647) ... FAILED
  495. 319.32 s > test crates/gammaloop-api/src/python.rs - python::GammaLoopAPI::get_active_command_blocks (line 3760) ... FAILED
  496. 319.32 s > test crates/gammaloop-api/src/lib.rs - (line 18) - compile ... ok
  497. 319.32 s > test crates/gammaloop-api/src/python.rs - python::GammaLoopAPI::run_command (line 3901) ... FAILED
  498. 319.32 s > test crates/gammaloop-api/src/python.rs - python::GammaLoopAPI::get_run_history (line 3711) ... FAILED
  499. 319.32 s > test crates/gammaloop-api/src/python.rs - python::atom_to_canonical_string (line 128) ... FAILED
  500. 319.32 s > test crates/gammaloop-api/src/python.rs - python::GammaLoopAPI::get_global_settings (line 3739) ... FAILED
  501. 319.32 s > test crates/gammaloop-api/src/python.rs - python::atom_to_dots (line 157) ... FAILED
  502. 319.32 s > test crates/gammaloop-api/src/python.rs - python::GammaLoopAPI::new_python (line 2834) ... FAILED
  503. 319.32 s > test crates/gammaloop-api/src/python.rs - python::evaluate_graph_overall_factor (line 95) ... FAILED
  504. 319.32 s > test crates/gammaloop-api/src/commands/evaluate_samples.rs - commands::evaluate_samples::EvaluateSamples (line 50) ... ok
  505. 319.32 s >
  506. 319.32 s > failures:
  507. 319.32 s >
  508. 319.32 s > ---- crates/gammaloop-api/src/python.rs - python::GammaLoopAPI::evaluate_samples (line 3108) stdout ----
  509. 319.32 s > error: expected one of `!` or `::`, found `pathlib`
  510. 319.32 s > --> crates/gammaloop-api/src/python.rs:3109:6
  511. 319.32 s > |
  512. 319.32 s > 3109 | from pathlib import Path
  513. 319.32 s > | ^^^^^^^ expected one of `!` or `::`
  514. 319.32 s >
  515. 319.32 s > error: aborting due to 1 previous error
  516. 319.32 s >
  517. 319.32 s > Couldn't compile the test.
  518. 319.32 s > ---- crates/gammaloop-api/src/python.rs - python::GammaLoopAPI::evaluate_sample (line 2967) stdout ----
  519. 319.32 s > error: expected one of `!` or `::`, found `pathlib`
  520. 319.32 s > --> crates/gammaloop-api/src/python.rs:2968:6
  521. 319.32 s > |
  522. 319.32 s > 2968 | from pathlib import Path
  523. 319.32 s > | ^^^^^^^ expected one of `!` or `::`
  524. 319.32 s >
  525. 319.32 s > error: aborting due to 1 previous error
  526. 319.32 s >
  527. 319.32 s > Couldn't compile the test.
  528. 319.32 s > ---- crates/gammaloop-api/src/python.rs - python::GammaLoopAPI::get_default_runtime_settings (line 3796) stdout ----
  529. 319.32 s > error: expected one of `!` or `::`, found `=`
  530. 319.32 s > --> crates/gammaloop-api/src/python.rs:3797:9
  531. 319.32 s > |
  532. 319.32 s > 3797 | runtime = api.get_default_runtime_settings()
  533. 319.32 s > | ^ expected one of `!` or `::`
  534. 319.32 s >
  535. 319.32 s > error: aborting due to 1 previous error
  536. 319.32 s >
  537. 319.32 s > Couldn't compile the test.
  538. 319.32 s > ---- crates/gammaloop-api/src/python.rs - python::GammaLoopAPI::get_integrand_info (line 3585) stdout ----
  539. 319.32 s > error: expected one of `!` or `::`, found `pathlib`
  540. 319.32 s > --> crates/gammaloop-api/src/python.rs:3586:6
  541. 319.32 s > |
  542. 319.32 s > 3586 | from pathlib import Path
  543. 319.32 s > | ^^^^^^^ expected one of `!` or `::`
  544. 319.32 s >
  545. 319.32 s > error: aborting due to 1 previous error
  546. 319.32 s >
  547. 319.32 s > Couldn't compile the test.
  548. 319.32 s > ---- crates/gammaloop-api/src/python.rs - python::PyHistogramAccumulator (line 871) stdout ----
  549. 319.32 s > error: expected one of `!` or `::`, found `gammaloop`
  550. 319.32 s > --> crates/gammaloop-api/src/python.rs:872:6
  551. 319.32 s > |
  552. 319.32 s > 872 | from gammaloop import HistogramAccumulator
  553. 319.32 s > | ^^^^^^^^^ expected one of `!` or `::`
  554. 319.32 s >
  555. 319.32 s > error: aborting due to 1 previous error
  556. 319.32 s >
  557. 319.32 s > Couldn't compile the test.
  558. 319.32 s > ---- crates/gammaloop-api/src/python.rs - python::GammaLoopAPI::get_integrand_settings (line 3647) stdout ----
  559. 319.32 s > error: expected one of `!` or `::`, found `=`
  560. 319.32 s > --> crates/gammaloop-api/src/python.rs:3648:10
  561. 319.32 s > |
  562. 319.32 s > 3648 | settings = api.get_integrand_settings(process_id=0)
  563. 319.32 s > | ^ expected one of `!` or `::`
  564. 319.32 s >
  565. 319.32 s > error: aborting due to 1 previous error
  566. 319.32 s >
  567. 319.32 s > Couldn't compile the test.
  568. 319.32 s > ---- crates/gammaloop-api/src/python.rs - python::GammaLoopAPI::get_active_command_blocks (line 3760) stdout ----
  569. 319.32 s > error: expected item, found keyword `for`
  570. 319.32 s > --> crates/gammaloop-api/src/python.rs:3761:1
  571. 319.32 s > |
  572. 319.32 s > 3761 | for name, commands in api.get_active_command_blocks().items():
  573. 319.32 s > | ^^^ expected item
  574. 319.32 s > |
  575. 319.32 s > = note: for a full list of items that can appear in modules, see <https://doc.rust-lang.org/reference/items.html>
  576. 319.32 s >
  577. 319.32 s > error: aborting due to 1 previous error
  578. 319.32 s >
  579. 319.32 s > Couldn't compile the test.
  580. 319.32 s > ---- crates/gammaloop-api/src/python.rs - python::GammaLoopAPI::run_command (line 3901) stdout ----
  581. 319.32 s > error[E0425]: cannot find value `api` in this scope
  582. 319.32 s > --> crates/gammaloop-api/src/python.rs:3902:1
  583. 319.32 s > |
  584. 319.32 s > 3902 | api.run("display processes")
  585. 319.32 s > | ^^^ not found in this scope
  586. 319.32 s >
  587. 319.32 s > error: aborting due to 1 previous error
  588. 319.32 s >
  589. 319.32 s > For more information about this error, try `rustc --explain E0425`.
  590. 319.32 s > Couldn't compile the test.
  591. 319.32 s > ---- crates/gammaloop-api/src/python.rs - python::GammaLoopAPI::get_run_history (line 3711) stdout ----
  592. 319.32 s > error[E0425]: cannot find value `run_card_toml` in this scope
  593. 319.32 s > --> crates/gammaloop-api/src/python.rs:3712:1
  594. 319.32 s > |
  595. 319.32 s > 3712 | run_card_toml = api.get_run_history()
  596. 319.32 s > | ^^^^^^^^^^^^^
  597. 319.32 s > |
  598. 319.32 s > help: you might have meant to introduce a new binding
  599. 319.32 s > |
  600. 319.32 s > 3712 | let run_card_toml = api.get_run_history()
  601. 319.32 s > | +++
  602. 319.32 s >
  603. 319.32 s > error[E0425]: cannot find value `api` in this scope
  604. 319.32 s > --> crates/gammaloop-api/src/python.rs:3712:17
  605. 319.32 s > |
  606. 319.32 s > 3712 | run_card_toml = api.get_run_history()
  607. 319.32 s > | ^^^ not found in this scope
  608. 319.32 s >
  609. 319.32 s > error: aborting due to 2 previous errors
  610. 319.32 s >
  611. 319.32 s > For more information about this error, try `rustc --explain E0425`.
  612. 319.32 s > Couldn't compile the test.
  613. 319.32 s > ---- crates/gammaloop-api/src/python.rs - python::atom_to_canonical_string (line 128) stdout ----
  614. 319.32 s > error[E0425]: cannot find function `atom_to_canonical_string` in this scope
  615. 319.32 s > --> crates/gammaloop-api/src/python.rs:129:1
  616. 319.32 s > |
  617. 319.32 s > 129 | atom_to_canonical_string("x + x")
  618. 319.32 s > | ^^^^^^^^^^^^^^^^^^^^^^^^ not found in this scope
  619. 319.32 s >
  620. 319.32 s > error: aborting due to 1 previous error
  621. 319.32 s >
  622. 319.32 s > For more information about this error, try `rustc --explain E0425`.
  623. 319.32 s > Couldn't compile the test.
  624. 319.32 s > ---- crates/gammaloop-api/src/python.rs - python::GammaLoopAPI::get_global_settings (line 3739) stdout ----
  625. 319.32 s > error[E0425]: cannot find value `settings_toml` in this scope
  626. 319.32 s > --> crates/gammaloop-api/src/python.rs:3740:1
  627. 319.32 s > |
  628. 319.32 s > 3740 | settings_toml = api.get_global_settings()
  629. 319.32 s > | ^^^^^^^^^^^^^
  630. 319.32 s > |
  631. 319.32 s > help: you might have meant to introduce a new binding
  632. 319.32 s > |
  633. 319.32 s > 3740 | let settings_toml = api.get_global_settings()
  634. 319.32 s > | +++
  635. 319.32 s >
  636. 319.32 s > error[E0425]: cannot find value `api` in this scope
  637. 319.32 s > --> crates/gammaloop-api/src/python.rs:3740:17
  638. 319.32 s > |
  639. 319.32 s > 3740 | settings_toml = api.get_global_settings()
  640. 319.32 s > | ^^^ not found in this scope
  641. 319.32 s >
  642. 319.32 s > error: aborting due to 2 previous errors
  643. 319.32 s >
  644. 319.32 s > For more information about this error, try `rustc --explain E0425`.
  645. 319.32 s > Couldn't compile the test.
  646. 319.32 s > ---- crates/gammaloop-api/src/python.rs - python::atom_to_dots (line 157) stdout ----
  647. 319.32 s > error[E0425]: cannot find function `to_dots` in this scope
  648. 319.32 s > --> crates/gammaloop-api/src/python.rs:158:1
  649. 319.32 s > |
  650. 319.32 s > 158 | to_dots("p(mu) * q(mu)")
  651. 319.32 s > | ^^^^^^^ not found in this scope
  652. 319.32 s >
  653. 319.32 s > error: aborting due to 1 previous error
  654. 319.32 s >
  655. 319.32 s > For more information about this error, try `rustc --explain E0425`.
  656. 319.32 s > Couldn't compile the test.
  657. 319.32 s > ---- crates/gammaloop-api/src/python.rs - python::GammaLoopAPI::new_python (line 2834) stdout ----
  658. 319.32 s > error[E0425]: cannot find value `api` in this scope
  659. 319.32 s > --> crates/gammaloop-api/src/python.rs:2835:1
  660. 319.32 s > |
  661. 319.32 s > 2835 | api = GammaLoopAPI(state_folder="./state", read_only_state=True)
  662. 319.32 s > | ^^^
  663. 319.32 s > |
  664. 319.32 s > help: you might have meant to introduce a new binding
  665. 319.32 s > |
  666. 319.32 s > 2835 | let api = GammaLoopAPI(state_folder="./state", read_only_state=True)
  667. 319.32 s > | +++
  668. 319.32 s >
  669. 319.32 s > error[E0425]: cannot find value `state_folder` in this scope
  670. 319.32 s > --> crates/gammaloop-api/src/python.rs:2835:20
  671. 319.32 s > |
  672. 319.32 s > 2835 | api = GammaLoopAPI(state_folder="./state", read_only_state=True)
  673. 319.32 s > | ^^^^^^^^^^^^ not found in this scope
  674. 319.32 s >
  675. 319.32 s > error[E0425]: cannot find value `read_only_state` in this scope
  676. 319.32 s > --> crates/gammaloop-api/src/python.rs:2835:44
  677. 319.32 s > |
  678. 319.32 s > 2835 | api = GammaLoopAPI(state_folder="./state", read_only_state=True)
  679. 319.32 s > | ^^^^^^^^^^^^^^^ not found in this scope
  680. 319.32 s >
  681. 319.32 s > error[E0425]: cannot find value `True` in this scope
  682. 319.32 s > --> crates/gammaloop-api/src/python.rs:2835:60
  683. 319.32 s > |
  684. 319.32 s > 2835 | api = GammaLoopAPI(state_folder="./state", read_only_state=True)
  685. 319.32 s > | ^^^^ not found in this scope
  686. 319.32 s > |
  687. 319.32 s > help: you may want to use a bool value instead
  688. 319.32 s > |
  689. 319.32 s > 2835 - api = GammaLoopAPI(state_folder="./state", read_only_state=True)
  690. 319.32 s > 2835 + api = GammaLoopAPI(state_folder="./state", read_only_state=true)
  691. 319.32 s > |
  692. 319.32 s >
  693. 319.32 s > error[E0425]: cannot find function, tuple struct or tuple variant `GammaLoopAPI` in this scope
  694. 319.32 s > --> crates/gammaloop-api/src/python.rs:2835:7
  695. 319.32 s > |
  696. 319.32 s > 2835 | api = GammaLoopAPI(state_folder="./state", read_only_state=True)
  697. 319.32 s > | ^^^^^^^^^^^^ not found in this scope
  698. 319.32 s >
  699. 319.32 s > error: aborting due to 5 previous errors
  700. 319.32 s >
  701. 319.32 s > For more information about this error, try `rustc --explain E0425`.
  702. 319.32 s > Couldn't compile the test.
  703. 319.32 s > ---- crates/gammaloop-api/src/python.rs - python::evaluate_graph_overall_factor (line 95) stdout ----
  704. 319.32 s > error[E0425]: cannot find function `evaluate_graph_overall_factor` in this scope
  705. 319.32 s > --> crates/gammaloop-api/src/python.rs:96:1
  706. 319.32 s > |
  707. 319.32 s > 96 | evaluate_graph_overall_factor(
  708. 319.32 s > | ^^^^^^^^^^^^^^^^^^^^^^^^^^^^^ not found in this scope
  709. 319.32 s >
  710. 319.32 s > error: aborting due to 1 previous error
  711. 319.32 s >
  712. 319.32 s > For more information about this error, try `rustc --explain E0425`.
  713. 319.32 s > Couldn't compile the test.
  714. 319.32 s >
  715. 319.32 s > failures:
  716. 319.32 s > crates/gammaloop-api/src/python.rs - python::GammaLoopAPI::evaluate_sample (line 2967)
  717. 319.32 s > crates/gammaloop-api/src/python.rs - python::GammaLoopAPI::evaluate_samples (line 3108)
  718. 319.32 s > crates/gammaloop-api/src/python.rs - python::GammaLoopAPI::get_active_command_blocks (line 3760)
  719. 319.32 s > crates/gammaloop-api/src/python.rs - python::GammaLoopAPI::get_default_runtime_settings (line 3796)
  720. 319.32 s > crates/gammaloop-api/src/python.rs - python::GammaLoopAPI::get_global_settings (line 3739)
  721. 319.32 s > crates/gammaloop-api/src/python.rs - python::GammaLoopAPI::get_integrand_info (line 3585)
  722. 319.32 s > crates/gammaloop-api/src/python.rs - python::GammaLoopAPI::get_integrand_settings (line 3647)
  723. 319.32 s > crates/gammaloop-api/src/python.rs - python::GammaLoopAPI::get_run_history (line 3711)
  724. 319.32 s > crates/gammaloop-api/src/python.rs - python::GammaLoopAPI::new_python (line 2834)
  725. 319.32 s > crates/gammaloop-api/src/python.rs - python::GammaLoopAPI::run_command (line 3901)
  726. 319.32 s > crates/gammaloop-api/src/python.rs - python::PyHistogramAccumulator (line 871)
  727. 319.32 s > crates/gammaloop-api/src/python.rs - python::atom_to_canonical_string (line 128)
  728. 319.32 s > crates/gammaloop-api/src/python.rs - python::atom_to_dots (line 157)
  729. 319.32 s > crates/gammaloop-api/src/python.rs - python::evaluate_graph_overall_factor (line 95)
  730. 319.32 s >
  731. 319.32 s > test result: FAILED. 2 passed; 14 failed; 0 ignored; 0 measured; 0 filtered out; finished in 2.49s
  732. 319.32 s >
  733. 319.32 s > error: doctest failed, to rerun pass `-p gammaloop-api --doc`
  734. 319.32 s For full logs, run:
  735. 319.32 s nix log /nix/store/l4jl276bp0050h66nydaswl0yrkqlgr4-gammaloop-workspace-doctest-0.1.0.drv
  736. 319.32 s [0 built (1 failed)]Run failed.