test packages.x86_64-linux.nix-ci-check-gammaloop-doctest
0.90 s
$ /nix/store/9ypz3flqsrl5xl495mm8h645gadjsxi1-coreutils-9.11/bin/timeout --kill-after=15s 7200s /nix/store/23zk8sgzamrbmj1fday15szf7f2279s8-nix-2.34.7/bin/nix --extra-experimental-features nix-command --extra-experimental-features flakes flake clone git+https://github.com/alphal00p/gammaloop --dest /tmp/nix-ci-worker/stable-pwd/repo/
0.95 s
Cloning into '/tmp/nix-ci-worker/stable-pwd/repo'...
0.95 s
remote: Enumerating objects: 63012, done.
0.95 s
remote: Counting objects: 0% (1/8378)
remote: Counting objects: 1% (84/8378)
remote: Counting objects: 2% (168/8378)
remote: Counting objects: 3% (252/8378)
remote: Counting objects: 4% (336/8378)
remote: Counting objects: 5% (419/8378)
remote: Counting objects: 6% (503/8378)
remote: Counting objects: 7% (587/8378)
remote: Counting objects: 8% (671/8378)
remote: Counting objects: 9% (755/8378)
remote: Counting objects: 10% (838/8378)
remote: Counting objects: 11% (922/8378)
remote: Counting objects: 12% (1006/8378)
remote: Counting objects: 13% (1090/8378)
remote: Counting objects: 14% (1173/8378)
remote: Counting objects: 15% (1257/8378)
remote: Counting objects: 16% (1341/8378)
remote: Counting objects: 17% (1425/8378)
remote: Counting objects: 18% (1509/8378)
remote: Counting objects: 19% (1592/8378)
remote: Counting objects: 20% (1676/8378)
remote: Counting objects: 21% (1760/8378)
remote: Counting objects: 22% (1844/8378)
remote: Counting objects: 23% (1927/8378)
remote: Counting objects: 24% (2011/8378)
remote: Counting objects: 25% (2095/8378)
remote: Counting objects: 26% (2179/8378)
remote: Counting objects: 27% (2263/8378)
remote: Counting objects: 28% (2346/8378)
remote: Counting objects: 29% (2430/8378)
remote: Counting objects: 30% (2514/8378)
remote: Counting objects: 31% (2598/8378)
remote: Counting objects: 32% (2681/8378)
remote: Counting objects: 33% (2765/8378)
remote: Counting objects: 34% (2849/8378)
remote: Counting objects: 35% (2933/8378)
remote: Counting objects: 36% (3017/8378)
remote: Counting objects: 37% (3100/8378)
remote: Counting objects: 38% (3184/8378)
remote: Counting objects: 39% (3268/8378)
remote: Counting objects: 40% (3352/8378)
remote: Counting objects: 41% (3435/8378)
remote: Counting objects: 42% (3519/8378)
remote: Counting objects: 43% (3603/8378)
remote: Counting objects: 44% (3687/8378)
remote: Counting objects: 45% (3771/8378)
remote: Counting objects: 46% (3854/8378)
remote: Counting objects: 47% (3938/8378)
remote: Counting objects: 48% (4022/8378)
remote: Counting objects: 49% (4106/8378)
remote: Counting objects: 50% (4189/8378)
remote: Counting objects: 51% (4273/8378)
remote: Counting objects: 52% (4357/8378)
remote: Counting objects: 53% (4441/8378)
remote: Counting objects: 54% (4525/8378)
remote: Counting objects: 55% (4608/8378)
remote: Counting objects: 56% (4692/8378)
remote: Counting objects: 57% (4776/8378)
remote: Counting objects: 58% (4860/8378)
remote: Counting objects: 59% (4944/8378)
remote: Counting objects: 60% (5027/8378)
remote: Counting objects: 61% (5111/8378)
remote: Counting objects: 62% (5195/8378)
remote: Counting objects: 63% (5279/8378)
remote: Counting objects: 64% (5362/8378)
remote: Counting objects: 65% (5446/8378)
remote: Counting objects: 66% (5530/8378)
remote: Counting objects: 67% (5614/8378)
remote: Counting objects: 68% (5698/8378)
remote: Counting objects: 69% (5781/8378)
remote: Counting objects: 70% (5865/8378)
remote: Counting objects: 71% (5949/8378)
remote: Counting objects: 72% (6033/8378)
remote: Counting objects: 73% (6116/8378)
remote: Counting objects: 74% (6200/8378)
remote: Counting objects: 75% (6284/8378)
remote: Counting objects: 76% (6368/8378)
remote: Counting objects: 77% (6452/8378)
remote: Counting objects: 78% (6535/8378)
remote: Counting objects: 79% (6619/8378)
remote: Counting objects: 80% (6703/8378)
remote: Counting objects: 81% (6787/8378)
remote: Counting objects: 82% (6870/8378)
remote: Counting objects: 83% (6954/8378)
remote: Counting objects: 84% (7038/8378)
remote: Counting objects: 85% (7122/8378)
remote: Counting objects: 86% (7206/8378)
remote: Counting objects: 87% (7289/8378)
remote: Counting objects: 88% (7373/8378)
remote: Counting objects: 89% (7457/8378)
remote: Counting objects: 90% (7541/8378)
remote: Counting objects: 91% (7624/8378)
remote: Counting objects: 92% (7708/8378)
remote: Counting objects: 93% (7792/8378)
remote: Counting objects: 94% (7876/8378)
remote: Counting objects: 95% (7960/8378)
remote: Counting objects: 96% (8043/8378)
remote: Counting objects: 97% (8127/8378)
remote: Counting objects: 98% (8211/8378)
remote: Counting objects: 99% (8295/8378)
remote: Counting objects: 100% (8378/8378)
remote: Counting objects: 100% (8378/8378), done.
2.75 s
remote: Compressing objects: 0% (1/1901)
remote: Compressing objects: 1% (20/1901)
remote: Compressing objects: 2% (39/1901)
remote: Compressing objects: 3% (58/1901)
remote: Compressing objects: 4% (77/1901)
remote: Compressing objects: 5% (96/1901)
remote: Compressing objects: 6% (115/1901)
remote: Compressing objects: 7% (134/1901)
remote: Compressing objects: 8% (153/1901)
remote: Compressing objects: 9% (172/1901)
remote: Compressing objects: 10% (191/1901)
remote: Compressing objects: 11% (210/1901)
remote: Compressing objects: 12% (229/1901)
remote: Compressing objects: 13% (248/1901)
remote: Compressing objects: 14% (267/1901)
remote: Compressing objects: 15% (286/1901)
remote: Compressing objects: 16% (305/1901)
remote: Compressing objects: 17% (324/1901)
remote: Compressing objects: 18% (343/1901)
remote: Compressing objects: 19% (362/1901)
remote: Compressing objects: 20% (381/1901)
remote: Compressing objects: 21% (400/1901)
remote: Compressing objects: 21% (412/1901)
remote: Compressing objects: 22% (419/1901)
remote: Compressing objects: 23% (438/1901)
remote: Compressing objects: 24% (457/1901)
remote: Compressing objects: 25% (476/1901)
remote: Compressing objects: 26% (495/1901)
remote: Compressing objects: 27% (514/1901)
remote: Compressing objects: 28% (533/1901)
remote: Compressing objects: 29% (552/1901)
remote: Compressing objects: 30% (571/1901)
remote: Compressing objects: 31% (590/1901)
remote: Compressing objects: 32% (609/1901)
remote: Compressing objects: 33% (628/1901)
remote: Compressing objects: 34% (647/1901)
remote: Compressing objects: 35% (666/1901)
remote: Compressing objects: 36% (685/1901)
remote: Compressing objects: 37% (704/1901)
remote: Compressing objects: 38% (723/1901)
remote: Compressing objects: 39% (742/1901)
remote: Compressing objects: 40% (761/1901)
remote: Compressing objects: 41% (780/1901)
remote: Compressing objects: 42% (799/1901)
remote: Compressing objects: 43% (818/1901)
remote: Compressing objects: 44% (837/1901)
remote: Compressing objects: 45% (856/1901)
remote: Compressing objects: 46% (875/1901)
remote: Compressing objects: 47% (894/1901)
remote: Compressing objects: 48% (913/1901)
remote: Compressing objects: 49% (932/1901)
remote: Compressing objects: 50% (951/1901)
remote: Compressing objects: 51% (970/1901)
remote: Compressing objects: 52% (989/1901)
remote: Compressing objects: 53% (1008/1901)
remote: Compressing objects: 54% (1027/1901)
remote: Compressing objects: 55% (1046/1901)
remote: Compressing objects: 56% (1065/1901)
remote: Compressing objects: 57% (1084/1901)
remote: Compressing objects: 58% (1103/1901)
remote: Compressing objects: 59% (1122/1901)
remote: Compressing objects: 60% (1141/1901)
remote: Compressing objects: 61% (1160/1901)
remote: Compressing objects: 62% (1179/1901)
remote: Compressing objects: 63% (1198/1901)
remote: Compressing objects: 64% (1217/1901)
remote: Compressing objects: 65% (1236/1901)
remote: Compressing objects: 66% (1255/1901)
remote: Compressing objects: 67% (1274/1901)
remote: Compressing objects: 68% (1293/1901)
remote: Compressing objects: 69% (1312/1901)
remote: Compressing objects: 70% (1331/1901)
remote: Compressing objects: 71% (1350/1901)
remote: Compressing objects: 72% (1369/1901)
remote: Compressing objects: 73% (1388/1901)
remote: Compressing objects: 74% (1407/1901)
remote: Compressing objects: 75% (1426/1901)
remote: Compressing objects: 76% (1445/1901)
remote: Compressing objects: 77% (1464/1901)
remote: Compressing objects: 78% (1483/1901)
remote: Compressing objects: 79% (1502/1901)
remote: Compressing objects: 80% (1521/1901)
remote: Compressing objects: 81% (1540/1901)
remote: Compressing objects: 82% (1559/1901)
remote: Compressing objects: 83% (1578/1901)
remote: Compressing objects: 84% (1597/1901)
remote: Compressing objects: 85% (1616/1901)
remote: Compressing objects: 86% (1635/1901)
remote: Compressing objects: 87% (1654/1901)
remote: Compressing objects: 88% (1673/1901)
remote: Compressing objects: 89% (1692/1901)
remote: Compressing objects: 90% (1711/1901)
remote: Compressing objects: 91% (1730/1901)
remote: Compressing objects: 92% (1749/1901)
remote: Compressing objects: 93% (1768/1901)
remote: Compressing objects: 94% (1787/1901)
remote: Compressing objects: 95% (1806/1901)
remote: Compressing objects: 96% (1825/1901)
remote: Compressing objects: 97% (1844/1901)
remote: Compressing objects: 98% (1863/1901)
remote: Compressing objects: 99% (1882/1901)
remote: Compressing objects: 100% (1901/1901)
remote: Compressing objects: 100% (1901/1901), done.
6.49 s
Receiving objects: 0% (1/63012)
Receiving objects: 1% (631/63012)
Receiving objects: 2% (1261/63012)
Receiving objects: 3% (1891/63012)
Receiving objects: 4% (2521/63012)
Receiving objects: 5% (3151/63012)
Receiving objects: 6% (3781/63012)
Receiving objects: 7% (4411/63012)
Receiving objects: 8% (5041/63012)
Receiving objects: 9% (5672/63012)
Receiving objects: 10% (6302/63012), 10.39 MiB | 20.60 MiB/s
Receiving objects: 11% (6932/63012), 10.39 MiB | 20.60 MiB/s
Receiving objects: 12% (7562/63012), 10.39 MiB | 20.60 MiB/s
Receiving objects: 13% (8192/63012), 10.39 MiB | 20.60 MiB/s
Receiving objects: 14% (8822/63012), 10.39 MiB | 20.60 MiB/s
Receiving objects: 15% (9452/63012), 10.39 MiB | 20.60 MiB/s
Receiving objects: 16% (10082/63012), 10.39 MiB | 20.60 MiB/s
Receiving objects: 17% (10713/63012), 10.39 MiB | 20.60 MiB/s
Receiving objects: 18% (11343/63012), 10.39 MiB | 20.60 MiB/s
Receiving objects: 19% (11973/63012), 10.39 MiB | 20.60 MiB/s
Receiving objects: 20% (12603/63012), 10.39 MiB | 20.60 MiB/s
Receiving objects: 21% (13233/63012), 10.39 MiB | 20.60 MiB/s
Receiving objects: 22% (13863/63012), 10.39 MiB | 20.60 MiB/s
Receiving objects: 23% (14493/63012), 10.39 MiB | 20.60 MiB/s
Receiving objects: 24% (15123/63012), 10.39 MiB | 20.60 MiB/s
Receiving objects: 25% (15753/63012), 10.39 MiB | 20.60 MiB/s
Receiving objects: 26% (16384/63012), 10.39 MiB | 20.60 MiB/s
Receiving objects: 27% (17014/63012), 10.39 MiB | 20.60 MiB/s
Receiving objects: 28% (17644/63012), 10.39 MiB | 20.60 MiB/s
Receiving objects: 29% (18274/63012), 10.39 MiB | 20.60 MiB/s
Receiving objects: 30% (18904/63012), 10.39 MiB | 20.60 MiB/s
Receiving objects: 31% (19534/63012), 10.39 MiB | 20.60 MiB/s
Receiving objects: 31% (19538/63012), 18.40 MiB | 18.29 MiB/s
Receiving objects: 32% (20164/63012), 18.40 MiB | 18.29 MiB/s
Receiving objects: 33% (20794/63012), 18.40 MiB | 18.29 MiB/s
Receiving objects: 34% (21425/63012), 18.40 MiB | 18.29 MiB/s
Receiving objects: 35% (22055/63012), 18.40 MiB | 18.29 MiB/s
Receiving objects: 36% (22685/63012), 18.40 MiB | 18.29 MiB/s
Receiving objects: 37% (23315/63012), 18.40 MiB | 18.29 MiB/s
Receiving objects: 38% (23945/63012), 18.40 MiB | 18.29 MiB/s
Receiving objects: 39% (24575/63012), 18.40 MiB | 18.29 MiB/s
Receiving objects: 40% (25205/63012), 18.40 MiB | 18.29 MiB/s
Receiving objects: 41% (25835/63012), 18.40 MiB | 18.29 MiB/s
Receiving objects: 42% (26466/63012), 18.40 MiB | 18.29 MiB/s
Receiving objects: 43% (27096/63012), 18.40 MiB | 18.29 MiB/s
Receiving objects: 44% (27726/63012), 18.40 MiB | 18.29 MiB/s
Receiving objects: 45% (28356/63012), 18.40 MiB | 18.29 MiB/s
Receiving objects: 46% (28986/63012), 18.40 MiB | 18.29 MiB/s
Receiving objects: 47% (29616/63012), 18.40 MiB | 18.29 MiB/s
Receiving objects: 48% (30246/63012), 18.40 MiB | 18.29 MiB/s
Receiving objects: 49% (30876/63012), 18.40 MiB | 18.29 MiB/s
Receiving objects: 50% (31506/63012), 18.40 MiB | 18.29 MiB/s
Receiving objects: 51% (32137/63012), 18.40 MiB | 18.29 MiB/s
Receiving objects: 52% (32767/63012), 28.46 MiB | 18.90 MiB/s
Receiving objects: 53% (33397/63012), 28.46 MiB | 18.90 MiB/s
Receiving objects: 54% (34027/63012), 28.46 MiB | 18.90 MiB/s
Receiving objects: 55% (34657/63012), 28.46 MiB | 18.90 MiB/s
Receiving objects: 56% (35287/63012), 28.46 MiB | 18.90 MiB/s
Receiving objects: 57% (35917/63012), 28.46 MiB | 18.90 MiB/s
Receiving objects: 58% (36547/63012), 28.46 MiB | 18.90 MiB/s
Receiving objects: 58% (36700/63012), 28.46 MiB | 18.90 MiB/s
Receiving objects: 59% (37178/63012), 40.95 MiB | 20.41 MiB/s
Receiving objects: 60% (37808/63012), 40.95 MiB | 20.41 MiB/s
Receiving objects: 61% (38438/63012), 40.95 MiB | 20.41 MiB/s
Receiving objects: 62% (39068/63012), 40.95 MiB | 20.41 MiB/s
Receiving objects: 63% (39698/63012), 40.95 MiB | 20.41 MiB/s
Receiving objects: 64% (40328/63012), 40.95 MiB | 20.41 MiB/s
Receiving objects: 65% (40958/63012), 40.95 MiB | 20.41 MiB/s
Receiving objects: 66% (41588/63012), 40.95 MiB | 20.41 MiB/s
Receiving objects: 67% (42219/63012), 40.95 MiB | 20.41 MiB/s
Receiving objects: 68% (42849/63012), 40.95 MiB | 20.41 MiB/s
Receiving objects: 69% (43479/63012), 40.95 MiB | 20.41 MiB/s
Receiving objects: 70% (44109/63012), 40.95 MiB | 20.41 MiB/s
Receiving objects: 71% (44739/63012), 40.95 MiB | 20.41 MiB/s
Receiving objects: 72% (45369/63012), 40.95 MiB | 20.41 MiB/s
Receiving objects: 73% (45999/63012), 55.01 MiB | 21.94 MiB/s
Receiving objects: 74% (46629/63012), 55.01 MiB | 21.94 MiB/s
Receiving objects: 75% (47259/63012), 55.01 MiB | 21.94 MiB/s
Receiving objects: 76% (47890/63012), 55.01 MiB | 21.94 MiB/s
Receiving objects: 77% (48520/63012), 55.01 MiB | 21.94 MiB/s
Receiving objects: 78% (49150/63012), 55.01 MiB | 21.94 MiB/s
Receiving objects: 78% (49483/63012), 70.98 MiB | 23.61 MiB/s
Receiving objects: 79% (49780/63012), 70.98 MiB | 23.61 MiB/s
Receiving objects: 80% (50410/63012), 70.98 MiB | 23.61 MiB/s
Receiving objects: 81% (51040/63012), 70.98 MiB | 23.61 MiB/s
Receiving objects: 82% (51670/63012), 70.98 MiB | 23.61 MiB/s
Receiving objects: 83% (52300/63012), 70.98 MiB | 23.61 MiB/s
Receiving objects: 84% (52931/63012), 70.98 MiB | 23.61 MiB/s
Receiving objects: 85% (53561/63012), 70.98 MiB | 23.61 MiB/s
Receiving objects: 86% (54191/63012), 70.98 MiB | 23.61 MiB/s
Receiving objects: 87% (54821/63012), 70.98 MiB | 23.61 MiB/s
Receiving objects: 88% (55451/63012), 70.98 MiB | 23.61 MiB/s
Receiving objects: 89% (56081/63012), 70.98 MiB | 23.61 MiB/s
Receiving objects: 90% (56711/63012), 70.98 MiB | 23.61 MiB/s
Receiving objects: 91% (57341/63012), 70.98 MiB | 23.61 MiB/s
Receiving objects: 92% (57972/63012), 70.98 MiB | 23.61 MiB/s
Receiving objects: 93% (58602/63012), 88.77 MiB | 25.32 MiB/s
Receiving objects: 94% (59232/63012), 88.77 MiB | 25.32 MiB/s
Receiving objects: 95% (59862/63012), 88.77 MiB | 25.32 MiB/s
Receiving objects: 96% (60492/63012), 88.77 MiB | 25.32 MiB/s
Receiving objects: 97% (61122/63012), 88.77 MiB | 25.32 MiB/s
Receiving objects: 98% (61752/63012), 88.77 MiB | 25.32 MiB/s
Receiving objects: 99% (62382/63012), 88.77 MiB | 25.32 MiB/s
remote: Total 63012 (delta 6797), reused 6802 (delta 6207), pack-reused 54634 (from 3)
6.59 s
Receiving objects: 100% (63012/63012), 88.77 MiB | 25.32 MiB/s
Receiving objects: 100% (63012/63012), 96.18 MiB | 25.94 MiB/s, done.
7.14 s
Resolving deltas: 0% (0/43716)
Resolving deltas: 1% (438/43716)
Resolving deltas: 2% (876/43716)
Resolving deltas: 3% (1312/43716)
Resolving deltas: 4% (1749/43716)
Resolving deltas: 5% (2186/43716)
Resolving deltas: 6% (2624/43716)
Resolving deltas: 7% (3061/43716)
Resolving deltas: 8% (3499/43716)
Resolving deltas: 9% (3936/43716)
Resolving deltas: 10% (4372/43716)
Resolving deltas: 11% (4809/43716)
Resolving deltas: 12% (5246/43716)
Resolving deltas: 13% (5684/43716)
Resolving deltas: 14% (6122/43716)
Resolving deltas: 15% (6559/43716)
Resolving deltas: 16% (6995/43716)
Resolving deltas: 17% (7433/43716)
Resolving deltas: 18% (7869/43716)
Resolving deltas: 19% (8307/43716)
Resolving deltas: 20% (8744/43716)
Resolving deltas: 21% (9181/43716)
Resolving deltas: 22% (9618/43716)
Resolving deltas: 23% (10055/43716)
Resolving deltas: 24% (10492/43716)
Resolving deltas: 25% (10930/43716)
Resolving deltas: 26% (11368/43716)
Resolving deltas: 27% (11806/43716)
Resolving deltas: 28% (12242/43716)
Resolving deltas: 29% (12678/43716)
Resolving deltas: 30% (13116/43716)
Resolving deltas: 31% (13552/43716)
Resolving deltas: 32% (13990/43716)
Resolving deltas: 33% (14427/43716)
Resolving deltas: 34% (14865/43716)
Resolving deltas: 35% (15303/43716)
Resolving deltas: 36% (15739/43716)
Resolving deltas: 37% (16175/43716)
Resolving deltas: 38% (16613/43716)
Resolving deltas: 39% (17050/43716)
Resolving deltas: 40% (17487/43716)
Resolving deltas: 41% (17924/43716)
Resolving deltas: 42% (18361/43716)
Resolving deltas: 43% (18798/43716)
Resolving deltas: 44% (19236/43716)
Resolving deltas: 45% (19673/43716)
Resolving deltas: 46% (20111/43716)
Resolving deltas: 47% (20547/43716)
Resolving deltas: 48% (20984/43716)
Resolving deltas: 49% (21421/43716)
Resolving deltas: 50% (21858/43716)
Resolving deltas: 51% (22296/43716)
Resolving deltas: 52% (22733/43716)
Resolving deltas: 53% (23170/43716)
Resolving deltas: 54% (23607/43716)
Resolving deltas: 55% (24044/43716)
Resolving deltas: 56% (24482/43716)
Resolving deltas: 57% (24919/43716)
Resolving deltas: 58% (25358/43716)
Resolving deltas: 59% (25793/43716)
Resolving deltas: 60% (26230/43716)
Resolving deltas: 61% (26667/43716)
Resolving deltas: 62% (27105/43716)
Resolving deltas: 63% (27542/43716)
Resolving deltas: 64% (27979/43716)
Resolving deltas: 65% (28416/43716)
Resolving deltas: 66% (28853/43716)
Resolving deltas: 67% (29290/43716)
Resolving deltas: 68% (29727/43716)
Resolving deltas: 69% (30165/43716)
Resolving deltas: 70% (30602/43716)
Resolving deltas: 71% (31039/43716)
Resolving deltas: 72% (31476/43716)
Resolving deltas: 73% (31913/43716)
Resolving deltas: 74% (32350/43716)
Resolving deltas: 75% (32788/43716)
Resolving deltas: 76% (33225/43716)
Resolving deltas: 77% (33663/43716)
Resolving deltas: 78% (34099/43716)
Resolving deltas: 79% (34536/43716)
Resolving deltas: 80% (34973/43716)
Resolving deltas: 81% (35411/43716)
Resolving deltas: 82% (35849/43716)
Resolving deltas: 83% (36285/43716)
Resolving deltas: 84% (36722/43716)
Resolving deltas: 85% (37159/43716)
Resolving deltas: 86% (37596/43716)
Resolving deltas: 87% (38033/43716)
Resolving deltas: 88% (38471/43716)
Resolving deltas: 89% (38908/43716)
Resolving deltas: 90% (39345/43716)
Resolving deltas: 91% (39782/43716)
Resolving deltas: 92% (40219/43716)
Resolving deltas: 93% (40656/43716)
Resolving deltas: 94% (41095/43716)
Resolving deltas: 95% (41531/43716)
Resolving deltas: 96% (41968/43716)
Resolving deltas: 97% (42405/43716)
Resolving deltas: 98% (42842/43716)
Resolving deltas: 99% (43280/43716)
Resolving deltas: 100% (43716/43716)
Resolving deltas: 100% (43716/43716), done.
7.40 s
Fetching commit ed5aa62ad38895524e198db9bbf1214fcd1c94ab for docs ...
7.40 s
$ /nix/store/bcnisk3ydfgv26v2gw3zlky24g00yww2-git-2.54.0/bin/git fetch origin ed5aa62ad38895524e198db9bbf1214fcd1c94ab
7.92 s
From https://github.com/alphal00p/gammaloop
7.92 s
* branch ed5aa62ad38895524e198db9bbf1214fcd1c94ab -> FETCH_HEAD
7.93 s
$ /nix/store/9ypz3flqsrl5xl495mm8h645gadjsxi1-coreutils-9.11/bin/timeout --kill-after=15s 7200s /nix/store/bcnisk3ydfgv26v2gw3zlky24g00yww2-git-2.54.0/bin/git -c advice.detachedHead=false checkout ed5aa62ad38895524e198db9bbf1214fcd1c94ab
8.12 s
HEAD is now at ed5aa62a include About graph fixture in Nix docs source
8.12 s
$ /nix/store/9ypz3flqsrl5xl495mm8h645gadjsxi1-coreutils-9.11/bin/timeout --kill-after=15s 7200s /nix/store/23zk8sgzamrbmj1fday15szf7f2279s8-nix-2.34.7/bin/nix --extra-experimental-features nix-command --extra-experimental-features flakes --log-format internal-json run .#packages.x86_64-linux.nix-ci-check-gammaloop-doctest --print-build-logs
10.13 s
12.07 s
evaluating derivation 'g
copying '/nix/store/509j
[0 /1 built]
[1 /0 /1 built] building g gammaloop-workspace-doctest> Running phase: unpackPhase
12.12 s
gammaloop-workspace-doctest> unpacking source archive /nix/store/zw60sp2yw0jzbn0l3i8p6pynq3h4pivs-source
12.20 s
gammaloop-workspace-doctest> source root is source
12.22 s
gammaloop-workspace-doctest> Running phase: patchPhase
12.23 s
gammaloop-workspace-doctest> Executing configureCargoCommonVars
12.23 s
gammaloop-workspace-doctest> decompressing cargo artifacts from /nix/store/8rkh7d3hq722l839568nhnwihnsx041a-gammaloop-workspace-deps-deps-0.1.0/target.tar.zst to target
13.46 s
gammaloop-workspace-doctest> Running phase: updateAutotoolsGnuConfigScriptsPhase
13.49 s
gammaloop-workspace-doctest> Running phase: configurePhase
13.49 s
gammaloop-workspace-doctest> will append /build/source/.cargo-home/config.toml with contents of /nix/store/xdy1vvhll2bijdplvl9fcc2b9plkxhaa-vendor-cargo-deps/config.toml
13.50 s
gammaloop-workspace-doctest> default configurePhase, nothing to do
13.50 s
gammaloop-workspace-doctest> Running phase: buildPhase
13.50 s
gammaloop-workspace-doctest> +++ command cargo --version
13.50 s
gammaloop-workspace-doctest> cargo 1.97.0 (c980f4866 2026-06-30)
13.53 s
gammaloop-workspace-doctest> +++ command cargo test --profile ci-optim --doc --locked --workspace --features gammaloop-api/cli,gammaloop-tracing-filter/clap,gammaloop-tracing-filter/symbolica,idenso/bincode,idenso/reference-cases,linnet/bincode,linnet/drawing,linnet/nodestore-vec,linnet/rkyv,linnet/serde,linnet/symbolica,spenso-macros/shadowing,spenso/shadowing,symbolica/tracing_max_level_info
13.92 s
gammaloop-workspace-doctest> Compiling target-lexicon v0.13.5
13.93 s
gammaloop-workspace-doctest> Compiling symbolica v2.2.0 (https://github.com/symbolica-dev/symbolica?branch=dev#0441bd7a)
13.93 s
gammaloop-workspace-doctest> Compiling maplit v1.0.2
13.94 s
gammaloop-workspace-doctest> Compiling gammaloop-tracing-filter-macros v0.1.0 (/build/source/crates/gammaloop-tracing-filter-macros)
13.94 s
gammaloop-workspace-doctest> Compiling vakint v0.1.2 (/build/source/crates/vakint)
13.95 s
gammaloop-workspace-doctest> Compiling gammalooprs v0.3.4 (/build/source/crates/gammalooprs)
13.96 s
gammaloop-workspace-doctest> Compiling alphal00p-docs-macros v0.1.0 (/build/source/crates/alphal00p-docs-macros)
13.96 s
gammaloop-workspace-doctest> Compiling alphal00p-docs-schema v0.1.0 (/build/source/crates/alphal00p-docs-schema)
13.96 s
gammaloop-workspace-doctest> Compiling rustc_version v0.4.1
13.96 s
gammaloop-workspace-doctest> Compiling bincode v1.3.3
13.97 s
gammaloop-workspace-doctest> Compiling gungraun-runner v0.18.2
13.97 s
gammaloop-workspace-doctest> Compiling iai-callgrind-runner v0.14.2
13.97 s
gammaloop-workspace-doctest> Compiling target-triple v1.0.1
13.98 s
gammaloop-workspace-doctest> Compiling gammaloop-integration-tests v0.1.0 (/build/source/tests)
13.98 s
gammaloop-workspace-doctest> Compiling test-log-core v0.2.20
14.14 s
gammaloop-workspace-doctest> Compiling wait-timeout v0.2.1
14.17 s
gammaloop-workspace-doctest> Compiling bit-vec v0.8.0
14.20 s
gammaloop-workspace-doctest> Compiling quick-error v1.2.3
14.21 s
gammaloop-workspace-doctest> Compiling iai-callgrind v0.14.2
14.25 s
gammaloop-workspace-doctest> Compiling rusty-fork v0.3.1
14.36 s
gammaloop-workspace-doctest> Compiling bit-set v0.8.0
14.40 s
gammaloop-workspace-doctest> Compiling iai-callgrind-macros v0.5.1
14.40 s
gammaloop-workspace-doctest> Compiling rand_xorshift v0.4.0
14.41 s
gammaloop-workspace-doctest> Compiling console v0.15.11
14.47 s
gammaloop-workspace-doctest> Compiling base64 v0.21.7
14.49 s
gammaloop-workspace-doctest> Compiling glob v0.3.4
14.53 s
gammaloop-workspace-doctest> Compiling gungraun-macros v0.8.0
14.53 s
gammaloop-workspace-doctest> Compiling unarray v0.1.4
14.60 s
gammaloop-workspace-doctest> Compiling termcolor v1.4.1
14.60 s
gammaloop-workspace-doctest> Compiling proptest v1.11.0
14.85 s
gammaloop-workspace-doctest> Compiling trybuild v1.0.120
14.90 s
gammaloop-workspace-doctest> Compiling similar-asserts v1.7.0
15.05 s
gammaloop-workspace-doctest> Compiling ron v0.8.1
15.06 s
gammaloop-workspace-doctest> Compiling alphal00p-docs-catalogs v0.1.0 (/build/source/crates/alphal00p-docs-catalogs)
15.30 s
gammaloop-workspace-doctest> Compiling alphal00p-docs-builder v0.1.0 (/build/source/crates/alphal00p-docs-builder)
15.31 s
gammaloop-workspace-doctest> Compiling kurvst v0.1.0 (/build/source/crates/kurvst)
15.46 s
gammaloop-workspace-doctest> Compiling pyo3-build-config v0.28.3
15.53 s
gammaloop-workspace-doctest> Compiling test-log-macros v0.2.20
17.42 s
gammaloop-workspace-doctest> Compiling test-log v0.2.20
17.48 s
gammaloop-workspace-doctest> Compiling alphal00p-docs-examples v0.1.0 (/build/source/crates/alphal00p-docs-examples)
19.54 s
gammaloop-workspace-doctest> Compiling gungraun v0.18.2
19.60 s
gammaloop-workspace-doctest> Compiling pyo3-ffi v0.28.3
19.95 s
gammaloop-workspace-doctest> Compiling pyo3-macros-backend v0.28.3
20.08 s
gammaloop-workspace-doctest> Compiling pyo3 v0.28.3
20.15 s
gammaloop-workspace-doctest> Compiling numpy v0.28.0
20.24 s
gammaloop-workspace-doctest> Compiling gammaloop-api v0.1.0 (/build/source/crates/gammaloop-api)
24.48 s
gammaloop-workspace-doctest> Compiling pyo3-macros v0.28.3
28.87 s
gammaloop-workspace-doctest> Compiling pyo3-stub-gen v0.17.2
29.52 s
gammaloop-workspace-doctest> Compiling numerica v2.2.0 (https://github.com/symbolica-dev/symbolica?branch=dev#0441bd7a)
31.48 s
gammaloop-workspace-doctest> Compiling graphica v2.1.0 (https://github.com/symbolica-dev/symbolica?branch=dev#0441bd7a)
33.48 s
gammaloop-workspace-doctest> Compiling symbolica-utils v0.1.0 (/build/source/crates/symbolica-utils)
167.71 s
gammaloop-workspace-doctest> Compiling gammaloop-workspace-hack v0.1.0 (/build/source/crates/gammaloop-workspace-hack)
167.76 s
gammaloop-workspace-doctest> Compiling spenso-macros v0.3.2 (/build/source/crates/spenso-macros)
167.85 s
gammaloop-workspace-doctest> Compiling linnet v0.17.0 (/build/source/crates/linnet)
170.64 s
gammaloop-workspace-doctest> Compiling spenso v0.6.0 (/build/source/crates/spenso)
177.07 s
gammaloop-workspace-doctest> Compiling idenso v0.3.0 (/build/source/crates/idenso)
177.13 s
gammaloop-workspace-doctest> Compiling gammaloop-tracing-filter v0.1.0 (/build/source/crates/gammaloop-tracing-filter)
180.30 s
gammaloop-workspace-doctest> Compiling spenso-hep-lib v0.1.7 (/build/source/crates/spenso-hep-lib)
180.50 s
gammaloop-workspace-doctest> Compiling spynso3 v0.1.2 (/build/source/crates/spynso3)
215.92 s
gammaloop-workspace-doctest> Compiling linnest v0.1.0 (/build/source/crates/linnest)
215.98 s
gammaloop-workspace-doctest> Compiling linnet-py v0.1.0 (/build/source/crates/linnet-py)
313.90 s
gammaloop-workspace-doctest> Finished `ci-optim` profile [optimized] target(s) in 5m 00s
313.98 s
gammaloop-workspace-doctest> warning : the following packages contain code that will be rejected by a future version of Rust: proc-macro-error2 v2.0.1
313.98 s
gammaloop-workspace-doctest> note : to see what the problems were, use the option `--future-incompat-report`, or run `cargo report future-incompatibilities --id 1`
314.01 s
gammaloop-workspace-doctest> Doc-tests alphal00p_docs_builder
314.14 s
gammaloop-workspace-doctest>
314.14 s
gammaloop-workspace-doctest> running 0 tests
314.14 s
gammaloop-workspace-doctest>
314.14 s
gammaloop-workspace-doctest> test result: ok. 0 passed; 0 failed; 0 ignored; 0 measured; 0 filtered out; finished in 0.00s
314.14 s
gammaloop-workspace-doctest>
314.14 s
gammaloop-workspace-doctest> Doc-tests alphal00p_docs_catalogs
315.23 s
gammaloop-workspace-doctest>
315.23 s
gammaloop-workspace-doctest> running 0 tests
315.23 s
gammaloop-workspace-doctest>
315.23 s
gammaloop-workspace-doctest> test result: ok. 0 passed; 0 failed; 0 ignored; 0 measured; 0 filtered out; finished in 0.00s
315.23 s
gammaloop-workspace-doctest>
315.23 s
gammaloop-workspace-doctest> Doc-tests alphal00p_docs_examples
315.24 s
gammaloop-workspace-doctest>
315.24 s
gammaloop-workspace-doctest> running 0 tests
315.24 s
gammaloop-workspace-doctest>
315.24 s
gammaloop-workspace-doctest> test result: ok. 0 passed; 0 failed; 0 ignored; 0 measured; 0 filtered out; finished in 0.00s
315.24 s
gammaloop-workspace-doctest>
315.24 s
gammaloop-workspace-doctest> Doc-tests alphal00p_docs
315.29 s
gammaloop-workspace-doctest>
315.29 s
gammaloop-workspace-doctest> running 0 tests
315.29 s
gammaloop-workspace-doctest>
315.29 s
gammaloop-workspace-doctest> test result: ok. 0 passed; 0 failed; 0 ignored; 0 measured; 0 filtered out; finished in 0.00s
315.29 s
gammaloop-workspace-doctest>
315.29 s
gammaloop-workspace-doctest> Doc-tests alphal00p_docs_schema
315.36 s
gammaloop-workspace-doctest>
315.36 s
gammaloop-workspace-doctest> running 0 tests
315.36 s
gammaloop-workspace-doctest>
315.36 s
gammaloop-workspace-doctest> test result: ok. 0 passed; 0 failed; 0 ignored; 0 measured; 0 filtered out; finished in 0.00s
315.36 s
gammaloop-workspace-doctest>
315.36 s
gammaloop-workspace-doctest> Doc-tests gammaloop_api
316.20 s
gammaloop-workspace-doctest>
316.20 s
gammaloop-workspace-doctest> running 16 tests
316.22 s
gammaloop-workspace-doctest> test crates/gammaloop-api/src/python.rs - python::GammaLoopAPI::evaluate_samples (line 3108) ... FAILED
316.22 s
gammaloop-workspace-doctest> test crates/gammaloop-api/src/python.rs - python::GammaLoopAPI::evaluate_sample (line 2967) ... FAILED
316.22 s
gammaloop-workspace-doctest> test crates/gammaloop-api/src/python.rs - python::GammaLoopAPI::get_default_runtime_settings (line 3796) ... FAILED
316.23 s
gammaloop-workspace-doctest> test crates/gammaloop-api/src/python.rs - python::GammaLoopAPI::get_integrand_info (line 3585) ... FAILED
316.23 s
gammaloop-workspace-doctest> test crates/gammaloop-api/src/python.rs - python::PyHistogramAccumulator (line 871) ... FAILED
316.23 s
gammaloop-workspace-doctest> test crates/gammaloop-api/src/python.rs - python::GammaLoopAPI::get_integrand_settings (line 3647) ... FAILED
316.23 s
gammaloop-workspace-doctest> test crates/gammaloop-api/src/python.rs - python::GammaLoopAPI::get_active_command_blocks (line 3760) ... FAILED
316.28 s
gammaloop-workspace-doctest> test crates/gammaloop-api/src/lib.rs - (line 18) - compile ... ok
316.31 s
gammaloop-workspace-doctest> test crates/gammaloop-api/src/python.rs - python::GammaLoopAPI::run_command (line 3901) ... FAILED
316.32 s
gammaloop-workspace-doctest> test crates/gammaloop-api/src/python.rs - python::GammaLoopAPI::get_run_history (line 3711) ... FAILED
316.32 s
gammaloop-workspace-doctest> test crates/gammaloop-api/src/python.rs - python::atom_to_canonical_string (line 128) ... FAILED
316.33 s
gammaloop-workspace-doctest> test crates/gammaloop-api/src/python.rs - python::GammaLoopAPI::get_global_settings (line 3739) ... FAILED
316.33 s
gammaloop-workspace-doctest> test crates/gammaloop-api/src/python.rs - python::atom_to_dots (line 157) ... FAILED
316.33 s
gammaloop-workspace-doctest> test crates/gammaloop-api/src/python.rs - python::GammaLoopAPI::new_python (line 2834) ... FAILED
316.34 s
gammaloop-workspace-doctest> test crates/gammaloop-api/src/python.rs - python::evaluate_graph_overall_factor (line 95) ... FAILED
318.69 s
gammaloop-workspace-doctest> test crates/gammaloop-api/src/commands/evaluate_samples.rs - commands::evaluate_samples::EvaluateSamples (line 50) ... ok
318.69 s
gammaloop-workspace-doctest>
318.69 s
gammaloop-workspace-doctest> failures:
318.69 s
gammaloop-workspace-doctest>
318.69 s
gammaloop-workspace-doctest> ---- crates/gammaloop-api/src/python.rs - python::GammaLoopAPI::evaluate_samples (line 3108) stdout ----
318.69 s
gammaloop-workspace-doctest> error: expected one of `!` or `::`, found `pathlib`
318.69 s
gammaloop-workspace-doctest> --> crates/gammaloop-api/src/python.rs:3109:6
318.69 s
gammaloop-workspace-doctest> |
318.69 s
gammaloop-workspace-doctest> 3109 | from pathlib import Path
318.69 s
gammaloop-workspace-doctest> | ^^^^^^^ expected one of `!` or `::`
318.69 s
gammaloop-workspace-doctest>
318.69 s
gammaloop-workspace-doctest> error: aborting due to 1 previous error
318.69 s
gammaloop-workspace-doctest>
318.69 s
gammaloop-workspace-doctest> Couldn't compile the test.
318.69 s
gammaloop-workspace-doctest> ---- crates/gammaloop-api/src/python.rs - python::GammaLoopAPI::evaluate_sample (line 2967) stdout ----
318.69 s
gammaloop-workspace-doctest> error: expected one of `!` or `::`, found `pathlib`
318.69 s
gammaloop-workspace-doctest> --> crates/gammaloop-api/src/python.rs:2968:6
318.69 s
gammaloop-workspace-doctest> |
318.69 s
gammaloop-workspace-doctest> 2968 | from pathlib import Path
318.69 s
gammaloop-workspace-doctest> | ^^^^^^^ expected one of `!` or `::`
318.69 s
gammaloop-workspace-doctest>
318.69 s
gammaloop-workspace-doctest> error: aborting due to 1 previous error
318.69 s
gammaloop-workspace-doctest>
318.69 s
gammaloop-workspace-doctest> Couldn't compile the test.
318.69 s
gammaloop-workspace-doctest> ---- crates/gammaloop-api/src/python.rs - python::GammaLoopAPI::get_default_runtime_settings (line 3796) stdout ----
318.69 s
gammaloop-workspace-doctest> error: expected one of `!` or `::`, found `=`
318.69 s
gammaloop-workspace-doctest> --> crates/gammaloop-api/src/python.rs:3797:9
318.69 s
gammaloop-workspace-doctest> |
318.69 s
gammaloop-workspace-doctest> 3797 | runtime = api.get_default_runtime_settings()
318.69 s
gammaloop-workspace-doctest> | ^ expected one of `!` or `::`
318.69 s
gammaloop-workspace-doctest>
318.69 s
gammaloop-workspace-doctest> error: aborting due to 1 previous error
318.69 s
gammaloop-workspace-doctest>
318.69 s
gammaloop-workspace-doctest> Couldn't compile the test.
318.69 s
gammaloop-workspace-doctest> ---- crates/gammaloop-api/src/python.rs - python::GammaLoopAPI::get_integrand_info (line 3585) stdout ----
318.69 s
gammaloop-workspace-doctest> error: expected one of `!` or `::`, found `pathlib`
318.69 s
gammaloop-workspace-doctest> --> crates/gammaloop-api/src/python.rs:3586:6
318.69 s
gammaloop-workspace-doctest> |
318.69 s
gammaloop-workspace-doctest> 3586 | from pathlib import Path
318.69 s
gammaloop-workspace-doctest> | ^^^^^^^ expected one of `!` or `::`
318.69 s
gammaloop-workspace-doctest>
318.69 s
gammaloop-workspace-doctest> error: aborting due to 1 previous error
318.69 s
gammaloop-workspace-doctest>
318.69 s
gammaloop-workspace-doctest> Couldn't compile the test.
318.69 s
gammaloop-workspace-doctest> ---- crates/gammaloop-api/src/python.rs - python::PyHistogramAccumulator (line 871) stdout ----
318.69 s
gammaloop-workspace-doctest> error: expected one of `!` or `::`, found `gammaloop`
318.69 s
gammaloop-workspace-doctest> --> crates/gammaloop-api/src/python.rs:872:6
318.69 s
gammaloop-workspace-doctest> |
318.69 s
gammaloop-workspace-doctest> 872 | from gammaloop import HistogramAccumulator
318.69 s
gammaloop-workspace-doctest> | ^^^^^^^^^ expected one of `!` or `::`
318.69 s
gammaloop-workspace-doctest>
318.69 s
gammaloop-workspace-doctest> error: aborting due to 1 previous error
318.69 s
gammaloop-workspace-doctest>
318.69 s
gammaloop-workspace-doctest> Couldn't compile the test.
318.69 s
gammaloop-workspace-doctest> ---- crates/gammaloop-api/src/python.rs - python::GammaLoopAPI::get_integrand_settings (line 3647) stdout ----
318.69 s
gammaloop-workspace-doctest> error: expected one of `!` or `::`, found `=`
318.69 s
gammaloop-workspace-doctest> --> crates/gammaloop-api/src/python.rs:3648:10
318.69 s
gammaloop-workspace-doctest> |
318.69 s
gammaloop-workspace-doctest> 3648 | settings = api.get_integrand_settings(process_id=0)
318.69 s
gammaloop-workspace-doctest> | ^ expected one of `!` or `::`
318.69 s
gammaloop-workspace-doctest>
318.69 s
gammaloop-workspace-doctest> error: aborting due to 1 previous error
318.69 s
gammaloop-workspace-doctest>
318.69 s
gammaloop-workspace-doctest> Couldn't compile the test.
318.69 s
gammaloop-workspace-doctest> ---- crates/gammaloop-api/src/python.rs - python::GammaLoopAPI::get_active_command_blocks (line 3760) stdout ----
318.69 s
gammaloop-workspace-doctest> error: expected item, found keyword `for`
318.69 s
gammaloop-workspace-doctest> --> crates/gammaloop-api/src/python.rs:3761:1
318.69 s
gammaloop-workspace-doctest> |
318.69 s
gammaloop-workspace-doctest> 3761 | for name, commands in api.get_active_command_blocks().items():
318.69 s
gammaloop-workspace-doctest> | ^^^ expected item
318.69 s
gammaloop-workspace-doctest> |
318.69 s
gammaloop-workspace-doctest> = note: for a full list of items that can appear in modules, see <https://doc.rust-lang.org/reference/items.html>
318.69 s
gammaloop-workspace-doctest>
318.69 s
gammaloop-workspace-doctest> error: aborting due to 1 previous error
318.69 s
gammaloop-workspace-doctest>
318.69 s
gammaloop-workspace-doctest> Couldn't compile the test.
318.69 s
gammaloop-workspace-doctest> ---- crates/gammaloop-api/src/python.rs - python::GammaLoopAPI::run_command (line 3901) stdout ----
318.69 s
gammaloop-workspace-doctest> error[E0425] : cannot find value `api` in this scope
318.69 s
gammaloop-workspace-doctest> --> crates/gammaloop-api/src/python.rs:3902:1
318.69 s
gammaloop-workspace-doctest> |
318.69 s
gammaloop-workspace-doctest> 3902 | api.run("display processes")
318.69 s
gammaloop-workspace-doctest> | ^^^ not found in this scope
318.69 s
gammaloop-workspace-doctest>
318.69 s
gammaloop-workspace-doctest> error : aborting due to 1 previous error
318.69 s
gammaloop-workspace-doctest>
318.69 s
gammaloop-workspace-doctest> For more information about this error, try `rustc --explain E0425`.
318.69 s
gammaloop-workspace-doctest> Couldn't compile the test.
318.69 s
gammaloop-workspace-doctest> ---- crates/gammaloop-api/src/python.rs - python::GammaLoopAPI::get_run_history (line 3711) stdout ----
318.69 s
gammaloop-workspace-doctest> error[E0425] : cannot find value `run_card_toml` in this scope
318.69 s
gammaloop-workspace-doctest> --> crates/gammaloop-api/src/python.rs:3712:1
318.69 s
gammaloop-workspace-doctest> |
318.69 s
gammaloop-workspace-doctest> 3712 | run_card_toml = api.get_run_history()
318.69 s
gammaloop-workspace-doctest> | ^^^^^^^^^^^^^
318.69 s
gammaloop-workspace-doctest> |
318.69 s
gammaloop-workspace-doctest> help : you might have meant to introduce a new binding
318.69 s
gammaloop-workspace-doctest> |
318.69 s
gammaloop-workspace-doctest> 3712 | let run_card_toml = api.get_run_history()
318.69 s
gammaloop-workspace-doctest> | +++
318.69 s
gammaloop-workspace-doctest>
318.69 s
gammaloop-workspace-doctest> error[E0425] : cannot find value `api` in this scope
318.69 s
gammaloop-workspace-doctest> --> crates/gammaloop-api/src/python.rs:3712:17
318.69 s
gammaloop-workspace-doctest> |
318.69 s
gammaloop-workspace-doctest> 3712 | run_card_toml = api.get_run_history()
318.69 s
gammaloop-workspace-doctest> | ^^^ not found in this scope
318.69 s
gammaloop-workspace-doctest>
318.69 s
gammaloop-workspace-doctest> error : aborting due to 2 previous errors
318.69 s
gammaloop-workspace-doctest>
318.69 s
gammaloop-workspace-doctest> For more information about this error, try `rustc --explain E0425`.
318.69 s
gammaloop-workspace-doctest> Couldn't compile the test.
318.69 s
gammaloop-workspace-doctest> ---- crates/gammaloop-api/src/python.rs - python::atom_to_canonical_string (line 128) stdout ----
318.69 s
gammaloop-workspace-doctest> error[E0425] : cannot find function `atom_to_canonical_string` in this scope
318.69 s
gammaloop-workspace-doctest> --> crates/gammaloop-api/src/python.rs:129:1
318.69 s
gammaloop-workspace-doctest> |
318.69 s
gammaloop-workspace-doctest> 129 | atom_to_canonical_string("x + x")
318.69 s
gammaloop-workspace-doctest> | ^^^^^^^^^^^^^^^^^^^^^^^^ not found in this scope
318.69 s
gammaloop-workspace-doctest>
318.69 s
gammaloop-workspace-doctest> error : aborting due to 1 previous error
318.69 s
gammaloop-workspace-doctest>
318.69 s
gammaloop-workspace-doctest> For more information about this error, try `rustc --explain E0425`.
318.69 s
gammaloop-workspace-doctest> Couldn't compile the test.
318.69 s
gammaloop-workspace-doctest> ---- crates/gammaloop-api/src/python.rs - python::GammaLoopAPI::get_global_settings (line 3739) stdout ----
318.69 s
gammaloop-workspace-doctest> error[E0425] : cannot find value `settings_toml` in this scope
318.69 s
gammaloop-workspace-doctest> --> crates/gammaloop-api/src/python.rs:3740:1
318.69 s
gammaloop-workspace-doctest> |
318.69 s
gammaloop-workspace-doctest> 3740 | settings_toml = api.get_global_settings()
318.69 s
gammaloop-workspace-doctest> | ^^^^^^^^^^^^^
318.69 s
gammaloop-workspace-doctest> |
318.69 s
gammaloop-workspace-doctest> help : you might have meant to introduce a new binding
318.69 s
gammaloop-workspace-doctest> |
318.69 s
gammaloop-workspace-doctest> 3740 | let settings_toml = api.get_global_settings()
318.69 s
gammaloop-workspace-doctest> | +++
318.69 s
gammaloop-workspace-doctest>
318.69 s
gammaloop-workspace-doctest> error[E0425] : cannot find value `api` in this scope
318.69 s
gammaloop-workspace-doctest> --> crates/gammaloop-api/src/python.rs:3740:17
318.69 s
gammaloop-workspace-doctest> |
318.69 s
gammaloop-workspace-doctest> 3740 | settings_toml = api.get_global_settings()
318.69 s
gammaloop-workspace-doctest> | ^^^ not found in this scope
318.69 s
gammaloop-workspace-doctest>
318.69 s
gammaloop-workspace-doctest> error : aborting due to 2 previous errors
318.69 s
gammaloop-workspace-doctest>
318.69 s
gammaloop-workspace-doctest> For more information about this error, try `rustc --explain E0425`.
318.69 s
gammaloop-workspace-doctest> Couldn't compile the test.
318.69 s
gammaloop-workspace-doctest> ---- crates/gammaloop-api/src/python.rs - python::atom_to_dots (line 157) stdout ----
318.69 s
gammaloop-workspace-doctest> error[E0425] : cannot find function `to_dots` in this scope
318.69 s
gammaloop-workspace-doctest> --> crates/gammaloop-api/src/python.rs:158:1
318.69 s
gammaloop-workspace-doctest> |
318.69 s
gammaloop-workspace-doctest> 158 | to_dots("p(mu) * q(mu)")
318.69 s
gammaloop-workspace-doctest> | ^^^^^^^ not found in this scope
318.69 s
gammaloop-workspace-doctest>
318.69 s
gammaloop-workspace-doctest> error : aborting due to 1 previous error
318.69 s
gammaloop-workspace-doctest>
318.69 s
gammaloop-workspace-doctest> For more information about this error, try `rustc --explain E0425`.
318.69 s
gammaloop-workspace-doctest> Couldn't compile the test.
318.69 s
gammaloop-workspace-doctest> ---- crates/gammaloop-api/src/python.rs - python::GammaLoopAPI::new_python (line 2834) stdout ----
318.69 s
gammaloop-workspace-doctest> error[E0425] : cannot find value `api` in this scope
318.69 s
gammaloop-workspace-doctest> --> crates/gammaloop-api/src/python.rs:2835:1
318.69 s
gammaloop-workspace-doctest> |
318.69 s
gammaloop-workspace-doctest> 2835 | api = GammaLoopAPI(state_folder="./state", read_only_state=True)
318.69 s
gammaloop-workspace-doctest> | ^^^
318.69 s
gammaloop-workspace-doctest> |
318.69 s
gammaloop-workspace-doctest> help : you might have meant to introduce a new binding
318.69 s
gammaloop-workspace-doctest> |
318.69 s
gammaloop-workspace-doctest> 2835 | let api = GammaLoopAPI(state_folder="./state", read_only_state=True)
318.69 s
gammaloop-workspace-doctest> | +++
318.69 s
gammaloop-workspace-doctest>
318.69 s
gammaloop-workspace-doctest> error[E0425] : cannot find value `state_folder` in this scope
318.69 s
gammaloop-workspace-doctest> --> crates/gammaloop-api/src/python.rs:2835:20
318.69 s
gammaloop-workspace-doctest> |
318.69 s
gammaloop-workspace-doctest> 2835 | api = GammaLoopAPI(state_folder="./state", read_only_state=True)
318.69 s
gammaloop-workspace-doctest> | ^^^^^^^^^^^^ not found in this scope
318.69 s
gammaloop-workspace-doctest>
318.69 s
gammaloop-workspace-doctest> error[E0425] : cannot find value `read_only_state` in this scope
318.69 s
gammaloop-workspace-doctest> --> crates/gammaloop-api/src/python.rs:2835:44
318.69 s
gammaloop-workspace-doctest> |
318.69 s
gammaloop-workspace-doctest> 2835 | api = GammaLoopAPI(state_folder="./state", read_only_state=True)
318.69 s
gammaloop-workspace-doctest> | ^^^^^^^^^^^^^^^ not found in this scope
318.69 s
gammaloop-workspace-doctest>
318.69 s
gammaloop-workspace-doctest> error[E0425] : cannot find value `True` in this scope
318.69 s
gammaloop-workspace-doctest> --> crates/gammaloop-api/src/python.rs:2835:60
318.69 s
gammaloop-workspace-doctest> |
318.69 s
gammaloop-workspace-doctest> 2835 | api = GammaLoopAPI(state_folder="./state", read_only_state=True)
318.69 s
gammaloop-workspace-doctest> | ^^^^ not found in this scope
318.69 s
gammaloop-workspace-doctest> |
318.69 s
gammaloop-workspace-doctest> help : you may want to use a bool value instead
318.69 s
gammaloop-workspace-doctest> |
318.69 s
gammaloop-workspace-doctest> 2835 - api = GammaLoopAPI(state_folder="./state", read_only_state=True )
318.69 s
gammaloop-workspace-doctest> 2835 + api = GammaLoopAPI(state_folder="./state", read_only_state=true )
318.69 s
gammaloop-workspace-doctest> |
318.69 s
gammaloop-workspace-doctest>
318.69 s
gammaloop-workspace-doctest> error[E0425] : cannot find function, tuple struct or tuple variant `GammaLoopAPI` in this scope
318.69 s
gammaloop-workspace-doctest> --> crates/gammaloop-api/src/python.rs:2835:7
318.69 s
gammaloop-workspace-doctest> |
318.69 s
gammaloop-workspace-doctest> 2835 | api = GammaLoopAPI(state_folder="./state", read_only_state=True)
318.69 s
gammaloop-workspace-doctest> | ^^^^^^^^^^^^ not found in this scope
318.69 s
gammaloop-workspace-doctest>
318.69 s
gammaloop-workspace-doctest> error : aborting due to 5 previous errors
318.69 s
gammaloop-workspace-doctest>
318.69 s
gammaloop-workspace-doctest> For more information about this error, try `rustc --explain E0425`.
318.69 s
gammaloop-workspace-doctest> Couldn't compile the test.
318.69 s
gammaloop-workspace-doctest> ---- crates/gammaloop-api/src/python.rs - python::evaluate_graph_overall_factor (line 95) stdout ----
318.69 s
gammaloop-workspace-doctest> error[E0425] : cannot find function `evaluate_graph_overall_factor` in this scope
318.69 s
gammaloop-workspace-doctest> --> crates/gammaloop-api/src/python.rs:96:1
318.69 s
gammaloop-workspace-doctest> |
318.69 s
gammaloop-workspace-doctest> 96 | evaluate_graph_overall_factor(
318.69 s
gammaloop-workspace-doctest> | ^^^^^^^^^^^^^^^^^^^^^^^^^^^^^ not found in this scope
318.69 s
gammaloop-workspace-doctest>
318.69 s
gammaloop-workspace-doctest> error : aborting due to 1 previous error
318.69 s
gammaloop-workspace-doctest>
318.69 s
gammaloop-workspace-doctest> For more information about this error, try `rustc --explain E0425`.
318.69 s
gammaloop-workspace-doctest> Couldn't compile the test.
318.69 s
gammaloop-workspace-doctest>
318.69 s
gammaloop-workspace-doctest> failures:
318.69 s
gammaloop-workspace-doctest> crates/gammaloop-api/src/python.rs - python::GammaLoopAPI::evaluate_sample (line 2967)
318.69 s
gammaloop-workspace-doctest> crates/gammaloop-api/src/python.rs - python::GammaLoopAPI::evaluate_samples (line 3108)
318.69 s
gammaloop-workspace-doctest> crates/gammaloop-api/src/python.rs - python::GammaLoopAPI::get_active_command_blocks (line 3760)
318.69 s
gammaloop-workspace-doctest> crates/gammaloop-api/src/python.rs - python::GammaLoopAPI::get_default_runtime_settings (line 3796)
318.69 s
gammaloop-workspace-doctest> crates/gammaloop-api/src/python.rs - python::GammaLoopAPI::get_global_settings (line 3739)
318.69 s
gammaloop-workspace-doctest> crates/gammaloop-api/src/python.rs - python::GammaLoopAPI::get_integrand_info (line 3585)
318.69 s
gammaloop-workspace-doctest> crates/gammaloop-api/src/python.rs - python::GammaLoopAPI::get_integrand_settings (line 3647)
318.69 s
gammaloop-workspace-doctest> crates/gammaloop-api/src/python.rs - python::GammaLoopAPI::get_run_history (line 3711)
318.69 s
gammaloop-workspace-doctest> crates/gammaloop-api/src/python.rs - python::GammaLoopAPI::new_python (line 2834)
318.69 s
gammaloop-workspace-doctest> crates/gammaloop-api/src/python.rs - python::GammaLoopAPI::run_command (line 3901)
318.69 s
gammaloop-workspace-doctest> crates/gammaloop-api/src/python.rs - python::PyHistogramAccumulator (line 871)
318.69 s
gammaloop-workspace-doctest> crates/gammaloop-api/src/python.rs - python::atom_to_canonical_string (line 128)
318.69 s
gammaloop-workspace-doctest> crates/gammaloop-api/src/python.rs - python::atom_to_dots (line 157)
318.69 s
gammaloop-workspace-doctest> crates/gammaloop-api/src/python.rs - python::evaluate_graph_overall_factor (line 95)
318.69 s
gammaloop-workspace-doctest>
318.69 s
gammaloop-workspace-doctest> test result: FAILED. 2 passed; 14 failed; 0 ignored; 0 measured; 0 filtered out; finished in 2.49s
318.69 s
gammaloop-workspace-doctest>
318.70 s
gammaloop-workspace-doctest> error : doctest failed, to rerun pass `-p gammaloop-api --doc`
319.21 s
error: Cannot build '/nix/store/l4jl276bp0050h66nydaswl0yrkqlgr4-gammaloop-workspace-doctest-0.1.0.drv '.
319.32 s
Reason: builder failed with exit code 101 .
319.32 s
Output paths:
319.32 s
/nix/store/hr6yd418rwbi8hzda4zdmla0j713f63m-gammaloop-workspace-doctest-0.1.0
319.32 s
Last 356 log lines:
319.32 s
> Running phase: unpackPhase
319.32 s
> unpacking source archive /nix/store/zw60sp2yw0jzbn0l3i8p6pynq3h4pivs-source
319.32 s
> source root is source
319.32 s
> Running phase: patchPhase
319.32 s
> Executing configureCargoCommonVars
319.32 s
> decompressing cargo artifacts from /nix/store/8rkh7d3hq722l839568nhnwihnsx041a-gammaloop-workspace-deps-deps-0.1.0/target.tar.zst to target
319.32 s
> Running phase: updateAutotoolsGnuConfigScriptsPhase
319.32 s
> Running phase: configurePhase
319.32 s
> will append /build/source/.cargo-home/config.toml with contents of /nix/store/xdy1vvhll2bijdplvl9fcc2b9plkxhaa-vendor-cargo-deps/config.toml
319.32 s
> default configurePhase, nothing to do
319.32 s
> Running phase: buildPhase
319.32 s
> +++ command cargo --version
319.32 s
> cargo 1.97.0 (c980f4866 2026-06-30)
319.32 s
> +++ command cargo test --profile ci-optim --doc --locked --workspace --features gammaloop-api/cli,gammaloop-tracing-filter/clap,gammaloop-tracing-filter/symbolica,idenso/bincode,idenso/reference-cases,linnet/bincode,linnet/drawing,linnet/nodestore-vec,linnet/rkyv,linnet/serde,linnet/symbolica,spenso-macros/shadowing,spenso/shadowing,symbolica/tracing_max_level_info
319.32 s
> Compiling target-lexicon v0.13.5
319.32 s
> Compiling symbolica v2.2.0 (https://github.com/symbolica-dev/symbolica?branch=dev#0441bd7a)
319.32 s
> Compiling maplit v1.0.2
319.32 s
> Compiling gammaloop-tracing-filter-macros v0.1.0 (/build/source/crates/gammaloop-tracing-filter-macros)
319.32 s
> Compiling vakint v0.1.2 (/build/source/crates/vakint)
319.32 s
> Compiling gammalooprs v0.3.4 (/build/source/crates/gammalooprs)
319.32 s
> Compiling alphal00p-docs-macros v0.1.0 (/build/source/crates/alphal00p-docs-macros)
319.32 s
> Compiling alphal00p-docs-schema v0.1.0 (/build/source/crates/alphal00p-docs-schema)
319.32 s
> Compiling rustc_version v0.4.1
319.32 s
> Compiling bincode v1.3.3
319.32 s
> Compiling gungraun-runner v0.18.2
319.32 s
> Compiling iai-callgrind-runner v0.14.2
319.32 s
> Compiling target-triple v1.0.1
319.32 s
> Compiling gammaloop-integration-tests v0.1.0 (/build/source/tests)
319.32 s
> Compiling test-log-core v0.2.20
319.32 s
> Compiling wait-timeout v0.2.1
319.32 s
> Compiling bit-vec v0.8.0
319.32 s
> Compiling quick-error v1.2.3
319.32 s
> Compiling iai-callgrind v0.14.2
319.32 s
> Compiling rusty-fork v0.3.1
319.32 s
> Compiling bit-set v0.8.0
319.32 s
> Compiling iai-callgrind-macros v0.5.1
319.32 s
> Compiling rand_xorshift v0.4.0
319.32 s
> Compiling console v0.15.11
319.32 s
> Compiling base64 v0.21.7
319.32 s
> Compiling glob v0.3.4
319.32 s
> Compiling gungraun-macros v0.8.0
319.32 s
> Compiling unarray v0.1.4
319.32 s
> Compiling termcolor v1.4.1
319.32 s
> Compiling proptest v1.11.0
319.32 s
> Compiling trybuild v1.0.120
319.32 s
> Compiling similar-asserts v1.7.0
319.32 s
> Compiling ron v0.8.1
319.32 s
> Compiling alphal00p-docs-catalogs v0.1.0 (/build/source/crates/alphal00p-docs-catalogs)
319.32 s
> Compiling alphal00p-docs-builder v0.1.0 (/build/source/crates/alphal00p-docs-builder)
319.32 s
> Compiling kurvst v0.1.0 (/build/source/crates/kurvst)
319.32 s
> Compiling pyo3-build-config v0.28.3
319.32 s
> Compiling test-log-macros v0.2.20
319.32 s
> Compiling test-log v0.2.20
319.32 s
> Compiling alphal00p-docs-examples v0.1.0 (/build/source/crates/alphal00p-docs-examples)
319.32 s
> Compiling gungraun v0.18.2
319.32 s
> Compiling pyo3-ffi v0.28.3
319.32 s
> Compiling pyo3-macros-backend v0.28.3
319.32 s
> Compiling pyo3 v0.28.3
319.32 s
> Compiling numpy v0.28.0
319.32 s
> Compiling gammaloop-api v0.1.0 (/build/source/crates/gammaloop-api)
319.32 s
> Compiling pyo3-macros v0.28.3
319.32 s
> Compiling pyo3-stub-gen v0.17.2
319.32 s
> Compiling numerica v2.2.0 (https://github.com/symbolica-dev/symbolica?branch=dev#0441bd7a)
319.32 s
> Compiling graphica v2.1.0 (https://github.com/symbolica-dev/symbolica?branch=dev#0441bd7a)
319.32 s
> Compiling symbolica-utils v0.1.0 (/build/source/crates/symbolica-utils)
319.32 s
> Compiling gammaloop-workspace-hack v0.1.0 (/build/source/crates/gammaloop-workspace-hack)
319.32 s
> Compiling spenso-macros v0.3.2 (/build/source/crates/spenso-macros)
319.32 s
> Compiling linnet v0.17.0 (/build/source/crates/linnet)
319.32 s
> Compiling spenso v0.6.0 (/build/source/crates/spenso)
319.32 s
> Compiling idenso v0.3.0 (/build/source/crates/idenso)
319.32 s
> Compiling gammaloop-tracing-filter v0.1.0 (/build/source/crates/gammaloop-tracing-filter)
319.32 s
> Compiling spenso-hep-lib v0.1.7 (/build/source/crates/spenso-hep-lib)
319.32 s
> Compiling spynso3 v0.1.2 (/build/source/crates/spynso3)
319.32 s
> Compiling linnest v0.1.0 (/build/source/crates/linnest)
319.32 s
> Compiling linnet-py v0.1.0 (/build/source/crates/linnet-py)
319.32 s
> Finished `ci-optim` profile [optimized] target(s) in 5m 00s
319.32 s
> warning : the following packages contain code that will be rejected by a future version of Rust: proc-macro-error2 v2.0.1
319.32 s
> note : to see what the problems were, use the option `--future-incompat-report`, or run `cargo report future-incompatibilities --id 1`
319.32 s
> Doc-tests alphal00p_docs_builder
319.32 s
>
319.32 s
> running 0 tests
319.32 s
>
319.32 s
> test result: ok. 0 passed; 0 failed; 0 ignored; 0 measured; 0 filtered out; finished in 0.00s
319.32 s
>
319.32 s
> Doc-tests alphal00p_docs_catalogs
319.32 s
>
319.32 s
> running 0 tests
319.32 s
>
319.32 s
> test result: ok. 0 passed; 0 failed; 0 ignored; 0 measured; 0 filtered out; finished in 0.00s
319.32 s
>
319.32 s
> Doc-tests alphal00p_docs_examples
319.32 s
>
319.32 s
> running 0 tests
319.32 s
>
319.32 s
> test result: ok. 0 passed; 0 failed; 0 ignored; 0 measured; 0 filtered out; finished in 0.00s
319.32 s
>
319.32 s
> Doc-tests alphal00p_docs
319.32 s
>
319.32 s
> running 0 tests
319.32 s
>
319.32 s
> test result: ok. 0 passed; 0 failed; 0 ignored; 0 measured; 0 filtered out; finished in 0.00s
319.32 s
>
319.32 s
> Doc-tests alphal00p_docs_schema
319.32 s
>
319.32 s
> running 0 tests
319.32 s
>
319.32 s
> test result: ok. 0 passed; 0 failed; 0 ignored; 0 measured; 0 filtered out; finished in 0.00s
319.32 s
>
319.32 s
> Doc-tests gammaloop_api
319.32 s
>
319.32 s
> running 16 tests
319.32 s
> test crates/gammaloop-api/src/python.rs - python::GammaLoopAPI::evaluate_samples (line 3108) ... FAILED
319.32 s
> test crates/gammaloop-api/src/python.rs - python::GammaLoopAPI::evaluate_sample (line 2967) ... FAILED
319.32 s
> test crates/gammaloop-api/src/python.rs - python::GammaLoopAPI::get_default_runtime_settings (line 3796) ... FAILED
319.32 s
> test crates/gammaloop-api/src/python.rs - python::GammaLoopAPI::get_integrand_info (line 3585) ... FAILED
319.32 s
> test crates/gammaloop-api/src/python.rs - python::PyHistogramAccumulator (line 871) ... FAILED
319.32 s
> test crates/gammaloop-api/src/python.rs - python::GammaLoopAPI::get_integrand_settings (line 3647) ... FAILED
319.32 s
> test crates/gammaloop-api/src/python.rs - python::GammaLoopAPI::get_active_command_blocks (line 3760) ... FAILED
319.32 s
> test crates/gammaloop-api/src/lib.rs - (line 18) - compile ... ok
319.32 s
> test crates/gammaloop-api/src/python.rs - python::GammaLoopAPI::run_command (line 3901) ... FAILED
319.32 s
> test crates/gammaloop-api/src/python.rs - python::GammaLoopAPI::get_run_history (line 3711) ... FAILED
319.32 s
> test crates/gammaloop-api/src/python.rs - python::atom_to_canonical_string (line 128) ... FAILED
319.32 s
> test crates/gammaloop-api/src/python.rs - python::GammaLoopAPI::get_global_settings (line 3739) ... FAILED
319.32 s
> test crates/gammaloop-api/src/python.rs - python::atom_to_dots (line 157) ... FAILED
319.32 s
> test crates/gammaloop-api/src/python.rs - python::GammaLoopAPI::new_python (line 2834) ... FAILED
319.32 s
> test crates/gammaloop-api/src/python.rs - python::evaluate_graph_overall_factor (line 95) ... FAILED
319.32 s
> test crates/gammaloop-api/src/commands/evaluate_samples.rs - commands::evaluate_samples::EvaluateSamples (line 50) ... ok
319.32 s
>
319.32 s
> failures:
319.32 s
>
319.32 s
> ---- crates/gammaloop-api/src/python.rs - python::GammaLoopAPI::evaluate_samples (line 3108) stdout ----
319.32 s
> error: expected one of `!` or `::`, found `pathlib`
319.32 s
> --> crates/gammaloop-api/src/python.rs:3109:6
319.32 s
> |
319.32 s
> 3109 | from pathlib import Path
319.32 s
> | ^^^^^^^ expected one of `!` or `::`
319.32 s
>
319.32 s
> error: aborting due to 1 previous error
319.32 s
>
319.32 s
> Couldn't compile the test.
319.32 s
> ---- crates/gammaloop-api/src/python.rs - python::GammaLoopAPI::evaluate_sample (line 2967) stdout ----
319.32 s
> error: expected one of `!` or `::`, found `pathlib`
319.32 s
> --> crates/gammaloop-api/src/python.rs:2968:6
319.32 s
> |
319.32 s
> 2968 | from pathlib import Path
319.32 s
> | ^^^^^^^ expected one of `!` or `::`
319.32 s
>
319.32 s
> error: aborting due to 1 previous error
319.32 s
>
319.32 s
> Couldn't compile the test.
319.32 s
> ---- crates/gammaloop-api/src/python.rs - python::GammaLoopAPI::get_default_runtime_settings (line 3796) stdout ----
319.32 s
> error: expected one of `!` or `::`, found `=`
319.32 s
> --> crates/gammaloop-api/src/python.rs:3797:9
319.32 s
> |
319.32 s
> 3797 | runtime = api.get_default_runtime_settings()
319.32 s
> | ^ expected one of `!` or `::`
319.32 s
>
319.32 s
> error: aborting due to 1 previous error
319.32 s
>
319.32 s
> Couldn't compile the test.
319.32 s
> ---- crates/gammaloop-api/src/python.rs - python::GammaLoopAPI::get_integrand_info (line 3585) stdout ----
319.32 s
> error: expected one of `!` or `::`, found `pathlib`
319.32 s
> --> crates/gammaloop-api/src/python.rs:3586:6
319.32 s
> |
319.32 s
> 3586 | from pathlib import Path
319.32 s
> | ^^^^^^^ expected one of `!` or `::`
319.32 s
>
319.32 s
> error: aborting due to 1 previous error
319.32 s
>
319.32 s
> Couldn't compile the test.
319.32 s
> ---- crates/gammaloop-api/src/python.rs - python::PyHistogramAccumulator (line 871) stdout ----
319.32 s
> error: expected one of `!` or `::`, found `gammaloop`
319.32 s
> --> crates/gammaloop-api/src/python.rs:872:6
319.32 s
> |
319.32 s
> 872 | from gammaloop import HistogramAccumulator
319.32 s
> | ^^^^^^^^^ expected one of `!` or `::`
319.32 s
>
319.32 s
> error: aborting due to 1 previous error
319.32 s
>
319.32 s
> Couldn't compile the test.
319.32 s
> ---- crates/gammaloop-api/src/python.rs - python::GammaLoopAPI::get_integrand_settings (line 3647) stdout ----
319.32 s
> error: expected one of `!` or `::`, found `=`
319.32 s
> --> crates/gammaloop-api/src/python.rs:3648:10
319.32 s
> |
319.32 s
> 3648 | settings = api.get_integrand_settings(process_id=0)
319.32 s
> | ^ expected one of `!` or `::`
319.32 s
>
319.32 s
> error: aborting due to 1 previous error
319.32 s
>
319.32 s
> Couldn't compile the test.
319.32 s
> ---- crates/gammaloop-api/src/python.rs - python::GammaLoopAPI::get_active_command_blocks (line 3760) stdout ----
319.32 s
> error: expected item, found keyword `for`
319.32 s
> --> crates/gammaloop-api/src/python.rs:3761:1
319.32 s
> |
319.32 s
> 3761 | for name, commands in api.get_active_command_blocks().items():
319.32 s
> | ^^^ expected item
319.32 s
> |
319.32 s
> = note: for a full list of items that can appear in modules, see <https://doc.rust-lang.org/reference/items.html>
319.32 s
>
319.32 s
> error: aborting due to 1 previous error
319.32 s
>
319.32 s
> Couldn't compile the test.
319.32 s
> ---- crates/gammaloop-api/src/python.rs - python::GammaLoopAPI::run_command (line 3901) stdout ----
319.32 s
> error[E0425] : cannot find value `api` in this scope
319.32 s
> --> crates/gammaloop-api/src/python.rs:3902:1
319.32 s
> |
319.32 s
> 3902 | api.run("display processes")
319.32 s
> | ^^^ not found in this scope
319.32 s
>
319.32 s
> error : aborting due to 1 previous error
319.32 s
>
319.32 s
> For more information about this error, try `rustc --explain E0425`.
319.32 s
> Couldn't compile the test.
319.32 s
> ---- crates/gammaloop-api/src/python.rs - python::GammaLoopAPI::get_run_history (line 3711) stdout ----
319.32 s
> error[E0425] : cannot find value `run_card_toml` in this scope
319.32 s
> --> crates/gammaloop-api/src/python.rs:3712:1
319.32 s
> |
319.32 s
> 3712 | run_card_toml = api.get_run_history()
319.32 s
> | ^^^^^^^^^^^^^
319.32 s
> |
319.32 s
> help : you might have meant to introduce a new binding
319.32 s
> |
319.32 s
> 3712 | let run_card_toml = api.get_run_history()
319.32 s
> | +++
319.32 s
>
319.32 s
> error[E0425] : cannot find value `api` in this scope
319.32 s
> --> crates/gammaloop-api/src/python.rs:3712:17
319.32 s
> |
319.32 s
> 3712 | run_card_toml = api.get_run_history()
319.32 s
> | ^^^ not found in this scope
319.32 s
>
319.32 s
> error : aborting due to 2 previous errors
319.32 s
>
319.32 s
> For more information about this error, try `rustc --explain E0425`.
319.32 s
> Couldn't compile the test.
319.32 s
> ---- crates/gammaloop-api/src/python.rs - python::atom_to_canonical_string (line 128) stdout ----
319.32 s
> error[E0425] : cannot find function `atom_to_canonical_string` in this scope
319.32 s
> --> crates/gammaloop-api/src/python.rs:129:1
319.32 s
> |
319.32 s
> 129 | atom_to_canonical_string("x + x")
319.32 s
> | ^^^^^^^^^^^^^^^^^^^^^^^^ not found in this scope
319.32 s
>
319.32 s
> error : aborting due to 1 previous error
319.32 s
>
319.32 s
> For more information about this error, try `rustc --explain E0425`.
319.32 s
> Couldn't compile the test.
319.32 s
> ---- crates/gammaloop-api/src/python.rs - python::GammaLoopAPI::get_global_settings (line 3739) stdout ----
319.32 s
> error[E0425] : cannot find value `settings_toml` in this scope
319.32 s
> --> crates/gammaloop-api/src/python.rs:3740:1
319.32 s
> |
319.32 s
> 3740 | settings_toml = api.get_global_settings()
319.32 s
> | ^^^^^^^^^^^^^
319.32 s
> |
319.32 s
> help : you might have meant to introduce a new binding
319.32 s
> |
319.32 s
> 3740 | let settings_toml = api.get_global_settings()
319.32 s
> | +++
319.32 s
>
319.32 s
> error[E0425] : cannot find value `api` in this scope
319.32 s
> --> crates/gammaloop-api/src/python.rs:3740:17
319.32 s
> |
319.32 s
> 3740 | settings_toml = api.get_global_settings()
319.32 s
> | ^^^ not found in this scope
319.32 s
>
319.32 s
> error : aborting due to 2 previous errors
319.32 s
>
319.32 s
> For more information about this error, try `rustc --explain E0425`.
319.32 s
> Couldn't compile the test.
319.32 s
> ---- crates/gammaloop-api/src/python.rs - python::atom_to_dots (line 157) stdout ----
319.32 s
> error[E0425] : cannot find function `to_dots` in this scope
319.32 s
> --> crates/gammaloop-api/src/python.rs:158:1
319.32 s
> |
319.32 s
> 158 | to_dots("p(mu) * q(mu)")
319.32 s
> | ^^^^^^^ not found in this scope
319.32 s
>
319.32 s
> error : aborting due to 1 previous error
319.32 s
>
319.32 s
> For more information about this error, try `rustc --explain E0425`.
319.32 s
> Couldn't compile the test.
319.32 s
> ---- crates/gammaloop-api/src/python.rs - python::GammaLoopAPI::new_python (line 2834) stdout ----
319.32 s
> error[E0425] : cannot find value `api` in this scope
319.32 s
> --> crates/gammaloop-api/src/python.rs:2835:1
319.32 s
> |
319.32 s
> 2835 | api = GammaLoopAPI(state_folder="./state", read_only_state=True)
319.32 s
> | ^^^
319.32 s
> |
319.32 s
> help : you might have meant to introduce a new binding
319.32 s
> |
319.32 s
> 2835 | let api = GammaLoopAPI(state_folder="./state", read_only_state=True)
319.32 s
> | +++
319.32 s
>
319.32 s
> error[E0425] : cannot find value `state_folder` in this scope
319.32 s
> --> crates/gammaloop-api/src/python.rs:2835:20
319.32 s
> |
319.32 s
> 2835 | api = GammaLoopAPI(state_folder="./state", read_only_state=True)
319.32 s
> | ^^^^^^^^^^^^ not found in this scope
319.32 s
>
319.32 s
> error[E0425] : cannot find value `read_only_state` in this scope
319.32 s
> --> crates/gammaloop-api/src/python.rs:2835:44
319.32 s
> |
319.32 s
> 2835 | api = GammaLoopAPI(state_folder="./state", read_only_state=True)
319.32 s
> | ^^^^^^^^^^^^^^^ not found in this scope
319.32 s
>
319.32 s
> error[E0425] : cannot find value `True` in this scope
319.32 s
> --> crates/gammaloop-api/src/python.rs:2835:60
319.32 s
> |
319.32 s
> 2835 | api = GammaLoopAPI(state_folder="./state", read_only_state=True)
319.32 s
> | ^^^^ not found in this scope
319.32 s
> |
319.32 s
> help : you may want to use a bool value instead
319.32 s
> |
319.32 s
> 2835 - api = GammaLoopAPI(state_folder="./state", read_only_state=True )
319.32 s
> 2835 + api = GammaLoopAPI(state_folder="./state", read_only_state=true )
319.32 s
> |
319.32 s
>
319.32 s
> error[E0425] : cannot find function, tuple struct or tuple variant `GammaLoopAPI` in this scope
319.32 s
> --> crates/gammaloop-api/src/python.rs:2835:7
319.32 s
> |
319.32 s
> 2835 | api = GammaLoopAPI(state_folder="./state", read_only_state=True)
319.32 s
> | ^^^^^^^^^^^^ not found in this scope
319.32 s
>
319.32 s
> error : aborting due to 5 previous errors
319.32 s
>
319.32 s
> For more information about this error, try `rustc --explain E0425`.
319.32 s
> Couldn't compile the test.
319.32 s
> ---- crates/gammaloop-api/src/python.rs - python::evaluate_graph_overall_factor (line 95) stdout ----
319.32 s
> error[E0425] : cannot find function `evaluate_graph_overall_factor` in this scope
319.32 s
> --> crates/gammaloop-api/src/python.rs:96:1
319.32 s
> |
319.32 s
> 96 | evaluate_graph_overall_factor(
319.32 s
> | ^^^^^^^^^^^^^^^^^^^^^^^^^^^^^ not found in this scope
319.32 s
>
319.32 s
> error : aborting due to 1 previous error
319.32 s
>
319.32 s
> For more information about this error, try `rustc --explain E0425`.
319.32 s
> Couldn't compile the test.
319.32 s
>
319.32 s
> failures:
319.32 s
> crates/gammaloop-api/src/python.rs - python::GammaLoopAPI::evaluate_sample (line 2967)
319.32 s
> crates/gammaloop-api/src/python.rs - python::GammaLoopAPI::evaluate_samples (line 3108)
319.32 s
> crates/gammaloop-api/src/python.rs - python::GammaLoopAPI::get_active_command_blocks (line 3760)
319.32 s
> crates/gammaloop-api/src/python.rs - python::GammaLoopAPI::get_default_runtime_settings (line 3796)
319.32 s
> crates/gammaloop-api/src/python.rs - python::GammaLoopAPI::get_global_settings (line 3739)
319.32 s
> crates/gammaloop-api/src/python.rs - python::GammaLoopAPI::get_integrand_info (line 3585)
319.32 s
> crates/gammaloop-api/src/python.rs - python::GammaLoopAPI::get_integrand_settings (line 3647)
319.32 s
> crates/gammaloop-api/src/python.rs - python::GammaLoopAPI::get_run_history (line 3711)
319.32 s
> crates/gammaloop-api/src/python.rs - python::GammaLoopAPI::new_python (line 2834)
319.32 s
> crates/gammaloop-api/src/python.rs - python::GammaLoopAPI::run_command (line 3901)
319.32 s
> crates/gammaloop-api/src/python.rs - python::PyHistogramAccumulator (line 871)
319.32 s
> crates/gammaloop-api/src/python.rs - python::atom_to_canonical_string (line 128)
319.32 s
> crates/gammaloop-api/src/python.rs - python::atom_to_dots (line 157)
319.32 s
> crates/gammaloop-api/src/python.rs - python::evaluate_graph_overall_factor (line 95)
319.32 s
>
319.32 s
> test result: FAILED. 2 passed; 14 failed; 0 ignored; 0 measured; 0 filtered out; finished in 2.49s
319.32 s
>
319.32 s
> error : doctest failed, to rerun pass `-p gammaloop-api --doc`
319.32 s
For full logs, run:
319.32 s
nix log /nix/store/l4jl276bp0050h66nydaswl0yrkqlgr4-gammaloop-workspace-doctest-0.1.0.drv
319.32 s
[0 built (1 failed )]Run failed.