test packages.x86_64-linux.nix-ci-check-gammaloop-nextest-integration

Reproduce this run
Original Run
  1. 127.94 s gammaloop-nextest-integration> | dod2_bubble | rls.integrated | GL0 | pass | 0.0sigma | compatible within 2sigma | - |
  2. 127.94 s gammaloop-nextest-integration> +-------------+-----------------+---------+--------+----------+-----------------------------------------------------------------------------------------------------------------------+-------+
  3. 127.94 s gammaloop-nextest-integration> | dod2_bubble | mu_r.inspect | inspect | pass | - | best inspect relative delta 6.951e-1 >= 1000*accuracy 1.000e-7 (accuracy=1.000e-10, exponent=+0.0, seed=0, probes=10) | - |
  4. 127.94 s gammaloop-nextest-integration> +-------------+-----------------+---------+--------+----------+-----------------------------------------------------------------------------------------------------------------------+-------+
  5. 127.94 s gammaloop-nextest-integration> | dod2_bubble | target | - | pass | - | 2sigma | - |
  6. 127.94 s gammaloop-nextest-integration> +-------------+-----------------+---------+--------+----------+-----------------------------------------------------------------------------------------------------------------------+-------+
  7. 127.94 s gammaloop-nextest-integration> test dod2_bubble_uv ... FAILED
  8. 127.94 s gammaloop-nextest-integration>
  9. 127.94 s gammaloop-nextest-integration> failures:
  10. 127.94 s gammaloop-nextest-integration>
  11. 127.94 s gammaloop-nextest-integration> failures:
  12. 127.94 s gammaloop-nextest-integration> dod2_bubble_uv
  13. 127.94 s gammaloop-nextest-integration>
  14. 127.94 s gammaloop-nextest-integration> test result: FAILED. 0 passed; 1 failed; 0 ignored; 0 measured; 24 filtered out; finished in 37.88s
  15. 127.94 s gammaloop-nextest-integration> system-err
  16. 127.94 s gammaloop-nextest-integration> [2026-08-26 08:22:08.790] @gammaloop_api::se... INFO : Running command run generate
  17. 127.94 s gammaloop-nextest-integration> [2026-08-26 08:22:08.790] @gammaloop_api::se... INFO : Starting command block generate
  18. 127.94 s gammaloop-nextest-integration> [2026-08-26 08:22:08.791] @gammaloop_api::se... INFO : Running command import model scalars-default.json
  19. 127.94 s gammaloop-nextest-integration> [2026-08-26 08:22:08.791] @import::model INFO : Loading built-in JSON model scalars-default
  20. 127.94 s gammaloop-nextest-integration> [2026-08-26 08:22:08.794] @gammalooprs::model INFO : The following 2 external parameters were forced to zero by the restriction card:
  21. 127.94 s gammaloop-nextest-integration> width_scalar_1, width_scalar_2
  22. 127.94 s gammaloop-nextest-integration> [2026-08-26 08:22:08.794] @gammaloop_api::se... INFO : Running command remove processes
  23. 127.94 s gammaloop-nextest-integration> [2026-08-26 08:22:08.795] @gammaloop_api::se... INFO : Running command set global kv global.generation.uv.generate_integrated=true
  24. 127.94 s gammaloop-nextest-integration> [2026-08-26 08:22:08.795] @gammaloop_api::se... INFO : Running command import graphs ./tests/resources/graphs/scalar/dod2_bubble.dot -p bubble_dod2 -i scalar_bubble_below_thres
  25. 127.94 s gammaloop-nextest-integration> [2026-08-26 08:22:08.795] @commands::import INFO : Loading graphs from '/build/source/tests/resources/graphs/scalar/dod2_bubble.dot'
  26. 127.94 s gammaloop-nextest-integration> [2026-08-26 08:22:08.798] @gammaloop_api::se... INFO : Running command generate existing -p bubble_dod2 -i scalar_bubble_below_thres
  27. 127.94 s gammaloop-nextest-integration> [2026-08-26 08:22:08.799] @approx::local_4d [{#uv, #inspect, #integrated}] DEBUG : Rescaled momenta expanded
  28. 127.94 s gammaloop-nextest-integration> field value
  29. 127.94 s gammaloop-nextest-integration> res n-terms: 1, byte size: 585,expr:
  30. 127.94 s gammaloop-nextest-integration> -SCALAR_COUPLING²·q₀(αᵉ².¹)·q₀(αᵉ³.¹)·q₂(αᵉ².¹)·q₂(αᵉ³.¹)
  31. 127.94 s gammaloop-nextest-integration> /(t²·denom(3,-q₀-q₂/t,mass_scalar_2²,-mass_scalar_2²+2·(q₀.q₂)/t+(q₂.q₂)/t²+(q₀.q₀))
  32. 127.94 s gammaloop-nextest-integration> ·denom(2,q₂/t,mass_scalar_2²,-mass_scalar_2²+(q₂.q₂)/t²))
  33. 127.94 s gammaloop-nextest-integration> [2026-08-26 08:22:08.801] @approx::local_4d [{#uv, #inspect, #integrated}] DEBUG : Rescaled momenta expanded
  34. 127.94 s gammaloop-nextest-integration> field value
  35. 127.94 s gammaloop-nextest-integration> res n-terms: 1, byte size: 3,expr:
  36. 127.94 s gammaloop-nextest-integration> 1
  37. 127.94 s gammaloop-nextest-integration> [2026-08-26 08:22:08.801] @approx::final_integrand[{#generation, #profile, #uv, #graph, #summary}] DEBUG : Computed global numerator
  38. 127.94 s gammaloop-nextest-integration> field value
  39. 127.94 s gammaloop-nextest-integration> global_num n-terms: 1, byte size: 4,expr:
  40. 127.94 s gammaloop-nextest-integration> 1/2
  41. 127.94 s gammaloop-nextest-integration> span build_3d{span_context=true graph=GL0 current=subgraph=0, topo_order=0, dod=0}
  42. 127.94 s gammaloop-nextest-integration> [2026-08-26 08:22:08.803] @uv::approx [{#generation, #uv, #fourd}] DEBUG : Computing 4D
  43. 127.94 s gammaloop-nextest-integration> field value
  44. 127.94 s gammaloop-nextest-integration> simple subgraph(S_11,S_y)*Approx(subgraph(S_y,0)) of GL0
  45. 127.94 s gammaloop-nextest-integration> span compute_4d{span_context=true graph=GL0 current=subgraph=y, topo_order=1, dod=2 given=subgraph=0, topo_order=0, dod=0 reduced=SubSet { set: BitVec<usize, bitvec::order::Lsb0> { addr: 0x7fffec017290, head: 000000, bits: 6, capacity: 64 } [0, 0, 1, 1, 1, 1], id: PhantomData<linnet::half_edge::involution::Hedge> }}
  46. 127.95 s gammaloop-nextest-integration> [2026-08-26 08:22:08.803] @approx::local_4d [{#uv, #algebra, #integrated, #start}] DEBUG :
  47. 127.95 s gammaloop-nextest-integration> field value
  48. 127.95 s gammaloop-nextest-integration> integrand n-terms: 1, byte size: 409,expr:
  49. 127.95 s gammaloop-nextest-integration> SCALAR_COUPLING²·(q₀(αᵉ³.¹)+q₃(αᵉ³.¹))·q₀(αᵉ².¹)·q₀(αᵉ³.¹)·q₂(αᵉ².¹)
  50. 127.95 s gammaloop-nextest-integration> /(denom(2,q₂,mass_scalar_2²,-mass_scalar_2²+(q₂.q₂))·denom(3,q₃,mass_scalar_2²,-mass_scalar_2²+(q₃.q₃)))
  51. 127.95 s gammaloop-nextest-integration> reduced y
  52. 127.95 s gammaloop-nextest-integration> span grow{span_context=true current=subgraph=y, topo_order=1, dod=2 given=subgraph=0, topo_order=0, dod=0}
  53. 127.95 s gammaloop-nextest-integration> [2026-08-26 08:22:08.804] @approx::local_4d [{#uv, #inspect, #integrated}] DEBUG : Rescaled momenta expanded
  54. 127.95 s gammaloop-nextest-integration> field value
  55. 127.95 s gammaloop-nextest-integration> res n-terms: 1, byte size: 585,expr:
  56. 127.95 s gammaloop-nextest-integration> -SCALAR_COUPLING²·q₀(αᵉ².¹)·q₀(αᵉ³.¹)·q₂(αᵉ².¹)·q₂(αᵉ³.¹)
  57. 127.95 s gammaloop-nextest-integration> /(t²·denom(3,-q₀-q₂/t,mass_scalar_2²,-mass_scalar_2²+2·(q₀.q₂)/t+(q₂.q₂)/t²+(q₀.q₀))
  58. 127.95 s gammaloop-nextest-integration> ·denom(2,q₂/t,mass_scalar_2²,-mass_scalar_2²+(q₂.q₂)/t²))
  59. 127.95 s gammaloop-nextest-integration> span t{span_context=true current=subgraph=y, topo_order=1, dod=2 given=subgraph=0, topo_order=0, dod=0}
  60. 127.95 s gammaloop-nextest-integration> [2026-08-26 08:22:08.807] @approx::local_4d [{#uv, #integrated, #rescaled}] DEBUG : Rescaled expanded
  61. 127.95 s gammaloop-nextest-integration> field value
  62. 127.95 s gammaloop-nextest-integration> n_loops 1
  63. 127.95 s gammaloop-nextest-integration> res n-terms: 1, byte size: 707,expr:
  64. 127.95 s gammaloop-nextest-integration> -SCALAR_COUPLING²·q₀(αᵉ².¹)·q₀(αᵉ³.¹)·q₂(αᵉ².¹)·q₂(αᵉ³.¹)
  65. 127.95 s gammaloop-nextest-integration> /(t²·denom(3,-q₂,mUVexp²+t²·mass_scalar_2²,-mUV²+t²·(-mass_scalar_2²+2·(q₀.q₂)/t+(q₂.q₂)/t²+(q₀.q₀))+t²·mUVexp²)
  66. 127.95 s gammaloop-nextest-integration> ·denom(2,q₂,mUVexp²+t²·mass_scalar_2²,-mUV²+t²·(-mass_scalar_2²+(q₂.q₂)/t²)+t²·mUVexp²))
  67. 127.95 s gammaloop-nextest-integration> span t{span_context=true current=subgraph=y, topo_order=1, dod=2 given=subgraph=0, topo_order=0, dod=0}
  68. 127.95 s gammaloop-nextest-integration> [2026-08-26 08:22:08.808] @approx::local_4d [{#uv, #integrated, #series}] DEBUG : Series expanded
  69. 127.95 s gammaloop-nextest-integration> field value
  70. 127.95 s gammaloop-nextest-integration> res n-terms: 3, byte size: 1896,expr:
  71. 127.95 s gammaloop-nextest-integration> (1/2·SCALAR_COUPLING²·(2·mUVexp²-2·mass_scalar_2²)/(denom(2,q₂,mUVexp²,-mUV²+(q₂.q₂))²·denom(3,-q₂,mUVexp²,-mUV²+(q₂.q₂)))
  72. 127.95 s gammaloop-nextest-integration> -SCALAR_COUPLING²
  73. 127.95 s gammaloop-nextest-integration> ·(-1/2·(2·mUVexp²-2·mass_scalar_2²+2·(q₀.q₀))/denom(3,-q₂,mUVexp²,-mUV²+(q₂.q₂))
  74. 127.95 s gammaloop-nextest-integration> +4·(q₀.q₂)²/denom(3,-q₂,mUVexp²,-mUV²+(q₂.q₂))²
  75. 127.95 s gammaloop-nextest-integration> )/(denom(2,q₂,mUVexp²,-mUV²+(q₂.q₂))·denom(3,-q₂,mUVexp²,-mUV²+(q₂.q₂)))
  76. 127.95 s gammaloop-nextest-integration> )·q₀(αᵉ².¹)·q₀(αᵉ³.¹)·q₂(αᵉ².¹)·q₂(αᵉ³.¹)
  77. 127.95 s gammaloop-nextest-integration> +2·SCALAR_COUPLING²·(q₀.q₂)·q₀(αᵉ².¹)·q₀(αᵉ³.¹)·q₂(αᵉ².¹)·q₂(αᵉ³.¹)
  78. 127.95 s gammaloop-nextest-integration> /(t·denom(2,q₂,mUVexp²,-mUV²+(q₂.q₂))·denom(3,-q₂,mUVexp²,-mUV²+(q₂.q₂))²)
  79. 127.95 s gammaloop-nextest-integration> -SCALAR_COUPLING²·q₀(αᵉ².¹)·q₀(αᵉ³.¹)·q₂(αᵉ².¹)·q₂(αᵉ³.¹)
  80. 127.95 s gammaloop-nextest-integration> /(t²·denom(2,q₂,mUVexp²,-mUV²+(q₂.q₂))·denom(3,-q₂,mUVexp²,-mUV²+(q₂.q₂)))
  81. 127.95 s gammaloop-nextest-integration> span t{span_context=true current=subgraph=y, topo_order=1, dod=2 given=subgraph=0, topo_order=0, dod=0}
  82. 127.95 s gammaloop-nextest-integration> [2026-08-26 08:22:08.808] @approx::local_4d [{#uv, #integrated, #series}] DEBUG : Evaluated at t = 1
  83. 127.95 s gammaloop-nextest-integration> field value
  84. 127.95 s gammaloop-nextest-integration> res n-terms: 3, byte size: 1880,expr:
  85. 127.95 s gammaloop-nextest-integration> (1/2·SCALAR_COUPLING²·(2·mUVexp²-2·mass_scalar_2²)/(denom(2,q₂,mUVexp²,-mUV²+(q₂.q₂))²·denom(3,-q₂,mUVexp²,-mUV²+(q₂.q₂)))
  86. 127.95 s gammaloop-nextest-integration> -SCALAR_COUPLING²
  87. 127.95 s gammaloop-nextest-integration> ·(-1/2·(2·mUVexp²-2·mass_scalar_2²+2·(q₀.q₀))/denom(3,-q₂,mUVexp²,-mUV²+(q₂.q₂))
  88. 127.95 s gammaloop-nextest-integration> +4·(q₀.q₂)²/denom(3,-q₂,mUVexp²,-mUV²+(q₂.q₂))²
  89. 127.95 s gammaloop-nextest-integration> )/(denom(2,q₂,mUVexp²,-mUV²+(q₂.q₂))·denom(3,-q₂,mUVexp²,-mUV²+(q₂.q₂)))
  90. 127.95 s gammaloop-nextest-integration> )·q₀(αᵉ².¹)·q₀(αᵉ³.¹)·q₂(αᵉ².¹)·q₂(αᵉ³.¹)
  91. 127.95 s gammaloop-nextest-integration> -SCALAR_COUPLING²·q₀(αᵉ².¹)·q₀(αᵉ³.¹)·q₂(αᵉ².¹)·q₂(αᵉ³.¹)
  92. 127.95 s gammaloop-nextest-integration> /(denom(2,q₂,mUVexp²,-mUV²+(q₂.q₂))·denom(3,-q₂,mUVexp²,-mUV²+(q₂.q₂)))
  93. 127.95 s gammaloop-nextest-integration> +2·SCALAR_COUPLING²·(q₀.q₂)·q₀(αᵉ².¹)·q₀(αᵉ³.¹)·q₂(αᵉ².¹)·q₂(αᵉ³.¹)
  94. 127.95 s gammaloop-nextest-integration> /(denom(2,q₂,mUVexp²,-mUV²+(q₂.q₂))·denom(3,-q₂,mUVexp²,-mUV²+(q₂.q₂))²)
  95. 127.95 s gammaloop-nextest-integration> span t{span_context=true current=subgraph=y, topo_order=1, dod=2 given=subgraph=0, topo_order=0, dod=0}
  96. 127.95 s gammaloop-nextest-integration> [2026-08-26 08:22:08.809] @approx::local_4d [{#uv, #collect, #integrated}] DEBUG : After gamma chain collection
  97. 127.95 s gammaloop-nextest-integration> field value
  98. 127.95 s gammaloop-nextest-integration> expr n-terms: 3, byte size: 1880,expr:
  99. 127.95 s gammaloop-nextest-integration> (1/2·SCALAR_COUPLING²·(2·mUVexp²-2·mass_scalar_2²)/(denom(2,q₂,mUVexp²,-mUV²+(q₂.q₂))²·denom(3,-q₂,mUVexp²,-mUV²+(q₂.q₂)))
  100. 127.95 s gammaloop-nextest-integration> -SCALAR_COUPLING²
  101. 127.95 s gammaloop-nextest-integration> ·(-1/2·(2·mUVexp²-2·mass_scalar_2²+2·(q₀.q₀))/denom(3,-q₂,mUVexp²,-mUV²+(q₂.q₂))
  102. 127.95 s gammaloop-nextest-integration> +4·(q₀.q₂)²/denom(3,-q₂,mUVexp²,-mUV²+(q₂.q₂))²
  103. 127.95 s gammaloop-nextest-integration> )/(denom(2,q₂,mUVexp²,-mUV²+(q₂.q₂))·denom(3,-q₂,mUVexp²,-mUV²+(q₂.q₂)))
  104. 127.95 s gammaloop-nextest-integration> )·q₀(αᵉ².¹)·q₀(αᵉ³.¹)·q₂(αᵉ².¹)·q₂(αᵉ³.¹)
  105. 127.95 s gammaloop-nextest-integration> -SCALAR_COUPLING²·q₀(αᵉ².¹)·q₀(αᵉ³.¹)·q₂(αᵉ².¹)·q₂(αᵉ³.¹)
  106. 127.95 s gammaloop-nextest-integration> /(denom(2,q₂,mUVexp²,-mUV²+(q₂.q₂))·denom(3,-q₂,mUVexp²,-mUV²+(q₂.q₂)))
  107. 127.95 s gammaloop-nextest-integration> +2·SCALAR_COUPLING²·(q₀.q₂)·q₀(αᵉ².¹)·q₀(αᵉ³.¹)·q₂(αᵉ².¹)·q₂(αᵉ³.¹)
  108. 127.95 s gammaloop-nextest-integration> /(denom(2,q₂,mUVexp²,-mUV²+(q₂.q₂))·denom(3,-q₂,mUVexp²,-mUV²+(q₂.q₂))²)
  109. 127.95 s gammaloop-nextest-integration> span t{span_context=true current=subgraph=y, topo_order=1, dod=2 given=subgraph=0, topo_order=0, dod=0}
  110. 127.95 s gammaloop-nextest-integration> [2026-08-26 08:22:08.814] @approx::local_4d [{#profile, #uv, #collect, #integrated, #start, #trace}] DEBUG : After gamma schoonschip
  111. 127.95 s gammaloop-nextest-integration> field value
  112. 127.95 s gammaloop-nextest-integration> expr n-terms: 3, byte size: 1631,expr:
  113. 127.95 s gammaloop-nextest-integration> (1/2·SCALAR_COUPLING²·(2·mUVexp²-2·mass_scalar_2²)/(denom(2,q₂,mUVexp²,-mUV²+(q₂.q₂))²·denom(3,-q₂,mUVexp²,-mUV²+(q₂.q₂)))
  114. 127.95 s gammaloop-nextest-integration> -SCALAR_COUPLING²
  115. 127.95 s gammaloop-nextest-integration> ·(-1/2·(2·mUVexp²-2·mass_scalar_2²+2·(q₀.q₀))/denom(3,-q₂,mUVexp²,-mUV²+(q₂.q₂))
  116. 127.95 s gammaloop-nextest-integration> +4·(q₀.q₂)²/denom(3,-q₂,mUVexp²,-mUV²+(q₂.q₂))²
  117. 127.95 s gammaloop-nextest-integration> )/(denom(2,q₂,mUVexp²,-mUV²+(q₂.q₂))·denom(3,-q₂,mUVexp²,-mUV²+(q₂.q₂)))
  118. 127.95 s gammaloop-nextest-integration> )·(q₀.q₂)²
  119. 127.95 s gammaloop-nextest-integration> -SCALAR_COUPLING²·(q₀.q₂)²/(denom(2,q₂,mUVexp²,-mUV²+(q₂.q₂))·denom(3,-q₂,mUVexp²,-mUV²+(q₂.q₂)))
  120. 127.95 s gammaloop-nextest-integration> +2·SCALAR_COUPLING²·(q₀.q₂)·(q₀.q₂)²
  121. 127.95 s gammaloop-nextest-integration> /(denom(2,q₂,mUVexp²,-mUV²+(q₂.q₂))·denom(3,-q₂,mUVexp²,-mUV²+(q₂.q₂))²)
  122. 127.95 s gammaloop-nextest-integration> span t{span_context=true current=subgraph=y, topo_order=1, dod=2 given=subgraph=0, topo_order=0, dod=0}
  123. 127.95 s gammaloop-nextest-integration> [2026-08-26 08:22:08.815] @approx::local_4d [{#profile, #uv, #collect, #integrated, #start, #trace}] DEBUG : After gamma collection
  124. 127.95 s gammaloop-nextest-integration> field value
  125. 127.95 s gammaloop-nextest-integration> expr n-terms: 1, byte size: 1347,expr:
  126. 127.95 s gammaloop-nextest-integration> SCALAR_COUPLING²
  127. 127.95 s gammaloop-nextest-integration> ·(-denom(2,q₂,mUVexp²,-mUV²+(q₂.q₂))·denom(3,-q₂,mUVexp²,-mUV²+(q₂.q₂))²
  128. 127.95 s gammaloop-nextest-integration> +1/2·(2·mUVexp²-2·mass_scalar_2²)·denom(3,-q₂,mUVexp²,-mUV²+(q₂.q₂))²
  129. 127.95 s gammaloop-nextest-integration> -(-1/2·(2·mUVexp²-2·mass_scalar_2²+2·(q₀.q₀))·denom(3,-q₂,mUVexp²,-mUV²+(q₂.q₂))+4·(q₀.q₂)²)
  130. 127.95 s gammaloop-nextest-integration> ·denom(2,q₂,mUVexp²,-mUV²+(q₂.q₂))
  131. 127.95 s gammaloop-nextest-integration> +2·(q₀.q₂)·denom(2,q₂,mUVexp²,-mUV²+(q₂.q₂))·denom(3,-q₂,mUVexp²,-mUV²+(q₂.q₂))
  132. 127.95 s gammaloop-nextest-integration> )·(q₀.q₂)²/(denom(2,q₂,mUVexp²,-mUV²+(q₂.q₂))²·denom(3,-q₂,mUVexp²,-mUV²+(q₂.q₂))³)
  133. 127.95 s gammaloop-nextest-integration> span t{span_context=true current=subgraph=y, topo_order=1, dod=2 given=subgraph=0, topo_order=0, dod=0}
  134. 127.95 s gammaloop-nextest-integration> [2026-08-26 08:22:08.816] @approx::local_4d [{#profile, #uv, #gamma, #integrated, #start, #trace, #vakint}] DEBUG : After gamma simplification
  135. 127.95 s gammaloop-nextest-integration> ... omitted 3263 more lines; see full nextest output above
  136. 127.95 s gammaloop-nextest-integration>
  137. 127.95 s gammaloop-nextest-integration> 8. gammaloop-integration-tests::uv::sunrise_scalar_1_uv
  138. 127.98 s gammaloop-nextest-integration> failure: test failure with exit code 101
  139. 127.98 s gammaloop-nextest-integration> system-out
  140. 127.98 s gammaloop-nextest-integration> running 1 test
  141. 127.98 s gammaloop-nextest-integration> test sunrise_scalar_1_uv has been running for over 60 seconds
  142. 127.98 s gammaloop-nextest-integration> +------------------+------------------------+--------------+--------+----------+----------------------------------------------------------------------------------------------------------------------+-------+
  143. 127.98 s gammaloop-nextest-integration> | case | check | graph | status | sigma | threshold | error |
  144. 127.98 s gammaloop-nextest-integration> +------------------+------------------------+--------------+--------+----------+----------------------------------------------------------------------------------------------------------------------+-------+
  145. 127.98 s gammaloop-nextest-integration> | sunrise_scalar_1 | uv_profile | - | FAIL | - | - | - |
  146. 127.98 s gammaloop-nextest-integration> +------------------+------------------------+--------------+--------+----------+----------------------------------------------------------------------------------------------------------------------+-------+
  147. 127.98 s gammaloop-nextest-integration> | sunrise_scalar_1 | m_uv.inspect | inspect | pass | - | best inspect relative delta 1.624e0 >= 1000*accuracy 1.000e-3 (accuracy=1.000e-6, exponent=+1.0, seed=1, probes=10) | - |
  148. 127.98 s gammaloop-nextest-integration> +------------------+------------------------+--------------+--------+----------+----------------------------------------------------------------------------------------------------------------------+-------+
  149. 127.98 s gammaloop-nextest-integration> | sunrise_scalar_1 | m_uv.integrated | sunrise | pass | 0.1sigma | compatible within 2sigma | - |
  150. 127.98 s gammaloop-nextest-integration> +------------------+------------------------+--------------+--------+----------+----------------------------------------------------------------------------------------------------------------------+-------+
  151. 127.98 s gammaloop-nextest-integration> | sunrise_scalar_1 | rls.inspect | inspect | pass | - | best inspect relative delta 8.682e-1 >= 1000*accuracy 1.000e-3 (accuracy=1.000e-6, exponent=+1.0, seed=1, probes=10) | - |
  152. 127.98 s gammaloop-nextest-integration> +------------------+------------------------+--------------+--------+----------+----------------------------------------------------------------------------------------------------------------------+-------+
  153. 127.98 s gammaloop-nextest-integration> | sunrise_scalar_1 | rls.integrated | sunrise | pass | 0.0sigma | compatible within 2sigma | - |
  154. 127.98 s gammaloop-nextest-integration> +------------------+------------------------+--------------+--------+----------+----------------------------------------------------------------------------------------------------------------------+-------+
  155. 127.98 s gammaloop-nextest-integration> | sunrise_scalar_1 | mu_r.inspect | inspect | pass | - | best inspect relative delta 1.752e0 >= 1000*accuracy 1.000e-3 (accuracy=1.000e-6, exponent=+1.0, seed=1, probes=10) | - |
  156. 127.98 s gammaloop-nextest-integration> +------------------+------------------------+--------------+--------+----------+----------------------------------------------------------------------------------------------------------------------+-------+
  157. 127.98 s gammaloop-nextest-integration> | sunrise_scalar_1 | integrated.relerr | integrated | pass | - | relative error 9.20% <= 10.00% | - |
  158. 127.98 s gammaloop-nextest-integration> +------------------+------------------------+--------------+--------+----------+----------------------------------------------------------------------------------------------------------------------+-------+
  159. 127.98 s gammaloop-nextest-integration> | sunrise_scalar_1 | m_uv.integrated.relerr | m_uv-shifted | pass | - | relative error 5.89% <= 10.00% | - |
  160. 127.98 s gammaloop-nextest-integration> +------------------+------------------------+--------------+--------+----------+----------------------------------------------------------------------------------------------------------------------+-------+
  161. 127.98 s gammaloop-nextest-integration> | sunrise_scalar_1 | target | - | pass | - | 2sigma | - |
  162. 127.98 s gammaloop-nextest-integration> +------------------+------------------------+--------------+--------+----------+----------------------------------------------------------------------------------------------------------------------+-------+
  163. 127.98 s gammaloop-nextest-integration> test sunrise_scalar_1_uv ... FAILED
  164. 127.98 s gammaloop-nextest-integration>
  165. 127.98 s gammaloop-nextest-integration> failures:
  166. 127.98 s gammaloop-nextest-integration>
  167. 127.98 s gammaloop-nextest-integration> failures:
  168. 127.98 s gammaloop-nextest-integration> sunrise_scalar_1_uv
  169. 127.98 s gammaloop-nextest-integration>
  170. 127.98 s gammaloop-nextest-integration> test result: FAILED. 0 passed; 1 failed; 0 ignored; 0 measured; 24 filtered out; finished in 92.84s
  171. 127.98 s gammaloop-nextest-integration> system-err
  172. 127.98 s gammaloop-nextest-integration> [2026-08-26 08:22:13.546] @gammaloop_api::se... INFO : Running command run generate
  173. 127.98 s gammaloop-nextest-integration> [2026-08-26 08:22:13.546] @gammaloop_api::se... INFO : Starting command block generate
  174. 127.98 s gammaloop-nextest-integration> [2026-08-26 08:22:13.546] @gammaloop_api::se... INFO : Running command import model scalars-default.json
  175. 127.98 s gammaloop-nextest-integration> [2026-08-26 08:22:13.546] @import::model INFO : Loading built-in JSON model scalars-default
  176. 127.98 s gammaloop-nextest-integration> [2026-08-26 08:22:13.549] @gammalooprs::model INFO : The following 2 external parameters were forced to zero by the restriction card:
  177. 127.98 s gammaloop-nextest-integration> width_scalar_1, width_scalar_2
  178. 127.98 s gammaloop-nextest-integration> [2026-08-26 08:22:13.550] @gammaloop_api::se... INFO : Running command remove processes
  179. 127.98 s gammaloop-nextest-integration> [2026-08-26 08:22:13.550] @gammaloop_api::se... INFO : Running command set global kv global.generation.uv.generate_integrated=true
  180. 127.98 s gammaloop-nextest-integration> [2026-08-26 08:22:13.550] @gammaloop_api::se... INFO : Running command import graphs ./tests/resources/graphs/scalar_sunrise.dot -p sunrise_scalar_1 -i scalar_sunrise
  181. 127.98 s gammaloop-nextest-integration> [2026-08-26 08:22:13.550] @commands::import INFO : Loading graphs from '/build/source/tests/resources/graphs/scalar_sunrise.dot'
  182. 127.98 s gammaloop-nextest-integration> [2026-08-26 08:22:13.553] @gammaloop_api::se... INFO : Running command generate existing -p sunrise_scalar_1 -i scalar_sunrise
  183. 127.98 s gammaloop-nextest-integration> [2026-08-26 08:22:13.555] @approx::local_4d [{#uv, #inspect, #integrated}] DEBUG : Rescaled momenta expanded
  184. 127.98 s gammaloop-nextest-integration> field value
  185. 127.98 s gammaloop-nextest-integration> res n-terms: 1, byte size: 611,expr:
  186. 127.98 s gammaloop-nextest-integration> 1/(denom(0,q₀/t,mass_scalar_1²,-mass_scalar_1²+(q₀.q₀)/t²)
  187. 127.98 s gammaloop-nextest-integration> ·denom(2,-q₁+q₃-q₀/t,mass_scalar_1²,
  188. 127.98 s gammaloop-nextest-integration> -mass_scalar_1²+2·(q₀.q₁)/t-2·(q₀.q₃)/t+(q₀.q₀)/t²+(q₁.q₁)
  189. 127.98 s gammaloop-nextest-integration> -2·(q₁.q₃)+(q₃.q₃)
  190. 127.98 s gammaloop-nextest-integration> ))
  191. 127.98 s gammaloop-nextest-integration> [2026-08-26 08:22:13.556] @approx::local_4d [{#uv, #inspect, #integrated}] DEBUG : Rescaled momenta expanded
  192. 127.98 s gammaloop-nextest-integration> field value
  193. 127.98 s gammaloop-nextest-integration> res n-terms: 1, byte size: 777,expr:
  194. 127.98 s gammaloop-nextest-integration> 1/(denom(0,q₀/t,mass_scalar_1²,-mass_scalar_1²+(q₀.q₀)/t²)·denom(1,q₁/t,mass_scalar_1²,-mass_scalar_1²+(q₁.q₁)/t²)
  195. 127.98 s gammaloop-nextest-integration> ·denom(2,q₄-q₀/t-q₁/t,mass_scalar_1²,
  196. 127.98 s gammaloop-nextest-integration> -mass_scalar_1²-2·(q₀.q₄)/t-2·(q₁.q₄)/t+(q₀.q₀)/t²+2·(q₀.q₁)/t²
  197. 127.98 s gammaloop-nextest-integration> +(q₁.q₁)/t²+(q₄.q₄)
  198. 127.98 s gammaloop-nextest-integration> ))
  199. 127.98 s gammaloop-nextest-integration> [2026-08-26 08:22:13.561] @approx::local_4d [{#uv, #inspect, #integrated}] DEBUG : Rescaled momenta expanded
  200. 127.98 s gammaloop-nextest-integration> field value
  201. 127.98 s gammaloop-nextest-integration> res n-terms: 1, byte size: 611,expr:
  202. 127.98 s gammaloop-nextest-integration> 1/(denom(0,q₀/t,mass_scalar_1²,-mass_scalar_1²+(q₀.q₀)/t²)
  203. 127.98 s gammaloop-nextest-integration> ·denom(1,-q₂+q₃-q₀/t,mass_scalar_1²,
  204. 127.98 s gammaloop-nextest-integration> -mass_scalar_1²+2·(q₀.q₂)/t-2·(q₀.q₃)/t+(q₀.q₀)/t²+(q₂.q₂)
  205. 127.98 s gammaloop-nextest-integration> -2·(q₂.q₃)+(q₃.q₃)
  206. 127.98 s gammaloop-nextest-integration> ))
  207. 127.98 s gammaloop-nextest-integration> [2026-08-26 08:22:13.562] @approx::local_4d [{#uv, #inspect, #integrated}] DEBUG : Rescaled momenta expanded
  208. 127.98 s gammaloop-nextest-integration> field value
  209. 127.98 s gammaloop-nextest-integration> res n-terms: 1, byte size: 611,expr:
  210. 127.98 s gammaloop-nextest-integration> 1/(denom(1,q₁/t,mass_scalar_1²,-mass_scalar_1²+(q₁.q₁)/t²)
  211. 127.98 s gammaloop-nextest-integration> ·denom(2,-q₀+q₃-q₁/t,mass_scalar_1²,
  212. 127.98 s gammaloop-nextest-integration> -mass_scalar_1²+2·(q₀.q₁)/t-2·(q₁.q₃)/t+(q₁.q₁)/t²+(q₀.q₀)
  213. 127.98 s gammaloop-nextest-integration> -2·(q₀.q₃)+(q₃.q₃)
  214. 127.98 s gammaloop-nextest-integration> ))
  215. 127.98 s gammaloop-nextest-integration> [2026-08-26 08:22:13.562] @approx::local_4d [{#uv, #inspect, #integrated}] DEBUG : Rescaled momenta expanded
  216. 127.98 s gammaloop-nextest-integration> field value
  217. 127.98 s gammaloop-nextest-integration> res n-terms: 1, byte size: 3,expr:
  218. 127.98 s gammaloop-nextest-integration> 1
  219. 127.98 s gammaloop-nextest-integration> [2026-08-26 08:22:13.563] @approx::final_integrand[{#generation, #profile, #uv, #graph, #summary}] DEBUG : Computed global numerator
  220. 127.98 s gammaloop-nextest-integration> field value
  221. 127.98 s gammaloop-nextest-integration> global_num n-terms: 1, byte size: 3,expr:
  222. 127.98 s gammaloop-nextest-integration> 1
  223. 127.98 s gammaloop-nextest-integration> span build_3d{span_context=true graph=sunrise current=subgraph=0, topo_order=0, dod=0}
  224. 127.98 s gammaloop-nextest-integration> [2026-08-26 08:22:13.567] @uv::approx [{#generation, #uv, #fourd}] DEBUG : Computing 4D
  225. 127.98 s gammaloop-nextest-integration> field value
  226. 127.98 s gammaloop-nextest-integration> simple subgraph(S_47,S_3I)*Approx(subgraph(S_3I,0)) of sunrise
  227. 127.98 s gammaloop-nextest-integration> span compute_4d{span_context=true graph=sunrise current=subgraph=3I, topo_order=1, dod=0 given=subgraph=0, topo_order=0, dod=0 reduced=SubSet { set: BitVec<usize, bitvec::order::Lsb0> { addr: 0x7fffb0026880, head: 000000, bits: 8, capacity: 64 } [0, 0, 1, 1, 0, 0, 1, 1], id: PhantomData<linnet::half_edge::involution::Hedge> }}
  228. 127.98 s gammaloop-nextest-integration> [2026-08-26 08:22:13.568] @approx::local_4d [{#uv, #algebra, #integrated, #start}] DEBUG :
  229. 127.98 s gammaloop-nextest-integration> field value
  230. 127.98 s gammaloop-nextest-integration> integrand n-terms: 1, byte size: 217,expr:
  231. 127.98 s gammaloop-nextest-integration> 1/(denom(0,q₀,mass_scalar_1²,-mass_scalar_1²+(q₀.q₀))·denom(2,q₂,mass_scalar_1²,-mass_scalar_1²+(q₂.q₂)))
  232. 127.98 s gammaloop-nextest-integration> reduced 3I
  233. 127.98 s gammaloop-nextest-integration> span grow{span_context=true current=subgraph=3I, topo_order=1, dod=0 given=subgraph=0, topo_order=0, dod=0}
  234. 127.98 s gammaloop-nextest-integration> [2026-08-26 08:22:13.568] @approx::local_4d [{#uv, #inspect, #integrated}] DEBUG : Rescaled momenta expanded
  235. 127.98 s gammaloop-nextest-integration> field value
  236. 127.98 s gammaloop-nextest-integration> res n-terms: 1, byte size: 611,expr:
  237. 127.98 s gammaloop-nextest-integration> 1/(denom(0,q₀/t,mass_scalar_1²,-mass_scalar_1²+(q₀.q₀)/t²)
  238. 127.98 s gammaloop-nextest-integration> ·denom(2,-q₁+q₃-q₀/t,mass_scalar_1²,
  239. 127.98 s gammaloop-nextest-integration> -mass_scalar_1²+2·(q₀.q₁)/t-2·(q₀.q₃)/t+(q₀.q₀)/t²+(q₁.q₁)
  240. 127.98 s gammaloop-nextest-integration> -2·(q₁.q₃)+(q₃.q₃)
  241. 127.98 s gammaloop-nextest-integration> ))
  242. 127.98 s gammaloop-nextest-integration> span t{span_context=true current=subgraph=3I, topo_order=1, dod=0 given=subgraph=0, topo_order=0, dod=0}
  243. 127.98 s gammaloop-nextest-integration> [2026-08-26 08:22:13.568] @approx::local_4d [{#uv, #integrated, #rescaled}] DEBUG : Rescaled expanded
  244. 127.98 s gammaloop-nextest-integration> field value
  245. 127.98 s gammaloop-nextest-integration> n_loops 1
  246. 127.98 s gammaloop-nextest-integration> res n-terms: 1, byte size: 723,expr:
  247. 127.98 s gammaloop-nextest-integration> 1/(denom(0,q₀,mUVexp²+t²·mass_scalar_1²,-mUV²+t²·(-mass_scalar_1²+(q₀.q₀)/t²)+t²·mUVexp²)
  248. 127.98 s gammaloop-nextest-integration> ·denom(2,-q₀,mUVexp²+t²·mass_scalar_1²,
  249. 127.98 s gammaloop-nextest-integration> -mUV²
  250. 127.98 s gammaloop-nextest-integration> +t²
  251. 127.98 s gammaloop-nextest-integration> ·(-mass_scalar_1²+2·(q₀.q₁)/t-2·(q₀.q₃)/t+(q₀.q₀)/t²+(q₁.q₁)
  252. 127.98 s gammaloop-nextest-integration> -2·(q₁.q₃)+(q₃.q₃)
  253. 127.98 s gammaloop-nextest-integration> )
  254. 127.98 s gammaloop-nextest-integration> +t²·mUVexp²
  255. 127.98 s gammaloop-nextest-integration> ))
  256. 127.98 s gammaloop-nextest-integration> span t{span_context=true current=subgraph=3I, topo_order=1, dod=0 given=subgraph=0, topo_order=0, dod=0}
  257. 127.98 s gammaloop-nextest-integration> [2026-08-26 08:22:13.568] @approx::local_4d [{#uv, #integrated, #series}] DEBUG : Series expanded
  258. 127.98 s gammaloop-nextest-integration> field value
  259. 127.98 s gammaloop-nextest-integration> res n-terms: 1, byte size: 223,expr:
  260. 127.98 s gammaloop-nextest-integration> 1/(denom(0,q₀,mUVexp²,-mUV²+(q₀.q₀))·denom(2,-q₀,mUVexp²,-mUV²+(q₀.q₀)))
  261. 127.98 s gammaloop-nextest-integration> span t{span_context=true current=subgraph=3I, topo_order=1, dod=0 given=subgraph=0, topo_order=0, dod=0}
  262. 127.98 s gammaloop-nextest-integration> [2026-08-26 08:22:13.568] @approx::local_4d [{#uv, #integrated, #series}] DEBUG : Evaluated at t = 1
  263. 127.98 s gammaloop-nextest-integration> field value
  264. 127.98 s gammaloop-nextest-integration> res n-terms: 1, byte size: 223,expr:
  265. 127.98 s gammaloop-nextest-integration> 1/(denom(0,q₀,mUVexp²,-mUV²+(q₀.q₀))·denom(2,-q₀,mUVexp²,-mUV²+(q₀.q₀)))
  266. 127.98 s gammaloop-nextest-integration> span t{span_context=true current=subgraph=3I, topo_order=1, dod=0 given=subgraph=0, topo_order=0, dod=0}
  267. 127.98 s gammaloop-nextest-integration> [2026-08-26 08:22:13.568] @approx::local_4d [{#uv, #collect, #integrated}] DEBUG : After gamma chain collection
  268. 127.98 s gammaloop-nextest-integration> field value
  269. 127.98 s gammaloop-nextest-integration> expr n-terms: 1, byte size: 223,expr:
  270. 127.98 s gammaloop-nextest-integration> 1/(denom(0,q₀,mUVexp²,-mUV²+(q₀.q₀))·denom(2,-q₀,mUVexp²,-mUV²+(q₀.q₀)))
  271. 127.98 s gammaloop-nextest-integration> span t{span_context=true current=subgraph=3I, topo_order=1, dod=0 given=subgraph=0, topo_order=0, dod=0}
  272. 127.98 s gammaloop-nextest-integration> [2026-08-26 08:22:13.569] @approx::local_4d [{#profile, #uv, #collect, #integrated, #start, #trace}] DEBUG : After gamma schoonschip
  273. 127.98 s gammaloop-nextest-integration> field value
  274. 127.98 s gammaloop-nextest-integration> expr n-terms: 1, byte size: 223,expr:
  275. 127.98 s gammaloop-nextest-integration> 1/(denom(0,q₀,mUVexp²,-mUV²+(q₀.q₀))·denom(2,-q₀,mUVexp²,-mUV²+(q₀.q₀)))
  276. 127.98 s gammaloop-nextest-integration> span t{span_context=true current=subgraph=3I, topo_order=1, dod=0 given=subgraph=0, topo_order=0, dod=0}
  277. 127.98 s gammaloop-nextest-integration> [2026-08-26 08:22:13.569] @approx::local_4d [{#profile, #uv, #collect, #integrated, #start, #trace}] DEBUG : After gamma collection
  278. 127.98 s gammaloop-nextest-integration> field value
  279. 127.98 s gammaloop-nextest-integration> expr n-terms: 1, byte size: 223,expr:
  280. 127.98 s gammaloop-nextest-integration> 1/(denom(0,q₀,mUVexp²,-mUV²+(q₀.q₀))·denom(2,-q₀,mUVexp²,-mUV²+(q₀.q₀)))
  281. 127.98 s gammaloop-nextest-integration> span t{span_context=true current=subgraph=3I, topo_order=1, dod=0 given=subgraph=0, topo_order=0, dod=0}
  282. 127.98 s gammaloop-nextest-integration> [2026-08-26 08:22:13.569] @approx::local_4d [{#profile, #uv, #gamma, #integrated, #start, #trace, #vakint}] DEBUG : After gamma simplification
  283. 127.98 s gammaloop-nextest-integration> field value
  284. 127.98 s gammaloop-nextest-integration> expr n-terms: 1, byte size: 223,expr:
  285. 127.98 s gammaloop-nextest-integration> 1/(denom(0,q₀,mUVexp²,-mUV²+(q₀.q₀))·denom(2,-q₀,mUVexp²,-mUV²+(q₀.q₀)))
  286. 127.98 s gammaloop-nextest-integration> span t{span_context=true current=subgraph=3I, topo_order=1, dod=0 given=subgraph=0, topo_order=0, dod=0}
  287. 127.98 s gammaloop-nextest-integration> [2026-08-26 08:22:13.569] @approx::local_4d [{#profile, #uv, #integrated, #schoonschip, #start, #trace, #vakint}] DEBUG : After Schoonschip net
  288. 127.98 s gammaloop-nextest-integration> field value
  289. 127.98 s gammaloop-nextest-integration> expr n-terms: 1, byte size: 223,expr:
  290. 127.98 s gammaloop-nextest-integration> 1/(denom(0,q₀,mUVexp²,-mUV²+(q₀.q₀))·denom(2,-q₀,mUVexp²,-mUV²+(q₀.q₀)))
  291. 127.98 s gammaloop-nextest-integration> ... omitted 20090 more lines; see full nextest output above
  292. 127.98 s gammaloop-nextest-integration>
  293. 127.98 s gammaloop-nextest-integration> 9. gammaloop-integration-tests::uv::se1l_uv
  294. 127.99 s gammaloop-nextest-integration> failure: test failure with exit code 101
  295. 127.99 s gammaloop-nextest-integration> system-out
  296. 127.99 s gammaloop-nextest-integration> running 1 test
  297. 127.99 s gammaloop-nextest-integration> test se1l_uv has been running for over 60 seconds
  298. 127.99 s gammaloop-nextest-integration> +------+-----------------+---------+--------+----------+-----------------------------------------------------------------------------------------------------------------------+-------+
  299. 127.99 s gammaloop-nextest-integration> | case | check | graph | status | sigma | threshold | error |
  300. 127.99 s gammaloop-nextest-integration> +------+-----------------+---------+--------+----------+-----------------------------------------------------------------------------------------------------------------------+-------+
  301. 127.99 s gammaloop-nextest-integration> | se1l | uv_profile | - | FAIL | - | - | - |
  302. 127.99 s gammaloop-nextest-integration> +------+-----------------+---------+--------+----------+-----------------------------------------------------------------------------------------------------------------------+-------+
  303. 127.99 s gammaloop-nextest-integration> | se1l | m_uv.inspect | inspect | pass | - | best inspect relative delta 1.097e-1 >= 1000*accuracy 1.000e-7 (accuracy=1.000e-10, exponent=+2.0, seed=1, probes=10) | - |
  304. 127.99 s gammaloop-nextest-integration> +------+-----------------+---------+--------+----------+-----------------------------------------------------------------------------------------------------------------------+-------+
  305. 127.99 s gammaloop-nextest-integration> | se1l | m_uv.integrated | se1l | pass | 0.1sigma | compatible within 2sigma | - |
  306. 127.99 s gammaloop-nextest-integration> +------+-----------------+---------+--------+----------+-----------------------------------------------------------------------------------------------------------------------+-------+
  307. 127.99 s gammaloop-nextest-integration> | se1l | rls.inspect | inspect | pass | - | best inspect relative delta 4.499e-2 >= 1000*accuracy 1.000e-7 (accuracy=1.000e-10, exponent=+2.0, seed=1, probes=10) | - |
  308. 127.99 s gammaloop-nextest-integration> +------+-----------------+---------+--------+----------+-----------------------------------------------------------------------------------------------------------------------+-------+
  309. 127.99 s gammaloop-nextest-integration> | se1l | rls.integrated | se1l | pass | 0.0sigma | compatible within 2sigma | - |
  310. 127.99 s gammaloop-nextest-integration> +------+-----------------+---------+--------+----------+-----------------------------------------------------------------------------------------------------------------------+-------+
  311. 127.99 s gammaloop-nextest-integration> | se1l | mu_r.inspect | inspect | pass | - | best inspect relative delta 1.424e-1 >= 1000*accuracy 1.000e-7 (accuracy=1.000e-10, exponent=+2.0, seed=1, probes=10) | - |
  312. 127.99 s gammaloop-nextest-integration> +------+-----------------+---------+--------+----------+-----------------------------------------------------------------------------------------------------------------------+-------+
  313. 127.99 s gammaloop-nextest-integration> | se1l | target | - | pass | - | 2sigma | - |
  314. 127.99 s gammaloop-nextest-integration> +------+-----------------+---------+--------+----------+-----------------------------------------------------------------------------------------------------------------------+-------+
  315. 127.99 s gammaloop-nextest-integration> test se1l_uv ... FAILED
  316. 127.99 s gammaloop-nextest-integration>
  317. 127.99 s gammaloop-nextest-integration> failures:
  318. 127.99 s gammaloop-nextest-integration>
  319. 127.99 s gammaloop-nextest-integration> failures:
  320. 127.99 s gammaloop-nextest-integration> se1l_uv
  321. 127.99 s gammaloop-nextest-integration>
  322. 127.99 s gammaloop-nextest-integration> test result: FAILED. 0 passed; 1 failed; 0 ignored; 0 measured; 24 filtered out; finished in 102.73s
  323. 127.99 s gammaloop-nextest-integration> system-err
  324. 127.99 s gammaloop-nextest-integration> [2026-08-26 08:22:13.006] @gammaloop_api::se... INFO : Running command run generate
  325. 127.99 s gammaloop-nextest-integration> [2026-08-26 08:22:13.006] @gammaloop_api::se... INFO : Starting command block generate
  326. 127.99 s gammaloop-nextest-integration> [2026-08-26 08:22:13.006] @gammaloop_api::se... INFO : Running command import model sm-default
  327. 127.99 s gammaloop-nextest-integration> [2026-08-26 08:22:13.006] @import::model INFO : Loading built-in JSON model sm-default
  328. 127.99 s gammaloop-nextest-integration> [2026-08-26 08:22:13.046] @gammalooprs::model INFO : The following 11 external parameters were forced to zero by the restriction card:
  329. 127.99 s gammaloop-nextest-integration> lamWS, AWS, rhoWS, etaWS, ymc, yme, ymm, MC, Me, MM, WTau
  330. 127.99 s gammaloop-nextest-integration> [2026-08-26 08:22:13.046] @gammalooprs::model INFO : The following 34 vertex rules were removed by the restriction card:
  331. 127.99 s gammaloop-nextest-integration> V_82 -> (c~, d, G+) | V_83 -> (t~, d, G+) | V_84 -> (c~, s, G+) | V_85 -> (t~, s, G+) | V_86 -> (u~, b, G+) | V_87 -> (c~, b, G+) | V_90 -> (c~, d, W+) | V_91 -> (t~, d, W+) | V_92 -> (u~, s, W+) | V_94 -> (t~, s, W+) | V_95 -> (u~, b, W+) | V_96 -> (c~, b, W+) | V_101 -> (e+, e-, G0) | V_102 -> (mu+, mu-, G0) | V_104 -> (e+, e-, H) | V_105 -> (mu+, mu-, H) | V_110 -> (ve~, e-, G+) | V_111 -> (vm~, mu-, G+) | V_116 -> (b~, u, G-) | V_117 -> (d~, c, G-) | V_118 -> (s~, c, G-) | V_119 -> (b~, c, G-) | V_120 -> (d~, t, G-) | V_121 -> (s~, t, G-) | V_124 -> (s~, u, W-) | V_125 -> (b~, u, W-) | V_126 -> (d~, c, W-) | V_128 -> (b~, c, W-) | V_129 -> (d~, t, W-) | V_130 -> (s~, t, W-) | V_138 -> (c~, c, G0) | V_140 -> (c~, c, H) | V_145 -> (e+, ve, G-) | V_146 -> (mu+, vm, G-)
  332. 127.99 s gammaloop-nextest-integration> [2026-08-26 08:22:13.046] @gammalooprs::model INFO : The following 36 couplings were removed by the restriction card:
  333. 127.99 s gammaloop-nextest-integration> GC_13, GC_14, GC_16, GC_17, GC_18, GC_19, GC_20, GC_22, GC_23, GC_24, GC_25, GC_26, GC_28, GC_29, GC_42, GC_43, GC_44, GC_46, GC_47, GC_48, GC_84, GC_85, GC_86, GC_87, GC_88, GC_89, GC_90, GC_91, GC_92, GC_93, GC_101, GC_102, GC_103, GC_105, GC_106, GC_107
  334. 127.99 s gammaloop-nextest-integration> [2026-08-26 08:22:13.047] @gammaloop_api::se... INFO : Running command remove processes
  335. 127.99 s gammaloop-nextest-integration> [2026-08-26 08:22:13.047] @gammaloop_api::se... INFO : Running command set global kv global.generation.uv.generate_integrated=true
  336. 127.99 s gammaloop-nextest-integration> [2026-08-26 08:22:13.047] @gammaloop_api::se... INFO : Running command import graphs ./tests/resources/graphs/uv_tests/se1l.dot -p se1l -i se1l
  337. 127.99 s gammaloop-nextest-integration> [2026-08-26 08:22:13.047] @commands::import INFO : Loading graphs from '/build/source/tests/resources/graphs/uv_tests/se1l.dot'
  338. 127.99 s gammaloop-nextest-integration> [2026-08-26 08:22:13.055] @gammaloop_api::se... INFO : Running command generate existing -p se1l -i se1l
  339. 127.99 s gammaloop-nextest-integration> [2026-08-26 08:22:14.043] @commands::generate INFO :
  340. 127.99 s gammaloop-nextest-integration> Integrand generation summary
  341. 127.99 s gammaloop-nextest-integration> peak RAM 89.81 MiB | cores 1
  342. 127.99 s gammaloop-nextest-integration> ╭───────────┬───────┬─────────┬─────────────┬─────────────┬────────────────┬─────────────╮
  343. 127.99 s gammaloop-nextest-integration> │ integrand │ graph │ # evals │ expr build │ spenso │ symbolica eval │ compile │
  344. 127.99 s gammaloop-nextest-integration> ├───────────┼───────┼─────────┼─────────────┼─────────────┼────────────────┼─────────────┤
  345. 127.99 s gammaloop-nextest-integration> │ se1l │ se1l │ 5 │ 782ms (90%) │ 33ms (3.8%) │ 53ms (6.1%) │ 0ms (0.00%) │
  346. 127.99 s gammaloop-nextest-integration> ├───────────┼───────┼─────────┼─────────────┼─────────────┼────────────────┼─────────────┤
  347. 127.99 s gammaloop-nextest-integration> │ Total │ │ 5 │ 782ms (90%) │ 33ms (3.8%) │ 53ms (6.1%) │ 0ms (0.00%) │
  348. 127.99 s gammaloop-nextest-integration> ╰───────────┴───────┴─────────┴─────────────┴─────────────┴────────────────┴─────────────╯
  349. 127.99 s gammaloop-nextest-integration> [2026-08-26 08:22:14.044] @gammaloop_api::se... INFO : Running command set process -p se1l -i se1l kv general.m_uv=0.2
  350. 127.99 s gammaloop-nextest-integration> [2026-08-26 08:22:14.045] @gammaloop_api::se... INFO : Running command set process -p se1l -i se1l kv general.mu_r=0.2
  351. 127.99 s gammaloop-nextest-integration> [2026-08-26 08:22:14.046] @gammaloop_api::se... INFO : Running command set process -p se1l -i se1l kv general.renormalization_localization_scale=0.2
  352. 127.99 s gammaloop-nextest-integration> [2026-08-26 08:22:14.047] @gammaloop_api::se... INFO : Running command duplicate integrand -p se1l -i se1l --output_process_name se1l --output_integrand_name se1l_muv_shifted
  353. 127.99 s gammaloop-nextest-integration> [2026-08-26 08:22:14.048] @gammaloop_api::se... INFO : Running command set process -p se1l -i se1l_muv_shifted kv general.m_uv=0.5
  354. 127.99 s gammaloop-nextest-integration> [2026-08-26 08:22:14.048] @gammaloop_api::se... INFO : Running command duplicate integrand -p se1l -i se1l --output_process_name se1l --output_integrand_name se1l_rls_shifted
  355. 127.99 s gammaloop-nextest-integration> [2026-08-26 08:22:14.053] @gammaloop_api::se... INFO : Running command set process -p se1l -i se1l_rls_shifted kv general.renormalization_localization_scale=1
  356. 127.99 s gammaloop-nextest-integration> [2026-08-26 08:22:14.054] @gammaloop_api::se... INFO : Running command duplicate integrand -p se1l -i se1l --output_process_name se1l --output_integrand_name se1l_mur_shifted
  357. 127.99 s gammaloop-nextest-integration> [2026-08-26 08:22:14.059] @gammaloop_api::se... INFO : Running command set process -p se1l -i se1l_mur_shifted kv general.mu_r=0.8
  358. 127.99 s gammaloop-nextest-integration> [2026-08-26 08:22:14.065] @process::amplitude WARNING : External state 0 ('g', PDG 21, helicity +) is off shell: p^2 = +2.5e5, expected m^2 = +0e0 (|Δ| = +2.5e5). Fixed-helicity spinor/vector/tensor external states may be ill-defined at this kinematic point.
  359. 127.99 s gammaloop-nextest-integration> field value
  360. 127.99 s gammaloop-nextest-integration> span warm_up{integrand.name=se1l}
  361. 127.99 s gammaloop-nextest-integration> [2026-08-26 08:22:14.065] @process::amplitude WARNING : External state 1 ('g', PDG 21, helicity -) is off shell: p^2 = +2.5e5, expected m^2 = +0e0 (|Δ| = +2.5e5). Fixed-helicity spinor/vector/tensor external states may be ill-defined at this kinematic point.
  362. 127.99 s gammaloop-nextest-integration> field value
  363. 127.99 s gammaloop-nextest-integration> span warm_up{integrand.name=se1l}
  364. 127.99 s gammaloop-nextest-integration> [2026-08-26 08:22:14.065] @process::amplitude INFO : Input is above threshold: 1 existing threshold E-surfaces across 1/1 graph groups
  365. 127.99 s gammaloop-nextest-integration> field value
  366. 127.99 s gammaloop-nextest-integration> existing_esurfaces 1
  367. 127.99 s gammaloop-nextest-integration> group_count 1
  368. 127.99 s gammaloop-nextest-integration> groups_above_threshold 1
  369. 127.99 s gammaloop-nextest-integration> integrand se1l
  370. 127.99 s gammaloop-nextest-integration> span warm_up{integrand.name=se1l}
  371. 127.99 s gammaloop-nextest-integration> threshold_status above threshold
  372. 127.99 s gammaloop-nextest-integration> [2026-08-26 08:22:14.065] @process::amplitude INFO : overlap structure of group 0: [1: [0(2,3)]]
  373. 127.99 s gammaloop-nextest-integration> field value
  374. 127.99 s gammaloop-nextest-integration> span warm_up{integrand.name=se1l}
  375. 127.99 s gammaloop-nextest-integration> [2026-08-26 08:22:14.199] @commands::profile INFO :
  376. 127.99 s gammaloop-nextest-integration> ╭───────┬──────┬──────────┬───────┬─────┬──────────┬───────────╮
  377. 127.99 s gammaloop-nextest-integration> │ fixed │ → ∞ │ slope │ r2 │ DOD │ bare DOD │ inspect │
  378. 127.99 s gammaloop-nextest-integration> ├───────┼──────┼──────────┼───────┼─────┼──────────┼───────────┤
  379. 127.99 s gammaloop-nextest-integration> │ {} │ {e3} │ 1.639236 │ 0.904 │ 2 │ 2 │ arb retry │
  380. 127.99 s gammaloop-nextest-integration> │ {} │ {e2} │ 1.698834 │ 0.902 │ 2 │ 2 │ arb retry │
  381. 127.99 s gammaloop-nextest-integration> ╰───────┴──────┴──────────┴───────┴─────┴──────────┴───────────╯
  382. 127.99 s gammaloop-nextest-integration> [2026-08-26 08:22:14.199] @commands::profile INFO :
  383. 127.99 s gammaloop-nextest-integration> ╭───────┬──────┬─────────────┬──────────┬───────┬─────┬──────────┬───────────╮
  384. 127.99 s gammaloop-nextest-integration> │ fixed │ → ∞ │ orientation │ slope │ r2 │ DOD │ bare DOD │ inspect │
  385. 127.99 s gammaloop-nextest-integration> ├───────┼──────┼─────────────┼──────────┼───────┼─────┼──────────┼───────────┤
  386. 127.99 s gammaloop-nextest-integration> │ {} │ {e3} │ 00-+ │ 0.343429 │ 0.145 │ 0 │ 2 │ arb retry │
  387. 127.99 s gammaloop-nextest-integration> │ {} │ {e3} │ 00+- │ 0.342577 │ 0.135 │ 0 │ 2 │ arb retry │
  388. 127.99 s gammaloop-nextest-integration> │ {} │ {e2} │ 00-+ │ 0.385975 │ 0.161 │ 0 │ 2 │ arb retry │
  389. 127.99 s gammaloop-nextest-integration> │ {} │ {e2} │ 00+- │ 0.384920 │ 0.192 │ 0 │ 2 │ arb retry │
  390. 127.99 s gammaloop-nextest-integration> ╰───────┴──────┴─────────────┴──────────┴───────┴─────┴──────────┴───────────╯
  391. 127.99 s gammaloop-nextest-integration> [2026-08-26 08:22:14.200] @gammaloop_api::se... INFO : Running command set process kv integrator.target_relative_accuracy=0.001 integrator.n_increase=0 integrator.n_start=50000 integrator.n_max=400000 integrator.seed=1337
  392. 127.99 s gammaloop-nextest-integration> [2026-08-26 08:22:14.201] @commands::integrate INFO : Created workspace directory at /build/source/tests/artifacts/se1l/integration_workspace_se1l
  393. 127.99 s gammaloop-nextest-integration> [2026-08-26 08:22:14.231] @commands::integrate INFO : No integration state found, starting new integration
  394. 127.99 s gammaloop-nextest-integration> [2026-08-26 08:22:14.231] @commands::integrate INFO : Gammaloop now integrates se1l@se1l, se1l@se1l_muv_shifted, se1l@se1l_rls_shifted
  395. 127.99 s gammaloop-nextest-integration> [2026-08-26 08:22:14.234] @process::amplitude WARNING : External state 0 ('g', PDG 21, helicity +) is off shell: p^2 = +2.5e5, expected m^2 = +0e0 (|Δ| = +2.5e5). Fixed-helicity spinor/vector/tensor external states may be ill-defined at this kinematic point.
  396. 127.99 s gammaloop-nextest-integration> field value
  397. 127.99 s gammaloop-nextest-integration> span warm_up{integrand.name=se1l}
  398. 127.99 s gammaloop-nextest-integration> [2026-08-26 08:22:14.234] @process::amplitude WARNING : External state 1 ('g', PDG 21, helicity -) is off shell: p^2 = +2.5e5, expected m^2 = +0e0 (|Δ| = +2.5e5). Fixed-helicity spinor/vector/tensor external states may be ill-defined at this kinematic point.
  399. 127.99 s gammaloop-nextest-integration> field value
  400. 127.99 s gammaloop-nextest-integration> span warm_up{integrand.name=se1l}
  401. 127.99 s gammaloop-nextest-integration> [2026-08-26 08:22:14.235] @process::amplitude INFO : Input is above threshold: 1 existing threshold E-surfaces across 1/1 graph groups
  402. 127.99 s gammaloop-nextest-integration> field value
  403. 127.99 s gammaloop-nextest-integration> existing_esurfaces 1
  404. 127.99 s gammaloop-nextest-integration> group_count 1
  405. 127.99 s gammaloop-nextest-integration> groups_above_threshold 1
  406. 127.99 s gammaloop-nextest-integration> integrand se1l
  407. 127.99 s gammaloop-nextest-integration> span warm_up{integrand.name=se1l}
  408. 127.99 s gammaloop-nextest-integration> threshold_status above threshold
  409. 127.99 s gammaloop-nextest-integration> [2026-08-26 08:22:14.235] @process::amplitude INFO : overlap structure of group 0: [1: [0(2,3)]]
  410. 127.99 s gammaloop-nextest-integration> field value
  411. 127.99 s gammaloop-nextest-integration> span warm_up{integrand.name=se1l}
  412. 127.99 s gammaloop-nextest-integration> [2026-08-26 08:22:14.235] @process::amplitude WARNING : External state 0 ('g', PDG 21, helicity +) is off shell: p^2 = +2.5e5, expected m^2 = +0e0 (|Δ| = +2.5e5). Fixed-helicity spinor/vector/tensor external states may be ill-defined at this kinematic point.
  413. 127.99 s gammaloop-nextest-integration> field value
  414. 127.99 s gammaloop-nextest-integration> span warm_up{integrand.name=se1l_muv_shifted}
  415. 127.99 s gammaloop-nextest-integration> [2026-08-26 08:22:14.236] @process::amplitude WARNING : External state 1 ('g', PDG 21, helicity -) is off shell: p^2 = +2.5e5, expected m^2 = +0e0 (|Δ| = +2.5e5). Fixed-helicity spinor/vector/tensor external states may be ill-defined at this kinematic point.
  416. 127.99 s gammaloop-nextest-integration> field value
  417. 127.99 s gammaloop-nextest-integration> span warm_up{integrand.name=se1l_muv_shifted}
  418. 127.99 s gammaloop-nextest-integration> [2026-08-26 08:22:14.236] @process::amplitude INFO : Input is above threshold: 1 existing threshold E-surfaces across 1/1 graph groups
  419. 127.99 s gammaloop-nextest-integration> field value
  420. 127.99 s gammaloop-nextest-integration> existing_esurfaces 1
  421. 127.99 s gammaloop-nextest-integration> group_count 1
  422. 127.99 s gammaloop-nextest-integration> groups_above_threshold 1
  423. 127.99 s gammaloop-nextest-integration> integrand se1l_muv_shifted
  424. 127.99 s gammaloop-nextest-integration> span warm_up{integrand.name=se1l_muv_shifted}
  425. 127.99 s gammaloop-nextest-integration> threshold_status above threshold
  426. 127.99 s gammaloop-nextest-integration> [2026-08-26 08:22:14.236] @process::amplitude INFO : overlap structure of group 0: [1: [0(2,3)]]
  427. 127.99 s gammaloop-nextest-integration> field value
  428. 127.99 s gammaloop-nextest-integration> span warm_up{integrand.name=se1l_muv_shifted}
  429. 127.99 s gammaloop-nextest-integration> [2026-08-26 08:22:14.237] @process::amplitude WARNING : External state 0 ('g', PDG 21, helicity +) is off shell: p^2 = +2.5e5, expected m^2 = +0e0 (|Δ| = +2.5e5). Fixed-helicity spinor/vector/tensor external states may be ill-defined at this kinematic point.
  430. 127.99 s gammaloop-nextest-integration> field value
  431. 127.99 s gammaloop-nextest-integration> span warm_up{integrand.name=se1l_rls_shifted}
  432. 127.99 s gammaloop-nextest-integration> [2026-08-26 08:22:14.237] @process::amplitude WARNING : External state 1 ('g', PDG 21, helicity -) is off shell: p^2 = +2.5e5, expected m^2 = +0e0 (|Δ| = +2.5e5). Fixed-helicity spinor/vector/tensor external states may be ill-defined at this kinematic point.
  433. 127.99 s gammaloop-nextest-integration> field value
  434. 127.99 s gammaloop-nextest-integration> span warm_up{integrand.name=se1l_rls_shifted}
  435. 127.99 s gammaloop-nextest-integration> [2026-08-26 08:22:14.237] @process::amplitude INFO : Input is above threshold: 1 existing threshold E-surfaces across 1/1 graph groups
  436. 127.99 s gammaloop-nextest-integration> field value
  437. 127.99 s gammaloop-nextest-integration> existing_esurfaces 1
  438. 127.99 s gammaloop-nextest-integration> group_count 1
  439. 127.99 s gammaloop-nextest-integration> groups_above_threshold 1
  440. 127.99 s gammaloop-nextest-integration> integrand se1l_rls_shifted
  441. 127.99 s gammaloop-nextest-integration> span warm_up{integrand.name=se1l_rls_shifted}
  442. 127.99 s gammaloop-nextest-integration> threshold_status above threshold
  443. 127.99 s gammaloop-nextest-integration> ... omitted 1410 more lines; see full nextest output above
  444. 127.99 s gammaloop-nextest-integration> =========================================
  445. 128.30 s error: Cannot build '/nix/store/z64pzsmdh7l76572yr3sfrwn8clcnq7n-gammaloop-nextest-integration.drv'.
  446. 128.30 s Reason: builder failed with exit code 100.
  447. 128.30 s Output paths:
  448. 128.30 s /nix/store/ig9divdxs867pdkmxwq7j78q7xgh2c40-gammaloop-nextest-integration
  449. 128.30 s Last 2048 log lines:
  450. 128.30 s > span warm_up{integrand.name=se1l_muv_shifted}
  451. 128.30 s > threshold_status above threshold
  452. 128.30 s > [2026-08-26 08:23:55.141] @process::amplitude INFO : overlap structure of group 0: [1: [0(2,3)]]
  453. 128.30 s > field value
  454. 128.30 s > span warm_up{integrand.name=se1l_muv_shifted}
  455. 128.30 s > [2026-08-26 08:23:55.147] @process::amplitude WARNING : External state 0 ('g', PDG 21, helicity +) is off shell: p^2 = +2.5e5, expected m^2 = +0e0 (|Δ| = +2.5e5). Fixed-helicity spinor/vector/tensor external states may be ill-defined at this kinematic point.
  456. 128.30 s > field value
  457. 128.30 s > span warm_up{integrand.name=se1l}
  458. 128.30 s > [2026-08-26 08:23:55.147] @process::amplitude WARNING : External state 1 ('g', PDG 21, helicity -) is off shell: p^2 = +2.5e5, expected m^2 = +0e0 (|Δ| = +2.5e5). Fixed-helicity spinor/vector/tensor external states may be ill-defined at this kinematic point.
  459. 128.30 s > field value
  460. 128.30 s > span warm_up{integrand.name=se1l}
  461. 128.30 s > [2026-08-26 08:23:55.147] @process::amplitude INFO : Input is above threshold: 1 existing threshold E-surfaces across 1/1 graph groups
  462. 128.30 s > field value
  463. 128.30 s > existing_esurfaces 1
  464. 128.30 s > group_count 1
  465. 128.30 s > groups_above_threshold 1
  466. 128.30 s > integrand se1l
  467. 128.30 s > span warm_up{integrand.name=se1l}
  468. 128.30 s > threshold_status above threshold
  469. 128.30 s > [2026-08-26 08:23:55.147] @process::amplitude INFO : overlap structure of group 0: [1: [0(2,3)]]
  470. 128.30 s > field value
  471. 128.30 s > span warm_up{integrand.name=se1l}
  472. 128.30 s > [2026-08-26 08:23:55.153] @process::amplitude WARNING : External state 0 ('g', PDG 21, helicity +) is off shell: p^2 = +2.5e5, expected m^2 = +0e0 (|Δ| = +2.5e5). Fixed-helicity spinor/vector/tensor external states may be ill-defined at this kinematic point.
  473. 128.30 s > field value
  474. 128.30 s > span warm_up{integrand.name=se1l_muv_shifted}
  475. 128.30 s > [2026-08-26 08:23:55.153] @process::amplitude WARNING : External state 1 ('g', PDG 21, helicity -) is off shell: p^2 = +2.5e5, expected m^2 = +0e0 (|Δ| = +2.5e5). Fixed-helicity spinor/vector/tensor external states may be ill-defined at this kinematic point.
  476. 128.30 s > field value
  477. 128.30 s > span warm_up{integrand.name=se1l_muv_shifted}
  478. 128.30 s > [2026-08-26 08:23:55.153] @process::amplitude INFO : Input is above threshold: 1 existing threshold E-surfaces across 1/1 graph groups
  479. 128.30 s > field value
  480. 128.30 s > existing_esurfaces 1
  481. 128.30 s > group_count 1
  482. 128.30 s > groups_above_threshold 1
  483. 128.30 s > integrand se1l_muv_shifted
  484. 128.30 s > span warm_up{integrand.name=se1l_muv_shifted}
  485. 128.30 s > threshold_status above threshold
  486. 128.30 s > [2026-08-26 08:23:55.153] @process::amplitude INFO : overlap structure of group 0: [1: [0(2,3)]]
  487. 128.30 s > field value
  488. 128.30 s > span warm_up{integrand.name=se1l_muv_shifted}
  489. 128.30 s > [2026-08-26 08:23:55.159] @process::amplitude WARNING : External state 0 ('g', PDG 21, helicity +) is off shell: p^2 = +2.5e5, expected m^2 = +0e0 (|Δ| = +2.5e5). Fixed-helicity spinor/vector/tensor external states may be ill-defined at this kinematic point.
  490. 128.30 s > field value
  491. 128.30 s > span warm_up{integrand.name=se1l}
  492. 128.30 s > [2026-08-26 08:23:55.159] @process::amplitude WARNING : External state 1 ('g', PDG 21, helicity -) is off shell: p^2 = +2.5e5, expected m^2 = +0e0 (|Δ| = +2.5e5). Fixed-helicity spinor/vector/tensor external states may be ill-defined at this kinematic point.
  493. 128.30 s > field value
  494. 128.30 s > span warm_up{integrand.name=se1l}
  495. 128.30 s > [2026-08-26 08:23:55.159] @process::amplitude INFO : Input is above threshold: 1 existing threshold E-surfaces across 1/1 graph groups
  496. 128.30 s > field value
  497. 128.30 s > existing_esurfaces 1
  498. 128.30 s > group_count 1
  499. 128.30 s > groups_above_threshold 1
  500. 128.30 s > integrand se1l
  501. 128.30 s > span warm_up{integrand.name=se1l}
  502. 128.30 s > threshold_status above threshold
  503. 128.30 s > [2026-08-26 08:23:55.159] @process::amplitude INFO : overlap structure of group 0: [1: [0(2,3)]]
  504. 128.30 s > field value
  505. 128.30 s > span warm_up{integrand.name=se1l}
  506. 128.30 s > [2026-08-26 08:23:55.165] @process::amplitude WARNING : External state 0 ('g', PDG 21, helicity +) is off shell: p^2 = +2.5e5, expected m^2 = +0e0 (|Δ| = +2.5e5). Fixed-helicity spinor/vector/tensor external states may be ill-defined at this kinematic point.
  507. 128.30 s > field value
  508. 128.30 s > span warm_up{integrand.name=se1l_muv_shifted}
  509. 128.30 s > [2026-08-26 08:23:55.165] @process::amplitude WARNING : External state 1 ('g', PDG 21, helicity -) is off shell: p^2 = +2.5e5, expected m^2 = +0e0 (|Δ| = +2.5e5). Fixed-helicity spinor/vector/tensor external states may be ill-defined at this kinematic point.
  510. 128.30 s > field value
  511. 128.30 s > span warm_up{integrand.name=se1l_muv_shifted}
  512. 128.30 s > [2026-08-26 08:23:55.166] @process::amplitude INFO : Input is above threshold: 1 existing threshold E-surfaces across 1/1 graph groups
  513. 128.30 s > field value
  514. 128.30 s > existing_esurfaces 1
  515. 128.30 s > group_count 1
  516. 128.30 s > groups_above_threshold 1
  517. 128.30 s > integrand se1l_muv_shifted
  518. 128.30 s > span warm_up{integrand.name=se1l_muv_shifted}
  519. 128.30 s > threshold_status above threshold
  520. 128.30 s > [2026-08-26 08:23:55.166] @process::amplitude INFO : overlap structure of group 0: [1: [0(2,3)]]
  521. 128.30 s > field value
  522. 128.30 s > span warm_up{integrand.name=se1l_muv_shifted}
  523. 128.30 s > [2026-08-26 08:23:55.172] @process::amplitude WARNING : External state 0 ('g', PDG 21, helicity +) is off shell: p^2 = +2.5e5, expected m^2 = +0e0 (|Δ| = +2.5e5). Fixed-helicity spinor/vector/tensor external states may be ill-defined at this kinematic point.
  524. 128.30 s > field value
  525. 128.30 s > span warm_up{integrand.name=se1l}
  526. 128.30 s > [2026-08-26 08:23:55.172] @process::amplitude WARNING : External state 1 ('g', PDG 21, helicity -) is off shell: p^2 = +2.5e5, expected m^2 = +0e0 (|Δ| = +2.5e5). Fixed-helicity spinor/vector/tensor external states may be ill-defined at this kinematic point.
  527. 128.30 s > field value
  528. 128.30 s > span warm_up{integrand.name=se1l}
  529. 128.30 s > [2026-08-26 08:23:55.172] @process::amplitude INFO : Input is above threshold: 1 existing threshold E-surfaces across 1/1 graph groups
  530. 128.30 s > field value
  531. 128.30 s > existing_esurfaces 1
  532. 128.30 s > group_count 1
  533. 128.30 s > groups_above_threshold 1
  534. 128.30 s > integrand se1l
  535. 128.30 s > span warm_up{integrand.name=se1l}
  536. 128.30 s > threshold_status above threshold
  537. 128.30 s > [2026-08-26 08:23:55.172] @process::amplitude INFO : overlap structure of group 0: [1: [0(2,3)]]
  538. 128.30 s > field value
  539. 128.30 s > span warm_up{integrand.name=se1l}
  540. 128.30 s > [2026-08-26 08:23:55.178] @process::amplitude WARNING : External state 0 ('g', PDG 21, helicity +) is off shell: p^2 = +2.5e5, expected m^2 = +0e0 (|Δ| = +2.5e5). Fixed-helicity spinor/vector/tensor external states may be ill-defined at this kinematic point.
  541. 128.30 s > field value
  542. 128.30 s > span warm_up{integrand.name=se1l_muv_shifted}
  543. 128.30 s > [2026-08-26 08:23:55.178] @process::amplitude WARNING : External state 1 ('g', PDG 21, helicity -) is off shell: p^2 = +2.5e5, expected m^2 = +0e0 (|Δ| = +2.5e5). Fixed-helicity spinor/vector/tensor external states may be ill-defined at this kinematic point.
  544. 128.30 s > field value
  545. 128.30 s > span warm_up{integrand.name=se1l_muv_shifted}
  546. 128.30 s > [2026-08-26 08:23:55.178] @process::amplitude INFO : Input is above threshold: 1 existing threshold E-surfaces across 1/1 graph groups
  547. 128.30 s > field value
  548. 128.30 s > existing_esurfaces 1
  549. 128.30 s > group_count 1
  550. 128.30 s > groups_above_threshold 1
  551. 128.30 s > integrand se1l_muv_shifted
  552. 128.30 s > span warm_up{integrand.name=se1l_muv_shifted}
  553. 128.30 s > threshold_status above threshold
  554. 128.30 s > [2026-08-26 08:23:55.178] @process::amplitude INFO : overlap structure of group 0: [1: [0(2,3)]]
  555. 128.30 s > field value
  556. 128.30 s > span warm_up{integrand.name=se1l_muv_shifted}
  557. 128.30 s > [2026-08-26 08:23:55.184] @process::amplitude WARNING : External state 0 ('g', PDG 21, helicity +) is off shell: p^2 = +2.5e5, expected m^2 = +0e0 (|Δ| = +2.5e5). Fixed-helicity spinor/vector/tensor external states may be ill-defined at this kinematic point.
  558. 128.30 s > field value
  559. 128.30 s > span warm_up{integrand.name=se1l}
  560. 128.30 s > [2026-08-26 08:23:55.184] @process::amplitude WARNING : External state 1 ('g', PDG 21, helicity -) is off shell: p^2 = +2.5e5, expected m^2 = +0e0 (|Δ| = +2.5e5). Fixed-helicity spinor/vector/tensor external states may be ill-defined at this kinematic point.
  561. 128.30 s > field value
  562. 128.30 s > span warm_up{integrand.name=se1l}
  563. 128.30 s > [2026-08-26 08:23:55.184] @process::amplitude INFO : Input is above threshold: 1 existing threshold E-surfaces across 1/1 graph groups
  564. 128.30 s > field value
  565. 128.30 s > existing_esurfaces 1
  566. 128.30 s > group_count 1
  567. 128.30 s > groups_above_threshold 1
  568. 128.30 s > integrand se1l
  569. 128.30 s > span warm_up{integrand.name=se1l}
  570. 128.30 s > threshold_status above threshold
  571. 128.30 s > [2026-08-26 08:23:55.184] @process::amplitude INFO : overlap structure of group 0: [1: [0(2,3)]]
  572. 128.30 s > field value
  573. 128.30 s > span warm_up{integrand.name=se1l}
  574. 128.30 s > [2026-08-26 08:23:55.190] @process::amplitude WARNING : External state 0 ('g', PDG 21, helicity +) is off shell: p^2 = +2.5e5, expected m^2 = +0e0 (|Δ| = +2.5e5). Fixed-helicity spinor/vector/tensor external states may be ill-defined at this kinematic point.
  575. 128.30 s > field value
  576. 128.30 s > span warm_up{integrand.name=se1l_rls_shifted}
  577. 128.30 s > [2026-08-26 08:23:55.190] @process::amplitude WARNING : External state 1 ('g', PDG 21, helicity -) is off shell: p^2 = +2.5e5, expected m^2 = +0e0 (|Δ| = +2.5e5). Fixed-helicity spinor/vector/tensor external states may be ill-defined at this kinematic point.
  578. 128.30 s > field value
  579. 128.30 s > span warm_up{integrand.name=se1l_rls_shifted}
  580. 128.30 s > [2026-08-26 08:23:55.190] @process::amplitude INFO : Input is above threshold: 1 existing threshold E-surfaces across 1/1 graph groups
  581. 128.30 s > field value
  582. 128.30 s > existing_esurfaces 1
  583. 128.30 s > group_count 1
  584. 128.30 s > groups_above_threshold 1
  585. 128.30 s > integrand se1l_rls_shifted
  586. 128.30 s > span warm_up{integrand.name=se1l_rls_shifted}
  587. 128.30 s > threshold_status above threshold
  588. 128.30 s > [2026-08-26 08:23:55.190] @process::amplitude INFO : overlap structure of group 0: [1: [0(2,3)]]
  589. 128.30 s > field value
  590. 128.30 s > span warm_up{integrand.name=se1l_rls_shifted}
  591. 128.30 s > [2026-08-26 08:23:55.196] @process::amplitude WARNING : External state 0 ('g', PDG 21, helicity +) is off shell: p^2 = +2.5e5, expected m^2 = +0e0 (|Δ| = +2.5e5). Fixed-helicity spinor/vector/tensor external states may be ill-defined at this kinematic point.
  592. 128.30 s > field value
  593. 128.30 s > span warm_up{integrand.name=se1l}
  594. 128.30 s > [2026-08-26 08:23:55.196] @process::amplitude WARNING : External state 1 ('g', PDG 21, helicity -) is off shell: p^2 = +2.5e5, expected m^2 = +0e0 (|Δ| = +2.5e5). Fixed-helicity spinor/vector/tensor external states may be ill-defined at this kinematic point.
  595. 128.30 s > field value
  596. 128.30 s > span warm_up{integrand.name=se1l}
  597. 128.30 s > [2026-08-26 08:23:55.196] @process::amplitude INFO : Input is above threshold: 1 existing threshold E-surfaces across 1/1 graph groups
  598. 128.30 s > field value
  599. 128.30 s > existing_esurfaces 1
  600. 128.30 s > group_count 1
  601. 128.30 s > groups_above_threshold 1
  602. 128.30 s > integrand se1l
  603. 128.30 s > span warm_up{integrand.name=se1l}
  604. 128.30 s > threshold_status above threshold
  605. 128.30 s > [2026-08-26 08:23:55.196] @process::amplitude INFO : overlap structure of group 0: [1: [0(2,3)]]
  606. 128.30 s > field value
  607. 128.30 s > span warm_up{integrand.name=se1l}
  608. 128.30 s > [2026-08-26 08:23:55.202] @process::amplitude WARNING : External state 0 ('g', PDG 21, helicity +) is off shell: p^2 = +2.5e5, expected m^2 = +0e0 (|Δ| = +2.5e5). Fixed-helicity spinor/vector/tensor external states may be ill-defined at this kinematic point.
  609. 128.30 s > field value
  610. 128.30 s > span warm_up{integrand.name=se1l_rls_shifted}
  611. 128.30 s > [2026-08-26 08:23:55.202] @process::amplitude WARNING : External state 1 ('g', PDG 21, helicity -) is off shell: p^2 = +2.5e5, expected m^2 = +0e0 (|Δ| = +2.5e5). Fixed-helicity spinor/vector/tensor external states may be ill-defined at this kinematic point.
  612. 128.30 s > field value
  613. 128.30 s > span warm_up{integrand.name=se1l_rls_shifted}
  614. 128.30 s > [2026-08-26 08:23:55.202] @process::amplitude INFO : Input is above threshold: 1 existing threshold E-surfaces across 1/1 graph groups
  615. 128.30 s > field value
  616. 128.30 s > existing_esurfaces 1
  617. 128.30 s > group_count 1
  618. 128.30 s > groups_above_threshold 1
  619. 128.30 s > integrand se1l_rls_shifted
  620. 128.30 s > span warm_up{integrand.name=se1l_rls_shifted}
  621. 128.30 s > threshold_status above threshold
  622. 128.30 s > [2026-08-26 08:23:55.202] @process::amplitude INFO : overlap structure of group 0: [1: [0(2,3)]]
  623. 128.30 s > field value
  624. 128.30 s > span warm_up{integrand.name=se1l_rls_shifted}
  625. 128.30 s > [2026-08-26 08:23:55.208] @process::amplitude WARNING : External state 0 ('g', PDG 21, helicity +) is off shell: p^2 = +2.5e5, expected m^2 = +0e0 (|Δ| = +2.5e5). Fixed-helicity spinor/vector/tensor external states may be ill-defined at this kinematic point.
  626. 128.30 s > field value
  627. 128.30 s > span warm_up{integrand.name=se1l}
  628. 128.30 s > [2026-08-26 08:23:55.208] @process::amplitude WARNING : External state 1 ('g', PDG 21, helicity -) is off shell: p^2 = +2.5e5, expected m^2 = +0e0 (|Δ| = +2.5e5). Fixed-helicity spinor/vector/tensor external states may be ill-defined at this kinematic point.
  629. 128.30 s > field value
  630. 128.30 s > span warm_up{integrand.name=se1l}
  631. 128.30 s > [2026-08-26 08:23:55.209] @process::amplitude INFO : Input is above threshold: 1 existing threshold E-surfaces across 1/1 graph groups
  632. 128.30 s > field value
  633. 128.30 s > existing_esurfaces 1
  634. 128.30 s > group_count 1
  635. 128.30 s > groups_above_threshold 1
  636. 128.30 s > integrand se1l
  637. 128.30 s > span warm_up{integrand.name=se1l}
  638. 128.30 s > threshold_status above threshold
  639. 128.30 s > [2026-08-26 08:23:55.209] @process::amplitude INFO : overlap structure of group 0: [1: [0(2,3)]]
  640. 128.30 s > field value
  641. 128.30 s > span warm_up{integrand.name=se1l}
  642. 128.30 s > [2026-08-26 08:23:55.215] @process::amplitude WARNING : External state 0 ('g', PDG 21, helicity +) is off shell: p^2 = +2.5e5, expected m^2 = +0e0 (|Δ| = +2.5e5). Fixed-helicity spinor/vector/tensor external states may be ill-defined at this kinematic point.
  643. 128.30 s > field value
  644. 128.30 s > span warm_up{integrand.name=se1l_rls_shifted}
  645. 128.30 s > [2026-08-26 08:23:55.215] @process::amplitude WARNING : External state 1 ('g', PDG 21, helicity -) is off shell: p^2 = +2.5e5, expected m^2 = +0e0 (|Δ| = +2.5e5). Fixed-helicity spinor/vector/tensor external states may be ill-defined at this kinematic point.
  646. 128.30 s > field value
  647. 128.30 s > span warm_up{integrand.name=se1l_rls_shifted}
  648. 128.30 s > [2026-08-26 08:23:55.215] @process::amplitude INFO : Input is above threshold: 1 existing threshold E-surfaces across 1/1 graph groups
  649. 128.30 s > field value
  650. 128.30 s > existing_esurfaces 1
  651. 128.30 s > group_count 1
  652. 128.30 s > groups_above_threshold 1
  653. 128.30 s > integrand se1l_rls_shifted
  654. 128.30 s > span warm_up{integrand.name=se1l_rls_shifted}
  655. 128.30 s > threshold_status above threshold
  656. 128.30 s > [2026-08-26 08:23:55.215] @process::amplitude INFO : overlap structure of group 0: [1: [0(2,3)]]
  657. 128.30 s > field value
  658. 128.30 s > span warm_up{integrand.name=se1l_rls_shifted}
  659. 128.30 s > [2026-08-26 08:23:55.222] @process::amplitude WARNING : External state 0 ('g', PDG 21, helicity +) is off shell: p^2 = +2.5e5, expected m^2 = +0e0 (|Δ| = +2.5e5). Fixed-helicity spinor/vector/tensor external states may be ill-defined at this kinematic point.
  660. 128.30 s > field value
  661. 128.30 s > span warm_up{integrand.name=se1l}
  662. 128.30 s > [2026-08-26 08:23:55.222] @process::amplitude WARNING : External state 1 ('g', PDG 21, helicity -) is off shell: p^2 = +2.5e5, expected m^2 = +0e0 (|Δ| = +2.5e5). Fixed-helicity spinor/vector/tensor external states may be ill-defined at this kinematic point.
  663. 128.30 s > field value
  664. 128.30 s > span warm_up{integrand.name=se1l}
  665. 128.30 s > [2026-08-26 08:23:55.222] @process::amplitude INFO : Input is above threshold: 1 existing threshold E-surfaces across 1/1 graph groups
  666. 128.30 s > field value
  667. 128.30 s > existing_esurfaces 1
  668. 128.30 s > group_count 1
  669. 128.30 s > groups_above_threshold 1
  670. 128.30 s > integrand se1l
  671. 128.30 s > span warm_up{integrand.name=se1l}
  672. 128.30 s > threshold_status above threshold
  673. 128.30 s > [2026-08-26 08:23:55.222] @process::amplitude INFO : overlap structure of group 0: [1: [0(2,3)]]
  674. 128.30 s > field value
  675. 128.30 s > span warm_up{integrand.name=se1l}
  676. 128.30 s > [2026-08-26 08:23:55.228] @process::amplitude WARNING : External state 0 ('g', PDG 21, helicity +) is off shell: p^2 = +2.5e5, expected m^2 = +0e0 (|Δ| = +2.5e5). Fixed-helicity spinor/vector/tensor external states may be ill-defined at this kinematic point.
  677. 128.30 s > field value
  678. 128.30 s > span warm_up{integrand.name=se1l_rls_shifted}
  679. 128.30 s > [2026-08-26 08:23:55.228] @process::amplitude WARNING : External state 1 ('g', PDG 21, helicity -) is off shell: p^2 = +2.5e5, expected m^2 = +0e0 (|Δ| = +2.5e5). Fixed-helicity spinor/vector/tensor external states may be ill-defined at this kinematic point.
  680. 128.30 s > field value
  681. 128.30 s > span warm_up{integrand.name=se1l_rls_shifted}
  682. 128.30 s > [2026-08-26 08:23:55.229] @process::amplitude INFO : Input is above threshold: 1 existing threshold E-surfaces across 1/1 graph groups
  683. 128.30 s > field value
  684. 128.30 s > existing_esurfaces 1
  685. 128.30 s > group_count 1
  686. 128.30 s > groups_above_threshold 1
  687. 128.30 s > integrand se1l_rls_shifted
  688. 128.30 s > span warm_up{integrand.name=se1l_rls_shifted}
  689. 128.30 s > threshold_status above threshold
  690. 128.30 s > [2026-08-26 08:23:55.229] @process::amplitude INFO : overlap structure of group 0: [1: [0(2,3)]]
  691. 128.30 s > field value
  692. 128.30 s > span warm_up{integrand.name=se1l_rls_shifted}
  693. 128.30 s > [2026-08-26 08:23:55.235] @process::amplitude WARNING : External state 0 ('g', PDG 21, helicity +) is off shell: p^2 = +2.5e5, expected m^2 = +0e0 (|Δ| = +2.5e5). Fixed-helicity spinor/vector/tensor external states may be ill-defined at this kinematic point.
  694. 128.30 s > field value
  695. 128.30 s > span warm_up{integrand.name=se1l}
  696. 128.30 s > [2026-08-26 08:23:55.235] @process::amplitude WARNING : External state 1 ('g', PDG 21, helicity -) is off shell: p^2 = +2.5e5, expected m^2 = +0e0 (|Δ| = +2.5e5). Fixed-helicity spinor/vector/tensor external states may be ill-defined at this kinematic point.
  697. 128.30 s > field value
  698. 128.30 s > span warm_up{integrand.name=se1l}
  699. 128.30 s > [2026-08-26 08:23:55.236] @process::amplitude INFO : Input is above threshold: 1 existing threshold E-surfaces across 1/1 graph groups
  700. 128.30 s > field value
  701. 128.30 s > existing_esurfaces 1
  702. 128.30 s > group_count 1
  703. 128.30 s > groups_above_threshold 1
  704. 128.30 s > integrand se1l
  705. 128.30 s > span warm_up{integrand.name=se1l}
  706. 128.30 s > threshold_status above threshold
  707. 128.30 s > [2026-08-26 08:23:55.236] @process::amplitude INFO : overlap structure of group 0: [1: [0(2,3)]]
  708. 128.30 s > field value
  709. 128.30 s > span warm_up{integrand.name=se1l}
  710. 128.30 s > [2026-08-26 08:23:55.242] @process::amplitude WARNING : External state 0 ('g', PDG 21, helicity +) is off shell: p^2 = +2.5e5, expected m^2 = +0e0 (|Δ| = +2.5e5). Fixed-helicity spinor/vector/tensor external states may be ill-defined at this kinematic point.
  711. 128.30 s > field value
  712. 128.30 s > span warm_up{integrand.name=se1l_rls_shifted}
  713. 128.30 s > [2026-08-26 08:23:55.242] @process::amplitude WARNING : External state 1 ('g', PDG 21, helicity -) is off shell: p^2 = +2.5e5, expected m^2 = +0e0 (|Δ| = +2.5e5). Fixed-helicity spinor/vector/tensor external states may be ill-defined at this kinematic point.
  714. 128.30 s > field value
  715. 128.30 s > span warm_up{integrand.name=se1l_rls_shifted}
  716. 128.30 s > [2026-08-26 08:23:55.243] @process::amplitude INFO : Input is above threshold: 1 existing threshold E-surfaces across 1/1 graph groups
  717. 128.30 s > field value
  718. 128.30 s > existing_esurfaces 1
  719. 128.30 s > group_count 1
  720. 128.30 s > groups_above_threshold 1
  721. 128.30 s > integrand se1l_rls_shifted
  722. 128.30 s > span warm_up{integrand.name=se1l_rls_shifted}
  723. 128.30 s > threshold_status above threshold
  724. 128.30 s > [2026-08-26 08:23:55.243] @process::amplitude INFO : overlap structure of group 0: [1: [0(2,3)]]
  725. 128.30 s > field value
  726. 128.30 s > span warm_up{integrand.name=se1l_rls_shifted}
  727. 128.30 s > [2026-08-26 08:23:55.249] @process::amplitude WARNING : External state 0 ('g', PDG 21, helicity +) is off shell: p^2 = +2.5e5, expected m^2 = +0e0 (|Δ| = +2.5e5). Fixed-helicity spinor/vector/tensor external states may be ill-defined at this kinematic point.
  728. 128.30 s > field value
  729. 128.30 s > span warm_up{integrand.name=se1l}
  730. 128.30 s > [2026-08-26 08:23:55.249] @process::amplitude WARNING : External state 1 ('g', PDG 21, helicity -) is off shell: p^2 = +2.5e5, expected m^2 = +0e0 (|Δ| = +2.5e5). Fixed-helicity spinor/vector/tensor external states may be ill-defined at this kinematic point.
  731. 128.30 s > field value
  732. 128.30 s > span warm_up{integrand.name=se1l}
  733. 128.30 s > [2026-08-26 08:23:55.249] @process::amplitude INFO : Input is above threshold: 1 existing threshold E-surfaces across 1/1 graph groups
  734. 128.30 s > field value
  735. 128.30 s > existing_esurfaces 1
  736. 128.30 s > group_count 1
  737. 128.30 s > groups_above_threshold 1
  738. 128.30 s > integrand se1l
  739. 128.30 s > span warm_up{integrand.name=se1l}
  740. 128.30 s > threshold_status above threshold
  741. 128.30 s > [2026-08-26 08:23:55.250] @process::amplitude INFO : overlap structure of group 0: [1: [0(2,3)]]
  742. 128.30 s > field value
  743. 128.30 s > span warm_up{integrand.name=se1l}
  744. 128.30 s > [2026-08-26 08:23:55.256] @process::amplitude WARNING : External state 0 ('g', PDG 21, helicity +) is off shell: p^2 = +2.5e5, expected m^2 = +0e0 (|Δ| = +2.5e5). Fixed-helicity spinor/vector/tensor external states may be ill-defined at this kinematic point.
  745. 128.30 s > field value
  746. 128.30 s > span warm_up{integrand.name=se1l_rls_shifted}
  747. 128.30 s > [2026-08-26 08:23:55.256] @process::amplitude WARNING : External state 1 ('g', PDG 21, helicity -) is off shell: p^2 = +2.5e5, expected m^2 = +0e0 (|Δ| = +2.5e5). Fixed-helicity spinor/vector/tensor external states may be ill-defined at this kinematic point.
  748. 128.30 s > field value
  749. 128.30 s > span warm_up{integrand.name=se1l_rls_shifted}
  750. 128.30 s > [2026-08-26 08:23:55.256] @process::amplitude INFO : Input is above threshold: 1 existing threshold E-surfaces across 1/1 graph groups
  751. 128.30 s > field value
  752. 128.30 s > existing_esurfaces 1
  753. 128.30 s > group_count 1
  754. 128.30 s > groups_above_threshold 1
  755. 128.30 s > integrand se1l_rls_shifted
  756. 128.30 s > span warm_up{integrand.name=se1l_rls_shifted}
  757. 128.30 s > threshold_status above threshold
  758. 128.30 s > [2026-08-26 08:23:55.257] @process::amplitude INFO : overlap structure of group 0: [1: [0(2,3)]]
  759. 128.30 s > field value
  760. 128.30 s > span warm_up{integrand.name=se1l_rls_shifted}
  761. 128.30 s > [2026-08-26 08:23:55.263] @process::amplitude WARNING : External state 0 ('g', PDG 21, helicity +) is off shell: p^2 = +2.5e5, expected m^2 = +0e0 (|Δ| = +2.5e5). Fixed-helicity spinor/vector/tensor external states may be ill-defined at this kinematic point.
  762. 128.30 s > field value
  763. 128.30 s > span warm_up{integrand.name=se1l}
  764. 128.30 s > [2026-08-26 08:23:55.264] @process::amplitude WARNING : External state 1 ('g', PDG 21, helicity -) is off shell: p^2 = +2.5e5, expected m^2 = +0e0 (|Δ| = +2.5e5). Fixed-helicity spinor/vector/tensor external states may be ill-defined at this kinematic point.
  765. 128.30 s > field value
  766. 128.30 s > span warm_up{integrand.name=se1l}
  767. 128.30 s > [2026-08-26 08:23:55.264] @process::amplitude INFO : Input is above threshold: 1 existing threshold E-surfaces across 1/1 graph groups
  768. 128.30 s > field value
  769. 128.30 s > existing_esurfaces 1
  770. 128.30 s > group_count 1
  771. 128.30 s > groups_above_threshold 1
  772. 128.30 s > integrand se1l
  773. 128.30 s > span warm_up{integrand.name=se1l}
  774. 128.30 s > threshold_status above threshold
  775. 128.30 s > [2026-08-26 08:23:55.264] @process::amplitude INFO : overlap structure of group 0: [1: [0(2,3)]]
  776. 128.30 s > field value
  777. 128.30 s > span warm_up{integrand.name=se1l}
  778. 128.30 s > [2026-08-26 08:23:55.271] @process::amplitude WARNING : External state 0 ('g', PDG 21, helicity +) is off shell: p^2 = +2.5e5, expected m^2 = +0e0 (|Δ| = +2.5e5). Fixed-helicity spinor/vector/tensor external states may be ill-defined at this kinematic point.
  779. 128.30 s > field value
  780. 128.30 s > span warm_up{integrand.name=se1l_rls_shifted}
  781. 128.31 s > [2026-08-26 08:23:55.271] @process::amplitude WARNING : External state 1 ('g', PDG 21, helicity -) is off shell: p^2 = +2.5e5, expected m^2 = +0e0 (|Δ| = +2.5e5). Fixed-helicity spinor/vector/tensor external states may be ill-defined at this kinematic point.
  782. 128.31 s > field value
  783. 128.31 s > span warm_up{integrand.name=se1l_rls_shifted}
  784. 128.31 s > [2026-08-26 08:23:55.272] @process::amplitude INFO : Input is above threshold: 1 existing threshold E-surfaces across 1/1 graph groups
  785. 128.31 s > field value
  786. 128.31 s > existing_esurfaces 1
  787. 128.31 s > group_count 1
  788. 128.31 s > groups_above_threshold 1
  789. 128.31 s > integrand se1l_rls_shifted
  790. 128.31 s > span warm_up{integrand.name=se1l_rls_shifted}
  791. 128.31 s > threshold_status above threshold
  792. 128.31 s > [2026-08-26 08:23:55.272] @process::amplitude INFO : overlap structure of group 0: [1: [0(2,3)]]
  793. 128.31 s > field value
  794. 128.31 s > span warm_up{integrand.name=se1l_rls_shifted}
  795. 128.31 s > [2026-08-26 08:23:55.279] @process::amplitude WARNING : External state 0 ('g', PDG 21, helicity +) is off shell: p^2 = +2.5e5, expected m^2 = +0e0 (|Δ| = +2.5e5). Fixed-helicity spinor/vector/tensor external states may be ill-defined at this kinematic point.
  796. 128.31 s > field value
  797. 128.31 s > span warm_up{integrand.name=se1l}
  798. 128.31 s > [2026-08-26 08:23:55.279] @process::amplitude WARNING : External state 1 ('g', PDG 21, helicity -) is off shell: p^2 = +2.5e5, expected m^2 = +0e0 (|Δ| = +2.5e5). Fixed-helicity spinor/vector/tensor external states may be ill-defined at this kinematic point.
  799. 128.31 s > field value
  800. 128.31 s > span warm_up{integrand.name=se1l}
  801. 128.31 s > [2026-08-26 08:23:55.279] @process::amplitude INFO : Input is above threshold: 1 existing threshold E-surfaces across 1/1 graph groups
  802. 128.31 s > field value
  803. 128.31 s > existing_esurfaces 1
  804. 128.31 s > group_count 1
  805. 128.31 s > groups_above_threshold 1
  806. 128.31 s > integrand se1l
  807. 128.31 s > span warm_up{integrand.name=se1l}
  808. 128.31 s > threshold_status above threshold
  809. 128.31 s > [2026-08-26 08:23:55.279] @process::amplitude INFO : overlap structure of group 0: [1: [0(2,3)]]
  810. 128.31 s > field value
  811. 128.31 s > span warm_up{integrand.name=se1l}
  812. 128.31 s > [2026-08-26 08:23:55.286] @process::amplitude WARNING : External state 0 ('g', PDG 21, helicity +) is off shell: p^2 = +2.5e5, expected m^2 = +0e0 (|Δ| = +2.5e5). Fixed-helicity spinor/vector/tensor external states may be ill-defined at this kinematic point.
  813. 128.31 s > field value
  814. 128.31 s > span warm_up{integrand.name=se1l_rls_shifted}
  815. 128.31 s > [2026-08-26 08:23:55.286] @process::amplitude WARNING : External state 1 ('g', PDG 21, helicity -) is off shell: p^2 = +2.5e5, expected m^2 = +0e0 (|Δ| = +2.5e5). Fixed-helicity spinor/vector/tensor external states may be ill-defined at this kinematic point.
  816. 128.31 s > field value
  817. 128.31 s > span warm_up{integrand.name=se1l_rls_shifted}
  818. 128.31 s > [2026-08-26 08:23:55.287] @process::amplitude INFO : Input is above threshold: 1 existing threshold E-surfaces across 1/1 graph groups
  819. 128.31 s > field value
  820. 128.31 s > existing_esurfaces 1
  821. 128.31 s > group_count 1
  822. 128.31 s > groups_above_threshold 1
  823. 128.31 s > integrand se1l_rls_shifted
  824. 128.31 s > span warm_up{integrand.name=se1l_rls_shifted}
  825. 128.31 s > threshold_status above threshold
  826. 128.31 s > [2026-08-26 08:23:55.287] @process::amplitude INFO : overlap structure of group 0: [1: [0(2,3)]]
  827. 128.31 s > field value
  828. 128.31 s > span warm_up{integrand.name=se1l_rls_shifted}
  829. 128.31 s > [2026-08-26 08:23:55.293] @process::amplitude WARNING : External state 0 ('g', PDG 21, helicity +) is off shell: p^2 = +2.5e5, expected m^2 = +0e0 (|Δ| = +2.5e5). Fixed-helicity spinor/vector/tensor external states may be ill-defined at this kinematic point.
  830. 128.31 s > field value
  831. 128.31 s > span warm_up{integrand.name=se1l}
  832. 128.31 s > [2026-08-26 08:23:55.293] @process::amplitude WARNING : External state 1 ('g', PDG 21, helicity -) is off shell: p^2 = +2.5e5, expected m^2 = +0e0 (|Δ| = +2.5e5). Fixed-helicity spinor/vector/tensor external states may be ill-defined at this kinematic point.
  833. 128.31 s > field value
  834. 128.31 s > span warm_up{integrand.name=se1l}
  835. 128.31 s > [2026-08-26 08:23:55.294] @process::amplitude INFO : Input is above threshold: 1 existing threshold E-surfaces across 1/1 graph groups
  836. 128.31 s > field value
  837. 128.31 s > existing_esurfaces 1
  838. 128.31 s > group_count 1
  839. 128.31 s > groups_above_threshold 1
  840. 128.31 s > integrand se1l
  841. 128.31 s > span warm_up{integrand.name=se1l}
  842. 128.31 s > threshold_status above threshold
  843. 128.31 s > [2026-08-26 08:23:55.294] @process::amplitude INFO : overlap structure of group 0: [1: [0(2,3)]]
  844. 128.31 s > field value
  845. 128.31 s > span warm_up{integrand.name=se1l}
  846. 128.31 s > [2026-08-26 08:23:55.300] @process::amplitude WARNING : External state 0 ('g', PDG 21, helicity +) is off shell: p^2 = +2.5e5, expected m^2 = +0e0 (|Δ| = +2.5e5). Fixed-helicity spinor/vector/tensor external states may be ill-defined at this kinematic point.
  847. 128.31 s > field value
  848. 128.31 s > span warm_up{integrand.name=se1l_rls_shifted}
  849. 128.31 s > [2026-08-26 08:23:55.300] @process::amplitude WARNING : External state 1 ('g', PDG 21, helicity -) is off shell: p^2 = +2.5e5, expected m^2 = +0e0 (|Δ| = +2.5e5). Fixed-helicity spinor/vector/tensor external states may be ill-defined at this kinematic point.
  850. 128.31 s > field value
  851. 128.31 s > span warm_up{integrand.name=se1l_rls_shifted}
  852. 128.31 s > [2026-08-26 08:23:55.300] @process::amplitude INFO : Input is above threshold: 1 existing threshold E-surfaces across 1/1 graph groups
  853. 128.31 s > field value
  854. 128.31 s > existing_esurfaces 1
  855. 128.31 s > group_count 1
  856. 128.31 s > groups_above_threshold 1
  857. 128.31 s > integrand se1l_rls_shifted
  858. 128.31 s > span warm_up{integrand.name=se1l_rls_shifted}
  859. 128.31 s > threshold_status above threshold
  860. 128.31 s > [2026-08-26 08:23:55.300] @process::amplitude INFO : overlap structure of group 0: [1: [0(2,3)]]
  861. 128.31 s > field value
  862. 128.31 s > span warm_up{integrand.name=se1l_rls_shifted}
  863. 128.31 s > [2026-08-26 08:23:55.306] @process::amplitude WARNING : External state 0 ('g', PDG 21, helicity +) is off shell: p^2 = +2.5e5, expected m^2 = +0e0 (|Δ| = +2.5e5). Fixed-helicity spinor/vector/tensor external states may be ill-defined at this kinematic point.
  864. 128.31 s > field value
  865. 128.31 s > span warm_up{integrand.name=se1l}
  866. 128.31 s > [2026-08-26 08:23:55.306] @process::amplitude WARNING : External state 1 ('g', PDG 21, helicity -) is off shell: p^2 = +2.5e5, expected m^2 = +0e0 (|Δ| = +2.5e5). Fixed-helicity spinor/vector/tensor external states may be ill-defined at this kinematic point.
  867. 128.31 s > field value
  868. 128.31 s > span warm_up{integrand.name=se1l}
  869. 128.31 s > [2026-08-26 08:23:55.307] @process::amplitude INFO : Input is above threshold: 1 existing threshold E-surfaces across 1/1 graph groups
  870. 128.31 s > field value
  871. 128.31 s > existing_esurfaces 1
  872. 128.31 s > group_count 1
  873. 128.31 s > groups_above_threshold 1
  874. 128.31 s > integrand se1l
  875. 128.31 s > span warm_up{integrand.name=se1l}
  876. 128.31 s > threshold_status above threshold
  877. 128.31 s > [2026-08-26 08:23:55.307] @process::amplitude INFO : overlap structure of group 0: [1: [0(2,3)]]
  878. 128.31 s > field value
  879. 128.31 s > span warm_up{integrand.name=se1l}
  880. 128.31 s > [2026-08-26 08:23:55.313] @process::amplitude WARNING : External state 0 ('g', PDG 21, helicity +) is off shell: p^2 = +2.5e5, expected m^2 = +0e0 (|Δ| = +2.5e5). Fixed-helicity spinor/vector/tensor external states may be ill-defined at this kinematic point.
  881. 128.31 s > field value
  882. 128.31 s > span warm_up{integrand.name=se1l_rls_shifted}
  883. 128.31 s > [2026-08-26 08:23:55.313] @process::amplitude WARNING : External state 1 ('g', PDG 21, helicity -) is off shell: p^2 = +2.5e5, expected m^2 = +0e0 (|Δ| = +2.5e5). Fixed-helicity spinor/vector/tensor external states may be ill-defined at this kinematic point.
  884. 128.31 s > field value
  885. 128.31 s > span warm_up{integrand.name=se1l_rls_shifted}
  886. 128.31 s > [2026-08-26 08:23:55.313] @process::amplitude INFO : Input is above threshold: 1 existing threshold E-surfaces across 1/1 graph groups
  887. 128.31 s > field value
  888. 128.31 s > existing_esurfaces 1
  889. 128.31 s > group_count 1
  890. 128.31 s > groups_above_threshold 1
  891. 128.31 s > integrand se1l_rls_shifted
  892. 128.31 s > span warm_up{integrand.name=se1l_rls_shifted}
  893. 128.31 s > threshold_status above threshold
  894. 128.31 s > [2026-08-26 08:23:55.314] @process::amplitude INFO : overlap structure of group 0: [1: [0(2,3)]]
  895. 128.31 s > field value
  896. 128.31 s > span warm_up{integrand.name=se1l_rls_shifted}
  897. 128.31 s > [2026-08-26 08:23:55.320] @process::amplitude WARNING : External state 0 ('g', PDG 21, helicity +) is off shell: p^2 = +2.5e5, expected m^2 = +0e0 (|Δ| = +2.5e5). Fixed-helicity spinor/vector/tensor external states may be ill-defined at this kinematic point.
  898. 128.31 s > field value
  899. 128.31 s > span warm_up{integrand.name=se1l}
  900. 128.31 s > [2026-08-26 08:23:55.320] @process::amplitude WARNING : External state 1 ('g', PDG 21, helicity -) is off shell: p^2 = +2.5e5, expected m^2 = +0e0 (|Δ| = +2.5e5). Fixed-helicity spinor/vector/tensor external states may be ill-defined at this kinematic point.
  901. 128.31 s > field value
  902. 128.31 s > span warm_up{integrand.name=se1l}
  903. 128.31 s > [2026-08-26 08:23:55.320] @process::amplitude INFO : Input is above threshold: 1 existing threshold E-surfaces across 1/1 graph groups
  904. 128.31 s > field value
  905. 128.31 s > existing_esurfaces 1
  906. 128.31 s > group_count 1
  907. 128.31 s > groups_above_threshold 1
  908. 128.31 s > integrand se1l
  909. 128.31 s > span warm_up{integrand.name=se1l}
  910. 128.31 s > threshold_status above threshold
  911. 128.31 s > [2026-08-26 08:23:55.320] @process::amplitude INFO : overlap structure of group 0: [1: [0(2,3)]]
  912. 128.31 s > field value
  913. 128.31 s > span warm_up{integrand.name=se1l}
  914. 128.31 s > [2026-08-26 08:23:55.327] @process::amplitude WARNING : External state 0 ('g', PDG 21, helicity +) is off shell: p^2 = +2.5e5, expected m^2 = +0e0 (|Δ| = +2.5e5). Fixed-helicity spinor/vector/tensor external states may be ill-defined at this kinematic point.
  915. 128.31 s > field value
  916. 128.31 s > span warm_up{integrand.name=se1l_mur_shifted}
  917. 128.31 s > [2026-08-26 08:23:55.327] @process::amplitude WARNING : External state 1 ('g', PDG 21, helicity -) is off shell: p^2 = +2.5e5, expected m^2 = +0e0 (|Δ| = +2.5e5). Fixed-helicity spinor/vector/tensor external states may be ill-defined at this kinematic point.
  918. 128.31 s > field value
  919. 128.31 s > span warm_up{integrand.name=se1l_mur_shifted}
  920. 128.31 s > [2026-08-26 08:23:55.327] @process::amplitude INFO : Input is above threshold: 1 existing threshold E-surfaces across 1/1 graph groups
  921. 128.31 s > field value
  922. 128.31 s > existing_esurfaces 1
  923. 128.31 s > group_count 1
  924. 128.31 s > groups_above_threshold 1
  925. 128.31 s > integrand se1l_mur_shifted
  926. 128.31 s > span warm_up{integrand.name=se1l_mur_shifted}
  927. 128.31 s > threshold_status above threshold
  928. 128.31 s > [2026-08-26 08:23:55.327] @process::amplitude INFO : overlap structure of group 0: [1: [0(2,3)]]
  929. 128.31 s > field value
  930. 128.31 s > span warm_up{integrand.name=se1l_mur_shifted}
  931. 128.31 s > [2026-08-26 08:23:55.334] @process::amplitude WARNING : External state 0 ('g', PDG 21, helicity +) is off shell: p^2 = +2.5e5, expected m^2 = +0e0 (|Δ| = +2.5e5). Fixed-helicity spinor/vector/tensor external states may be ill-defined at this kinematic point.
  932. 128.31 s > field value
  933. 128.31 s > span warm_up{integrand.name=se1l}
  934. 128.31 s > [2026-08-26 08:23:55.334] @process::amplitude WARNING : External state 1 ('g', PDG 21, helicity -) is off shell: p^2 = +2.5e5, expected m^2 = +0e0 (|Δ| = +2.5e5). Fixed-helicity spinor/vector/tensor external states may be ill-defined at this kinematic point.
  935. 128.31 s > field value
  936. 128.31 s > span warm_up{integrand.name=se1l}
  937. 128.31 s > [2026-08-26 08:23:55.334] @process::amplitude INFO : Input is above threshold: 1 existing threshold E-surfaces across 1/1 graph groups
  938. 128.31 s > field value
  939. 128.31 s > existing_esurfaces 1
  940. 128.31 s > group_count 1
  941. 128.31 s > groups_above_threshold 1
  942. 128.31 s > integrand se1l
  943. 128.31 s > span warm_up{integrand.name=se1l}
  944. 128.31 s > threshold_status above threshold
  945. 128.31 s > [2026-08-26 08:23:55.334] @process::amplitude INFO : overlap structure of group 0: [1: [0(2,3)]]
  946. 128.31 s > field value
  947. 128.31 s > span warm_up{integrand.name=se1l}
  948. 128.31 s > [2026-08-26 08:23:55.341] @process::amplitude WARNING : External state 0 ('g', PDG 21, helicity +) is off shell: p^2 = +2.5e5, expected m^2 = +0e0 (|Δ| = +2.5e5). Fixed-helicity spinor/vector/tensor external states may be ill-defined at this kinematic point.
  949. 128.31 s > field value
  950. 128.31 s > span warm_up{integrand.name=se1l_mur_shifted}
  951. 128.31 s > [2026-08-26 08:23:55.341] @process::amplitude WARNING : External state 1 ('g', PDG 21, helicity -) is off shell: p^2 = +2.5e5, expected m^2 = +0e0 (|Δ| = +2.5e5). Fixed-helicity spinor/vector/tensor external states may be ill-defined at this kinematic point.
  952. 128.31 s > field value
  953. 128.31 s > span warm_up{integrand.name=se1l_mur_shifted}
  954. 128.31 s > [2026-08-26 08:23:55.341] @process::amplitude INFO : Input is above threshold: 1 existing threshold E-surfaces across 1/1 graph groups
  955. 128.31 s > field value
  956. 128.31 s > existing_esurfaces 1
  957. 128.31 s > group_count 1
  958. 128.31 s > groups_above_threshold 1
  959. 128.31 s > integrand se1l_mur_shifted
  960. 128.31 s > span warm_up{integrand.name=se1l_mur_shifted}
  961. 128.31 s > threshold_status above threshold
  962. 128.31 s > [2026-08-26 08:23:55.341] @process::amplitude INFO : overlap structure of group 0: [1: [0(2,3)]]
  963. 128.31 s > field value
  964. 128.31 s > span warm_up{integrand.name=se1l_mur_shifted}
  965. 128.31 s > [2026-08-26 08:23:55.347] @process::amplitude WARNING : External state 0 ('g', PDG 21, helicity +) is off shell: p^2 = +2.5e5, expected m^2 = +0e0 (|Δ| = +2.5e5). Fixed-helicity spinor/vector/tensor external states may be ill-defined at this kinematic point.
  966. 128.31 s > field value
  967. 128.31 s > span warm_up{integrand.name=se1l}
  968. 128.31 s > [2026-08-26 08:23:55.347] @process::amplitude WARNING : External state 1 ('g', PDG 21, helicity -) is off shell: p^2 = +2.5e5, expected m^2 = +0e0 (|Δ| = +2.5e5). Fixed-helicity spinor/vector/tensor external states may be ill-defined at this kinematic point.
  969. 128.31 s > field value
  970. 128.31 s > span warm_up{integrand.name=se1l}
  971. 128.31 s > [2026-08-26 08:23:55.348] @process::amplitude INFO : Input is above threshold: 1 existing threshold E-surfaces across 1/1 graph groups
  972. 128.31 s > field value
  973. 128.31 s > existing_esurfaces 1
  974. 128.31 s > group_count 1
  975. 128.31 s > groups_above_threshold 1
  976. 128.31 s > integrand se1l
  977. 128.31 s > span warm_up{integrand.name=se1l}
  978. 128.31 s > threshold_status above threshold
  979. 128.31 s > [2026-08-26 08:23:55.348] @process::amplitude INFO : overlap structure of group 0: [1: [0(2,3)]]
  980. 128.31 s > field value
  981. 128.31 s > span warm_up{integrand.name=se1l}
  982. 128.31 s > [2026-08-26 08:23:55.354] @process::amplitude WARNING : External state 0 ('g', PDG 21, helicity +) is off shell: p^2 = +2.5e5, expected m^2 = +0e0 (|Δ| = +2.5e5). Fixed-helicity spinor/vector/tensor external states may be ill-defined at this kinematic point.
  983. 128.31 s > field value
  984. 128.31 s > span warm_up{integrand.name=se1l_mur_shifted}
  985. 128.31 s > [2026-08-26 08:23:55.354] @process::amplitude WARNING : External state 1 ('g', PDG 21, helicity -) is off shell: p^2 = +2.5e5, expected m^2 = +0e0 (|Δ| = +2.5e5). Fixed-helicity spinor/vector/tensor external states may be ill-defined at this kinematic point.
  986. 128.31 s > field value
  987. 128.31 s > span warm_up{integrand.name=se1l_mur_shifted}
  988. 128.31 s > [2026-08-26 08:23:55.354] @process::amplitude INFO : Input is above threshold: 1 existing threshold E-surfaces across 1/1 graph groups
  989. 128.31 s > field value
  990. 128.31 s > existing_esurfaces 1
  991. 128.31 s > group_count 1
  992. 128.31 s > groups_above_threshold 1
  993. 128.31 s > integrand se1l_mur_shifted
  994. 128.31 s > span warm_up{integrand.name=se1l_mur_shifted}
  995. 128.31 s > threshold_status above threshold
  996. 128.31 s > [2026-08-26 08:23:55.355] @process::amplitude INFO : overlap structure of group 0: [1: [0(2,3)]]
  997. 128.31 s > field value
  998. 128.31 s > span warm_up{integrand.name=se1l_mur_shifted}
  999. 128.31 s > [2026-08-26 08:23:55.360] @process::amplitude WARNING : External state 0 ('g', PDG 21, helicity +) is off shell: p^2 = +2.5e5, expected m^2 = +0e0 (|Δ| = +2.5e5). Fixed-helicity spinor/vector/tensor external states may be ill-defined at this kinematic point.
  1000. 128.31 s > field value
  1001. 128.31 s > span warm_up{integrand.name=se1l}
  1002. 128.31 s > [2026-08-26 08:23:55.360] @process::amplitude WARNING : External state 1 ('g', PDG 21, helicity -) is off shell: p^2 = +2.5e5, expected m^2 = +0e0 (|Δ| = +2.5e5). Fixed-helicity spinor/vector/tensor external states may be ill-defined at this kinematic point.
  1003. 128.31 s > field value
  1004. 128.31 s > span warm_up{integrand.name=se1l}
  1005. 128.31 s > [2026-08-26 08:23:55.361] @process::amplitude INFO : Input is above threshold: 1 existing threshold E-surfaces across 1/1 graph groups
  1006. 128.31 s > field value
  1007. 128.31 s > existing_esurfaces 1
  1008. 128.31 s > group_count 1
  1009. 128.31 s > groups_above_threshold 1
  1010. 128.31 s > integrand se1l
  1011. 128.31 s > span warm_up{integrand.name=se1l}
  1012. 128.31 s > threshold_status above threshold
  1013. 128.31 s > [2026-08-26 08:23:55.361] @process::amplitude INFO : overlap structure of group 0: [1: [0(2,3)]]
  1014. 128.31 s > field value
  1015. 128.31 s > span warm_up{integrand.name=se1l}
  1016. 128.31 s > [2026-08-26 08:23:55.367] @process::amplitude WARNING : External state 0 ('g', PDG 21, helicity +) is off shell: p^2 = +2.5e5, expected m^2 = +0e0 (|Δ| = +2.5e5). Fixed-helicity spinor/vector/tensor external states may be ill-defined at this kinematic point.
  1017. 128.31 s > field value
  1018. 128.31 s > span warm_up{integrand.name=se1l_mur_shifted}
  1019. 128.31 s > [2026-08-26 08:23:55.367] @process::amplitude WARNING : External state 1 ('g', PDG 21, helicity -) is off shell: p^2 = +2.5e5, expected m^2 = +0e0 (|Δ| = +2.5e5). Fixed-helicity spinor/vector/tensor external states may be ill-defined at this kinematic point.
  1020. 128.31 s > field value
  1021. 128.31 s > span warm_up{integrand.name=se1l_mur_shifted}
  1022. 128.31 s > [2026-08-26 08:23:55.367] @process::amplitude INFO : Input is above threshold: 1 existing threshold E-surfaces across 1/1 graph groups
  1023. 128.31 s > field value
  1024. 128.31 s > existing_esurfaces 1
  1025. 128.31 s > group_count 1
  1026. 128.31 s > groups_above_threshold 1
  1027. 128.31 s > integrand se1l_mur_shifted
  1028. 128.31 s > span warm_up{integrand.name=se1l_mur_shifted}
  1029. 128.31 s > threshold_status above threshold
  1030. 128.31 s > [2026-08-26 08:23:55.367] @process::amplitude INFO : overlap structure of group 0: [1: [0(2,3)]]
  1031. 128.31 s > field value
  1032. 128.31 s > span warm_up{integrand.name=se1l_mur_shifted}
  1033. 128.31 s > [2026-08-26 08:23:55.373] @process::amplitude WARNING : External state 0 ('g', PDG 21, helicity +) is off shell: p^2 = +2.5e5, expected m^2 = +0e0 (|Δ| = +2.5e5). Fixed-helicity spinor/vector/tensor external states may be ill-defined at this kinematic point.
  1034. 128.31 s > field value
  1035. 128.31 s > span warm_up{integrand.name=se1l}
  1036. 128.31 s > [2026-08-26 08:23:55.373] @process::amplitude WARNING : External state 1 ('g', PDG 21, helicity -) is off shell: p^2 = +2.5e5, expected m^2 = +0e0 (|Δ| = +2.5e5). Fixed-helicity spinor/vector/tensor external states may be ill-defined at this kinematic point.
  1037. 128.31 s > field value
  1038. 128.31 s > span warm_up{integrand.name=se1l}
  1039. 128.31 s > [2026-08-26 08:23:55.374] @process::amplitude INFO : Input is above threshold: 1 existing threshold E-surfaces across 1/1 graph groups
  1040. 128.31 s > field value
  1041. 128.31 s > existing_esurfaces 1
  1042. 128.31 s > group_count 1
  1043. 128.31 s > groups_above_threshold 1
  1044. 128.31 s > integrand se1l
  1045. 128.31 s > span warm_up{integrand.name=se1l}
  1046. 128.31 s > threshold_status above threshold
  1047. 128.31 s > [2026-08-26 08:23:55.374] @process::amplitude INFO : overlap structure of group 0: [1: [0(2,3)]]
  1048. 128.31 s > field value
  1049. 128.31 s > span warm_up{integrand.name=se1l}
  1050. 128.31 s > [2026-08-26 08:23:55.380] @process::amplitude WARNING : External state 0 ('g', PDG 21, helicity +) is off shell: p^2 = +2.5e5, expected m^2 = +0e0 (|Δ| = +2.5e5). Fixed-helicity spinor/vector/tensor external states may be ill-defined at this kinematic point.
  1051. 128.31 s > field value
  1052. 128.31 s > span warm_up{integrand.name=se1l_mur_shifted}
  1053. 128.31 s > [2026-08-26 08:23:55.380] @process::amplitude WARNING : External state 1 ('g', PDG 21, helicity -) is off shell: p^2 = +2.5e5, expected m^2 = +0e0 (|Δ| = +2.5e5). Fixed-helicity spinor/vector/tensor external states may be ill-defined at this kinematic point.
  1054. 128.31 s > field value
  1055. 128.31 s > span warm_up{integrand.name=se1l_mur_shifted}
  1056. 128.31 s > [2026-08-26 08:23:55.380] @process::amplitude INFO : Input is above threshold: 1 existing threshold E-surfaces across 1/1 graph groups
  1057. 128.31 s > field value
  1058. 128.31 s > existing_esurfaces 1
  1059. 128.31 s > group_count 1
  1060. 128.31 s > groups_above_threshold 1
  1061. 128.31 s > integrand se1l_mur_shifted
  1062. 128.31 s > span warm_up{integrand.name=se1l_mur_shifted}
  1063. 128.31 s > threshold_status above threshold
  1064. 128.31 s > [2026-08-26 08:23:55.381] @process::amplitude INFO : overlap structure of group 0: [1: [0(2,3)]]
  1065. 128.31 s > field value
  1066. 128.31 s > span warm_up{integrand.name=se1l_mur_shifted}
  1067. 128.31 s > [2026-08-26 08:23:55.387] @process::amplitude WARNING : External state 0 ('g', PDG 21, helicity +) is off shell: p^2 = +2.5e5, expected m^2 = +0e0 (|Δ| = +2.5e5). Fixed-helicity spinor/vector/tensor external states may be ill-defined at this kinematic point.
  1068. 128.31 s > field value
  1069. 128.31 s > span warm_up{integrand.name=se1l}
  1070. 128.31 s > [2026-08-26 08:23:55.387] @process::amplitude WARNING : External state 1 ('g', PDG 21, helicity -) is off shell: p^2 = +2.5e5, expected m^2 = +0e0 (|Δ| = +2.5e5). Fixed-helicity spinor/vector/tensor external states may be ill-defined at this kinematic point.
  1071. 128.31 s > field value
  1072. 128.31 s > span warm_up{integrand.name=se1l}
  1073. 128.31 s > [2026-08-26 08:23:55.387] @process::amplitude INFO : Input is above threshold: 1 existing threshold E-surfaces across 1/1 graph groups
  1074. 128.31 s > field value
  1075. 128.31 s > existing_esurfaces 1
  1076. 128.31 s > group_count 1
  1077. 128.31 s > groups_above_threshold 1
  1078. 128.31 s > integrand se1l
  1079. 128.31 s > span warm_up{integrand.name=se1l}
  1080. 128.31 s > threshold_status above threshold
  1081. 128.31 s > [2026-08-26 08:23:55.387] @process::amplitude INFO : overlap structure of group 0: [1: [0(2,3)]]
  1082. 128.31 s > field value
  1083. 128.31 s > span warm_up{integrand.name=se1l}
  1084. 128.31 s > [2026-08-26 08:23:55.393] @process::amplitude WARNING : External state 0 ('g', PDG 21, helicity +) is off shell: p^2 = +2.5e5, expected m^2 = +0e0 (|Δ| = +2.5e5). Fixed-helicity spinor/vector/tensor external states may be ill-defined at this kinematic point.
  1085. 128.31 s > field value
  1086. 128.31 s > span warm_up{integrand.name=se1l_mur_shifted}
  1087. 128.31 s > [2026-08-26 08:23:55.393] @process::amplitude WARNING : External state 1 ('g', PDG 21, helicity -) is off shell: p^2 = +2.5e5, expected m^2 = +0e0 (|Δ| = +2.5e5). Fixed-helicity spinor/vector/tensor external states may be ill-defined at this kinematic point.
  1088. 128.31 s > field value
  1089. 128.31 s > span warm_up{integrand.name=se1l_mur_shifted}
  1090. 128.31 s > [2026-08-26 08:23:55.394] @process::amplitude INFO : Input is above threshold: 1 existing threshold E-surfaces across 1/1 graph groups
  1091. 128.31 s > field value
  1092. 128.31 s > existing_esurfaces 1
  1093. 128.31 s > group_count 1
  1094. 128.31 s > groups_above_threshold 1
  1095. 128.31 s > integrand se1l_mur_shifted
  1096. 128.31 s > span warm_up{integrand.name=se1l_mur_shifted}
  1097. 128.31 s > threshold_status above threshold
  1098. 128.31 s > [2026-08-26 08:23:55.394] @process::amplitude INFO : overlap structure of group 0: [1: [0(2,3)]]
  1099. 128.31 s > field value
  1100. 128.31 s > span warm_up{integrand.name=se1l_mur_shifted}
  1101. 128.31 s > [2026-08-26 08:23:55.400] @process::amplitude WARNING : External state 0 ('g', PDG 21, helicity +) is off shell: p^2 = +2.5e5, expected m^2 = +0e0 (|Δ| = +2.5e5). Fixed-helicity spinor/vector/tensor external states may be ill-defined at this kinematic point.
  1102. 128.31 s > field value
  1103. 128.31 s > span warm_up{integrand.name=se1l}
  1104. 128.31 s > [2026-08-26 08:23:55.400] @process::amplitude WARNING : External state 1 ('g', PDG 21, helicity -) is off shell: p^2 = +2.5e5, expected m^2 = +0e0 (|Δ| = +2.5e5). Fixed-helicity spinor/vector/tensor external states may be ill-defined at this kinematic point.
  1105. 128.31 s > field value
  1106. 128.31 s > span warm_up{integrand.name=se1l}
  1107. 128.31 s > [2026-08-26 08:23:55.400] @process::amplitude INFO : Input is above threshold: 1 existing threshold E-surfaces across 1/1 graph groups
  1108. 128.31 s > field value
  1109. 128.31 s > existing_esurfaces 1
  1110. 128.31 s > group_count 1
  1111. 128.31 s > groups_above_threshold 1
  1112. 128.31 s > integrand se1l
  1113. 128.31 s > span warm_up{integrand.name=se1l}
  1114. 128.31 s > threshold_status above threshold
  1115. 128.31 s > [2026-08-26 08:23:55.400] @process::amplitude INFO : overlap structure of group 0: [1: [0(2,3)]]
  1116. 128.31 s > field value
  1117. 128.31 s > span warm_up{integrand.name=se1l}
  1118. 128.31 s > [2026-08-26 08:23:55.406] @process::amplitude WARNING : External state 0 ('g', PDG 21, helicity +) is off shell: p^2 = +2.5e5, expected m^2 = +0e0 (|Δ| = +2.5e5). Fixed-helicity spinor/vector/tensor external states may be ill-defined at this kinematic point.
  1119. 128.31 s > field value
  1120. 128.31 s > span warm_up{integrand.name=se1l_mur_shifted}
  1121. 128.31 s > [2026-08-26 08:23:55.406] @process::amplitude WARNING : External state 1 ('g', PDG 21, helicity -) is off shell: p^2 = +2.5e5, expected m^2 = +0e0 (|Δ| = +2.5e5). Fixed-helicity spinor/vector/tensor external states may be ill-defined at this kinematic point.
  1122. 128.31 s > field value
  1123. 128.31 s > span warm_up{integrand.name=se1l_mur_shifted}
  1124. 128.31 s > [2026-08-26 08:23:55.407] @process::amplitude INFO : Input is above threshold: 1 existing threshold E-surfaces across 1/1 graph groups
  1125. 128.31 s > field value
  1126. 128.31 s > existing_esurfaces 1
  1127. 128.31 s > group_count 1
  1128. 128.31 s > groups_above_threshold 1
  1129. 128.31 s > integrand se1l_mur_shifted
  1130. 128.31 s > span warm_up{integrand.name=se1l_mur_shifted}
  1131. 128.31 s > threshold_status above threshold
  1132. 128.31 s > [2026-08-26 08:23:55.407] @process::amplitude INFO : overlap structure of group 0: [1: [0(2,3)]]
  1133. 128.31 s > field value
  1134. 128.31 s > span warm_up{integrand.name=se1l_mur_shifted}
  1135. 128.31 s > [2026-08-26 08:23:55.412] @process::amplitude WARNING : External state 0 ('g', PDG 21, helicity +) is off shell: p^2 = +2.5e5, expected m^2 = +0e0 (|Δ| = +2.5e5). Fixed-helicity spinor/vector/tensor external states may be ill-defined at this kinematic point.
  1136. 128.31 s > field value
  1137. 128.31 s > span warm_up{integrand.name=se1l}
  1138. 128.31 s > [2026-08-26 08:23:55.413] @process::amplitude WARNING : External state 1 ('g', PDG 21, helicity -) is off shell: p^2 = +2.5e5, expected m^2 = +0e0 (|Δ| = +2.5e5). Fixed-helicity spinor/vector/tensor external states may be ill-defined at this kinematic point.
  1139. 128.31 s > field value
  1140. 128.31 s > span warm_up{integrand.name=se1l}
  1141. 128.31 s > [2026-08-26 08:23:55.413] @process::amplitude INFO : Input is above threshold: 1 existing threshold E-surfaces across 1/1 graph groups
  1142. 128.31 s > field value
  1143. 128.31 s > existing_esurfaces 1
  1144. 128.31 s > group_count 1
  1145. 128.31 s > groups_above_threshold 1
  1146. 128.31 s > integrand se1l
  1147. 128.31 s > span warm_up{integrand.name=se1l}
  1148. 128.31 s > threshold_status above threshold
  1149. 128.31 s > [2026-08-26 08:23:55.413] @process::amplitude INFO : overlap structure of group 0: [1: [0(2,3)]]
  1150. 128.31 s > field value
  1151. 128.31 s > span warm_up{integrand.name=se1l}
  1152. 128.31 s > [2026-08-26 08:23:55.419] @process::amplitude WARNING : External state 0 ('g', PDG 21, helicity +) is off shell: p^2 = +2.5e5, expected m^2 = +0e0 (|Δ| = +2.5e5). Fixed-helicity spinor/vector/tensor external states may be ill-defined at this kinematic point.
  1153. 128.31 s > field value
  1154. 128.31 s > span warm_up{integrand.name=se1l_mur_shifted}
  1155. 128.31 s > [2026-08-26 08:23:55.419] @process::amplitude WARNING : External state 1 ('g', PDG 21, helicity -) is off shell: p^2 = +2.5e5, expected m^2 = +0e0 (|Δ| = +2.5e5). Fixed-helicity spinor/vector/tensor external states may be ill-defined at this kinematic point.
  1156. 128.31 s > field value
  1157. 128.31 s > span warm_up{integrand.name=se1l_mur_shifted}
  1158. 128.31 s > [2026-08-26 08:23:55.419] @process::amplitude INFO : Input is above threshold: 1 existing threshold E-surfaces across 1/1 graph groups
  1159. 128.31 s > field value
  1160. 128.31 s > existing_esurfaces 1
  1161. 128.31 s > group_count 1
  1162. 128.31 s > groups_above_threshold 1
  1163. 128.31 s > integrand se1l_mur_shifted
  1164. 128.31 s > span warm_up{integrand.name=se1l_mur_shifted}
  1165. 128.31 s > threshold_status above threshold
  1166. 128.31 s > [2026-08-26 08:23:55.419] @process::amplitude INFO : overlap structure of group 0: [1: [0(2,3)]]
  1167. 128.31 s > field value
  1168. 128.31 s > span warm_up{integrand.name=se1l_mur_shifted}
  1169. 128.31 s > [2026-08-26 08:23:55.425] @process::amplitude WARNING : External state 0 ('g', PDG 21, helicity +) is off shell: p^2 = +2.5e5, expected m^2 = +0e0 (|Δ| = +2.5e5). Fixed-helicity spinor/vector/tensor external states may be ill-defined at this kinematic point.
  1170. 128.31 s > field value
  1171. 128.31 s > span warm_up{integrand.name=se1l}
  1172. 128.31 s > [2026-08-26 08:23:55.425] @process::amplitude WARNING : External state 1 ('g', PDG 21, helicity -) is off shell: p^2 = +2.5e5, expected m^2 = +0e0 (|Δ| = +2.5e5). Fixed-helicity spinor/vector/tensor external states may be ill-defined at this kinematic point.
  1173. 128.31 s > field value
  1174. 128.31 s > span warm_up{integrand.name=se1l}
  1175. 128.31 s > [2026-08-26 08:23:55.425] @process::amplitude INFO : Input is above threshold: 1 existing threshold E-surfaces across 1/1 graph groups
  1176. 128.31 s > field value
  1177. 128.31 s > existing_esurfaces 1
  1178. 128.31 s > group_count 1
  1179. 128.31 s > groups_above_threshold 1
  1180. 128.31 s > integrand se1l
  1181. 128.31 s > span warm_up{integrand.name=se1l}
  1182. 128.31 s > threshold_status above threshold
  1183. 128.31 s > [2026-08-26 08:23:55.425] @process::amplitude INFO : overlap structure of group 0: [1: [0(2,3)]]
  1184. 128.31 s > field value
  1185. 128.31 s > span warm_up{integrand.name=se1l}
  1186. 128.31 s > [2026-08-26 08:23:55.431] @process::amplitude WARNING : External state 0 ('g', PDG 21, helicity +) is off shell: p^2 = +2.5e5, expected m^2 = +0e0 (|Δ| = +2.5e5). Fixed-helicity spinor/vector/tensor external states may be ill-defined at this kinematic point.
  1187. 128.31 s > field value
  1188. 128.31 s > span warm_up{integrand.name=se1l_mur_shifted}
  1189. 128.31 s > [2026-08-26 08:23:55.431] @process::amplitude WARNING : External state 1 ('g', PDG 21, helicity -) is off shell: p^2 = +2.5e5, expected m^2 = +0e0 (|Δ| = +2.5e5). Fixed-helicity spinor/vector/tensor external states may be ill-defined at this kinematic point.
  1190. 128.31 s > field value
  1191. 128.31 s > span warm_up{integrand.name=se1l_mur_shifted}
  1192. 128.31 s > [2026-08-26 08:23:55.431] @process::amplitude INFO : Input is above threshold: 1 existing threshold E-surfaces across 1/1 graph groups
  1193. 128.31 s > field value
  1194. 128.31 s > existing_esurfaces 1
  1195. 128.31 s > group_count 1
  1196. 128.31 s > groups_above_threshold 1
  1197. 128.31 s > integrand se1l_mur_shifted
  1198. 128.31 s > span warm_up{integrand.name=se1l_mur_shifted}
  1199. 128.31 s > threshold_status above threshold
  1200. 128.31 s > [2026-08-26 08:23:55.431] @process::amplitude INFO : overlap structure of group 0: [1: [0(2,3)]]
  1201. 128.31 s > field value
  1202. 128.31 s > span warm_up{integrand.name=se1l_mur_shifted}
  1203. 128.31 s > [2026-08-26 08:23:55.437] @process::amplitude WARNING : External state 0 ('g', PDG 21, helicity +) is off shell: p^2 = +2.5e5, expected m^2 = +0e0 (|Δ| = +2.5e5). Fixed-helicity spinor/vector/tensor external states may be ill-defined at this kinematic point.
  1204. 128.31 s > field value
  1205. 128.31 s > span warm_up{integrand.name=se1l}
  1206. 128.31 s > [2026-08-26 08:23:55.437] @process::amplitude WARNING : External state 1 ('g', PDG 21, helicity -) is off shell: p^2 = +2.5e5, expected m^2 = +0e0 (|Δ| = +2.5e5). Fixed-helicity spinor/vector/tensor external states may be ill-defined at this kinematic point.
  1207. 128.31 s > field value
  1208. 128.31 s > span warm_up{integrand.name=se1l}
  1209. 128.31 s > [2026-08-26 08:23:55.437] @process::amplitude INFO : Input is above threshold: 1 existing threshold E-surfaces across 1/1 graph groups
  1210. 128.31 s > field value
  1211. 128.31 s > existing_esurfaces 1
  1212. 128.31 s > group_count 1
  1213. 128.31 s > groups_above_threshold 1
  1214. 128.31 s > integrand se1l
  1215. 128.31 s > span warm_up{integrand.name=se1l}
  1216. 128.31 s > threshold_status above threshold
  1217. 128.31 s > [2026-08-26 08:23:55.437] @process::amplitude INFO : overlap structure of group 0: [1: [0(2,3)]]
  1218. 128.31 s > field value
  1219. 128.31 s > span warm_up{integrand.name=se1l}
  1220. 128.31 s > [2026-08-26 08:23:55.443] @process::amplitude WARNING : External state 0 ('g', PDG 21, helicity +) is off shell: p^2 = +2.5e5, expected m^2 = +0e0 (|Δ| = +2.5e5). Fixed-helicity spinor/vector/tensor external states may be ill-defined at this kinematic point.
  1221. 128.31 s > field value
  1222. 128.31 s > span warm_up{integrand.name=se1l_mur_shifted}
  1223. 128.31 s > [2026-08-26 08:23:55.443] @process::amplitude WARNING : External state 1 ('g', PDG 21, helicity -) is off shell: p^2 = +2.5e5, expected m^2 = +0e0 (|Δ| = +2.5e5). Fixed-helicity spinor/vector/tensor external states may be ill-defined at this kinematic point.
  1224. 128.31 s > field value
  1225. 128.31 s > span warm_up{integrand.name=se1l_mur_shifted}
  1226. 128.31 s > [2026-08-26 08:23:55.443] @process::amplitude INFO : Input is above threshold: 1 existing threshold E-surfaces across 1/1 graph groups
  1227. 128.31 s > field value
  1228. 128.31 s > existing_esurfaces 1
  1229. 128.31 s > group_count 1
  1230. 128.31 s > groups_above_threshold 1
  1231. 128.31 s > integrand se1l_mur_shifted
  1232. 128.31 s > span warm_up{integrand.name=se1l_mur_shifted}
  1233. 128.31 s > threshold_status above threshold
  1234. 128.31 s > [2026-08-26 08:23:55.443] @process::amplitude INFO : overlap structure of group 0: [1: [0(2,3)]]
  1235. 128.31 s > field value
  1236. 128.31 s > span warm_up{integrand.name=se1l_mur_shifted}
  1237. 128.31 s > The application panicked (crashed).
  1238. 128.31 s > Message: Integrated UV case failed: se1l
  1239. 128.31 s > Location: tests/tests/uv.rs:1068
  1240. 128.31 s >
  1241. 128.31 s > ━━━━━━━━━━━━━━━━━━━━━━━━━━━━━━━━━━ BACKTRACE ━━━━━━━━━━━━━━━━━━━━━━━━━━━━━━━━━━━
  1242. 128.31 s > 1: <color_eyre[51793ea62743adbd]::config::PanicHook>::panic_report<unknown>
  1243. 128.31 s > at <unknown source file>:<unknown line>
  1244. 128.31 s > 2: <color_eyre[51793ea62743adbd]::config::PanicHook>::into_panic_hook::{closure#0}<unknown>
  1245. 128.31 s > at <unknown source file>:<unknown line>
  1246. 128.31 s > 3: std[bcb96dfbba0ab899]::panicking::panic_with_hook<unknown>
  1247. 128.31 s > at <unknown source file>:<unknown line>
  1248. 128.31 s > 4: std[bcb96dfbba0ab899]::panicking::panic_handler::{closure#0}<unknown>
  1249. 128.31 s > at <unknown source file>:<unknown line>
  1250. 128.31 s > 5: std[bcb96dfbba0ab899]::sys::backtrace::__rust_end_short_backtrace::<std[bcb96dfbba0ab899]::panicking::panic_handler::{closure#0}, !><unknown>
  1251. 128.31 s > at <unknown source file>:<unknown line>
  1252. 128.31 s > 6: __rustc[6c289b9f9c454d21]::rust_begin_unwind<unknown>
  1253. 128.31 s > at <unknown source file>:<unknown line>
  1254. 128.31 s > 7: core[940e698046960fd5]::panicking::panic_fmt<unknown>
  1255. 128.31 s > at <unknown source file>:<unknown line>
  1256. 128.31 s > 8: uv[52cf2b63f0104e31]::run_single_integrated_uv_case<unknown>
  1257. 128.31 s > at <unknown source file>:<unknown line>
  1258. 128.31 s > 9: <uv[52cf2b63f0104e31]::se1l_uv::{closure#0} as core[940e698046960fd5]::ops::function::FnOnce<()>>::call_once<unknown>
  1259. 128.31 s > at <unknown source file>:<unknown line>
  1260. 128.31 s > 10: test[75d6903177b1d7e9]::__rust_begin_short_backtrace::<core[940e698046960fd5]::result::Result<(), alloc[2ea6bcb46fca0c42]::string::String>, fn() -> core[940e698046960fd5]::result::Result<(), alloc[2ea6bcb46fca0c42]::string::String>><unknown>
  1261. 128.31 s > at <unknown source file>:<unknown line>
  1262. 128.31 s > 11: test[75d6903177b1d7e9]::run_test::{closure#0}<unknown>
  1263. 128.31 s > at <unknown source file>:<unknown line>
  1264. 128.31 s > 12: std[bcb96dfbba0ab899]::sys::backtrace::__rust_begin_short_backtrace::<test[75d6903177b1d7e9]::run_test::{closure#1}, ()><unknown>
  1265. 128.31 s > at <unknown source file>:<unknown line>
  1266. 128.31 s > 13: <std[bcb96dfbba0ab899]::thread::lifecycle::spawn_unchecked<test[75d6903177b1d7e9]::run_test::{closure#1}, ()>::{closure#1} as core[940e698046960fd5]::ops::function::FnOnce<()>>::call_once::{shim:vtable#0}<unknown>
  1267. 128.31 s > at <unknown source file>:<unknown line>
  1268. 128.31 s > 14: <std[bcb96dfbba0ab899]::sys::thread::unix::Thread>::new::thread_start<unknown>
  1269. 128.31 s > at <unknown source file>:<unknown line>
  1270. 128.31 s > 15: start_thread<unknown>
  1271. 128.31 s > at <unknown source file>:<unknown line>
  1272. 128.31 s > 16: __clone3<unknown>
  1273. 128.31 s > at <unknown source file>:<unknown line>
  1274. 128.31 s >
  1275. 128.31 s > Run with COLORBT_SHOW_HIDDEN=1 environment variable to disable frame filtering.
  1276. 128.31 s > Run with RUST_BACKTRACE=full to include source snippets.
  1277. 128.31 s >
  1278. 128.31 s > error: test run failed
  1279. 128.31 s >
  1280. 128.31 s > ========== nextest test summary ==========
  1281. 128.31 s > report: target/nextest/ci_gammaloop/junit.xml
  1282. 128.31 s > tests: 106, failures: 9, errors: 0
  1283. 128.31 s >
  1284. 128.31 s > 1. gammaloop-integration-tests::test_runs::approach::approach_momentum_space_reports_incomplete_triplet_cleanly
  1285. 128.31 s > failure: test failure with exit code 101
  1286. 128.31 s > system-out
  1287. 128.31 s > running 1 test
  1288. 128.31 s > test approach::approach_momentum_space_reports_incomplete_triplet_cleanly ... FAILED
  1289. 128.31 s >
  1290. 128.31 s > failures:
  1291. 128.31 s >
  1292. 128.31 s > failures:
  1293. 128.31 s > approach::approach_momentum_space_reports_incomplete_triplet_cleanly
  1294. 128.31 s >
  1295. 128.31 s > test result: FAILED. 0 passed; 1 failed; 0 ignored; 0 measured; 82 filtered out; finished in 0.59s
  1296. 128.31 s > system-err
  1297. 128.31 s > [2026-08-26 08:22:04.397] @gammaloop_api::se... INFO : Running command import model scalars-default.json
  1298. 128.31 s > [2026-08-26 08:22:04.397] @import::model INFO : Loading built-in JSON model scalars-default
  1299. 128.31 s > [2026-08-26 08:22:04.400] @gammalooprs::model INFO : The following 2 external parameters were forced to zero by the restriction card:
  1300. 128.31 s > width_scalar_1, width_scalar_2
  1301. 128.31 s > [2026-08-26 08:22:04.401] @gammaloop_api::se... INFO : Running command remove processes
  1302. 128.31 s > [2026-08-26 08:22:04.402] @gammaloop_api::se... INFO : Running command generate amp scalar_1 > scalar_0 scalar_0 [{1}] --allowed-vertex-interactions V_3_SCALAR_022 V_3_SCALAR_122 -p triangle -i scalar_tri
  1303. 128.31 s > [2026-08-26 08:22:04.403] @feyngen::diagram_... INFO : 0s | Δ=0s | Starting Feynman graph generation with Symbolica...
  1304. 128.31 s > [2026-08-26 08:22:04.403] @feyngen::diagram_... INFO : 0s | Δ=0s | Number of graphs resulting from Symbolica generation: 1
  1305. 128.31 s > [2026-08-26 08:22:04.403] @feyngen::diagram_... INFO : 0s | Δ=0s | Number of graphs retained after removal of vetoed topologies: 1
  1306. 128.31 s > [2026-08-26 08:22:04.403] @feyngen::diagram_... INFO : 0s | Δ=0s | Number of graphs after vertex info assignment: 1
  1307. 128.31 s > [2026-08-26 08:22:04.403] @feyngen::diagram_... INFO : 0s | Δ=0s | Number of graphs after all complete graphs filters are applied: 1
  1308. 128.31 s > [2026-08-26 08:22:04.404] @feyngen::diagram_... INFO : 0s | Δ=0s | Number of graphs after closed fermion chains analysis: 1
  1309. 128.31 s > [2026-08-26 08:22:04.404] @feyngen::diagram_... INFO : 0s | Δ=0s | Number of graphs after symmetrization of external states: 1
  1310. 128.31 s > [2026-08-26 08:22:04.404] @feyngen::diagram_... INFO : 0s | Δ=0s | Number of graphs after canonization of vertices, edges and flows (graph labels assigned here): 1
  1311. 128.31 s > [2026-08-26 08:22:04.409] @feyngen::diagram_... INFO : 0s | Δ=0s | Number of graphs after numerator-aware grouping with strategy 'up to a scalar rescaling': 1 (1 isomorphically unique graph, 0 color zero, 0 lorentz zero, 0 grouped and 0 cancellation)
  1312. 128.31 s > [2026-08-26 08:22:04.409] @feyngen::diagram_... INFO : ( Sum of the symmetry factors from each graph generated = 1 )
  1313. 128.31 s > [2026-08-26 08:22:04.409] @commands::generate INFO : Generated amplitude 1 graphs.
  1314. 128.31 s > [2026-08-26 08:22:04.430] @settings::runtime WARNING : No external kinematics were provided; using default-generated external momenta and helicities.
  1315. 128.31 s > [2026-08-26 08:22:04.518] @commands::generate INFO :
  1316. 128.31 s > Integrand generation summary
  1317. 128.31 s > peak RAM 66.34 MiB | cores 1
  1318. 128.31 s > ╭────────────┬───────┬─────────┬────────────┬────────────┬────────────────┬─────────────╮
  1319. 128.31 s > │ integrand │ graph │ # evals │ expr build │ spenso │ symbolica eval │ compile │
  1320. 128.31 s > ├────────────┼───────┼─────────┼────────────┼────────────┼────────────────┼─────────────┤
  1321. 128.31 s > │ scalar_tri │ GL0 │ 9 │ 10ms (57%) │ 1ms (9.6%) │ 6ms (34%) │ 0ms (0.00%) │
  1322. 128.31 s > ├────────────┼───────┼─────────┼────────────┼────────────┼────────────────┼─────────────┤
  1323. 128.31 s > │ Total │ │ 9 │ 10ms (57%) │ 1ms (9.6%) │ 6ms (34%) │ 0ms (0.00%) │
  1324. 128.31 s > ╰────────────┴───────┴─────────┴────────────┴────────────┴────────────────┴─────────────╯
  1325. 128.31 s > [2026-08-26 08:22:04.519] @gammaloop_api::se... INFO : Running command generate amp scalar_0 scalar_0 > scalar_0 scalar_0 [{1}] --allowed-vertex-interactions V_3_SCALAR_022 -p box -i scalar_box --select-graphs GL0
  1326. 128.31 s > [2026-08-26 08:22:04.521] @feyngen::diagram_... INFO : 0s | Δ=0s | Starting Feynman graph generation with Symbolica...
  1327. 128.31 s > [2026-08-26 08:22:04.521] @feyngen::diagram_... INFO : 0s | Δ=0s | Number of graphs resulting from Symbolica generation: 3
  1328. 128.31 s > [2026-08-26 08:22:04.524] @feyngen::diagram_... INFO : 0s | Δ=0s | Number of graphs retained after removal of vetoed topologies: 3
  1329. 128.31 s > [2026-08-26 08:22:04.525] @feyngen::diagram_... INFO : 0s | Δ=0s | Number of graphs after vertex info assignment: 3
  1330. 128.31 s > [2026-08-26 08:22:04.525] @feyngen::diagram_... INFO : 0s | Δ=0s | Number of graphs after all complete graphs filters are applied: 3
  1331. 128.31 s > [2026-08-26 08:22:04.528] @feyngen::diagram_... INFO : 0s | Δ=0s | Number of graphs after closed fermion chains analysis: 3
  1332. 128.31 s > [2026-08-26 08:22:04.528] @feyngen::diagram_... INFO : 0s | Δ=0s | Number of graphs after symmetrization of external states: 3
  1333. 128.31 s > [2026-08-26 08:22:04.529] @feyngen::diagram_... INFO : 0s | Δ=0s | Number of graphs after canonization of vertices, edges and flows (graph labels assigned here): 3
  1334. 128.31 s > [2026-08-26 08:22:04.541] @feyngen::diagram_... INFO : 0s | Δ=0s | Number of graphs after numerator-aware grouping with strategy 'up to a scalar rescaling': 1 (1 isomorphically unique graph, 0 color zero, 0 lorentz zero, 0 grouped and 0 cancellation)
  1335. 128.31 s > [2026-08-26 08:22:04.541] @feyngen::diagram_... INFO : ( Sum of the symmetry factors from each graph generated = 1 )
  1336. 128.31 s > [2026-08-26 08:22:04.541] @commands::generate INFO : Generated amplitude 1 graphs.
  1337. 128.31 s > [2026-08-26 08:22:04.740] @settings::runtime WARNING : No external kinematics were provided; using default-generated external momenta and helicities.
  1338. 128.31 s > [2026-08-26 08:22:04.753] @commands::generate INFO :
  1339. 128.31 s > Integrand generation summary
  1340. 128.31 s > peak RAM 69.00 MiB | cores 1
  1341. 128.31 s > ╭────────────┬───────┬─────────┬────────────┬─────────────┬────────────────┬─────────────╮
  1342. 128.31 s > │ integrand │ graph │ # evals │ expr build │ spenso │ symbolica eval │ compile │
  1343. 128.31 s > ├────────────┼───────┼─────────┼────────────┼─────────────┼────────────────┼─────────────┤
  1344. 128.31 s > │ scalar_box │ GL0 │ 13 │ 94ms (51%) │ 12ms (6.9%) │ 79ms (43%) │ 0ms (0.00%) │
  1345. 128.31 s > ├────────────┼───────┼─────────┼────────────┼─────────────┼────────────────┼─────────────┤
  1346. 128.31 s > │ Total │ │ 13 │ 94ms (51%) │ 12ms (6.9%) │ 79ms (43%) │ 0ms (0.00%) │
  1347. 128.31 s > ╰────────────┴───────┴─────────┴────────────┴─────────────┴────────────────┴─────────────╯
  1348. 128.31 s > [2026-08-26 08:22:04.754] @gammaloop_api::se... INFO : Running command generate
  1349. 128.31 s > [2026-08-26 08:22:04.817] @settings::runtime WARNING : No external kinematics were provided; using default-generated external momenta and helicities.
  1350. 128.31 s > [2026-08-26 08:22:04.854] @settings::runtime WARNING : No external kinematics were provided; using default-generated external momenta and helicities.
  1351. 128.31 s > [2026-08-26 08:22:04.860] @commands::generate INFO :
  1352. 128.31 s > Integrand generation summary
  1353. 128.31 s > peak RAM 70.22 MiB | cores 1
  1354. 128.31 s > ╭────────────┬───────┬─────────┬────────────┬────────────┬────────────────┬─────────────╮
  1355. 128.31 s > │ integrand │ graph │ # evals │ expr build │ spenso │ symbolica eval │ compile │
  1356. 128.31 s > ├────────────┼───────┼─────────┼────────────┼────────────┼────────────────┼─────────────┤
  1357. 128.31 s > │ scalar_tri │ GL0 │ 9 │ 10ms (60%) │ 1ms (8.7%) │ 5ms (32%) │ 0ms (0.00%) │
  1358. 128.31 s > │ scalar_box │ GL0 │ 13 │ 41ms (54%) │ 7ms (9.8%) │ 27ms (36%) │ 0ms (0.00%) │
  1359. 128.31 s > ├────────────┼───────┼─────────┼────────────┼────────────┼────────────────┼─────────────┤
  1360. 128.31 s > │ Total │ │ 22 │ 51ms (55%) │ 9ms (9.6%) │ 33ms (35%) │ 0ms (0.00%) │
  1361. 128.31 s > ╰────────────┴───────┴─────────┴────────────┴────────────┴────────────────┴─────────────╯
  1362. 128.31 s > [2026-08-26 08:22:04.861] @gammaloop_api::se... INFO : Running command set model mass_scalar_2=2.0
  1363. 128.31 s > [2026-08-26 08:22:04.862] @gammaloop_api::se... INFO : Running command set model mass_scalar_1=1.0
  1364. 128.31 s > [2026-08-26 08:22:04.863] @gammaloop_api::se... INFO : Running command set process -p triangle -i scalar_tri string '
  1365. 128.31 s > [kinematics.externals]
  1366. 128.31 s > type = "constant"
  1367. 128.31 s >
  1368. 128.31 s > [kinematics.externals.data]
  1369. 128.31 s > [...]
  1370. 128.31 s > [2026-08-26 08:22:04.864] @gammaloop_api::se... INFO : Running command set process -p box -i scalar_box string '
  1371. 128.31 s > [kinematics.externals]
  1372. 128.31 s > type = "constant"
  1373. 128.31 s >
  1374. 128.31 s > [kinematics.externals.data]
  1375. 128.31 s > [...]
  1376. 128.31 s > [2026-08-26 08:22:04.866] @gammaloop_api::se... INFO : Running command approach -x 1.0000000000000001e-1,2.0000000000000001e-1,2.9999999999999999e-1,4.0000000000000002e-1 --approach-axis 1.0000000000000000e-3,0.0000000000000000e0,0.0000000000000000e0,0.0000000000000000e0 --n-points 1 --n-cores 1 --output-results /build/source/tests/artifacts/scalar_box_invalid_momentum_approach/approach_momentum.json --momentum-space --graph-id 0
  1377. 128.31 s > The application panicked (crashed).
  1378. 128.31 s > Message: There are 2 processes available. Please specify a process.
  1379. 128.31 s > Location: tests/tests/test_runs/approach.rs:332
  1380. 128.31 s >
  1381. 128.31 s > ━━━━━━━━━━━━━━━━━━━━━━━━━━━━━━━━━━ BACKTRACE ━━━━━━━━━━━━━━━━━━━━━━━━━━━━━━━━━━━
  1382. 128.31 s > 1: <color_eyre[51793ea62743adbd]::config::PanicHook>::panic_report<unknown>
  1383. 128.31 s > at <unknown source file>:<unknown line>
  1384. 128.31 s > 2: <color_eyre[51793ea62743adbd]::config::PanicHook>::into_panic_hook::{closure#0}<unknown>
  1385. 128.31 s > at <unknown source file>:<unknown line>
  1386. 128.31 s > 3: std[bcb96dfbba0ab899]::panicking::panic_with_hook<unknown>
  1387. 128.31 s > at <unknown source file>:<unknown line>
  1388. 128.31 s > 4: std[bcb96dfbba0ab899]::panicking::panic_handler::{closure#0}<unknown>
  1389. 128.31 s > at <unknown source file>:<unknown line>
  1390. 128.31 s > 5: std[bcb96dfbba0ab899]::sys::backtrace::__rust_end_short_backtrace::<std[bcb96dfbba0ab899]::panicking::panic_handler::{closure#0}, !><unknown>
  1391. 128.31 s > at <unknown source file>:<unknown line>
  1392. 128.31 s > 6: __rustc[6c289b9f9c454d21]::rust_begin_unwind<unknown>
  1393. 128.31 s > at <unknown source file>:<unknown line>
  1394. 128.31 s > 7: core[940e698046960fd5]::panicking::panic_fmt<unknown>
  1395. 128.31 s > at <unknown source file>:<unknown line>
  1396. 128.31 s > 8: test_runs[3e7a390caee4e338]::approach::approach_momentum_space_reports_incomplete_triplet_cleanly<unknown>
  1397. 128.31 s > at <unknown source file>:<unknown line>
  1398. 128.31 s > 9: <test_runs[3e7a390caee4e338]::approach::approach_momentum_space_reports_incomplete_triplet_cleanly::{closure#0} as core[940e698046960fd5]::ops::function::FnOnce<()>>::call_once<unknown>
  1399. 128.31 s > at <unknown source file>:<unknown line>
  1400. 128.31 s > 10: test[75d6903177b1d7e9]::__rust_begin_short_backtrace::<core[940e698046960fd5]::result::Result<(), alloc[2ea6bcb46fca0c42]::string::String>, fn() -> core[940e698046960fd5]::result::Result<(), alloc[2ea6bcb46fca0c42]::string::String>><unknown>
  1401. 128.31 s > at <unknown source file>:<unknown line>
  1402. 128.31 s > 11: test[75d6903177b1d7e9]::run_test::{closure#0}<unknown>
  1403. 128.31 s > at <unknown source file>:<unknown line>
  1404. 128.31 s > 12: std[bcb96dfbba0ab899]::sys::backtrace::__rust_begin_short_backtrace::<test[75d6903177b1d7e9]::run_test::{closure#1}, ()><unknown>
  1405. 128.31 s > at <unknown source file>:<unknown line>
  1406. 128.31 s > 13: <std[bcb96dfbba0ab899]::thread::lifecycle::spawn_unchecked<test[75d6903177b1d7e9]::run_test::{closure#1}, ()>::{closure#1} as core[940e698046960fd5]::ops::function::FnOnce<()>>::call_once::{shim:vtable#0}<unknown>
  1407. 128.31 s > at <unknown source file>:<unknown line>
  1408. 128.31 s > 14: <std[bcb96dfbba0ab899]::sys::thread::unix::Thread>::new::thread_start<unknown>
  1409. 128.31 s > at <unknown source file>:<unknown line>
  1410. 128.31 s > 15: start_thread<unknown>
  1411. 128.31 s > at <unknown source file>:<unknown line>
  1412. 128.31 s > 16: __clone3<unknown>
  1413. 128.31 s > at <unknown source file>:<unknown line>
  1414. 128.31 s >
  1415. 128.31 s > Run with COLORBT_SHOW_HIDDEN=1 environment variable to disable frame filtering.
  1416. 128.31 s > ... omitted 1 more lines; see full nextest output above
  1417. 128.31 s >
  1418. 128.31 s > 2. gammaloop-integration-tests::test_runs::profile_bulk::dotted_bubble_amp_bulk_profile_passes
  1419. 128.31 s > failure: test failure with exit code 101
  1420. 128.31 s > Error:
  1421. 128.31 s > 0: IR profiling requested arbitrary precision but received a quad-precision result
  1422. 128.31 s >
  1423. 128.31 s > Location:
  1424. 128.31 s > crates/gammalooprs/src/integrands/process/ir.rs:2123
  1425. 128.31 s >
  1426. 128.31 s > ━━━━━━━━━━━━━━━━━━━━━━━━━━━━━━━━━━ BACKTRACE ━━━━━━━━━━━━━━━━━━━━━━━━━━━━━━━━━━━
  1427. 128.31 s > 1: <color_eyre[51793ea62743adbd]::config::EyreHook>::into_eyre_hook::{closure#0}<unknown>
  1428. 128.31 s > at <unknown source file>:<unknown line>
  1429. 128.31 s > 2: eyre[cb2fd339c0c40fca]::capture_handler<unknown>
  1430. 128.31 s > at <unknown source file>:<unknown line>
  1431. 128.31 s > 3: eyre[cb2fd339c0c40fca]::private::format_err<unknown>
  1432. 128.31 s > at <unknown source file>:<unknown line>
  1433. 128.31 s > 4: gammalooprs[d7a7c067ebd19583]::integrands::process::ir::evaluate_profile_momentum_point_arb::<gammalooprs[d7a7c067ebd19583]::integrands::process::amplitude::AmplitudeIntegrand><unknown>
  1434. 128.31 s > at <unknown source file>:<unknown line>
  1435. 128.31 s > 5: <gammalooprs[d7a7c067ebd19583]::integrands::process::amplitude::AmplitudeIntegrand>::test_single_ir_limit_impl<unknown>
  1436. 128.31 s > at <unknown source file>:<unknown line>
  1437. 128.31 s > 6: gammalooprs[d7a7c067ebd19583]::integrands::process::ir::run_ir_profile::<gammalooprs[d7a7c067ebd19583]::integrands::process::amplitude::AmplitudeIntegrand, <gammalooprs[d7a7c067ebd19583]::integrands::process::amplitude::AmplitudeIntegrand>::enumerate_ir_limits, <gammalooprs[d7a7c067ebd19583]::integrands::process::amplitude::AmplitudeIntegrand>::graph_cut_definitions, <gammalooprs[d7a7c067ebd19583]::integrands::process::amplitude::AmplitudeIntegrand>::test_single_ir_limit_impl><unknown>
  1438. 128.31 s > at <unknown source file>:<unknown line>
  1439. 128.31 s > 7: <gammalooprs[d7a7c067ebd19583]::integrands::process::amplitude::AmplitudeIntegrand>::test_ir<unknown>
  1440. 128.31 s > at <unknown source file>:<unknown line>
  1441. 128.31 s > 8: <gammaloop_api[92ae732909e47e14]::commands::profile::Profile>::run<unknown>
  1442. 128.31 s > at <unknown source file>:<unknown line>
  1443. 128.31 s > 9: test_runs[3e7a390caee4e338]::profile_bulk::dotted_bubble_amp_bulk_profile_passes<unknown>
  1444. 128.31 s > at <unknown source file>:<unknown line>
  1445. 128.31 s > 10: <test_runs[3e7a390caee4e338]::profile_bulk::dotted_bubble_amp_bulk_profile_passes::{closure#0} as core[940e698046960fd5]::ops::function::FnOnce<()>>::call_once<unknown>
  1446. 128.31 s > at <unknown source file>:<unknown line>
  1447. 128.31 s > 11: test[75d6903177b1d7e9]::__rust_begin_short_backtrace::<core[940e698046960fd5]::result::Result<(), alloc[2ea6bcb46fca0c42]::string::String>, fn() -> core[940e698046960fd5]::result::Result<(), alloc[2ea6bcb46fca0c42]::string::String>><unknown>
  1448. 128.31 s > at <unknown source file>:<unknown line>
  1449. 128.31 s > 12: test[75d6903177b1d7e9]::run_test::{closure#0}<unknown>
  1450. 128.31 s > at <unknown source file>:<unknown line>
  1451. 128.31 s > 13: std[bcb96dfbba0ab899]::sys::backtrace::__rust_begin_short_backtrace::<test[75d6903177b1d7e9]::run_test::{closure#1}, ()><unknown>
  1452. 128.31 s > at <unknown source file>:<unknown line>
  1453. 128.31 s > 14: <std[bcb96dfbba0ab899]::thread::lifecycle::spawn_unchecked<test[75d6903177b1d7e9]::run_test::{closure#1}, ()>::{closure#1} as core[940e698046960fd5]::ops::function::FnOnce<()>>::call_once::{shim:vtable#0}<unknown>
  1454. 128.31 s > at <unknown source file>:<unknown line>
  1455. 128.31 s > 15: <std[bcb96dfbba0ab899]::sys::thread::unix::Thread>::new::thread_start<unknown>
  1456. 128.31 s > at <unknown source file>:<unknown line>
  1457. 128.31 s > 16: start_thread<unknown>
  1458. 128.31 s > at <unknown source file>:<unknown line>
  1459. 128.31 s > 17: __clone3<unknown>
  1460. 128.31 s > at <unknown source file>:<unknown line>
  1461. 128.31 s >
  1462. 128.31 s > Run with COLORBT_SHOW_HIDDEN=1 environment variable to disable frame filtering.
  1463. 128.31 s > Run with RUST_BACKTRACE=full to include source snippets.
  1464. 128.31 s > Warning: SpanTrace capture is Unsupported.
  1465. 128.31 s > Ensure that you've setup a tracing-error ErrorLayer and the semver versions are compatible
  1466. 128.31 s > system-out
  1467. 128.31 s > running 1 test
  1468. 128.31 s > test profile_bulk::dotted_bubble_amp_bulk_profile_passes ... FAILED
  1469. 128.31 s >
  1470. 128.31 s > failures:
  1471. 128.31 s >
  1472. 128.31 s > failures:
  1473. 128.31 s > profile_bulk::dotted_bubble_amp_bulk_profile_passes
  1474. 128.31 s >
  1475. 128.31 s > test result: FAILED. 0 passed; 1 failed; 0 ignored; 0 measured; 82 filtered out; finished in 0.25s
  1476. 128.31 s > system-err
  1477. 128.31 s > [2026-08-26 08:22:06.414] @gammaloop_api::se... INFO : Running command import model ./assets/models/json/scalars/scalars_2p_3p.json
  1478. 128.31 s > [2026-08-26 08:22:06.414] @import::model INFO : Loading JSON model scalars_2p_3p-default from /build/source/assets/models/json/scalars/scalars_2p_3p
  1479. 128.31 s > [2026-08-26 08:22:06.416] @gammaloop_api::se... INFO : Running command import graphs ./tests/resources/graphs/dotted_bubble_amp.dot
  1480. 128.31 s > [2026-08-26 08:22:06.416] @commands::import INFO : Loading graphs from '/build/source/tests/resources/graphs/dotted_bubble_amp.dot'
  1481. 128.31 s > [2026-08-26 08:22:06.421] @gammaloop_api::se... INFO : Running command generate
  1482. 128.31 s > [2026-08-26 08:22:06.535] @commands::generate INFO :
  1483. 128.31 s > Integrand generation summary
  1484. 128.31 s > peak RAM 64.32 MiB | cores 1
  1485. 128.31 s > ╭───────────┬───────────────────┬─────────┬────────────┬────────────┬────────────────┬─────────────╮
  1486. 128.31 s > │ integrand │ graph │ # evals │ expr build │ spenso │ symbolica eval │ compile │
  1487. 128.31 s > ├───────────┼───────────────────┼─────────┼────────────┼────────────┼────────────────┼─────────────┤
  1488. 128.31 s > │ default │ dotted_bubble_amp │ 8 │ 34ms (86%) │ 1ms (2.7%) │ 4ms (11%) │ 0ms (0.00%) │
  1489. 128.31 s > ├───────────┼───────────────────┼─────────┼────────────┼────────────┼────────────────┼─────────────┤
  1490. 128.31 s > │ Total │ │ 8 │ 34ms (86%) │ 1ms (2.7%) │ 4ms (11%) │ 0ms (0.00%) │
  1491. 128.31 s > ╰───────────┴───────────────────┴─────────┴────────────┴────────────┴────────────────┴─────────────╯
  1492. 128.31 s > [2026-08-26 08:22:06.537] @process::amplitude INFO : Input is above threshold: 1 existing threshold E-surfaces across 1/1 graph groups
  1493. 128.31 s > [2026-08-26 08:22:06.537] @process::amplitude INFO : overlap structure of group 0: [1: [1(1,3)]]
  1494. 128.31 s > Error:
  1495. 128.31 s > 0: IR profiling requested arbitrary precision but received a quad-precision result
  1496. 128.31 s >
  1497. 128.31 s > Location:
  1498. 128.31 s > crates/gammalooprs/src/integrands/process/ir.rs:2123
  1499. 128.31 s >
  1500. 128.31 s > ━━━━━━━━━━━━━━━━━━━━━━━━━━━━━━━━━━ BACKTRACE ━━━━━━━━━━━━━━━━━━━━━━━━━━━━━━━━━━━
  1501. 128.31 s > 1: <color_eyre[51793ea62743adbd]::config::EyreHook>::into_eyre_hook::{closure#0}<unknown>
  1502. 128.31 s > at <unknown source file>:<unknown line>
  1503. 128.31 s > 2: eyre[cb2fd339c0c40fca]::capture_handler<unknown>
  1504. 128.31 s > at <unknown source file>:<unknown line>
  1505. 128.31 s > 3: eyre[cb2fd339c0c40fca]::private::format_err<unknown>
  1506. 128.31 s > at <unknown source file>:<unknown line>
  1507. 128.31 s > 4: gammalooprs[d7a7c067ebd19583]::integrands::process::ir::evaluate_profile_momentum_point_arb::<gammalooprs[d7a7c067ebd19583]::integrands::process::amplitude::AmplitudeIntegrand><unknown>
  1508. 128.31 s > at <unknown source file>:<unknown line>
  1509. 128.31 s > 5: <gammalooprs[d7a7c067ebd19583]::integrands::process::amplitude::AmplitudeIntegrand>::test_single_ir_limit_impl<unknown>
  1510. 128.31 s > at <unknown source file>:<unknown line>
  1511. 128.31 s > 6: gammalooprs[d7a7c067ebd19583]::integrands::process::ir::run_ir_profile::<gammalooprs[d7a7c067ebd19583]::integrands::process::amplitude::AmplitudeIntegrand, <gammalooprs[d7a7c067ebd19583]::integrands::process::amplitude::AmplitudeIntegrand>::enumerate_ir_limits, <gammalooprs[d7a7c067ebd19583]::integrands::process::amplitude::AmplitudeIntegrand>::graph_cut_definitions, <gammalooprs[d7a7c067ebd19583]::integrands::process::amplitude::AmplitudeIntegrand>::test_single_ir_limit_impl><unknown>
  1512. 128.31 s > at <unknown source file>:<unknown line>
  1513. 128.31 s > 7: <gammalooprs[d7a7c067ebd19583]::integrands::process::amplitude::AmplitudeIntegrand>::test_ir<unknown>
  1514. 128.31 s > at <unknown source file>:<unknown line>
  1515. 128.31 s > 8: <gammaloop_api[92ae732909e47e14]::commands::profile::Profile>::run<unknown>
  1516. 128.31 s > at <unknown source file>:<unknown line>
  1517. 128.31 s > 9: test_runs[3e7a390caee4e338]::profile_bulk::dotted_bubble_amp_bulk_profile_passes<unknown>
  1518. 128.31 s > at <unknown source file>:<unknown line>
  1519. 128.31 s > 10: <test_runs[3e7a390caee4e338]::profile_bulk::dotted_bubble_amp_bulk_profile_passes::{closure#0} as core[940e698046960fd5]::ops::function::FnOnce<()>>::call_once<unknown>
  1520. 128.31 s > at <unknown source file>:<unknown line>
  1521. 128.31 s > 11: test[75d6903177b1d7e9]::__rust_begin_short_backtrace::<core[940e698046960fd5]::result::Result<(), alloc[2ea6bcb46fca0c42]::string::String>, fn() -> core[940e698046960fd5]::result::Result<(), alloc[2ea6bcb46fca0c42]::string::String>><unknown>
  1522. 128.31 s > at <unknown source file>:<unknown line>
  1523. 128.31 s > 12: test[75d6903177b1d7e9]::run_test::{closure#0}<unknown>
  1524. 128.31 s > at <unknown source file>:<unknown line>
  1525. 128.31 s > 13: std[bcb96dfbba0ab899]::sys::backtrace::__rust_begin_short_backtrace::<test[75d6903177b1d7e9]::run_test::{closure#1}, ()><unknown>
  1526. 128.31 s > at <unknown source file>:<unknown line>
  1527. 128.31 s > 14: <std[bcb96dfbba0ab899]::thread::lifecycle::spawn_unchecked<test[75d6903177b1d7e9]::run_test::{closure#1}, ()>::{closure#1} as core[940e698046960fd5]::ops::function::FnOnce<()>>::call_once::{shim:vtable#0}<unknown>
  1528. 128.31 s > at <unknown source file>:<unknown line>
  1529. 128.31 s > 15: <std[bcb96dfbba0ab899]::sys::thread::unix::Thread>::new::thread_start<unknown>
  1530. 128.31 s > at <unknown source file>:<unknown line>
  1531. 128.31 s > 16: start_thread<unknown>
  1532. 128.31 s > at <unknown source file>:<unknown line>
  1533. 128.31 s > 17: __clone3<unknown>
  1534. 128.31 s > at <unknown source file>:<unknown line>
  1535. 128.31 s >
  1536. 128.31 s > Run with COLORBT_SHOW_HIDDEN=1 environment variable to disable frame filtering.
  1537. 128.31 s > Run with RUST_BACKTRACE=full to include source snippets.
  1538. 128.31 s > Warning: SpanTrace capture is Unsupported.
  1539. 128.31 s > Ensure that you've setup a tracing-error ErrorLayer and the semver versions are compatible
  1540. 128.31 s >
  1541. 128.31 s > 3. gammaloop-integration-tests::test_runs::profile_bulk::double_dotted_bubble_amp_bulk_profile_passes
  1542. 128.31 s > failure: test failure with exit code 101
  1543. 128.31 s > Error:
  1544. 128.31 s > 0: IR profiling requested arbitrary precision but received a quad-precision result
  1545. 128.31 s >
  1546. 128.31 s > Location:
  1547. 128.31 s > crates/gammalooprs/src/integrands/process/ir.rs:2123
  1548. 128.31 s >
  1549. 128.31 s > ━━━━━━━━━━━━━━━━━━━━━━━━━━━━━━━━━━ BACKTRACE ━━━━━━━━━━━━━━━━━━━━━━━━━━━━━━━━━━━
  1550. 128.31 s > 1: <color_eyre[51793ea62743adbd]::config::EyreHook>::into_eyre_hook::{closure#0}<unknown>
  1551. 128.31 s > at <unknown source file>:<unknown line>
  1552. 128.31 s > 2: eyre[cb2fd339c0c40fca]::capture_handler<unknown>
  1553. 128.31 s > at <unknown source file>:<unknown line>
  1554. 128.31 s > 3: eyre[cb2fd339c0c40fca]::private::format_err<unknown>
  1555. 128.31 s > at <unknown source file>:<unknown line>
  1556. 128.31 s > 4: gammalooprs[d7a7c067ebd19583]::integrands::process::ir::evaluate_profile_momentum_point_arb::<gammalooprs[d7a7c067ebd19583]::integrands::process::amplitude::AmplitudeIntegrand><unknown>
  1557. 128.31 s > at <unknown source file>:<unknown line>
  1558. 128.31 s > 5: <gammalooprs[d7a7c067ebd19583]::integrands::process::amplitude::AmplitudeIntegrand>::test_single_ir_limit_impl<unknown>
  1559. 128.31 s > at <unknown source file>:<unknown line>
  1560. 128.31 s > 6: gammalooprs[d7a7c067ebd19583]::integrands::process::ir::run_ir_profile::<gammalooprs[d7a7c067ebd19583]::integrands::process::amplitude::AmplitudeIntegrand, <gammalooprs[d7a7c067ebd19583]::integrands::process::amplitude::AmplitudeIntegrand>::enumerate_ir_limits, <gammalooprs[d7a7c067ebd19583]::integrands::process::amplitude::AmplitudeIntegrand>::graph_cut_definitions, <gammalooprs[d7a7c067ebd19583]::integrands::process::amplitude::AmplitudeIntegrand>::test_single_ir_limit_impl><unknown>
  1561. 128.31 s > at <unknown source file>:<unknown line>
  1562. 128.31 s > 7: <gammalooprs[d7a7c067ebd19583]::integrands::process::amplitude::AmplitudeIntegrand>::test_ir<unknown>
  1563. 128.31 s > at <unknown source file>:<unknown line>
  1564. 128.31 s > 8: <gammaloop_api[92ae732909e47e14]::commands::profile::Profile>::run<unknown>
  1565. 128.31 s > at <unknown source file>:<unknown line>
  1566. 128.31 s > 9: test_runs[3e7a390caee4e338]::profile_bulk::double_dotted_bubble_amp_bulk_profile_passes<unknown>
  1567. 128.31 s > at <unknown source file>:<unknown line>
  1568. 128.31 s > 10: <test_runs[3e7a390caee4e338]::profile_bulk::double_dotted_bubble_amp_bulk_profile_passes::{closure#0} as core[940e698046960fd5]::ops::function::FnOnce<()>>::call_once<unknown>
  1569. 128.31 s > at <unknown source file>:<unknown line>
  1570. 128.31 s > 11: test[75d6903177b1d7e9]::__rust_begin_short_backtrace::<core[940e698046960fd5]::result::Result<(), alloc[2ea6bcb46fca0c42]::string::String>, fn() -> core[940e698046960fd5]::result::Result<(), alloc[2ea6bcb46fca0c42]::string::String>><unknown>
  1571. 128.31 s > at <unknown source file>:<unknown line>
  1572. 128.31 s > 12: test[75d6903177b1d7e9]::run_test::{closure#0}<unknown>
  1573. 128.31 s > at <unknown source file>:<unknown line>
  1574. 128.31 s > 13: std[bcb96dfbba0ab899]::sys::backtrace::__rust_begin_short_backtrace::<test[75d6903177b1d7e9]::run_test::{closure#1}, ()><unknown>
  1575. 128.31 s > at <unknown source file>:<unknown line>
  1576. 128.31 s > 14: <std[bcb96dfbba0ab899]::thread::lifecycle::spawn_unchecked<test[75d6903177b1d7e9]::run_test::{closure#1}, ()>::{closure#1} as core[940e698046960fd5]::ops::function::FnOnce<()>>::call_once::{shim:vtable#0}<unknown>
  1577. 128.31 s > at <unknown source file>:<unknown line>
  1578. 128.31 s > 15: <std[bcb96dfbba0ab899]::sys::thread::unix::Thread>::new::thread_start<unknown>
  1579. 128.31 s > at <unknown source file>:<unknown line>
  1580. 128.31 s > 16: start_thread<unknown>
  1581. 128.31 s > at <unknown source file>:<unknown line>
  1582. 128.31 s > 17: __clone3<unknown>
  1583. 128.31 s > at <unknown source file>:<unknown line>
  1584. 128.31 s >
  1585. 128.31 s > Run with COLORBT_SHOW_HIDDEN=1 environment variable to disable frame filtering.
  1586. 128.31 s > Run with RUST_BACKTRACE=full to include source snippets.
  1587. 128.31 s > Warning: SpanTrace capture is Unsupported.
  1588. 128.31 s > Ensure that you've setup a tracing-error ErrorLayer and the semver versions are compatible
  1589. 128.31 s > system-out
  1590. 128.31 s > running 1 test
  1591. 128.31 s > test profile_bulk::double_dotted_bubble_amp_bulk_profile_passes ... FAILED
  1592. 128.31 s >
  1593. 128.31 s > failures:
  1594. 128.31 s >
  1595. 128.31 s > failures:
  1596. 128.31 s > profile_bulk::double_dotted_bubble_amp_bulk_profile_passes
  1597. 128.31 s >
  1598. 128.31 s > test result: FAILED. 0 passed; 1 failed; 0 ignored; 0 measured; 82 filtered out; finished in 0.35s
  1599. 128.31 s > system-err
  1600. 128.31 s > [2026-08-26 08:22:06.536] @gammaloop_api::se... INFO : Running command import model ./assets/models/json/scalars/scalars_2p_3p.json
  1601. 128.31 s > [2026-08-26 08:22:06.536] @import::model INFO : Loading JSON model scalars_2p_3p-default from /build/source/assets/models/json/scalars/scalars_2p_3p
  1602. 128.31 s > [2026-08-26 08:22:06.538] @gammaloop_api::se... INFO : Running command import graphs ./tests/resources/graphs/double_dotted_bubble_amp.dot
  1603. 128.31 s > [2026-08-26 08:22:06.538] @commands::import INFO : Loading graphs from '/build/source/tests/resources/graphs/double_dotted_bubble_amp.dot'
  1604. 128.31 s > [2026-08-26 08:22:06.545] @gammaloop_api::se... INFO : Running command generate
  1605. 128.31 s > [2026-08-26 08:22:06.765] @commands::generate INFO :
  1606. 128.31 s > Integrand generation summary
  1607. 128.31 s > peak RAM 66.52 MiB | cores 1
  1608. 128.31 s > ╭───────────┬──────────────────────────┬─────────┬────────────┬────────────┬────────────────┬─────────────╮
  1609. 128.31 s > │ integrand │ graph │ # evals │ expr build │ spenso │ symbolica eval │ compile │
  1610. 128.31 s > ├───────────┼──────────────────────────┼─────────┼────────────┼────────────┼────────────────┼─────────────┤
  1611. 128.31 s > │ default │ double_dotted_bubble_amp │ 11 │ 67ms (52%) │ 2ms (2.1%) │ 61ms (46%) │ 0ms (0.00%) │
  1612. 128.31 s > ├───────────┼──────────────────────────┼─────────┼────────────┼────────────┼────────────────┼─────────────┤
  1613. 128.31 s > │ Total │ │ 11 │ 67ms (52%) │ 2ms (2.1%) │ 61ms (46%) │ 0ms (0.00%) │
  1614. 128.31 s > ╰───────────┴──────────────────────────┴─────────┴────────────┴────────────┴────────────────┴─────────────╯
  1615. 128.31 s > [2026-08-26 08:22:06.767] @process::amplitude INFO : Input is above threshold: 1 existing threshold E-surfaces across 1/1 graph groups
  1616. 128.31 s > [2026-08-26 08:22:06.767] @process::amplitude INFO : overlap structure of group 0: [1: [1(1,4)]]
  1617. 128.31 s > Error:
  1618. 128.31 s > 0: IR profiling requested arbitrary precision but received a quad-precision result
  1619. 128.31 s >
  1620. 128.31 s > Location:
  1621. 128.31 s > crates/gammalooprs/src/integrands/process/ir.rs:2123
  1622. 128.31 s >
  1623. 128.31 s > ━━━━━━━━━━━━━━━━━━━━━━━━━━━━━━━━━━ BACKTRACE ━━━━━━━━━━━━━━━━━━━━━━━━━━━━━━━━━━━
  1624. 128.31 s > 1: <color_eyre[51793ea62743adbd]::config::EyreHook>::into_eyre_hook::{closure#0}<unknown>
  1625. 128.31 s > at <unknown source file>:<unknown line>
  1626. 128.31 s > 2: eyre[cb2fd339c0c40fca]::capture_handler<unknown>
  1627. 128.31 s > at <unknown source file>:<unknown line>
  1628. 128.31 s > 3: eyre[cb2fd339c0c40fca]::private::format_err<unknown>
  1629. 128.31 s > at <unknown source file>:<unknown line>
  1630. 128.31 s > 4: gammalooprs[d7a7c067ebd19583]::integrands::process::ir::evaluate_profile_momentum_point_arb::<gammalooprs[d7a7c067ebd19583]::integrands::process::amplitude::AmplitudeIntegrand><unknown>
  1631. 128.31 s > at <unknown source file>:<unknown line>
  1632. 128.31 s > 5: <gammalooprs[d7a7c067ebd19583]::integrands::process::amplitude::AmplitudeIntegrand>::test_single_ir_limit_impl<unknown>
  1633. 128.31 s > at <unknown source file>:<unknown line>
  1634. 128.31 s > 6: gammalooprs[d7a7c067ebd19583]::integrands::process::ir::run_ir_profile::<gammalooprs[d7a7c067ebd19583]::integrands::process::amplitude::AmplitudeIntegrand, <gammalooprs[d7a7c067ebd19583]::integrands::process::amplitude::AmplitudeIntegrand>::enumerate_ir_limits, <gammalooprs[d7a7c067ebd19583]::integrands::process::amplitude::AmplitudeIntegrand>::graph_cut_definitions, <gammalooprs[d7a7c067ebd19583]::integrands::process::amplitude::AmplitudeIntegrand>::test_single_ir_limit_impl><unknown>
  1635. 128.31 s > at <unknown source file>:<unknown line>
  1636. 128.31 s > 7: <gammalooprs[d7a7c067ebd19583]::integrands::process::amplitude::AmplitudeIntegrand>::test_ir<unknown>
  1637. 128.31 s > at <unknown source file>:<unknown line>
  1638. 128.31 s > 8: <gammaloop_api[92ae732909e47e14]::commands::profile::Profile>::run<unknown>
  1639. 128.31 s > at <unknown source file>:<unknown line>
  1640. 128.31 s > 9: test_runs[3e7a390caee4e338]::profile_bulk::double_dotted_bubble_amp_bulk_profile_passes<unknown>
  1641. 128.31 s > at <unknown source file>:<unknown line>
  1642. 128.31 s > 10: <test_runs[3e7a390caee4e338]::profile_bulk::double_dotted_bubble_amp_bulk_profile_passes::{closure#0} as core[940e698046960fd5]::ops::function::FnOnce<()>>::call_once<unknown>
  1643. 128.31 s > at <unknown source file>:<unknown line>
  1644. 128.31 s > 11: test[75d6903177b1d7e9]::__rust_begin_short_backtrace::<core[940e698046960fd5]::result::Result<(), alloc[2ea6bcb46fca0c42]::string::String>, fn() -> core[940e698046960fd5]::result::Result<(), alloc[2ea6bcb46fca0c42]::string::String>><unknown>
  1645. 128.31 s > at <unknown source file>:<unknown line>
  1646. 128.31 s > 12: test[75d6903177b1d7e9]::run_test::{closure#0}<unknown>
  1647. 128.31 s > at <unknown source file>:<unknown line>
  1648. 128.31 s > 13: std[bcb96dfbba0ab899]::sys::backtrace::__rust_begin_short_backtrace::<test[75d6903177b1d7e9]::run_test::{closure#1}, ()><unknown>
  1649. 128.31 s > at <unknown source file>:<unknown line>
  1650. 128.31 s > 14: <std[bcb96dfbba0ab899]::thread::lifecycle::spawn_unchecked<test[75d6903177b1d7e9]::run_test::{closure#1}, ()>::{closure#1} as core[940e698046960fd5]::ops::function::FnOnce<()>>::call_once::{shim:vtable#0}<unknown>
  1651. 128.31 s > at <unknown source file>:<unknown line>
  1652. 128.31 s > 15: <std[bcb96dfbba0ab899]::sys::thread::unix::Thread>::new::thread_start<unknown>
  1653. 128.31 s > at <unknown source file>:<unknown line>
  1654. 128.31 s > 16: start_thread<unknown>
  1655. 128.31 s > at <unknown source file>:<unknown line>
  1656. 128.31 s > 17: __clone3<unknown>
  1657. 128.31 s > at <unknown source file>:<unknown line>
  1658. 128.31 s >
  1659. 128.31 s > Run with COLORBT_SHOW_HIDDEN=1 environment variable to disable frame filtering.
  1660. 128.31 s > Run with RUST_BACKTRACE=full to include source snippets.
  1661. 128.31 s > Warning: SpanTrace capture is Unsupported.
  1662. 128.31 s > Ensure that you've setup a tracing-error ErrorLayer and the semver versions are compatible
  1663. 128.31 s >
  1664. 128.31 s > 4. gammaloop-integration-tests::test_runs::profile_bulk::box_4e_bulk_profile_passes
  1665. 128.31 s > failure: test failure with exit code 101
  1666. 128.31 s > Error:
  1667. 128.31 s > 0: IR profiling requested arbitrary precision but received a quad-precision result
  1668. 128.31 s >
  1669. 128.31 s > Location:
  1670. 128.31 s > crates/gammalooprs/src/integrands/process/ir.rs:2123
  1671. 128.31 s >
  1672. 128.31 s > ━━━━━━━━━━━━━━━━━━━━━━━━━━━━━━━━━━ BACKTRACE ━━━━━━━━━━━━━━━━━━━━━━━━━━━━━━━━━━━
  1673. 128.31 s > 1: <color_eyre[51793ea62743adbd]::config::EyreHook>::into_eyre_hook::{closure#0}<unknown>
  1674. 128.31 s > at <unknown source file>:<unknown line>
  1675. 128.31 s > 2: eyre[cb2fd339c0c40fca]::capture_handler<unknown>
  1676. 128.31 s > at <unknown source file>:<unknown line>
  1677. 128.31 s > 3: eyre[cb2fd339c0c40fca]::private::format_err<unknown>
  1678. 128.31 s > at <unknown source file>:<unknown line>
  1679. 128.31 s > 4: gammalooprs[d7a7c067ebd19583]::integrands::process::ir::evaluate_profile_momentum_point_arb::<gammalooprs[d7a7c067ebd19583]::integrands::process::amplitude::AmplitudeIntegrand><unknown>
  1680. 128.31 s > at <unknown source file>:<unknown line>
  1681. 128.31 s > 5: <gammalooprs[d7a7c067ebd19583]::integrands::process::amplitude::AmplitudeIntegrand>::test_single_ir_limit_impl<unknown>
  1682. 128.31 s > at <unknown source file>:<unknown line>
  1683. 128.31 s > 6: gammalooprs[d7a7c067ebd19583]::integrands::process::ir::run_ir_profile::<gammalooprs[d7a7c067ebd19583]::integrands::process::amplitude::AmplitudeIntegrand, <gammalooprs[d7a7c067ebd19583]::integrands::process::amplitude::AmplitudeIntegrand>::enumerate_ir_limits, <gammalooprs[d7a7c067ebd19583]::integrands::process::amplitude::AmplitudeIntegrand>::graph_cut_definitions, <gammalooprs[d7a7c067ebd19583]::integrands::process::amplitude::AmplitudeIntegrand>::test_single_ir_limit_impl><unknown>
  1684. 128.31 s > at <unknown source file>:<unknown line>
  1685. 128.31 s > 7: <gammalooprs[d7a7c067ebd19583]::integrands::process::amplitude::AmplitudeIntegrand>::test_ir<unknown>
  1686. 128.31 s > at <unknown source file>:<unknown line>
  1687. 128.31 s > 8: <gammaloop_api[92ae732909e47e14]::commands::profile::Profile>::run<unknown>
  1688. 128.31 s > at <unknown source file>:<unknown line>
  1689. 128.31 s > 9: test_runs[3e7a390caee4e338]::profile_bulk::box_4e_bulk_profile_passes<unknown>
  1690. 128.31 s > at <unknown source file>:<unknown line>
  1691. 128.31 s > 10: <test_runs[3e7a390caee4e338]::profile_bulk::box_4e_bulk_profile_passes::{closure#0} as core[940e698046960fd5]::ops::function::FnOnce<()>>::call_once<unknown>
  1692. 128.31 s > at <unknown source file>:<unknown line>
  1693. 128.31 s > 11: test[75d6903177b1d7e9]::__rust_begin_short_backtrace::<core[940e698046960fd5]::result::Result<(), alloc[2ea6bcb46fca0c42]::string::String>, fn() -> core[940e698046960fd5]::result::Result<(), alloc[2ea6bcb46fca0c42]::string::String>><unknown>
  1694. 128.31 s > at <unknown source file>:<unknown line>
  1695. 128.31 s > 12: test[75d6903177b1d7e9]::run_test::{closure#0}<unknown>
  1696. 128.31 s > at <unknown source file>:<unknown line>
  1697. 128.31 s > 13: std[bcb96dfbba0ab899]::sys::backtrace::__rust_begin_short_backtrace::<test[75d6903177b1d7e9]::run_test::{closure#1}, ()><unknown>
  1698. 128.31 s > at <unknown source file>:<unknown line>
  1699. 128.31 s > 14: <std[bcb96dfbba0ab899]::thread::lifecycle::spawn_unchecked<test[75d6903177b1d7e9]::run_test::{closure#1}, ()>::{closure#1} as core[940e698046960fd5]::ops::function::FnOnce<()>>::call_once::{shim:vtable#0}<unknown>
  1700. 128.31 s > at <unknown source file>:<unknown line>
  1701. 128.31 s > 15: <std[bcb96dfbba0ab899]::sys::thread::unix::Thread>::new::thread_start<unknown>
  1702. 128.31 s > at <unknown source file>:<unknown line>
  1703. 128.31 s > 16: start_thread<unknown>
  1704. 128.31 s > at <unknown source file>:<unknown line>
  1705. 128.31 s > 17: __clone3<unknown>
  1706. 128.31 s > at <unknown source file>:<unknown line>
  1707. 128.31 s >
  1708. 128.31 s > Run with COLORBT_SHOW_HIDDEN=1 environment variable to disable frame filtering.
  1709. 128.31 s > Run with RUST_BACKTRACE=full to include source snippets.
  1710. 128.31 s > Warning: SpanTrace capture is Unsupported.
  1711. 128.31 s > Ensure that you've setup a tracing-error ErrorLayer and the semver versions are compatible
  1712. 128.31 s > system-out
  1713. 128.31 s > running 1 test
  1714. 128.31 s > test profile_bulk::box_4e_bulk_profile_passes ... FAILED
  1715. 128.31 s >
  1716. 128.31 s > failures:
  1717. 128.31 s >
  1718. 128.31 s > failures:
  1719. 128.31 s > profile_bulk::box_4e_bulk_profile_passes
  1720. 128.31 s >
  1721. 128.31 s > test result: FAILED. 0 passed; 1 failed; 0 ignored; 0 measured; 82 filtered out; finished in 0.57s
  1722. 128.31 s > system-err
  1723. 128.31 s > [2026-08-26 08:22:06.524] @gammaloop_api::se... INFO : Running command import model ./assets/models/json/scalars/scalars.json
  1724. 128.31 s > [2026-08-26 08:22:06.524] @import::model INFO : Loading JSON model scalars-default from /build/source/assets/models/json/scalars/scalars
  1725. 128.31 s > [2026-08-26 08:22:06.527] @gammalooprs::model INFO : The following 2 external parameters were forced to zero by the restriction card:
  1726. 128.31 s > width_scalar_1, width_scalar_2
  1727. 128.31 s > [2026-08-26 08:22:06.528] @gammaloop_api::se... INFO : Running command import graphs ./tests/resources/graphs/massless_box.dot
  1728. 128.31 s > [2026-08-26 08:22:06.528] @commands::import INFO : Loading graphs from '/build/source/tests/resources/graphs/massless_box.dot'
  1729. 128.31 s > [2026-08-26 08:22:06.532] @gammaloop_api::se... INFO : Running command generate
  1730. 128.31 s > [2026-08-26 08:22:06.747] @commands::generate INFO :
  1731. 128.31 s > Integrand generation summary
  1732. 128.31 s > peak RAM 66.05 MiB | cores 1
  1733. 128.31 s > ╭───────────┬────────────────┬─────────┬─────────────┬────────────┬────────────────┬─────────────╮
  1734. 128.31 s > │ integrand │ graph │ # evals │ expr build │ spenso │ symbolica eval │ compile │
  1735. 128.31 s > ├───────────┼────────────────┼─────────┼─────────────┼────────────┼────────────────┼─────────────┤
  1736. 128.31 s > │ default │ massless_box_0 │ 14 │ 160ms (81%) │ 23ms (12%) │ 13ms (6.9%) │ 0ms (0.00%) │
  1737. 128.31 s > ├───────────┼────────────────┼─────────┼─────────────┼────────────┼────────────────┼─────────────┤
  1738. 128.31 s > │ Total │ │ 14 │ 160ms (81%) │ 23ms (12%) │ 13ms (6.9%) │ 0ms (0.00%) │
  1739. 128.31 s > ╰───────────┴────────────────┴─────────┴─────────────┴────────────┴────────────────┴─────────────╯
  1740. 128.31 s > [2026-08-26 08:22:06.750] @process::amplitude INFO : Input is above threshold: 4 existing threshold E-surfaces across 1/1 graph groups
  1741. 128.31 s > [2026-08-26 08:22:06.751] @process::amplitude INFO : overlap structure of group 0: [2: [4(3,4), 8(4,6)], 2: [9(3,5), 11(5,6)], 2: [4(3,4), 9(3,5)], 2: [8(4,6), 11(5,6)]]
  1742. 128.31 s > Error:
  1743. 128.31 s > 0: IR profiling requested arbitrary precision but received a quad-precision result
  1744. 128.31 s >
  1745. 128.31 s > Location:
  1746. 128.31 s > crates/gammalooprs/src/integrands/process/ir.rs:2123
  1747. 128.31 s >
  1748. 128.31 s > ━━━━━━━━━━━━━━━━━━━━━━━━━━━━━━━━━━ BACKTRACE ━━━━━━━━━━━━━━━━━━━━━━━━━━━━━━━━━━━
  1749. 128.31 s > 1: <color_eyre[51793ea62743adbd]::config::EyreHook>::into_eyre_hook::{closure#0}<unknown>
  1750. 128.31 s > at <unknown source file>:<unknown line>
  1751. 128.31 s > 2: eyre[cb2fd339c0c40fca]::capture_handler<unknown>
  1752. 128.31 s > at <unknown source file>:<unknown line>
  1753. 128.31 s > 3: eyre[cb2fd339c0c40fca]::private::format_err<unknown>
  1754. 128.31 s > at <unknown source file>:<unknown line>
  1755. 128.31 s > 4: gammalooprs[d7a7c067ebd19583]::integrands::process::ir::evaluate_profile_momentum_point_arb::<gammalooprs[d7a7c067ebd19583]::integrands::process::amplitude::AmplitudeIntegrand><unknown>
  1756. 128.31 s > at <unknown source file>:<unknown line>
  1757. 128.31 s > 5: <gammalooprs[d7a7c067ebd19583]::integrands::process::amplitude::AmplitudeIntegrand>::test_single_ir_limit_impl<unknown>
  1758. 128.31 s > at <unknown source file>:<unknown line>
  1759. 128.31 s > 6: gammalooprs[d7a7c067ebd19583]::integrands::process::ir::run_ir_profile::<gammalooprs[d7a7c067ebd19583]::integrands::process::amplitude::AmplitudeIntegrand, <gammalooprs[d7a7c067ebd19583]::integrands::process::amplitude::AmplitudeIntegrand>::enumerate_ir_limits, <gammalooprs[d7a7c067ebd19583]::integrands::process::amplitude::AmplitudeIntegrand>::graph_cut_definitions, <gammalooprs[d7a7c067ebd19583]::integrands::process::amplitude::AmplitudeIntegrand>::test_single_ir_limit_impl><unknown>
  1760. 128.31 s > at <unknown source file>:<unknown line>
  1761. 128.31 s > 7: <gammalooprs[d7a7c067ebd19583]::integrands::process::amplitude::AmplitudeIntegrand>::test_ir<unknown>
  1762. 128.31 s > at <unknown source file>:<unknown line>
  1763. 128.31 s > 8: <gammaloop_api[92ae732909e47e14]::commands::profile::Profile>::run<unknown>
  1764. 128.31 s > at <unknown source file>:<unknown line>
  1765. 128.31 s > 9: test_runs[3e7a390caee4e338]::profile_bulk::box_4e_bulk_profile_passes<unknown>
  1766. 128.31 s > at <unknown source file>:<unknown line>
  1767. 128.31 s > 10: <test_runs[3e7a390caee4e338]::profile_bulk::box_4e_bulk_profile_passes::{closure#0} as core[940e698046960fd5]::ops::function::FnOnce<()>>::call_once<unknown>
  1768. 128.31 s > at <unknown source file>:<unknown line>
  1769. 128.31 s > 11: test[75d6903177b1d7e9]::__rust_begin_short_backtrace::<core[940e698046960fd5]::result::Result<(), alloc[2ea6bcb46fca0c42]::string::String>, fn() -> core[940e698046960fd5]::result::Result<(), alloc[2ea6bcb46fca0c42]::string::String>><unknown>
  1770. 128.31 s > at <unknown source file>:<unknown line>
  1771. 128.31 s > 12: test[75d6903177b1d7e9]::run_test::{closure#0}<unknown>
  1772. 128.31 s > at <unknown source file>:<unknown line>
  1773. 128.31 s > 13: std[bcb96dfbba0ab899]::sys::backtrace::__rust_begin_short_backtrace::<test[75d6903177b1d7e9]::run_test::{closure#1}, ()><unknown>
  1774. 128.31 s > at <unknown source file>:<unknown line>
  1775. 128.31 s > 14: <std[bcb96dfbba0ab899]::thread::lifecycle::spawn_unchecked<test[75d6903177b1d7e9]::run_test::{closure#1}, ()>::{closure#1} as core[940e698046960fd5]::ops::function::FnOnce<()>>::call_once::{shim:vtable#0}<unknown>
  1776. 128.31 s > at <unknown source file>:<unknown line>
  1777. 128.31 s > 15: <std[bcb96dfbba0ab899]::sys::thread::unix::Thread>::new::thread_start<unknown>
  1778. 128.31 s > at <unknown source file>:<unknown line>
  1779. 128.31 s > 16: start_thread<unknown>
  1780. 128.31 s > at <unknown source file>:<unknown line>
  1781. 128.31 s > 17: __clone3<unknown>
  1782. 128.31 s > at <unknown source file>:<unknown line>
  1783. 128.31 s >
  1784. 128.31 s > Run with COLORBT_SHOW_HIDDEN=1 environment variable to disable frame filtering.
  1785. 128.31 s > Run with RUST_BACKTRACE=full to include source snippets.
  1786. 128.31 s > Warning: SpanTrace capture is Unsupported.
  1787. 128.31 s > Ensure that you've setup a tracing-error ErrorLayer and the semver versions are compatible
  1788. 128.31 s >
  1789. 128.31 s > 5. gammaloop-integration-tests::test_runs::profile_bulk::massless_triangle_bulk_profile_passes
  1790. 128.31 s > failure: test failure with exit code 101
  1791. 128.31 s > Error:
  1792. 128.31 s > 0: IR profiling requested arbitrary precision but received a quad-precision result
  1793. 128.31 s >
  1794. 128.31 s > Location:
  1795. 128.31 s > crates/gammalooprs/src/integrands/process/ir.rs:2123
  1796. 128.31 s >
  1797. 128.31 s > ━━━━━━━━━━━━━━━━━━━━━━━━━━━━━━━━━━ BACKTRACE ━━━━━━━━━━━━━━━━━━━━━━━━━━━━━━━━━━━
  1798. 128.31 s > 1: <color_eyre[51793ea62743adbd]::config::EyreHook>::into_eyre_hook::{closure#0}<unknown>
  1799. 128.31 s > at <unknown source file>:<unknown line>
  1800. 128.31 s > 2: eyre[cb2fd339c0c40fca]::capture_handler<unknown>
  1801. 128.31 s > at <unknown source file>:<unknown line>
  1802. 128.31 s > 3: eyre[cb2fd339c0c40fca]::private::format_err<unknown>
  1803. 128.31 s > at <unknown source file>:<unknown line>
  1804. 128.31 s > 4: gammalooprs[d7a7c067ebd19583]::integrands::process::ir::evaluate_profile_momentum_point_arb::<gammalooprs[d7a7c067ebd19583]::integrands::process::amplitude::AmplitudeIntegrand><unknown>
  1805. 128.31 s > at <unknown source file>:<unknown line>
  1806. 128.31 s > 5: <gammalooprs[d7a7c067ebd19583]::integrands::process::amplitude::AmplitudeIntegrand>::test_single_ir_limit_impl<unknown>
  1807. 128.31 s > at <unknown source file>:<unknown line>
  1808. 128.31 s > 6: gammalooprs[d7a7c067ebd19583]::integrands::process::ir::run_ir_profile::<gammalooprs[d7a7c067ebd19583]::integrands::process::amplitude::AmplitudeIntegrand, <gammalooprs[d7a7c067ebd19583]::integrands::process::amplitude::AmplitudeIntegrand>::enumerate_ir_limits, <gammalooprs[d7a7c067ebd19583]::integrands::process::amplitude::AmplitudeIntegrand>::graph_cut_definitions, <gammalooprs[d7a7c067ebd19583]::integrands::process::amplitude::AmplitudeIntegrand>::test_single_ir_limit_impl><unknown>
  1809. 128.31 s > at <unknown source file>:<unknown line>
  1810. 128.31 s > 7: <gammalooprs[d7a7c067ebd19583]::integrands::process::amplitude::AmplitudeIntegrand>::test_ir<unknown>
  1811. 128.31 s > at <unknown source file>:<unknown line>
  1812. 128.31 s > 8: <gammaloop_api[92ae732909e47e14]::commands::profile::Profile>::run<unknown>
  1813. 128.31 s > at <unknown source file>:<unknown line>
  1814. 128.31 s > 9: test_runs[3e7a390caee4e338]::profile_bulk::massless_triangle_bulk_profile_passes<unknown>
  1815. 128.31 s > at <unknown source file>:<unknown line>
  1816. 128.31 s > 10: <test_runs[3e7a390caee4e338]::profile_bulk::massless_triangle_bulk_profile_passes::{closure#0} as core[940e698046960fd5]::ops::function::FnOnce<()>>::call_once<unknown>
  1817. 128.31 s > at <unknown source file>:<unknown line>
  1818. 128.31 s > 11: test[75d6903177b1d7e9]::__rust_begin_short_backtrace::<core[940e698046960fd5]::result::Result<(), alloc[2ea6bcb46fca0c42]::string::String>, fn() -> core[940e698046960fd5]::result::Result<(), alloc[2ea6bcb46fca0c42]::string::String>><unknown>
  1819. 128.31 s > at <unknown source file>:<unknown line>
  1820. 128.31 s > 12: test[75d6903177b1d7e9]::run_test::{closure#0}<unknown>
  1821. 128.31 s > at <unknown source file>:<unknown line>
  1822. 128.31 s > 13: std[bcb96dfbba0ab899]::sys::backtrace::__rust_begin_short_backtrace::<test[75d6903177b1d7e9]::run_test::{closure#1}, ()><unknown>
  1823. 128.31 s > at <unknown source file>:<unknown line>
  1824. 128.31 s > 14: <std[bcb96dfbba0ab899]::thread::lifecycle::spawn_unchecked<test[75d6903177b1d7e9]::run_test::{closure#1}, ()>::{closure#1} as core[940e698046960fd5]::ops::function::FnOnce<()>>::call_once::{shim:vtable#0}<unknown>
  1825. 128.31 s > at <unknown source file>:<unknown line>
  1826. 128.31 s > 15: <std[bcb96dfbba0ab899]::sys::thread::unix::Thread>::new::thread_start<unknown>
  1827. 128.31 s > at <unknown source file>:<unknown line>
  1828. 128.31 s > 16: start_thread<unknown>
  1829. 128.31 s > at <unknown source file>:<unknown line>
  1830. 128.31 s > 17: __clone3<unknown>
  1831. 128.31 s > at <unknown source file>:<unknown line>
  1832. 128.31 s >
  1833. 128.31 s > Run with COLORBT_SHOW_HIDDEN=1 environment variable to disable frame filtering.
  1834. 128.31 s > Run with RUST_BACKTRACE=full to include source snippets.
  1835. 128.31 s > Warning: SpanTrace capture is Unsupported.
  1836. 128.31 s > Ensure that you've setup a tracing-error ErrorLayer and the semver versions are compatible
  1837. 128.31 s > system-out
  1838. 128.31 s > running 1 test
  1839. 128.31 s > test profile_bulk::massless_triangle_bulk_profile_passes ... FAILED
  1840. 128.31 s >
  1841. 128.31 s > failures:
  1842. 128.31 s >
  1843. 128.31 s > failures:
  1844. 128.31 s > profile_bulk::massless_triangle_bulk_profile_passes
  1845. 128.31 s >
  1846. 128.31 s > test result: FAILED. 0 passed; 1 failed; 0 ignored; 0 measured; 82 filtered out; finished in 0.46s
  1847. 128.31 s > system-err
  1848. 128.31 s > [2026-08-26 08:22:06.824] @gammaloop_api::se... INFO : Running command import model scalars
  1849. 128.31 s > [2026-08-26 08:22:06.824] @import::model INFO : Loading built-in JSON model scalars-default
  1850. 128.31 s > [2026-08-26 08:22:06.831] @gammalooprs::model INFO : The following 2 external parameters were forced to zero by the restriction card:
  1851. 128.31 s > width_scalar_1, width_scalar_2
  1852. 128.31 s > [2026-08-26 08:22:06.831] @gammaloop_api::se... INFO : Running command import graphs ./tests/resources/graphs/massless_triangle.dot
  1853. 128.31 s > [2026-08-26 08:22:06.832] @commands::import INFO : Loading graphs from '/build/source/tests/resources/graphs/massless_triangle.dot'
  1854. 128.31 s > [2026-08-26 08:22:06.841] @gammaloop_api::se... INFO : Running command generate
  1855. 128.31 s > [2026-08-26 08:22:06.955] @commands::generate INFO :
  1856. 128.31 s > Integrand generation summary
  1857. 128.31 s > peak RAM 62.26 MiB | cores 1
  1858. 128.31 s > ╭───────────┬─────────────────────┬─────────┬────────────┬────────────┬────────────────┬─────────────╮
  1859. 128.31 s > │ integrand │ graph │ # evals │ expr build │ spenso │ symbolica eval │ compile │
  1860. 128.31 s > ├───────────┼─────────────────────┼─────────┼────────────┼────────────┼────────────────┼─────────────┤
  1861. 128.31 s > │ default │ massless_triangle_0 │ 9 │ 20ms (53%) │ 2ms (5.2%) │ 16ms (42%) │ 0ms (0.00%) │
  1862. 128.31 s > ├───────────┼─────────────────────┼─────────┼────────────┼────────────┼────────────────┼─────────────┤
  1863. 128.31 s > │ Total │ │ 9 │ 20ms (53%) │ 2ms (5.2%) │ 16ms (42%) │ 0ms (0.00%) │
  1864. 128.31 s > ╰───────────┴─────────────────────┴─────────┴────────────┴────────────┴────────────────┴─────────────╯
  1865. 128.31 s > [2026-08-26 08:22:06.957] @process::amplitude INFO : Input is above threshold: 2 existing threshold E-surfaces across 1/1 graph groups
  1866. 128.31 s > [2026-08-26 08:22:06.957] @process::amplitude INFO : overlap structure of group 0: [2: [0(1,5), 1(1,3)]]
  1867. 128.31 s > Error:
  1868. 128.31 s > 0: IR profiling requested arbitrary precision but received a quad-precision result
  1869. 128.31 s >
  1870. 128.31 s > Location:
  1871. 128.31 s > crates/gammalooprs/src/integrands/process/ir.rs:2123
  1872. 128.31 s >
  1873. 128.31 s > ━━━━━━━━━━━━━━━━━━━━━━━━━━━━━━━━━━ BACKTRACE ━━━━━━━━━━━━━━━━━━━━━━━━━━━━━━━━━━━
  1874. 128.31 s > 1: <color_eyre[51793ea62743adbd]::config::EyreHook>::into_eyre_hook::{closure#0}<unknown>
  1875. 128.31 s > at <unknown source file>:<unknown line>
  1876. 128.31 s > 2: eyre[cb2fd339c0c40fca]::capture_handler<unknown>
  1877. 128.31 s > at <unknown source file>:<unknown line>
  1878. 128.31 s > 3: eyre[cb2fd339c0c40fca]::private::format_err<unknown>
  1879. 128.31 s > at <unknown source file>:<unknown line>
  1880. 128.31 s > 4: gammalooprs[d7a7c067ebd19583]::integrands::process::ir::evaluate_profile_momentum_point_arb::<gammalooprs[d7a7c067ebd19583]::integrands::process::amplitude::AmplitudeIntegrand><unknown>
  1881. 128.31 s > at <unknown source file>:<unknown line>
  1882. 128.31 s > 5: <gammalooprs[d7a7c067ebd19583]::integrands::process::amplitude::AmplitudeIntegrand>::test_single_ir_limit_impl<unknown>
  1883. 128.31 s > at <unknown source file>:<unknown line>
  1884. 128.31 s > 6: gammalooprs[d7a7c067ebd19583]::integrands::process::ir::run_ir_profile::<gammalooprs[d7a7c067ebd19583]::integrands::process::amplitude::AmplitudeIntegrand, <gammalooprs[d7a7c067ebd19583]::integrands::process::amplitude::AmplitudeIntegrand>::enumerate_ir_limits, <gammalooprs[d7a7c067ebd19583]::integrands::process::amplitude::AmplitudeIntegrand>::graph_cut_definitions, <gammalooprs[d7a7c067ebd19583]::integrands::process::amplitude::AmplitudeIntegrand>::test_single_ir_limit_impl><unknown>
  1885. 128.31 s > at <unknown source file>:<unknown line>
  1886. 128.31 s > 7: <gammalooprs[d7a7c067ebd19583]::integrands::process::amplitude::AmplitudeIntegrand>::test_ir<unknown>
  1887. 128.31 s > at <unknown source file>:<unknown line>
  1888. 128.31 s > 8: <gammaloop_api[92ae732909e47e14]::commands::profile::Profile>::run<unknown>
  1889. 128.31 s > at <unknown source file>:<unknown line>
  1890. 128.31 s > 9: test_runs[3e7a390caee4e338]::profile_bulk::massless_triangle_bulk_profile_passes<unknown>
  1891. 128.31 s > at <unknown source file>:<unknown line>
  1892. 128.31 s > 10: <test_runs[3e7a390caee4e338]::profile_bulk::massless_triangle_bulk_profile_passes::{closure#0} as core[940e698046960fd5]::ops::function::FnOnce<()>>::call_once<unknown>
  1893. 128.31 s > at <unknown source file>:<unknown line>
  1894. 128.31 s > 11: test[75d6903177b1d7e9]::__rust_begin_short_backtrace::<core[940e698046960fd5]::result::Result<(), alloc[2ea6bcb46fca0c42]::string::String>, fn() -> core[940e698046960fd5]::result::Result<(), alloc[2ea6bcb46fca0c42]::string::String>><unknown>
  1895. 128.31 s > at <unknown source file>:<unknown line>
  1896. 128.31 s > 12: test[75d6903177b1d7e9]::run_test::{closure#0}<unknown>
  1897. 128.31 s > at <unknown source file>:<unknown line>
  1898. 128.31 s > 13: std[bcb96dfbba0ab899]::sys::backtrace::__rust_begin_short_backtrace::<test[75d6903177b1d7e9]::run_test::{closure#1}, ()><unknown>
  1899. 128.31 s > at <unknown source file>:<unknown line>
  1900. 128.31 s > 14: <std[bcb96dfbba0ab899]::thread::lifecycle::spawn_unchecked<test[75d6903177b1d7e9]::run_test::{closure#1}, ()>::{closure#1} as core[940e698046960fd5]::ops::function::FnOnce<()>>::call_once::{shim:vtable#0}<unknown>
  1901. 128.31 s > at <unknown source file>:<unknown line>
  1902. 128.31 s > 15: <std[bcb96dfbba0ab899]::sys::thread::unix::Thread>::new::thread_start<unknown>
  1903. 128.31 s > at <unknown source file>:<unknown line>
  1904. 128.31 s > 16: start_thread<unknown>
  1905. 128.31 s > at <unknown source file>:<unknown line>
  1906. 128.31 s > 17: __clone3<unknown>
  1907. 128.31 s > at <unknown source file>:<unknown line>
  1908. 128.31 s >
  1909. 128.31 s > Run with COLORBT_SHOW_HIDDEN=1 environment variable to disable frame filtering.
  1910. 128.31 s > Run with RUST_BACKTRACE=full to include source snippets.
  1911. 128.31 s > Warning: SpanTrace capture is Unsupported.
  1912. 128.31 s > Ensure that you've setup a tracing-error ErrorLayer and the semver versions are compatible
  1913. 128.31 s >
  1914. 128.31 s > 6. gammaloop-integration-tests::test_runs::profile_bulk::scalar_self_energy_amp_bulk_profile_passes
  1915. 128.31 s > failure: test failure with exit code 101
  1916. 128.31 s > Error:
  1917. 128.31 s > 0: IR profiling requested arbitrary precision but received a quad-precision result
  1918. 128.31 s >
  1919. 128.31 s > Location:
  1920. 128.31 s > crates/gammalooprs/src/integrands/process/ir.rs:2123
  1921. 128.31 s >
  1922. 128.31 s > ━━━━━━━━━━━━━━━━━━━━━━━━━━━━━━━━━━ BACKTRACE ━━━━━━━━━━━━━━━━━━━━━━━━━━━━━━━━━━━
  1923. 128.31 s > 1: <color_eyre[51793ea62743adbd]::config::EyreHook>::into_eyre_hook::{closure#0}<unknown>
  1924. 128.31 s > at <unknown source file>:<unknown line>
  1925. 128.31 s > 2: eyre[cb2fd339c0c40fca]::capture_handler<unknown>
  1926. 128.31 s > at <unknown source file>:<unknown line>
  1927. 128.31 s > 3: eyre[cb2fd339c0c40fca]::private::format_err<unknown>
  1928. 128.31 s > at <unknown source file>:<unknown line>
  1929. 128.31 s > 4: gammalooprs[d7a7c067ebd19583]::integrands::process::ir::evaluate_profile_momentum_point_arb::<gammalooprs[d7a7c067ebd19583]::integrands::process::amplitude::AmplitudeIntegrand><unknown>
  1930. 128.31 s > at <unknown source file>:<unknown line>
  1931. 128.31 s > 5: <gammalooprs[d7a7c067ebd19583]::integrands::process::amplitude::AmplitudeIntegrand>::test_single_ir_limit_impl<unknown>
  1932. 128.31 s > at <unknown source file>:<unknown line>
  1933. 128.31 s > 6: gammalooprs[d7a7c067ebd19583]::integrands::process::ir::run_ir_profile::<gammalooprs[d7a7c067ebd19583]::integrands::process::amplitude::AmplitudeIntegrand, <gammalooprs[d7a7c067ebd19583]::integrands::process::amplitude::AmplitudeIntegrand>::enumerate_ir_limits, <gammalooprs[d7a7c067ebd19583]::integrands::process::amplitude::AmplitudeIntegrand>::graph_cut_definitions, <gammalooprs[d7a7c067ebd19583]::integrands::process::amplitude::AmplitudeIntegrand>::test_single_ir_limit_impl><unknown>
  1934. 128.31 s > at <unknown source file>:<unknown line>
  1935. 128.31 s > 7: <gammalooprs[d7a7c067ebd19583]::integrands::process::amplitude::AmplitudeIntegrand>::test_ir<unknown>
  1936. 128.31 s > at <unknown source file>:<unknown line>
  1937. 128.31 s > 8: <gammaloop_api[92ae732909e47e14]::commands::profile::Profile>::run<unknown>
  1938. 128.31 s > at <unknown source file>:<unknown line>
  1939. 128.31 s > 9: test_runs[3e7a390caee4e338]::profile_bulk::scalar_self_energy_amp_bulk_profile_passes<unknown>
  1940. 128.31 s > at <unknown source file>:<unknown line>
  1941. 128.31 s > 10: <test_runs[3e7a390caee4e338]::profile_bulk::scalar_self_energy_amp_bulk_profile_passes::{closure#0} as core[940e698046960fd5]::ops::function::FnOnce<()>>::call_once<unknown>
  1942. 128.31 s > at <unknown source file>:<unknown line>
  1943. 128.31 s > 11: test[75d6903177b1d7e9]::__rust_begin_short_backtrace::<core[940e698046960fd5]::result::Result<(), alloc[2ea6bcb46fca0c42]::string::String>, fn() -> core[940e698046960fd5]::result::Result<(), alloc[2ea6bcb46fca0c42]::string::String>><unknown>
  1944. 128.31 s > at <unknown source file>:<unknown line>
  1945. 128.31 s > 12: test[75d6903177b1d7e9]::run_test::{closure#0}<unknown>
  1946. 128.31 s > at <unknown source file>:<unknown line>
  1947. 128.31 s > 13: std[bcb96dfbba0ab899]::sys::backtrace::__rust_begin_short_backtrace::<test[75d6903177b1d7e9]::run_test::{closure#1}, ()><unknown>
  1948. 128.31 s > at <unknown source file>:<unknown line>
  1949. 128.31 s > 14: <std[bcb96dfbba0ab899]::thread::lifecycle::spawn_unchecked<test[75d6903177b1d7e9]::run_test::{closure#1}, ()>::{closure#1} as core[940e698046960fd5]::ops::function::FnOnce<()>>::call_once::{shim:vtable#0}<unknown>
  1950. 128.31 s > at <unknown source file>:<unknown line>
  1951. 128.31 s > 15: <std[bcb96dfbba0ab899]::sys::thread::unix::Thread>::new::thread_start<unknown>
  1952. 128.31 s > at <unknown source file>:<unknown line>
  1953. 128.31 s > 16: start_thread<unknown>
  1954. 128.31 s > at <unknown source file>:<unknown line>
  1955. 128.31 s > 17: __clone3<unknown>
  1956. 128.31 s > at <unknown source file>:<unknown line>
  1957. 128.31 s >
  1958. 128.31 s > Run with COLORBT_SHOW_HIDDEN=1 environment variable to disable frame filtering.
  1959. 128.31 s > Run with RUST_BACKTRACE=full to include source snippets.
  1960. 128.31 s > Warning: SpanTrace capture is Unsupported.
  1961. 128.31 s > Ensure that you've setup a tracing-error ErrorLayer and the semver versions are compatible
  1962. 128.31 s > system-out
  1963. 128.31 s > running 1 test
  1964. 128.31 s > test profile_bulk::scalar_self_energy_amp_bulk_profile_passes ... FAILED
  1965. 128.31 s >
  1966. 128.31 s > failures:
  1967. 128.31 s >
  1968. 128.31 s > failures:
  1969. 128.31 s > profile_bulk::scalar_self_energy_amp_bulk_profile_passes
  1970. 128.31 s >
  1971. 128.31 s > test result: FAILED. 0 passed; 1 failed; 0 ignored; 0 measured; 82 filtered out; finished in 0.68s
  1972. 128.31 s > system-err
  1973. 128.31 s > [2026-08-26 08:22:06.828] @gammaloop_api::se... INFO : Running command import model ./assets/models/json/scalars/scalars.json
  1974. 128.31 s > [2026-08-26 08:22:06.828] @import::model INFO : Loading JSON model scalars-default from /build/source/assets/models/json/scalars/scalars
  1975. 128.31 s > [2026-08-26 08:22:06.831] @gammalooprs::model INFO : The following 2 external parameters were forced to zero by the restriction card:
  1976. 128.31 s > width_scalar_1, width_scalar_2
  1977. 128.31 s > [2026-08-26 08:22:06.832] @gammaloop_api::se... INFO : Running command import graphs ./tests/resources/graphs/scalar_self_energy_amp.dot
  1978. 128.31 s > [2026-08-26 08:22:06.832] @commands::import INFO : Loading graphs from '/build/source/tests/resources/graphs/scalar_self_energy_amp.dot'
  1979. 128.31 s > [2026-08-26 08:22:06.839] @gammaloop_api::se... INFO : Running command generate
  1980. 128.31 s > [2026-08-26 08:22:07.166] @commands::generate INFO :
  1981. 128.31 s > Integrand generation summary
  1982. 128.31 s > peak RAM 70.35 MiB | cores 1
  1983. 128.31 s > ╭───────────┬────────────────────────┬─────────┬─────────────┬─────────────┬────────────────┬─────────────╮
  1984. 128.31 s > │ integrand │ graph │ # evals │ expr build │ spenso │ symbolica eval │ compile │
  1985. 128.31 s > ├───────────┼────────────────────────┼─────────┼─────────────┼─────────────┼────────────────┼─────────────┤
  1986. 128.31 s > │ default │ scalar_self_energy_amp │ 6 │ 287ms (92%) │ 13ms (4.4%) │ 10ms (3.2%) │ 0ms (0.00%) │
  1987. 128.31 s > ├───────────┼────────────────────────┼─────────┼─────────────┼─────────────┼────────────────┼─────────────┤
  1988. 128.31 s > │ Total │ │ 6 │ 287ms (92%) │ 13ms (4.4%) │ 10ms (3.2%) │ 0ms (0.00%) │
  1989. 128.31 s > ╰───────────┴────────────────────────┴─────────┴─────────────┴─────────────┴────────────────┴─────────────╯
  1990. 128.31 s > [2026-08-26 08:22:07.168] @process::amplitude INFO : Input is above threshold: 2 existing threshold E-surfaces across 1/1 graph groups
  1991. 128.31 s > [2026-08-26 08:22:07.168] @process::amplitude INFO : overlap structure of group 0: [2: [2(1,5), 4(2,3,5)]]
  1992. 128.31 s > Error:
  1993. 128.31 s > 0: IR profiling requested arbitrary precision but received a quad-precision result
  1994. 128.31 s >
  1995. 128.31 s > Location:
  1996. 128.31 s > crates/gammalooprs/src/integrands/process/ir.rs:2123
  1997. 128.31 s >
  1998. 128.31 s > ━━━━━━━━━━━━━━━━━━━━━━━━━━━━━━━━━━ BACKTRACE ━━━━━━━━━━━━━━━━━━━━━━━━━━━━━━━━━━━
  1999. 128.31 s > 1: <color_eyre[51793ea62743adbd]::config::EyreHook>::into_eyre_hook::{closure#0}<unknown>
  2000. 128.31 s > at <unknown source file>:<unknown line>
  2001. 128.31 s > 2: eyre[cb2fd339c0c40fca]::capture_handler<unknown>
  2002. 128.31 s > at <unknown source file>:<unknown line>
  2003. 128.31 s > 3: eyre[cb2fd339c0c40fca]::private::format_err<unknown>
  2004. 128.31 s > at <unknown source file>:<unknown line>
  2005. 128.31 s > 4: gammalooprs[d7a7c067ebd19583]::integrands::process::ir::evaluate_profile_momentum_point_arb::<gammalooprs[d7a7c067ebd19583]::integrands::process::amplitude::AmplitudeIntegrand><unknown>
  2006. 128.31 s > at <unknown source file>:<unknown line>
  2007. 128.31 s > 5: <gammalooprs[d7a7c067ebd19583]::integrands::process::amplitude::AmplitudeIntegrand>::test_single_ir_limit_impl<unknown>
  2008. 128.31 s > at <unknown source file>:<unknown line>
  2009. 128.31 s > 6: gammalooprs[d7a7c067ebd19583]::integrands::process::ir::run_ir_profile::<gammalooprs[d7a7c067ebd19583]::integrands::process::amplitude::AmplitudeIntegrand, <gammalooprs[d7a7c067ebd19583]::integrands::process::amplitude::AmplitudeIntegrand>::enumerate_ir_limits, <gammalooprs[d7a7c067ebd19583]::integrands::process::amplitude::AmplitudeIntegrand>::graph_cut_definitions, <gammalooprs[d7a7c067ebd19583]::integrands::process::amplitude::AmplitudeIntegrand>::test_single_ir_limit_impl><unknown>
  2010. 128.31 s > at <unknown source file>:<unknown line>
  2011. 128.31 s > 7: <gammalooprs[d7a7c067ebd19583]::integrands::process::amplitude::AmplitudeIntegrand>::test_ir<unknown>
  2012. 128.31 s > at <unknown source file>:<unknown line>
  2013. 128.31 s > 8: <gammaloop_api[92ae732909e47e14]::commands::profile::Profile>::run<unknown>
  2014. 128.31 s > at <unknown source file>:<unknown line>
  2015. 128.31 s > 9: test_runs[3e7a390caee4e338]::profile_bulk::scalar_self_energy_amp_bulk_profile_passes<unknown>
  2016. 128.31 s > at <unknown source file>:<unknown line>
  2017. 128.31 s > 10: <test_runs[3e7a390caee4e338]::profile_bulk::scalar_self_energy_amp_bulk_profile_passes::{closure#0} as core[940e698046960fd5]::ops::function::FnOnce<()>>::call_once<unknown>
  2018. 128.31 s > at <unknown source file>:<unknown line>
  2019. 128.31 s > 11: test[75d6903177b1d7e9]::__rust_begin_short_backtrace::<core[940e698046960fd5]::result::Result<(), alloc[2ea6bcb46fca0c42]::string::String>, fn() -> core[940e698046960fd5]::result::Result<(), alloc[2ea6bcb46fca0c42]::string::String>><unknown>
  2020. 128.31 s > at <unknown source file>:<unknown line>
  2021. 128.31 s > 12: test[75d6903177b1d7e9]::run_test::{closure#0}<unknown>
  2022. 128.31 s > at <unknown source file>:<unknown line>
  2023. 128.31 s > 13: std[bcb96dfbba0ab899]::sys::backtrace::__rust_begin_short_backtrace::<test[75d6903177b1d7e9]::run_test::{closure#1}, ()><unknown>
  2024. 128.31 s > at <unknown source file>:<unknown line>
  2025. 128.31 s > 14: <std[bcb96dfbba0ab899]::thread::lifecycle::spawn_unchecked<test[75d6903177b1d7e9]::run_test::{closure#1}, ()>::{closure#1} as core[940e698046960fd5]::ops::function::FnOnce<()>>::call_once::{shim:vtable#0}<unknown>
  2026. 128.31 s > at <unknown source file>:<unknown line>
  2027. 128.31 s > 15: <std[bcb96dfbba0ab899]::sys::thread::unix::Thread>::new::thread_start<unknown>
  2028. 128.31 s > at <unknown source file>:<unknown line>
  2029. 128.31 s > 16: start_thread<unknown>
  2030. 128.31 s > at <unknown source file>:<unknown line>
  2031. 128.31 s > 17: __clone3<unknown>
  2032. 128.31 s > at <unknown source file>:<unknown line>
  2033. 128.31 s >
  2034. 128.31 s > Run with COLORBT_SHOW_HIDDEN=1 environment variable to disable frame filtering.
  2035. 128.31 s > Run with RUST_BACKTRACE=full to include source snippets.
  2036. 128.31 s > Warning: SpanTrace capture is Unsupported.
  2037. 128.31 s > Ensure that you've setup a tracing-error ErrorLayer and the semver versions are compatible
  2038. 128.31 s >
  2039. 128.31 s > 7. gammaloop-integration-tests::uv::dod2_bubble_uv
  2040. 128.31 s > failure: test failure with exit code 101
  2041. 128.31 s > system-out
  2042. 128.31 s > running 1 test
  2043. 128.31 s > +-------------+-----------------+---------+--------+----------+-----------------------------------------------------------------------------------------------------------------------+-------+
  2044. 128.31 s > | case | check | graph | status | sigma | threshold | error |
  2045. 128.31 s > +-------------+-----------------+---------+--------+----------+-----------------------------------------------------------------------------------------------------------------------+-------+
  2046. 128.31 s > | dod2_bubble | uv_profile | - | FAIL | - | - | - |
  2047. 128.31 s > +-------------+-----------------+---------+--------+----------+-----------------------------------------------------------------------------------------------------------------------+-------+
  2048. 128.31 s > | dod2_bubble | m_uv.inspect | inspect | pass | - | best inspect relative delta 1.000e0 >= 1000*accuracy 1.000e-7 (accuracy=1.000e-10, exponent=+8.0, seed=0, probes=10) | - |
  2049. 128.31 s > +-------------+-----------------+---------+--------+----------+-----------------------------------------------------------------------------------------------------------------------+-------+
  2050. 128.31 s > | dod2_bubble | m_uv.integrated | GL0 | pass | 0.0sigma | compatible within 2sigma | - |
  2051. 128.31 s > +-------------+-----------------+---------+--------+----------+-----------------------------------------------------------------------------------------------------------------------+-------+
  2052. 128.31 s > | dod2_bubble | rls.inspect | inspect | pass | - | best inspect relative delta 2.822e-3 >= 1000*accuracy 1.000e-7 (accuracy=1.000e-10, exponent=+2.0, seed=1, probes=10) | - |
  2053. 128.31 s > +-------------+-----------------+---------+--------+----------+-----------------------------------------------------------------------------------------------------------------------+-------+
  2054. 128.31 s > | dod2_bubble | rls.integrated | GL0 | pass | 0.0sigma | compatible within 2sigma | - |
  2055. 128.31 s > +-------------+-----------------+---------+--------+----------+-----------------------------------------------------------------------------------------------------------------------+-------+
  2056. 128.31 s > | dod2_bubble | mu_r.inspect | inspect | pass | - | best inspect relative delta 6.951e-1 >= 1000*accuracy 1.000e-7 (accuracy=1.000e-10, exponent=+0.0, seed=0, probes=10) | - |
  2057. 128.31 s > +-------------+-----------------+---------+--------+----------+-----------------------------------------------------------------------------------------------------------------------+-------+
  2058. 128.31 s > | dod2_bubble | target | - | pass | - | 2sigma | - |
  2059. 128.31 s > +-------------+-----------------+---------+--------+----------+-----------------------------------------------------------------------------------------------------------------------+-------+
  2060. 128.31 s > test dod2_bubble_uv ... FAILED
  2061. 128.31 s >
  2062. 128.31 s > failures:
  2063. 128.31 s >
  2064. 128.31 s > failures:
  2065. 128.31 s > dod2_bubble_uv
  2066. 128.31 s >
  2067. 128.31 s > test result: FAILED. 0 passed; 1 failed; 0 ignored; 0 measured; 24 filtered out; finished in 37.88s
  2068. 128.31 s > system-err
  2069. 128.31 s > [2026-08-26 08:22:08.790] @gammaloop_api::se... INFO : Running command run generate
  2070. 128.31 s > [2026-08-26 08:22:08.790] @gammaloop_api::se... INFO : Starting command block generate
  2071. 128.31 s > [2026-08-26 08:22:08.791] @gammaloop_api::se... INFO : Running command import model scalars-default.json
  2072. 128.31 s > [2026-08-26 08:22:08.791] @import::model INFO : Loading built-in JSON model scalars-default
  2073. 128.31 s > [2026-08-26 08:22:08.794] @gammalooprs::model INFO : The following 2 external parameters were forced to zero by the restriction card:
  2074. 128.31 s > width_scalar_1, width_scalar_2
  2075. 128.31 s > [2026-08-26 08:22:08.794] @gammaloop_api::se... INFO : Running command remove processes
  2076. 128.31 s > [2026-08-26 08:22:08.795] @gammaloop_api::se... INFO : Running command set global kv global.generation.uv.generate_integrated=true
  2077. 128.31 s > [2026-08-26 08:22:08.795] @gammaloop_api::se... INFO : Running command import graphs ./tests/resources/graphs/scalar/dod2_bubble.dot -p bubble_dod2 -i scalar_bubble_below_thres
  2078. 128.31 s > [2026-08-26 08:22:08.795] @commands::import INFO : Loading graphs from '/build/source/tests/resources/graphs/scalar/dod2_bubble.dot'
  2079. 128.31 s > [2026-08-26 08:22:08.798] @gammaloop_api::se... INFO : Running command generate existing -p bubble_dod2 -i scalar_bubble_below_thres
  2080. 128.31 s > [2026-08-26 08:22:08.799] @approx::local_4d [{#uv, #inspect, #integrated}] DEBUG : Rescaled momenta expanded
  2081. 128.31 s > field value
  2082. 128.31 s > res n-terms: 1, byte size: 585,expr:
  2083. 128.31 s > -SCALAR_COUPLING²·q₀(αᵉ².¹)·q₀(αᵉ³.¹)·q₂(αᵉ².¹)·q₂(αᵉ³.¹)
  2084. 128.31 s > /(t²·denom(3,-q₀-q₂/t,mass_scalar_2²,-mass_scalar_2²+2·(q₀.q₂)/t+(q₂.q₂)/t²+(q₀.q₀))
  2085. 128.31 s > ·denom(2,q₂/t,mass_scalar_2²,-mass_scalar_2²+(q₂.q₂)/t²))
  2086. 128.31 s > [2026-08-26 08:22:08.801] @approx::local_4d [{#uv, #inspect, #integrated}] DEBUG : Rescaled momenta expanded
  2087. 128.31 s > field value
  2088. 128.31 s > res n-terms: 1, byte size: 3,expr:
  2089. 128.31 s > 1
  2090. 128.31 s > [2026-08-26 08:22:08.801] @approx::final_integrand[{#generation, #profile, #uv, #graph, #summary}] DEBUG : Computed global numerator
  2091. 128.31 s > field value
  2092. 128.31 s > global_num n-terms: 1, byte size: 4,expr:
  2093. 128.31 s > 1/2
  2094. 128.31 s > span build_3d{span_context=true graph=GL0 current=subgraph=0, topo_order=0, dod=0}
  2095. 128.31 s > [2026-08-26 08:22:08.803] @uv::approx [{#generation, #uv, #fourd}] DEBUG : Computing 4D
  2096. 128.31 s > field value
  2097. 128.31 s > simple subgraph(S_11,S_y)*Approx(subgraph(S_y,0)) of GL0
  2098. 128.31 s > span compute_4d{span_context=true graph=GL0 current=subgraph=y, topo_order=1, dod=2 given=subgraph=0, topo_order=0, dod=0 reduced=SubSet { set: BitVec<usize, bitvec::order::Lsb0> { addr: 0x7fffec017290, head: 000000, bits: 6, capacity: 64 } [0, 0, 1, 1, 1, 1], id: PhantomData<linnet::half_edge::involution::Hedge> }}
  2099. 128.31 s > [2026-08-26 08:22:08.803] @approx::local_4d [{#uv, #algebra, #integrated, #start}] DEBUG :
  2100. 128.31 s > field value
  2101. 128.31 s > integrand n-terms: 1, byte size: 409,expr:
  2102. 128.31 s > SCALAR_COUPLING²·(q₀(αᵉ³.¹)+q₃(αᵉ³.¹))·q₀(αᵉ².¹)·q₀(αᵉ³.¹)·q₂(αᵉ².¹)
  2103. 128.31 s > /(denom(2,q₂,mass_scalar_2²,-mass_scalar_2²+(q₂.q₂))·denom(3,q₃,mass_scalar_2²,-mass_scalar_2²+(q₃.q₃)))
  2104. 128.31 s > reduced y
  2105. 128.31 s > span grow{span_context=true current=subgraph=y, topo_order=1, dod=2 given=subgraph=0, topo_order=0, dod=0}
  2106. 128.31 s > [2026-08-26 08:22:08.804] @approx::local_4d [{#uv, #inspect, #integrated}] DEBUG : Rescaled momenta expanded
  2107. 128.31 s > field value
  2108. 128.31 s > res n-terms: 1, byte size: 585,expr:
  2109. 128.31 s > -SCALAR_COUPLING²·q₀(αᵉ².¹)·q₀(αᵉ³.¹)·q₂(αᵉ².¹)·q₂(αᵉ³.¹)
  2110. 128.31 s > /(t²·denom(3,-q₀-q₂/t,mass_scalar_2²,-mass_scalar_2²+2·(q₀.q₂)/t+(q₂.q₂)/t²+(q₀.q₀))
  2111. 128.31 s > ·denom(2,q₂/t,mass_scalar_2²,-mass_scalar_2²+(q₂.q₂)/t²))
  2112. 128.31 s > span t{span_context=true current=subgraph=y, topo_order=1, dod=2 given=subgraph=0, topo_order=0, dod=0}
  2113. 128.31 s > [2026-08-26 08:22:08.807] @approx::local_4d [{#uv, #integrated, #rescaled}] DEBUG : Rescaled expanded
  2114. 128.31 s > field value
  2115. 128.31 s > n_loops 1
  2116. 128.31 s > res n-terms: 1, byte size: 707,expr:
  2117. 128.31 s > -SCALAR_COUPLING²·q₀(αᵉ².¹)·q₀(αᵉ³.¹)·q₂(αᵉ².¹)·q₂(αᵉ³.¹)
  2118. 128.31 s > /(t²·denom(3,-q₂,mUVexp²+t²·mass_scalar_2²,-mUV²+t²·(-mass_scalar_2²+2·(q₀.q₂)/t+(q₂.q₂)/t²+(q₀.q₀))+t²·mUVexp²)
  2119. 128.31 s > ·denom(2,q₂,mUVexp²+t²·mass_scalar_2²,-mUV²+t²·(-mass_scalar_2²+(q₂.q₂)/t²)+t²·mUVexp²))
  2120. 128.31 s > span t{span_context=true current=subgraph=y, topo_order=1, dod=2 given=subgraph=0, topo_order=0, dod=0}
  2121. 128.31 s > [2026-08-26 08:22:08.808] @approx::local_4d [{#uv, #integrated, #series}] DEBUG : Series expanded
  2122. 128.31 s > field value
  2123. 128.31 s > res n-terms: 3, byte size: 1896,expr:
  2124. 128.31 s > (1/2·SCALAR_COUPLING²·(2·mUVexp²-2·mass_scalar_2²)/(denom(2,q₂,mUVexp²,-mUV²+(q₂.q₂))²·denom(3,-q₂,mUVexp²,-mUV²+(q₂.q₂)))
  2125. 128.31 s > -SCALAR_COUPLING²
  2126. 128.31 s > ·(-1/2·(2·mUVexp²-2·mass_scalar_2²+2·(q₀.q₀))/denom(3,-q₂,mUVexp²,-mUV²+(q₂.q₂))
  2127. 128.31 s > +4·(q₀.q₂)²/denom(3,-q₂,mUVexp²,-mUV²+(q₂.q₂))²
  2128. 128.31 s > )/(denom(2,q₂,mUVexp²,-mUV²+(q₂.q₂))·denom(3,-q₂,mUVexp²,-mUV²+(q₂.q₂)))
  2129. 128.31 s > )·q₀(αᵉ².¹)·q₀(αᵉ³.¹)·q₂(αᵉ².¹)·q₂(αᵉ³.¹)
  2130. 128.31 s > +2·SCALAR_COUPLING²·(q₀.q₂)·q₀(αᵉ².¹)·q₀(αᵉ³.¹)·q₂(αᵉ².¹)·q₂(αᵉ³.¹)
  2131. 128.31 s > /(t·denom(2,q₂,mUVexp²,-mUV²+(q₂.q₂))·denom(3,-q₂,mUVexp²,-mUV²+(q₂.q₂))²)
  2132. 128.31 s > -SCALAR_COUPLING²·q₀(αᵉ².¹)·q₀(αᵉ³.¹)·q₂(αᵉ².¹)·q₂(αᵉ³.¹)
  2133. 128.31 s > /(t²·denom(2,q₂,mUVexp²,-mUV²+(q₂.q₂))·denom(3,-q₂,mUVexp²,-mUV²+(q₂.q₂)))
  2134. 128.31 s > span t{span_context=true current=subgraph=y, topo_order=1, dod=2 given=subgraph=0, topo_order=0, dod=0}
  2135. 128.31 s > [2026-08-26 08:22:08.808] @approx::local_4d [{#uv, #integrated, #series}] DEBUG : Evaluated at t = 1
  2136. 128.31 s > field value
  2137. 128.31 s > res n-terms: 3, byte size: 1880,expr:
  2138. 128.31 s > (1/2·SCALAR_COUPLING²·(2·mUVexp²-2·mass_scalar_2²)/(denom(2,q₂,mUVexp²,-mUV²+(q₂.q₂))²·denom(3,-q₂,mUVexp²,-mUV²+(q₂.q₂)))
  2139. 128.31 s > -SCALAR_COUPLING²
  2140. 128.31 s > ·(-1/2·(2·mUVexp²-2·mass_scalar_2²+2·(q₀.q₀))/denom(3,-q₂,mUVexp²,-mUV²+(q₂.q₂))
  2141. 128.31 s > +4·(q₀.q₂)²/denom(3,-q₂,mUVexp²,-mUV²+(q₂.q₂))²
  2142. 128.31 s > )/(denom(2,q₂,mUVexp²,-mUV²+(q₂.q₂))·denom(3,-q₂,mUVexp²,-mUV²+(q₂.q₂)))
  2143. 128.31 s > )·q₀(αᵉ².¹)·q₀(αᵉ³.¹)·q₂(αᵉ².¹)·q₂(αᵉ³.¹)
  2144. 128.31 s > -SCALAR_COUPLING²·q₀(αᵉ².¹)·q₀(αᵉ³.¹)·q₂(αᵉ².¹)·q₂(αᵉ³.¹)
  2145. 128.31 s > /(denom(2,q₂,mUVexp²,-mUV²+(q₂.q₂))·denom(3,-q₂,mUVexp²,-mUV²+(q₂.q₂)))
  2146. 128.31 s > +2·SCALAR_COUPLING²·(q₀.q₂)·q₀(αᵉ².¹)·q₀(αᵉ³.¹)·q₂(αᵉ².¹)·q₂(αᵉ³.¹)
  2147. 128.31 s > /(denom(2,q₂,mUVexp²,-mUV²+(q₂.q₂))·denom(3,-q₂,mUVexp²,-mUV²+(q₂.q₂))²)
  2148. 128.31 s > span t{span_context=true current=subgraph=y, topo_order=1, dod=2 given=subgraph=0, topo_order=0, dod=0}
  2149. 128.31 s > [2026-08-26 08:22:08.809] @approx::local_4d [{#uv, #collect, #integrated}] DEBUG : After gamma chain collection
  2150. 128.31 s > field value
  2151. 128.31 s > expr n-terms: 3, byte size: 1880,expr:
  2152. 128.31 s > (1/2·SCALAR_COUPLING²·(2·mUVexp²-2·mass_scalar_2²)/(denom(2,q₂,mUVexp²,-mUV²+(q₂.q₂))²·denom(3,-q₂,mUVexp²,-mUV²+(q₂.q₂)))
  2153. 128.31 s > -SCALAR_COUPLING²
  2154. 128.31 s > ·(-1/2·(2·mUVexp²-2·mass_scalar_2²+2·(q₀.q₀))/denom(3,-q₂,mUVexp²,-mUV²+(q₂.q₂))
  2155. 128.31 s > +4·(q₀.q₂)²/denom(3,-q₂,mUVexp²,-mUV²+(q₂.q₂))²
  2156. 128.31 s > )/(denom(2,q₂,mUVexp²,-mUV²+(q₂.q₂))·denom(3,-q₂,mUVexp²,-mUV²+(q₂.q₂)))
  2157. 128.31 s > )·q₀(αᵉ².¹)·q₀(αᵉ³.¹)·q₂(αᵉ².¹)·q₂(αᵉ³.¹)
  2158. 128.31 s > -SCALAR_COUPLING²·q₀(αᵉ².¹)·q₀(αᵉ³.¹)·q₂(αᵉ².¹)·q₂(αᵉ³.¹)
  2159. 128.31 s > /(denom(2,q₂,mUVexp²,-mUV²+(q₂.q₂))·denom(3,-q₂,mUVexp²,-mUV²+(q₂.q₂)))
  2160. 128.31 s > +2·SCALAR_COUPLING²·(q₀.q₂)·q₀(αᵉ².¹)·q₀(αᵉ³.¹)·q₂(αᵉ².¹)·q₂(αᵉ³.¹)
  2161. 128.31 s > /(denom(2,q₂,mUVexp²,-mUV²+(q₂.q₂))·denom(3,-q₂,mUVexp²,-mUV²+(q₂.q₂))²)
  2162. 128.31 s > span t{span_context=true current=subgraph=y, topo_order=1, dod=2 given=subgraph=0, topo_order=0, dod=0}
  2163. 128.31 s > [2026-08-26 08:22:08.814] @approx::local_4d [{#profile, #uv, #collect, #integrated, #start, #trace}] DEBUG : After gamma schoonschip
  2164. 128.31 s > field value
  2165. 128.31 s > expr n-terms: 3, byte size: 1631,expr:
  2166. 128.31 s > (1/2·SCALAR_COUPLING²·(2·mUVexp²-2·mass_scalar_2²)/(denom(2,q₂,mUVexp²,-mUV²+(q₂.q₂))²·denom(3,-q₂,mUVexp²,-mUV²+(q₂.q₂)))
  2167. 128.31 s > -SCALAR_COUPLING²
  2168. 128.31 s > ·(-1/2·(2·mUVexp²-2·mass_scalar_2²+2·(q₀.q₀))/denom(3,-q₂,mUVexp²,-mUV²+(q₂.q₂))
  2169. 128.31 s > +4·(q₀.q₂)²/denom(3,-q₂,mUVexp²,-mUV²+(q₂.q₂))²
  2170. 128.31 s > )/(denom(2,q₂,mUVexp²,-mUV²+(q₂.q₂))·denom(3,-q₂,mUVexp²,-mUV²+(q₂.q₂)))
  2171. 128.31 s > )·(q₀.q₂)²
  2172. 128.31 s > -SCALAR_COUPLING²·(q₀.q₂)²/(denom(2,q₂,mUVexp²,-mUV²+(q₂.q₂))·denom(3,-q₂,mUVexp²,-mUV²+(q₂.q₂)))
  2173. 128.31 s > +2·SCALAR_COUPLING²·(q₀.q₂)·(q₀.q₂)²
  2174. 128.31 s > /(denom(2,q₂,mUVexp²,-mUV²+(q₂.q₂))·denom(3,-q₂,mUVexp²,-mUV²+(q₂.q₂))²)
  2175. 128.31 s > span t{span_context=true current=subgraph=y, topo_order=1, dod=2 given=subgraph=0, topo_order=0, dod=0}
  2176. 128.31 s > [2026-08-26 08:22:08.815] @approx::local_4d [{#profile, #uv, #collect, #integrated, #start, #trace}] DEBUG : After gamma collection
  2177. 128.31 s > field value
  2178. 128.31 s > expr n-terms: 1, byte size: 1347,expr:
  2179. 128.31 s > SCALAR_COUPLING²
  2180. 128.31 s > ·(-denom(2,q₂,mUVexp²,-mUV²+(q₂.q₂))·denom(3,-q₂,mUVexp²,-mUV²+(q₂.q₂))²
  2181. 128.31 s > +1/2·(2·mUVexp²-2·mass_scalar_2²)·denom(3,-q₂,mUVexp²,-mUV²+(q₂.q₂))²
  2182. 128.31 s > -(-1/2·(2·mUVexp²-2·mass_scalar_2²+2·(q₀.q₀))·denom(3,-q₂,mUVexp²,-mUV²+(q₂.q₂))+4·(q₀.q₂)²)
  2183. 128.31 s > ·denom(2,q₂,mUVexp²,-mUV²+(q₂.q₂))
  2184. 128.31 s > +2·(q₀.q₂)·denom(2,q₂,mUVexp²,-mUV²+(q₂.q₂))·denom(3,-q₂,mUVexp²,-mUV²+(q₂.q₂))
  2185. 128.31 s > )·(q₀.q₂)²/(denom(2,q₂,mUVexp²,-mUV²+(q₂.q₂))²·denom(3,-q₂,mUVexp²,-mUV²+(q₂.q₂))³)
  2186. 128.31 s > span t{span_context=true current=subgraph=y, topo_order=1, dod=2 given=subgraph=0, topo_order=0, dod=0}
  2187. 128.31 s > [2026-08-26 08:22:08.816] @approx::local_4d [{#profile, #uv, #gamma, #integrated, #start, #trace, #vakint}] DEBUG : After gamma simplification
  2188. 128.31 s > ... omitted 3263 more lines; see full nextest output above
  2189. 128.31 s >
  2190. 128.31 s > 8. gammaloop-integration-tests::uv::sunrise_scalar_1_uv
  2191. 128.31 s > failure: test failure with exit code 101
  2192. 128.31 s > system-out
  2193. 128.31 s > running 1 test
  2194. 128.31 s > test sunrise_scalar_1_uv has been running for over 60 seconds
  2195. 128.31 s > +------------------+------------------------+--------------+--------+----------+----------------------------------------------------------------------------------------------------------------------+-------+
  2196. 128.31 s > | case | check | graph | status | sigma | threshold | error |
  2197. 128.31 s > +------------------+------------------------+--------------+--------+----------+----------------------------------------------------------------------------------------------------------------------+-------+
  2198. 128.31 s > | sunrise_scalar_1 | uv_profile | - | FAIL | - | - | - |
  2199. 128.31 s > +------------------+------------------------+--------------+--------+----------+----------------------------------------------------------------------------------------------------------------------+-------+
  2200. 128.31 s > | sunrise_scalar_1 | m_uv.inspect | inspect | pass | - | best inspect relative delta 1.624e0 >= 1000*accuracy 1.000e-3 (accuracy=1.000e-6, exponent=+1.0, seed=1, probes=10) | - |
  2201. 128.31 s > +------------------+------------------------+--------------+--------+----------+----------------------------------------------------------------------------------------------------------------------+-------+
  2202. 128.31 s > | sunrise_scalar_1 | m_uv.integrated | sunrise | pass | 0.1sigma | compatible within 2sigma | - |
  2203. 128.31 s > +------------------+------------------------+--------------+--------+----------+----------------------------------------------------------------------------------------------------------------------+-------+
  2204. 128.31 s > | sunrise_scalar_1 | rls.inspect | inspect | pass | - | best inspect relative delta 8.682e-1 >= 1000*accuracy 1.000e-3 (accuracy=1.000e-6, exponent=+1.0, seed=1, probes=10) | - |
  2205. 128.31 s > +------------------+------------------------+--------------+--------+----------+----------------------------------------------------------------------------------------------------------------------+-------+
  2206. 128.31 s > | sunrise_scalar_1 | rls.integrated | sunrise | pass | 0.0sigma | compatible within 2sigma | - |
  2207. 128.31 s > +------------------+------------------------+--------------+--------+----------+----------------------------------------------------------------------------------------------------------------------+-------+
  2208. 128.31 s > | sunrise_scalar_1 | mu_r.inspect | inspect | pass | - | best inspect relative delta 1.752e0 >= 1000*accuracy 1.000e-3 (accuracy=1.000e-6, exponent=+1.0, seed=1, probes=10) | - |
  2209. 128.31 s > +------------------+------------------------+--------------+--------+----------+----------------------------------------------------------------------------------------------------------------------+-------+
  2210. 128.31 s > | sunrise_scalar_1 | integrated.relerr | integrated | pass | - | relative error 9.20% <= 10.00% | - |
  2211. 128.31 s > +------------------+------------------------+--------------+--------+----------+----------------------------------------------------------------------------------------------------------------------+-------+
  2212. 128.31 s > | sunrise_scalar_1 | m_uv.integrated.relerr | m_uv-shifted | pass | - | relative error 5.89% <= 10.00% | - |
  2213. 128.31 s > +------------------+------------------------+--------------+--------+----------+----------------------------------------------------------------------------------------------------------------------+-------+
  2214. 128.31 s > | sunrise_scalar_1 | target | - | pass | - | 2sigma | - |
  2215. 128.31 s > +------------------+------------------------+--------------+--------+----------+----------------------------------------------------------------------------------------------------------------------+-------+
  2216. 128.31 s > test sunrise_scalar_1_uv ... FAILED
  2217. 128.31 s >
  2218. 128.31 s > failures:
  2219. 128.31 s >
  2220. 128.31 s > failures:
  2221. 128.31 s > sunrise_scalar_1_uv
  2222. 128.31 s >
  2223. 128.31 s > test result: FAILED. 0 passed; 1 failed; 0 ignored; 0 measured; 24 filtered out; finished in 92.84s
  2224. 128.31 s > system-err
  2225. 128.31 s > [2026-08-26 08:22:13.546] @gammaloop_api::se... INFO : Running command run generate
  2226. 128.31 s > [2026-08-26 08:22:13.546] @gammaloop_api::se... INFO : Starting command block generate
  2227. 128.31 s > [2026-08-26 08:22:13.546] @gammaloop_api::se... INFO : Running command import model scalars-default.json
  2228. 128.31 s > [2026-08-26 08:22:13.546] @import::model INFO : Loading built-in JSON model scalars-default
  2229. 128.31 s > [2026-08-26 08:22:13.549] @gammalooprs::model INFO : The following 2 external parameters were forced to zero by the restriction card:
  2230. 128.31 s > width_scalar_1, width_scalar_2
  2231. 128.31 s > [2026-08-26 08:22:13.550] @gammaloop_api::se... INFO : Running command remove processes
  2232. 128.31 s > [2026-08-26 08:22:13.550] @gammaloop_api::se... INFO : Running command set global kv global.generation.uv.generate_integrated=true
  2233. 128.31 s > [2026-08-26 08:22:13.550] @gammaloop_api::se... INFO : Running command import graphs ./tests/resources/graphs/scalar_sunrise.dot -p sunrise_scalar_1 -i scalar_sunrise
  2234. 128.31 s > [2026-08-26 08:22:13.550] @commands::import INFO : Loading graphs from '/build/source/tests/resources/graphs/scalar_sunrise.dot'
  2235. 128.31 s > [2026-08-26 08:22:13.553] @gammaloop_api::se... INFO : Running command generate existing -p sunrise_scalar_1 -i scalar_sunrise
  2236. 128.31 s > [2026-08-26 08:22:13.555] @approx::local_4d [{#uv, #inspect, #integrated}] DEBUG : Rescaled momenta expanded
  2237. 128.31 s > field value
  2238. 128.31 s > res n-terms: 1, byte size: 611,expr:
  2239. 128.31 s > 1/(denom(0,q₀/t,mass_scalar_1²,-mass_scalar_1²+(q₀.q₀)/t²)
  2240. 128.31 s > ·denom(2,-q₁+q₃-q₀/t,mass_scalar_1²,
  2241. 128.31 s > -mass_scalar_1²+2·(q₀.q₁)/t-2·(q₀.q₃)/t+(q₀.q₀)/t²+(q₁.q₁)
  2242. 128.31 s > -2·(q₁.q₃)+(q₃.q₃)
  2243. 128.31 s > ))
  2244. 128.31 s > [2026-08-26 08:22:13.556] @approx::local_4d [{#uv, #inspect, #integrated}] DEBUG : Rescaled momenta expanded
  2245. 128.31 s > field value
  2246. 128.32 s > res n-terms: 1, byte size: 777,expr:
  2247. 128.32 s > 1/(denom(0,q₀/t,mass_scalar_1²,-mass_scalar_1²+(q₀.q₀)/t²)·denom(1,q₁/t,mass_scalar_1²,-mass_scalar_1²+(q₁.q₁)/t²)
  2248. 128.32 s > ·denom(2,q₄-q₀/t-q₁/t,mass_scalar_1²,
  2249. 128.32 s > -mass_scalar_1²-2·(q₀.q₄)/t-2·(q₁.q₄)/t+(q₀.q₀)/t²+2·(q₀.q₁)/t²
  2250. 128.32 s > +(q₁.q₁)/t²+(q₄.q₄)
  2251. 128.32 s > ))
  2252. 128.32 s > [2026-08-26 08:22:13.561] @approx::local_4d [{#uv, #inspect, #integrated}] DEBUG : Rescaled momenta expanded
  2253. 128.32 s > field value
  2254. 128.32 s > res n-terms: 1, byte size: 611,expr:
  2255. 128.32 s > 1/(denom(0,q₀/t,mass_scalar_1²,-mass_scalar_1²+(q₀.q₀)/t²)
  2256. 128.32 s > ·denom(1,-q₂+q₃-q₀/t,mass_scalar_1²,
  2257. 128.32 s > -mass_scalar_1²+2·(q₀.q₂)/t-2·(q₀.q₃)/t+(q₀.q₀)/t²+(q₂.q₂)
  2258. 128.32 s > -2·(q₂.q₃)+(q₃.q₃)
  2259. 128.32 s > ))
  2260. 128.32 s > [2026-08-26 08:22:13.562] @approx::local_4d [{#uv, #inspect, #integrated}] DEBUG : Rescaled momenta expanded
  2261. 128.32 s > field value
  2262. 128.32 s > res n-terms: 1, byte size: 611,expr:
  2263. 128.32 s > 1/(denom(1,q₁/t,mass_scalar_1²,-mass_scalar_1²+(q₁.q₁)/t²)
  2264. 128.32 s > ·denom(2,-q₀+q₃-q₁/t,mass_scalar_1²,
  2265. 128.32 s > -mass_scalar_1²+2·(q₀.q₁)/t-2·(q₁.q₃)/t+(q₁.q₁)/t²+(q₀.q₀)
  2266. 128.32 s > -2·(q₀.q₃)+(q₃.q₃)
  2267. 128.32 s > ))
  2268. 128.32 s > [2026-08-26 08:22:13.562] @approx::local_4d [{#uv, #inspect, #integrated}] DEBUG : Rescaled momenta expanded
  2269. 128.32 s > field value
  2270. 128.32 s > res n-terms: 1, byte size: 3,expr:
  2271. 128.32 s > 1
  2272. 128.32 s > [2026-08-26 08:22:13.563] @approx::final_integrand[{#generation, #profile, #uv, #graph, #summary}] DEBUG : Computed global numerator
  2273. 128.32 s > field value
  2274. 128.32 s > global_num n-terms: 1, byte size: 3,expr:
  2275. 128.32 s > 1
  2276. 128.32 s > span build_3d{span_context=true graph=sunrise current=subgraph=0, topo_order=0, dod=0}
  2277. 128.32 s > [2026-08-26 08:22:13.567] @uv::approx [{#generation, #uv, #fourd}] DEBUG : Computing 4D
  2278. 128.32 s > field value
  2279. 128.32 s > simple subgraph(S_47,S_3I)*Approx(subgraph(S_3I,0)) of sunrise
  2280. 128.32 s > span compute_4d{span_context=true graph=sunrise current=subgraph=3I, topo_order=1, dod=0 given=subgraph=0, topo_order=0, dod=0 reduced=SubSet { set: BitVec<usize, bitvec::order::Lsb0> { addr: 0x7fffb0026880, head: 000000, bits: 8, capacity: 64 } [0, 0, 1, 1, 0, 0, 1, 1], id: PhantomData<linnet::half_edge::involution::Hedge> }}
  2281. 128.32 s > [2026-08-26 08:22:13.568] @approx::local_4d [{#uv, #algebra, #integrated, #start}] DEBUG :
  2282. 128.32 s > field value
  2283. 128.32 s > integrand n-terms: 1, byte size: 217,expr:
  2284. 128.32 s > 1/(denom(0,q₀,mass_scalar_1²,-mass_scalar_1²+(q₀.q₀))·denom(2,q₂,mass_scalar_1²,-mass_scalar_1²+(q₂.q₂)))
  2285. 128.32 s > reduced 3I
  2286. 128.32 s > span grow{span_context=true current=subgraph=3I, topo_order=1, dod=0 given=subgraph=0, topo_order=0, dod=0}
  2287. 128.32 s > [2026-08-26 08:22:13.568] @approx::local_4d [{#uv, #inspect, #integrated}] DEBUG : Rescaled momenta expanded
  2288. 128.32 s > field value
  2289. 128.32 s > res n-terms: 1, byte size: 611,expr:
  2290. 128.32 s > 1/(denom(0,q₀/t,mass_scalar_1²,-mass_scalar_1²+(q₀.q₀)/t²)
  2291. 128.32 s > ·denom(2,-q₁+q₃-q₀/t,mass_scalar_1²,
  2292. 128.32 s > -mass_scalar_1²+2·(q₀.q₁)/t-2·(q₀.q₃)/t+(q₀.q₀)/t²+(q₁.q₁)
  2293. 128.32 s > -2·(q₁.q₃)+(q₃.q₃)
  2294. 128.32 s > ))
  2295. 128.32 s > span t{span_context=true current=subgraph=3I, topo_order=1, dod=0 given=subgraph=0, topo_order=0, dod=0}
  2296. 128.32 s > [2026-08-26 08:22:13.568] @approx::local_4d [{#uv, #integrated, #rescaled}] DEBUG : Rescaled expanded
  2297. 128.32 s > field value
  2298. 128.32 s > n_loops 1
  2299. 128.32 s > res n-terms: 1, byte size: 723,expr:
  2300. 128.32 s > 1/(denom(0,q₀,mUVexp²+t²·mass_scalar_1²,-mUV²+t²·(-mass_scalar_1²+(q₀.q₀)/t²)+t²·mUVexp²)
  2301. 128.32 s > ·denom(2,-q₀,mUVexp²+t²·mass_scalar_1²,
  2302. 128.32 s > -mUV²
  2303. 128.32 s > +t²
  2304. 128.32 s > ·(-mass_scalar_1²+2·(q₀.q₁)/t-2·(q₀.q₃)/t+(q₀.q₀)/t²+(q₁.q₁)
  2305. 128.32 s > -2·(q₁.q₃)+(q₃.q₃)
  2306. 128.32 s > )
  2307. 128.32 s > +t²·mUVexp²
  2308. 128.32 s > ))
  2309. 128.32 s > span t{span_context=true current=subgraph=3I, topo_order=1, dod=0 given=subgraph=0, topo_order=0, dod=0}
  2310. 128.32 s > [2026-08-26 08:22:13.568] @approx::local_4d [{#uv, #integrated, #series}] DEBUG : Series expanded
  2311. 128.32 s > field value
  2312. 128.32 s > res n-terms: 1, byte size: 223,expr:
  2313. 128.32 s > 1/(denom(0,q₀,mUVexp²,-mUV²+(q₀.q₀))·denom(2,-q₀,mUVexp²,-mUV²+(q₀.q₀)))
  2314. 128.32 s > span t{span_context=true current=subgraph=3I, topo_order=1, dod=0 given=subgraph=0, topo_order=0, dod=0}
  2315. 128.32 s > [2026-08-26 08:22:13.568] @approx::local_4d [{#uv, #integrated, #series}] DEBUG : Evaluated at t = 1
  2316. 128.32 s > field value
  2317. 128.32 s > res n-terms: 1, byte size: 223,expr:
  2318. 128.32 s > 1/(denom(0,q₀,mUVexp²,-mUV²+(q₀.q₀))·denom(2,-q₀,mUVexp²,-mUV²+(q₀.q₀)))
  2319. 128.32 s > span t{span_context=true current=subgraph=3I, topo_order=1, dod=0 given=subgraph=0, topo_order=0, dod=0}
  2320. 128.32 s > [2026-08-26 08:22:13.568] @approx::local_4d [{#uv, #collect, #integrated}] DEBUG : After gamma chain collection
  2321. 128.32 s > field value
  2322. 128.32 s > expr n-terms: 1, byte size: 223,expr:
  2323. 128.32 s > 1/(denom(0,q₀,mUVexp²,-mUV²+(q₀.q₀))·denom(2,-q₀,mUVexp²,-mUV²+(q₀.q₀)))
  2324. 128.32 s > span t{span_context=true current=subgraph=3I, topo_order=1, dod=0 given=subgraph=0, topo_order=0, dod=0}
  2325. 128.32 s > [2026-08-26 08:22:13.569] @approx::local_4d [{#profile, #uv, #collect, #integrated, #start, #trace}] DEBUG : After gamma schoonschip
  2326. 128.32 s > field value
  2327. 128.32 s > expr n-terms: 1, byte size: 223,expr:
  2328. 128.32 s > 1/(denom(0,q₀,mUVexp²,-mUV²+(q₀.q₀))·denom(2,-q₀,mUVexp²,-mUV²+(q₀.q₀)))
  2329. 128.32 s > span t{span_context=true current=subgraph=3I, topo_order=1, dod=0 given=subgraph=0, topo_order=0, dod=0}
  2330. 128.32 s > [2026-08-26 08:22:13.569] @approx::local_4d [{#profile, #uv, #collect, #integrated, #start, #trace}] DEBUG : After gamma collection
  2331. 128.32 s > field value
  2332. 128.32 s > expr n-terms: 1, byte size: 223,expr:
  2333. 128.32 s > 1/(denom(0,q₀,mUVexp²,-mUV²+(q₀.q₀))·denom(2,-q₀,mUVexp²,-mUV²+(q₀.q₀)))
  2334. 128.32 s > span t{span_context=true current=subgraph=3I, topo_order=1, dod=0 given=subgraph=0, topo_order=0, dod=0}
  2335. 128.32 s > [2026-08-26 08:22:13.569] @approx::local_4d [{#profile, #uv, #gamma, #integrated, #start, #trace, #vakint}] DEBUG : After gamma simplification
  2336. 128.32 s > field value
  2337. 128.32 s > expr n-terms: 1, byte size: 223,expr:
  2338. 128.32 s > 1/(denom(0,q₀,mUVexp²,-mUV²+(q₀.q₀))·denom(2,-q₀,mUVexp²,-mUV²+(q₀.q₀)))
  2339. 128.32 s > span t{span_context=true current=subgraph=3I, topo_order=1, dod=0 given=subgraph=0, topo_order=0, dod=0}
  2340. 128.32 s > [2026-08-26 08:22:13.569] @approx::local_4d [{#profile, #uv, #integrated, #schoonschip, #start, #trace, #vakint}] DEBUG : After Schoonschip net
  2341. 128.32 s > field value
  2342. 128.32 s > expr n-terms: 1, byte size: 223,expr:
  2343. 128.32 s > 1/(denom(0,q₀,mUVexp²,-mUV²+(q₀.q₀))·denom(2,-q₀,mUVexp²,-mUV²+(q₀.q₀)))
  2344. 128.32 s > ... omitted 20090 more lines; see full nextest output above
  2345. 128.32 s >
  2346. 128.32 s > 9. gammaloop-integration-tests::uv::se1l_uv
  2347. 128.32 s > failure: test failure with exit code 101
  2348. 128.32 s > system-out
  2349. 128.32 s > running 1 test
  2350. 128.32 s > test se1l_uv has been running for over 60 seconds
  2351. 128.32 s > +------+-----------------+---------+--------+----------+-----------------------------------------------------------------------------------------------------------------------+-------+
  2352. 128.32 s > | case | check | graph | status | sigma | threshold | error |
  2353. 128.32 s > +------+-----------------+---------+--------+----------+-----------------------------------------------------------------------------------------------------------------------+-------+
  2354. 128.32 s > | se1l | uv_profile | - | FAIL | - | - | - |
  2355. 128.32 s > +------+-----------------+---------+--------+----------+-----------------------------------------------------------------------------------------------------------------------+-------+
  2356. 128.32 s > | se1l | m_uv.inspect | inspect | pass | - | best inspect relative delta 1.097e-1 >= 1000*accuracy 1.000e-7 (accuracy=1.000e-10, exponent=+2.0, seed=1, probes=10) | - |
  2357. 128.32 s > +------+-----------------+---------+--------+----------+-----------------------------------------------------------------------------------------------------------------------+-------+
  2358. 128.32 s > | se1l | m_uv.integrated | se1l | pass | 0.1sigma | compatible within 2sigma | - |
  2359. 128.32 s > +------+-----------------+---------+--------+----------+-----------------------------------------------------------------------------------------------------------------------+-------+
  2360. 128.32 s > | se1l | rls.inspect | inspect | pass | - | best inspect relative delta 4.499e-2 >= 1000*accuracy 1.000e-7 (accuracy=1.000e-10, exponent=+2.0, seed=1, probes=10) | - |
  2361. 128.32 s > +------+-----------------+---------+--------+----------+-----------------------------------------------------------------------------------------------------------------------+-------+
  2362. 128.32 s > | se1l | rls.integrated | se1l | pass | 0.0sigma | compatible within 2sigma | - |
  2363. 128.32 s > +------+-----------------+---------+--------+----------+-----------------------------------------------------------------------------------------------------------------------+-------+
  2364. 128.32 s > | se1l | mu_r.inspect | inspect | pass | - | best inspect relative delta 1.424e-1 >= 1000*accuracy 1.000e-7 (accuracy=1.000e-10, exponent=+2.0, seed=1, probes=10) | - |
  2365. 128.32 s > +------+-----------------+---------+--------+----------+-----------------------------------------------------------------------------------------------------------------------+-------+
  2366. 128.32 s > | se1l | target | - | pass | - | 2sigma | - |
  2367. 128.32 s > +------+-----------------+---------+--------+----------+-----------------------------------------------------------------------------------------------------------------------+-------+
  2368. 128.32 s > test se1l_uv ... FAILED
  2369. 128.32 s >
  2370. 128.32 s > failures:
  2371. 128.32 s >
  2372. 128.32 s > failures:
  2373. 128.32 s > se1l_uv
  2374. 128.32 s >
  2375. 128.32 s > test result: FAILED. 0 passed; 1 failed; 0 ignored; 0 measured; 24 filtered out; finished in 102.73s
  2376. 128.32 s > system-err
  2377. 128.32 s > [2026-08-26 08:22:13.006] @gammaloop_api::se... INFO : Running command run generate
  2378. 128.32 s > [2026-08-26 08:22:13.006] @gammaloop_api::se... INFO : Starting command block generate
  2379. 128.32 s > [2026-08-26 08:22:13.006] @gammaloop_api::se... INFO : Running command import model sm-default
  2380. 128.32 s > [2026-08-26 08:22:13.006] @import::model INFO : Loading built-in JSON model sm-default
  2381. 128.32 s > [2026-08-26 08:22:13.046] @gammalooprs::model INFO : The following 11 external parameters were forced to zero by the restriction card:
  2382. 128.32 s > lamWS, AWS, rhoWS, etaWS, ymc, yme, ymm, MC, Me, MM, WTau
  2383. 128.32 s > [2026-08-26 08:22:13.046] @gammalooprs::model INFO : The following 34 vertex rules were removed by the restriction card:
  2384. 128.32 s > V_82 -> (c~, d, G+) | V_83 -> (t~, d, G+) | V_84 -> (c~, s, G+) | V_85 -> (t~, s, G+) | V_86 -> (u~, b, G+) | V_87 -> (c~, b, G+) | V_90 -> (c~, d, W+) | V_91 -> (t~, d, W+) | V_92 -> (u~, s, W+) | V_94 -> (t~, s, W+) | V_95 -> (u~, b, W+) | V_96 -> (c~, b, W+) | V_101 -> (e+, e-, G0) | V_102 -> (mu+, mu-, G0) | V_104 -> (e+, e-, H) | V_105 -> (mu+, mu-, H) | V_110 -> (ve~, e-, G+) | V_111 -> (vm~, mu-, G+) | V_116 -> (b~, u, G-) | V_117 -> (d~, c, G-) | V_118 -> (s~, c, G-) | V_119 -> (b~, c, G-) | V_120 -> (d~, t, G-) | V_121 -> (s~, t, G-) | V_124 -> (s~, u, W-) | V_125 -> (b~, u, W-) | V_126 -> (d~, c, W-) | V_128 -> (b~, c, W-) | V_129 -> (d~, t, W-) | V_130 -> (s~, t, W-) | V_138 -> (c~, c, G0) | V_140 -> (c~, c, H) | V_145 -> (e+, ve, G-) | V_146 -> (mu+, vm, G-)
  2385. 128.32 s > [2026-08-26 08:22:13.046] @gammalooprs::model INFO : The following 36 couplings were removed by the restriction card:
  2386. 128.32 s > GC_13, GC_14, GC_16, GC_17, GC_18, GC_19, GC_20, GC_22, GC_23, GC_24, GC_25, GC_26, GC_28, GC_29, GC_42, GC_43, GC_44, GC_46, GC_47, GC_48, GC_84, GC_85, GC_86, GC_87, GC_88, GC_89, GC_90, GC_91, GC_92, GC_93, GC_101, GC_102, GC_103, GC_105, GC_106, GC_107
  2387. 128.32 s > [2026-08-26 08:22:13.047] @gammaloop_api::se... INFO : Running command remove processes
  2388. 128.32 s > [2026-08-26 08:22:13.047] @gammaloop_api::se... INFO : Running command set global kv global.generation.uv.generate_integrated=true
  2389. 128.32 s > [2026-08-26 08:22:13.047] @gammaloop_api::se... INFO : Running command import graphs ./tests/resources/graphs/uv_tests/se1l.dot -p se1l -i se1l
  2390. 128.32 s > [2026-08-26 08:22:13.047] @commands::import INFO : Loading graphs from '/build/source/tests/resources/graphs/uv_tests/se1l.dot'
  2391. 128.32 s > [2026-08-26 08:22:13.055] @gammaloop_api::se... INFO : Running command generate existing -p se1l -i se1l
  2392. 128.32 s > [2026-08-26 08:22:14.043] @commands::generate INFO :
  2393. 128.32 s > Integrand generation summary
  2394. 128.32 s > peak RAM 89.81 MiB | cores 1
  2395. 128.32 s > ╭───────────┬───────┬─────────┬─────────────┬─────────────┬────────────────┬─────────────╮
  2396. 128.32 s > │ integrand │ graph │ # evals │ expr build │ spenso │ symbolica eval │ compile │
  2397. 128.32 s > ├───────────┼───────┼─────────┼─────────────┼─────────────┼────────────────┼─────────────┤
  2398. 128.32 s > │ se1l │ se1l │ 5 │ 782ms (90%) │ 33ms (3.8%) │ 53ms (6.1%) │ 0ms (0.00%) │
  2399. 128.32 s > ├───────────┼───────┼─────────┼─────────────┼─────────────┼────────────────┼─────────────┤
  2400. 128.32 s > │ Total │ │ 5 │ 782ms (90%) │ 33ms (3.8%) │ 53ms (6.1%) │ 0ms (0.00%) │
  2401. 128.32 s > ╰───────────┴───────┴─────────┴─────────────┴─────────────┴────────────────┴─────────────╯
  2402. 128.32 s > [2026-08-26 08:22:14.044] @gammaloop_api::se... INFO : Running command set process -p se1l -i se1l kv general.m_uv=0.2
  2403. 128.32 s > [2026-08-26 08:22:14.045] @gammaloop_api::se... INFO : Running command set process -p se1l -i se1l kv general.mu_r=0.2
  2404. 128.32 s > [2026-08-26 08:22:14.046] @gammaloop_api::se... INFO : Running command set process -p se1l -i se1l kv general.renormalization_localization_scale=0.2
  2405. 128.32 s > [2026-08-26 08:22:14.047] @gammaloop_api::se... INFO : Running command duplicate integrand -p se1l -i se1l --output_process_name se1l --output_integrand_name se1l_muv_shifted
  2406. 128.32 s > [2026-08-26 08:22:14.048] @gammaloop_api::se... INFO : Running command set process -p se1l -i se1l_muv_shifted kv general.m_uv=0.5
  2407. 128.32 s > [2026-08-26 08:22:14.048] @gammaloop_api::se... INFO : Running command duplicate integrand -p se1l -i se1l --output_process_name se1l --output_integrand_name se1l_rls_shifted
  2408. 128.32 s > [2026-08-26 08:22:14.053] @gammaloop_api::se... INFO : Running command set process -p se1l -i se1l_rls_shifted kv general.renormalization_localization_scale=1
  2409. 128.32 s > [2026-08-26 08:22:14.054] @gammaloop_api::se... INFO : Running command duplicate integrand -p se1l -i se1l --output_process_name se1l --output_integrand_name se1l_mur_shifted
  2410. 128.32 s > [2026-08-26 08:22:14.059] @gammaloop_api::se... INFO : Running command set process -p se1l -i se1l_mur_shifted kv general.mu_r=0.8
  2411. 128.32 s > [2026-08-26 08:22:14.065] @process::amplitude WARNING : External state 0 ('g', PDG 21, helicity +) is off shell: p^2 = +2.5e5, expected m^2 = +0e0 (|Δ| = +2.5e5). Fixed-helicity spinor/vector/tensor external states may be ill-defined at this kinematic point.
  2412. 128.32 s > field value
  2413. 128.32 s > span warm_up{integrand.name=se1l}
  2414. 128.32 s > [2026-08-26 08:22:14.065] @process::amplitude WARNING : External state 1 ('g', PDG 21, helicity -) is off shell: p^2 = +2.5e5, expected m^2 = +0e0 (|Δ| = +2.5e5). Fixed-helicity spinor/vector/tensor external states may be ill-defined at this kinematic point.
  2415. 128.32 s > field value
  2416. 128.32 s > span warm_up{integrand.name=se1l}
  2417. 128.32 s > [2026-08-26 08:22:14.065] @process::amplitude INFO : Input is above threshold: 1 existing threshold E-surfaces across 1/1 graph groups
  2418. 128.32 s > field value
  2419. 128.32 s > existing_esurfaces 1
  2420. 128.32 s > group_count 1
  2421. 128.32 s > groups_above_threshold 1
  2422. 128.32 s > integrand se1l
  2423. 128.32 s > span warm_up{integrand.name=se1l}
  2424. 128.32 s > threshold_status above threshold
  2425. 128.32 s > [2026-08-26 08:22:14.065] @process::amplitude INFO : overlap structure of group 0: [1: [0(2,3)]]
  2426. 128.32 s > field value
  2427. 128.32 s > span warm_up{integrand.name=se1l}
  2428. 128.32 s > [2026-08-26 08:22:14.199] @commands::profile INFO :
  2429. 128.32 s > ╭───────┬──────┬──────────┬───────┬─────┬──────────┬───────────╮
  2430. 128.32 s > │ fixed │ → ∞ │ slope │ r2 │ DOD │ bare DOD │ inspect │
  2431. 128.32 s > ├───────┼──────┼──────────┼───────┼─────┼──────────┼───────────┤
  2432. 128.32 s > │ {} │ {e3} │ 1.639236 │ 0.904 │ 2 │ 2 │ arb retry │
  2433. 128.32 s > │ {} │ {e2} │ 1.698834 │ 0.902 │ 2 │ 2 │ arb retry │
  2434. 128.32 s > ╰───────┴──────┴──────────┴───────┴─────┴──────────┴───────────╯
  2435. 128.32 s > [2026-08-26 08:22:14.199] @commands::profile INFO :
  2436. 128.32 s > ╭───────┬──────┬─────────────┬──────────┬───────┬─────┬──────────┬───────────╮
  2437. 128.32 s > │ fixed │ → ∞ │ orientation │ slope │ r2 │ DOD │ bare DOD │ inspect │
  2438. 128.32 s > ├───────┼──────┼─────────────┼──────────┼───────┼─────┼──────────┼───────────┤
  2439. 128.32 s > │ {} │ {e3} │ 00-+ │ 0.343429 │ 0.145 │ 0 │ 2 │ arb retry │
  2440. 128.32 s > │ {} │ {e3} │ 00+- │ 0.342577 │ 0.135 │ 0 │ 2 │ arb retry │
  2441. 128.32 s > │ {} │ {e2} │ 00-+ │ 0.385975 │ 0.161 │ 0 │ 2 │ arb retry │
  2442. 128.32 s > │ {} │ {e2} │ 00+- │ 0.384920 │ 0.192 │ 0 │ 2 │ arb retry │
  2443. 128.32 s > ╰───────┴──────┴─────────────┴──────────┴───────┴─────┴──────────┴───────────╯
  2444. 128.32 s > [2026-08-26 08:22:14.200] @gammaloop_api::se... INFO : Running command set process kv integrator.target_relative_accuracy=0.001 integrator.n_increase=0 integrator.n_start=50000 integrator.n_max=400000 integrator.seed=1337
  2445. 128.32 s > [2026-08-26 08:22:14.201] @commands::integrate INFO : Created workspace directory at /build/source/tests/artifacts/se1l/integration_workspace_se1l
  2446. 128.32 s > [2026-08-26 08:22:14.231] @commands::integrate INFO : No integration state found, starting new integration
  2447. 128.32 s > [2026-08-26 08:22:14.231] @commands::integrate INFO : Gammaloop now integrates se1l@se1l, se1l@se1l_muv_shifted, se1l@se1l_rls_shifted
  2448. 128.32 s > [2026-08-26 08:22:14.234] @process::amplitude WARNING : External state 0 ('g', PDG 21, helicity +) is off shell: p^2 = +2.5e5, expected m^2 = +0e0 (|Δ| = +2.5e5). Fixed-helicity spinor/vector/tensor external states may be ill-defined at this kinematic point.
  2449. 128.32 s > field value
  2450. 128.32 s > span warm_up{integrand.name=se1l}
  2451. 128.32 s > [2026-08-26 08:22:14.234] @process::amplitude WARNING : External state 1 ('g', PDG 21, helicity -) is off shell: p^2 = +2.5e5, expected m^2 = +0e0 (|Δ| = +2.5e5). Fixed-helicity spinor/vector/tensor external states may be ill-defined at this kinematic point.
  2452. 128.32 s > field value
  2453. 128.32 s > span warm_up{integrand.name=se1l}
  2454. 128.32 s > [2026-08-26 08:22:14.235] @process::amplitude INFO : Input is above threshold: 1 existing threshold E-surfaces across 1/1 graph groups
  2455. 128.32 s > field value
  2456. 128.32 s > existing_esurfaces 1
  2457. 128.32 s > group_count 1
  2458. 128.32 s > groups_above_threshold 1
  2459. 128.32 s > integrand se1l
  2460. 128.32 s > span warm_up{integrand.name=se1l}
  2461. 128.32 s > threshold_status above threshold
  2462. 128.32 s > [2026-08-26 08:22:14.235] @process::amplitude INFO : overlap structure of group 0: [1: [0(2,3)]]
  2463. 128.32 s > field value
  2464. 128.32 s > span warm_up{integrand.name=se1l}
  2465. 128.32 s > [2026-08-26 08:22:14.235] @process::amplitude WARNING : External state 0 ('g', PDG 21, helicity +) is off shell: p^2 = +2.5e5, expected m^2 = +0e0 (|Δ| = +2.5e5). Fixed-helicity spinor/vector/tensor external states may be ill-defined at this kinematic point.
  2466. 128.32 s > field value
  2467. 128.32 s > span warm_up{integrand.name=se1l_muv_shifted}
  2468. 128.32 s > [2026-08-26 08:22:14.236] @process::amplitude WARNING : External state 1 ('g', PDG 21, helicity -) is off shell: p^2 = +2.5e5, expected m^2 = +0e0 (|Δ| = +2.5e5). Fixed-helicity spinor/vector/tensor external states may be ill-defined at this kinematic point.
  2469. 128.32 s > field value
  2470. 128.32 s > span warm_up{integrand.name=se1l_muv_shifted}
  2471. 128.32 s > [2026-08-26 08:22:14.236] @process::amplitude INFO : Input is above threshold: 1 existing threshold E-surfaces across 1/1 graph groups
  2472. 128.32 s > field value
  2473. 128.32 s > existing_esurfaces 1
  2474. 128.32 s > group_count 1
  2475. 128.32 s > groups_above_threshold 1
  2476. 128.32 s > integrand se1l_muv_shifted
  2477. 128.32 s > span warm_up{integrand.name=se1l_muv_shifted}
  2478. 128.32 s > threshold_status above threshold
  2479. 128.32 s > [2026-08-26 08:22:14.236] @process::amplitude INFO : overlap structure of group 0: [1: [0(2,3)]]
  2480. 128.32 s > field value
  2481. 128.32 s > span warm_up{integrand.name=se1l_muv_shifted}
  2482. 128.32 s > [2026-08-26 08:22:14.237] @process::amplitude WARNING : External state 0 ('g', PDG 21, helicity +) is off shell: p^2 = +2.5e5, expected m^2 = +0e0 (|Δ| = +2.5e5). Fixed-helicity spinor/vector/tensor external states may be ill-defined at this kinematic point.
  2483. 128.32 s > field value
  2484. 128.32 s > span warm_up{integrand.name=se1l_rls_shifted}
  2485. 128.32 s > [2026-08-26 08:22:14.237] @process::amplitude WARNING : External state 1 ('g', PDG 21, helicity -) is off shell: p^2 = +2.5e5, expected m^2 = +0e0 (|Δ| = +2.5e5). Fixed-helicity spinor/vector/tensor external states may be ill-defined at this kinematic point.
  2486. 128.32 s > field value
  2487. 128.32 s > span warm_up{integrand.name=se1l_rls_shifted}
  2488. 128.32 s > [2026-08-26 08:22:14.237] @process::amplitude INFO : Input is above threshold: 1 existing threshold E-surfaces across 1/1 graph groups
  2489. 128.32 s > field value
  2490. 128.32 s > existing_esurfaces 1
  2491. 128.32 s > group_count 1
  2492. 128.32 s > groups_above_threshold 1
  2493. 128.32 s > integrand se1l_rls_shifted
  2494. 128.32 s > span warm_up{integrand.name=se1l_rls_shifted}
  2495. 128.32 s > threshold_status above threshold
  2496. 128.32 s > ... omitted 1410 more lines; see full nextest output above
  2497. 128.32 s > =========================================
  2498. 128.32 s For full logs, run:
  2499. 128.32 s nix log /nix/store/z64pzsmdh7l76572yr3sfrwn8clcnq7n-gammaloop-nextest-integration.drv
  2500. 128.45 s [0 built (1 failed)]Run failed.