test packages.x86_64-linux.nix-ci-check-gammaloop-nextest-integration

Reproduce this run
Retry Run
  1. 165.83 s gammaloop-nextest-integration> | dod2_bubble | rls.integrated | GL0 | pass | 0.0sigma | compatible within 2sigma | - |
  2. 165.83 s gammaloop-nextest-integration> +-------------+-----------------+---------+--------+----------+-----------------------------------------------------------------------------------------------------------------------+-------+
  3. 165.83 s gammaloop-nextest-integration> | dod2_bubble | mu_r.inspect | inspect | pass | - | best inspect relative delta 6.951e-1 >= 1000*accuracy 1.000e-7 (accuracy=1.000e-10, exponent=+0.0, seed=0, probes=10) | - |
  4. 165.83 s gammaloop-nextest-integration> +-------------+-----------------+---------+--------+----------+-----------------------------------------------------------------------------------------------------------------------+-------+
  5. 165.83 s gammaloop-nextest-integration> | dod2_bubble | target | - | pass | - | 2sigma | - |
  6. 165.83 s gammaloop-nextest-integration> +-------------+-----------------+---------+--------+----------+-----------------------------------------------------------------------------------------------------------------------+-------+
  7. 165.83 s gammaloop-nextest-integration> test dod2_bubble_uv ... FAILED
  8. 165.83 s gammaloop-nextest-integration>
  9. 165.83 s gammaloop-nextest-integration> failures:
  10. 165.83 s gammaloop-nextest-integration>
  11. 165.83 s gammaloop-nextest-integration> failures:
  12. 165.83 s gammaloop-nextest-integration> dod2_bubble_uv
  13. 165.83 s gammaloop-nextest-integration>
  14. 165.83 s gammaloop-nextest-integration> test result: FAILED. 0 passed; 1 failed; 0 ignored; 0 measured; 24 filtered out; finished in 52.46s
  15. 165.83 s gammaloop-nextest-integration> system-err
  16. 165.83 s gammaloop-nextest-integration> [2026-08-26 08:19:37.806] @gammaloop_api::se... INFO : Running command run generate
  17. 165.83 s gammaloop-nextest-integration> [2026-08-26 08:19:37.807] @gammaloop_api::se... INFO : Starting command block generate
  18. 165.83 s gammaloop-nextest-integration> [2026-08-26 08:19:37.807] @gammaloop_api::se... INFO : Running command import model scalars-default.json
  19. 165.83 s gammaloop-nextest-integration> [2026-08-26 08:19:37.807] @import::model INFO : Loading built-in JSON model scalars-default
  20. 165.83 s gammaloop-nextest-integration> [2026-08-26 08:19:37.811] @gammalooprs::model INFO : The following 2 external parameters were forced to zero by the restriction card:
  21. 165.83 s gammaloop-nextest-integration> width_scalar_1, width_scalar_2
  22. 165.83 s gammaloop-nextest-integration> [2026-08-26 08:19:37.811] @gammaloop_api::se... INFO : Running command remove processes
  23. 165.83 s gammaloop-nextest-integration> [2026-08-26 08:19:37.812] @gammaloop_api::se... INFO : Running command set global kv global.generation.uv.generate_integrated=true
  24. 165.83 s gammaloop-nextest-integration> [2026-08-26 08:19:37.812] @gammaloop_api::se... INFO : Running command import graphs ./tests/resources/graphs/scalar/dod2_bubble.dot -p bubble_dod2 -i scalar_bubble_below_thres
  25. 165.83 s gammaloop-nextest-integration> [2026-08-26 08:19:37.812] @commands::import INFO : Loading graphs from '/build/source/tests/resources/graphs/scalar/dod2_bubble.dot'
  26. 165.83 s gammaloop-nextest-integration> [2026-08-26 08:19:37.818] @gammaloop_api::se... INFO : Running command generate existing -p bubble_dod2 -i scalar_bubble_below_thres
  27. 165.83 s gammaloop-nextest-integration> [2026-08-26 08:19:37.820] @approx::local_4d [{#uv, #inspect, #integrated}] DEBUG : Rescaled momenta expanded
  28. 165.83 s gammaloop-nextest-integration> field value
  29. 165.83 s gammaloop-nextest-integration> res n-terms: 1, byte size: 585,expr:
  30. 165.83 s gammaloop-nextest-integration> -SCALAR_COUPLING²·q₀(αᵉ².¹)·q₀(αᵉ³.¹)·q₂(αᵉ².¹)·q₂(αᵉ³.¹)
  31. 165.83 s gammaloop-nextest-integration> /(t²·denom(3,-q₀-q₂/t,mass_scalar_2²,-mass_scalar_2²+2·(q₀.q₂)/t+(q₂.q₂)/t²+(q₀.q₀))
  32. 165.83 s gammaloop-nextest-integration> ·denom(2,q₂/t,mass_scalar_2²,-mass_scalar_2²+(q₂.q₂)/t²))
  33. 165.83 s gammaloop-nextest-integration> [2026-08-26 08:19:37.828] @approx::local_4d [{#uv, #inspect, #integrated}] DEBUG : Rescaled momenta expanded
  34. 165.83 s gammaloop-nextest-integration> field value
  35. 165.83 s gammaloop-nextest-integration> res n-terms: 1, byte size: 3,expr:
  36. 165.83 s gammaloop-nextest-integration> 1
  37. 165.83 s gammaloop-nextest-integration> [2026-08-26 08:19:37.829] @approx::final_integrand[{#generation, #profile, #uv, #graph, #summary}] DEBUG : Computed global numerator
  38. 165.83 s gammaloop-nextest-integration> field value
  39. 165.83 s gammaloop-nextest-integration> global_num n-terms: 1, byte size: 4,expr:
  40. 165.83 s gammaloop-nextest-integration> 1/2
  41. 165.83 s gammaloop-nextest-integration> span build_3d{span_context=true graph=GL0 current=subgraph=0, topo_order=0, dod=0}
  42. 165.83 s gammaloop-nextest-integration> [2026-08-26 08:19:37.835] @uv::approx [{#generation, #uv, #fourd}] DEBUG : Computing 4D
  43. 165.83 s gammaloop-nextest-integration> field value
  44. 165.83 s gammaloop-nextest-integration> simple subgraph(S_11,S_y)*Approx(subgraph(S_y,0)) of GL0
  45. 165.83 s gammaloop-nextest-integration> span compute_4d{span_context=true graph=GL0 current=subgraph=y, topo_order=1, dod=2 given=subgraph=0, topo_order=0, dod=0 reduced=SubSet { set: BitVec<usize, bitvec::order::Lsb0> { addr: 0x7fffe0017290, head: 000000, bits: 6, capacity: 64 } [0, 0, 1, 1, 1, 1], id: PhantomData<linnet::half_edge::involution::Hedge> }}
  46. 165.83 s gammaloop-nextest-integration> [2026-08-26 08:19:37.839] @approx::local_4d [{#uv, #algebra, #integrated, #start}] DEBUG :
  47. 165.83 s gammaloop-nextest-integration> field value
  48. 165.83 s gammaloop-nextest-integration> integrand n-terms: 1, byte size: 409,expr:
  49. 165.83 s gammaloop-nextest-integration> SCALAR_COUPLING²·(q₀(αᵉ³.¹)+q₃(αᵉ³.¹))·q₀(αᵉ².¹)·q₀(αᵉ³.¹)·q₂(αᵉ².¹)
  50. 165.83 s gammaloop-nextest-integration> /(denom(2,q₂,mass_scalar_2²,-mass_scalar_2²+(q₂.q₂))·denom(3,q₃,mass_scalar_2²,-mass_scalar_2²+(q₃.q₃)))
  51. 165.84 s gammaloop-nextest-integration> reduced y
  52. 165.84 s gammaloop-nextest-integration> span grow{span_context=true current=subgraph=y, topo_order=1, dod=2 given=subgraph=0, topo_order=0, dod=0}
  53. 165.84 s gammaloop-nextest-integration> [2026-08-26 08:19:37.839] @approx::local_4d [{#uv, #inspect, #integrated}] DEBUG : Rescaled momenta expanded
  54. 165.84 s gammaloop-nextest-integration> field value
  55. 165.84 s gammaloop-nextest-integration> res n-terms: 1, byte size: 585,expr:
  56. 165.84 s gammaloop-nextest-integration> -SCALAR_COUPLING²·q₀(αᵉ².¹)·q₀(αᵉ³.¹)·q₂(αᵉ².¹)·q₂(αᵉ³.¹)
  57. 165.84 s gammaloop-nextest-integration> /(t²·denom(3,-q₀-q₂/t,mass_scalar_2²,-mass_scalar_2²+2·(q₀.q₂)/t+(q₂.q₂)/t²+(q₀.q₀))
  58. 165.84 s gammaloop-nextest-integration> ·denom(2,q₂/t,mass_scalar_2²,-mass_scalar_2²+(q₂.q₂)/t²))
  59. 165.84 s gammaloop-nextest-integration> span t{span_context=true current=subgraph=y, topo_order=1, dod=2 given=subgraph=0, topo_order=0, dod=0}
  60. 165.84 s gammaloop-nextest-integration> [2026-08-26 08:19:37.839] @approx::local_4d [{#uv, #integrated, #rescaled}] DEBUG : Rescaled expanded
  61. 165.84 s gammaloop-nextest-integration> field value
  62. 165.84 s gammaloop-nextest-integration> n_loops 1
  63. 165.84 s gammaloop-nextest-integration> res n-terms: 1, byte size: 707,expr:
  64. 165.84 s gammaloop-nextest-integration> -SCALAR_COUPLING²·q₀(αᵉ².¹)·q₀(αᵉ³.¹)·q₂(αᵉ².¹)·q₂(αᵉ³.¹)
  65. 165.84 s gammaloop-nextest-integration> /(t²·denom(3,-q₂,mUVexp²+t²·mass_scalar_2²,-mUV²+t²·(-mass_scalar_2²+2·(q₀.q₂)/t+(q₂.q₂)/t²+(q₀.q₀))+t²·mUVexp²)
  66. 165.84 s gammaloop-nextest-integration> ·denom(2,q₂,mUVexp²+t²·mass_scalar_2²,-mUV²+t²·(-mass_scalar_2²+(q₂.q₂)/t²)+t²·mUVexp²))
  67. 165.84 s gammaloop-nextest-integration> span t{span_context=true current=subgraph=y, topo_order=1, dod=2 given=subgraph=0, topo_order=0, dod=0}
  68. 165.84 s gammaloop-nextest-integration> [2026-08-26 08:19:37.841] @approx::local_4d [{#uv, #integrated, #series}] DEBUG : Series expanded
  69. 165.84 s gammaloop-nextest-integration> field value
  70. 165.84 s gammaloop-nextest-integration> res n-terms: 3, byte size: 1896,expr:
  71. 165.84 s gammaloop-nextest-integration> (1/2·SCALAR_COUPLING²·(2·mUVexp²-2·mass_scalar_2²)/(denom(2,q₂,mUVexp²,-mUV²+(q₂.q₂))²·denom(3,-q₂,mUVexp²,-mUV²+(q₂.q₂)))
  72. 165.84 s gammaloop-nextest-integration> -SCALAR_COUPLING²
  73. 165.84 s gammaloop-nextest-integration> ·(-1/2·(2·mUVexp²-2·mass_scalar_2²+2·(q₀.q₀))/denom(3,-q₂,mUVexp²,-mUV²+(q₂.q₂))
  74. 165.84 s gammaloop-nextest-integration> +4·(q₀.q₂)²/denom(3,-q₂,mUVexp²,-mUV²+(q₂.q₂))²
  75. 165.84 s gammaloop-nextest-integration> )/(denom(2,q₂,mUVexp²,-mUV²+(q₂.q₂))·denom(3,-q₂,mUVexp²,-mUV²+(q₂.q₂)))
  76. 165.84 s gammaloop-nextest-integration> )·q₀(αᵉ².¹)·q₀(αᵉ³.¹)·q₂(αᵉ².¹)·q₂(αᵉ³.¹)
  77. 165.84 s gammaloop-nextest-integration> +2·SCALAR_COUPLING²·(q₀.q₂)·q₀(αᵉ².¹)·q₀(αᵉ³.¹)·q₂(αᵉ².¹)·q₂(αᵉ³.¹)
  78. 165.84 s gammaloop-nextest-integration> /(t·denom(2,q₂,mUVexp²,-mUV²+(q₂.q₂))·denom(3,-q₂,mUVexp²,-mUV²+(q₂.q₂))²)
  79. 165.84 s gammaloop-nextest-integration> -SCALAR_COUPLING²·q₀(αᵉ².¹)·q₀(αᵉ³.¹)·q₂(αᵉ².¹)·q₂(αᵉ³.¹)
  80. 165.84 s gammaloop-nextest-integration> /(t²·denom(2,q₂,mUVexp²,-mUV²+(q₂.q₂))·denom(3,-q₂,mUVexp²,-mUV²+(q₂.q₂)))
  81. 165.84 s gammaloop-nextest-integration> span t{span_context=true current=subgraph=y, topo_order=1, dod=2 given=subgraph=0, topo_order=0, dod=0}
  82. 165.84 s gammaloop-nextest-integration> [2026-08-26 08:19:37.841] @approx::local_4d [{#uv, #integrated, #series}] DEBUG : Evaluated at t = 1
  83. 165.84 s gammaloop-nextest-integration> field value
  84. 165.84 s gammaloop-nextest-integration> res n-terms: 3, byte size: 1880,expr:
  85. 165.84 s gammaloop-nextest-integration> (1/2·SCALAR_COUPLING²·(2·mUVexp²-2·mass_scalar_2²)/(denom(2,q₂,mUVexp²,-mUV²+(q₂.q₂))²·denom(3,-q₂,mUVexp²,-mUV²+(q₂.q₂)))
  86. 165.84 s gammaloop-nextest-integration> -SCALAR_COUPLING²
  87. 165.84 s gammaloop-nextest-integration> ·(-1/2·(2·mUVexp²-2·mass_scalar_2²+2·(q₀.q₀))/denom(3,-q₂,mUVexp²,-mUV²+(q₂.q₂))
  88. 165.84 s gammaloop-nextest-integration> +4·(q₀.q₂)²/denom(3,-q₂,mUVexp²,-mUV²+(q₂.q₂))²
  89. 165.84 s gammaloop-nextest-integration> )/(denom(2,q₂,mUVexp²,-mUV²+(q₂.q₂))·denom(3,-q₂,mUVexp²,-mUV²+(q₂.q₂)))
  90. 165.84 s gammaloop-nextest-integration> )·q₀(αᵉ².¹)·q₀(αᵉ³.¹)·q₂(αᵉ².¹)·q₂(αᵉ³.¹)
  91. 165.84 s gammaloop-nextest-integration> -SCALAR_COUPLING²·q₀(αᵉ².¹)·q₀(αᵉ³.¹)·q₂(αᵉ².¹)·q₂(αᵉ³.¹)
  92. 165.84 s gammaloop-nextest-integration> /(denom(2,q₂,mUVexp²,-mUV²+(q₂.q₂))·denom(3,-q₂,mUVexp²,-mUV²+(q₂.q₂)))
  93. 165.84 s gammaloop-nextest-integration> +2·SCALAR_COUPLING²·(q₀.q₂)·q₀(αᵉ².¹)·q₀(αᵉ³.¹)·q₂(αᵉ².¹)·q₂(αᵉ³.¹)
  94. 165.84 s gammaloop-nextest-integration> /(denom(2,q₂,mUVexp²,-mUV²+(q₂.q₂))·denom(3,-q₂,mUVexp²,-mUV²+(q₂.q₂))²)
  95. 165.84 s gammaloop-nextest-integration> span t{span_context=true current=subgraph=y, topo_order=1, dod=2 given=subgraph=0, topo_order=0, dod=0}
  96. 165.84 s gammaloop-nextest-integration> [2026-08-26 08:19:37.846] @approx::local_4d [{#uv, #collect, #integrated}] DEBUG : After gamma chain collection
  97. 165.84 s gammaloop-nextest-integration> field value
  98. 165.84 s gammaloop-nextest-integration> expr n-terms: 3, byte size: 1880,expr:
  99. 165.84 s gammaloop-nextest-integration> (1/2·SCALAR_COUPLING²·(2·mUVexp²-2·mass_scalar_2²)/(denom(2,q₂,mUVexp²,-mUV²+(q₂.q₂))²·denom(3,-q₂,mUVexp²,-mUV²+(q₂.q₂)))
  100. 165.84 s gammaloop-nextest-integration> -SCALAR_COUPLING²
  101. 165.84 s gammaloop-nextest-integration> ·(-1/2·(2·mUVexp²-2·mass_scalar_2²+2·(q₀.q₀))/denom(3,-q₂,mUVexp²,-mUV²+(q₂.q₂))
  102. 165.84 s gammaloop-nextest-integration> +4·(q₀.q₂)²/denom(3,-q₂,mUVexp²,-mUV²+(q₂.q₂))²
  103. 165.84 s gammaloop-nextest-integration> )/(denom(2,q₂,mUVexp²,-mUV²+(q₂.q₂))·denom(3,-q₂,mUVexp²,-mUV²+(q₂.q₂)))
  104. 165.84 s gammaloop-nextest-integration> )·q₀(αᵉ².¹)·q₀(αᵉ³.¹)·q₂(αᵉ².¹)·q₂(αᵉ³.¹)
  105. 165.84 s gammaloop-nextest-integration> -SCALAR_COUPLING²·q₀(αᵉ².¹)·q₀(αᵉ³.¹)·q₂(αᵉ².¹)·q₂(αᵉ³.¹)
  106. 165.84 s gammaloop-nextest-integration> /(denom(2,q₂,mUVexp²,-mUV²+(q₂.q₂))·denom(3,-q₂,mUVexp²,-mUV²+(q₂.q₂)))
  107. 165.84 s gammaloop-nextest-integration> +2·SCALAR_COUPLING²·(q₀.q₂)·q₀(αᵉ².¹)·q₀(αᵉ³.¹)·q₂(αᵉ².¹)·q₂(αᵉ³.¹)
  108. 165.84 s gammaloop-nextest-integration> /(denom(2,q₂,mUVexp²,-mUV²+(q₂.q₂))·denom(3,-q₂,mUVexp²,-mUV²+(q₂.q₂))²)
  109. 165.84 s gammaloop-nextest-integration> span t{span_context=true current=subgraph=y, topo_order=1, dod=2 given=subgraph=0, topo_order=0, dod=0}
  110. 165.84 s gammaloop-nextest-integration> [2026-08-26 08:19:37.852] @approx::local_4d [{#profile, #uv, #collect, #integrated, #start, #trace}] DEBUG : After gamma schoonschip
  111. 165.84 s gammaloop-nextest-integration> field value
  112. 165.84 s gammaloop-nextest-integration> expr n-terms: 3, byte size: 1631,expr:
  113. 165.84 s gammaloop-nextest-integration> (1/2·SCALAR_COUPLING²·(2·mUVexp²-2·mass_scalar_2²)/(denom(2,q₂,mUVexp²,-mUV²+(q₂.q₂))²·denom(3,-q₂,mUVexp²,-mUV²+(q₂.q₂)))
  114. 165.84 s gammaloop-nextest-integration> -SCALAR_COUPLING²
  115. 165.84 s gammaloop-nextest-integration> ·(-1/2·(2·mUVexp²-2·mass_scalar_2²+2·(q₀.q₀))/denom(3,-q₂,mUVexp²,-mUV²+(q₂.q₂))
  116. 165.84 s gammaloop-nextest-integration> +4·(q₀.q₂)²/denom(3,-q₂,mUVexp²,-mUV²+(q₂.q₂))²
  117. 165.84 s gammaloop-nextest-integration> )/(denom(2,q₂,mUVexp²,-mUV²+(q₂.q₂))·denom(3,-q₂,mUVexp²,-mUV²+(q₂.q₂)))
  118. 165.84 s gammaloop-nextest-integration> )·(q₀.q₂)²
  119. 165.84 s gammaloop-nextest-integration> -SCALAR_COUPLING²·(q₀.q₂)²/(denom(2,q₂,mUVexp²,-mUV²+(q₂.q₂))·denom(3,-q₂,mUVexp²,-mUV²+(q₂.q₂)))
  120. 165.84 s gammaloop-nextest-integration> +2·SCALAR_COUPLING²·(q₀.q₂)·(q₀.q₂)²
  121. 165.84 s gammaloop-nextest-integration> /(denom(2,q₂,mUVexp²,-mUV²+(q₂.q₂))·denom(3,-q₂,mUVexp²,-mUV²+(q₂.q₂))²)
  122. 165.84 s gammaloop-nextest-integration> span t{span_context=true current=subgraph=y, topo_order=1, dod=2 given=subgraph=0, topo_order=0, dod=0}
  123. 165.84 s gammaloop-nextest-integration> [2026-08-26 08:19:37.857] @approx::local_4d [{#profile, #uv, #collect, #integrated, #start, #trace}] DEBUG : After gamma collection
  124. 165.84 s gammaloop-nextest-integration> field value
  125. 165.84 s gammaloop-nextest-integration> expr n-terms: 1, byte size: 1347,expr:
  126. 165.84 s gammaloop-nextest-integration> SCALAR_COUPLING²
  127. 165.84 s gammaloop-nextest-integration> ·(-denom(2,q₂,mUVexp²,-mUV²+(q₂.q₂))·denom(3,-q₂,mUVexp²,-mUV²+(q₂.q₂))²
  128. 165.84 s gammaloop-nextest-integration> +1/2·(2·mUVexp²-2·mass_scalar_2²)·denom(3,-q₂,mUVexp²,-mUV²+(q₂.q₂))²
  129. 165.84 s gammaloop-nextest-integration> -(-1/2·(2·mUVexp²-2·mass_scalar_2²+2·(q₀.q₀))·denom(3,-q₂,mUVexp²,-mUV²+(q₂.q₂))+4·(q₀.q₂)²)
  130. 165.84 s gammaloop-nextest-integration> ·denom(2,q₂,mUVexp²,-mUV²+(q₂.q₂))
  131. 165.84 s gammaloop-nextest-integration> +2·(q₀.q₂)·denom(2,q₂,mUVexp²,-mUV²+(q₂.q₂))·denom(3,-q₂,mUVexp²,-mUV²+(q₂.q₂))
  132. 165.84 s gammaloop-nextest-integration> )·(q₀.q₂)²/(denom(2,q₂,mUVexp²,-mUV²+(q₂.q₂))²·denom(3,-q₂,mUVexp²,-mUV²+(q₂.q₂))³)
  133. 165.84 s gammaloop-nextest-integration> span t{span_context=true current=subgraph=y, topo_order=1, dod=2 given=subgraph=0, topo_order=0, dod=0}
  134. 165.84 s gammaloop-nextest-integration> [2026-08-26 08:19:37.858] @approx::local_4d [{#profile, #uv, #gamma, #integrated, #start, #trace, #vakint}] DEBUG : After gamma simplification
  135. 165.84 s gammaloop-nextest-integration> ... omitted 3263 more lines; see full nextest output above
  136. 165.84 s gammaloop-nextest-integration>
  137. 165.84 s gammaloop-nextest-integration> 8. gammaloop-integration-tests::uv::sunrise_scalar_1_uv
  138. 165.87 s gammaloop-nextest-integration> failure: test failure with exit code 101
  139. 165.87 s gammaloop-nextest-integration> system-out
  140. 165.87 s gammaloop-nextest-integration> running 1 test
  141. 165.87 s gammaloop-nextest-integration> test sunrise_scalar_1_uv has been running for over 60 seconds
  142. 165.87 s gammaloop-nextest-integration> +------------------+------------------------+--------------+--------+----------+----------------------------------------------------------------------------------------------------------------------+-------+
  143. 165.87 s gammaloop-nextest-integration> | case | check | graph | status | sigma | threshold | error |
  144. 165.87 s gammaloop-nextest-integration> +------------------+------------------------+--------------+--------+----------+----------------------------------------------------------------------------------------------------------------------+-------+
  145. 165.87 s gammaloop-nextest-integration> | sunrise_scalar_1 | uv_profile | - | FAIL | - | - | - |
  146. 165.87 s gammaloop-nextest-integration> +------------------+------------------------+--------------+--------+----------+----------------------------------------------------------------------------------------------------------------------+-------+
  147. 165.87 s gammaloop-nextest-integration> | sunrise_scalar_1 | m_uv.inspect | inspect | pass | - | best inspect relative delta 1.624e0 >= 1000*accuracy 1.000e-3 (accuracy=1.000e-6, exponent=+1.0, seed=1, probes=10) | - |
  148. 165.87 s gammaloop-nextest-integration> +------------------+------------------------+--------------+--------+----------+----------------------------------------------------------------------------------------------------------------------+-------+
  149. 165.87 s gammaloop-nextest-integration> | sunrise_scalar_1 | m_uv.integrated | sunrise | pass | 0.1sigma | compatible within 2sigma | - |
  150. 165.87 s gammaloop-nextest-integration> +------------------+------------------------+--------------+--------+----------+----------------------------------------------------------------------------------------------------------------------+-------+
  151. 165.87 s gammaloop-nextest-integration> | sunrise_scalar_1 | rls.inspect | inspect | pass | - | best inspect relative delta 8.682e-1 >= 1000*accuracy 1.000e-3 (accuracy=1.000e-6, exponent=+1.0, seed=1, probes=10) | - |
  152. 165.87 s gammaloop-nextest-integration> +------------------+------------------------+--------------+--------+----------+----------------------------------------------------------------------------------------------------------------------+-------+
  153. 165.87 s gammaloop-nextest-integration> | sunrise_scalar_1 | rls.integrated | sunrise | pass | 0.0sigma | compatible within 2sigma | - |
  154. 165.87 s gammaloop-nextest-integration> +------------------+------------------------+--------------+--------+----------+----------------------------------------------------------------------------------------------------------------------+-------+
  155. 165.87 s gammaloop-nextest-integration> | sunrise_scalar_1 | mu_r.inspect | inspect | pass | - | best inspect relative delta 1.752e0 >= 1000*accuracy 1.000e-3 (accuracy=1.000e-6, exponent=+1.0, seed=1, probes=10) | - |
  156. 165.87 s gammaloop-nextest-integration> +------------------+------------------------+--------------+--------+----------+----------------------------------------------------------------------------------------------------------------------+-------+
  157. 165.87 s gammaloop-nextest-integration> | sunrise_scalar_1 | integrated.relerr | integrated | pass | - | relative error 9.20% <= 10.00% | - |
  158. 165.87 s gammaloop-nextest-integration> +------------------+------------------------+--------------+--------+----------+----------------------------------------------------------------------------------------------------------------------+-------+
  159. 165.87 s gammaloop-nextest-integration> | sunrise_scalar_1 | m_uv.integrated.relerr | m_uv-shifted | pass | - | relative error 5.89% <= 10.00% | - |
  160. 165.87 s gammaloop-nextest-integration> +------------------+------------------------+--------------+--------+----------+----------------------------------------------------------------------------------------------------------------------+-------+
  161. 165.87 s gammaloop-nextest-integration> | sunrise_scalar_1 | target | - | pass | - | 2sigma | - |
  162. 165.87 s gammaloop-nextest-integration> +------------------+------------------------+--------------+--------+----------+----------------------------------------------------------------------------------------------------------------------+-------+
  163. 165.87 s gammaloop-nextest-integration> test sunrise_scalar_1_uv ... FAILED
  164. 165.87 s gammaloop-nextest-integration>
  165. 165.87 s gammaloop-nextest-integration> failures:
  166. 165.87 s gammaloop-nextest-integration>
  167. 165.87 s gammaloop-nextest-integration> failures:
  168. 165.87 s gammaloop-nextest-integration> sunrise_scalar_1_uv
  169. 165.87 s gammaloop-nextest-integration>
  170. 165.87 s gammaloop-nextest-integration> test result: FAILED. 0 passed; 1 failed; 0 ignored; 0 measured; 24 filtered out; finished in 105.63s
  171. 165.87 s gammaloop-nextest-integration> system-err
  172. 165.87 s gammaloop-nextest-integration> [2026-08-26 08:19:47.091] @gammaloop_api::se... INFO : Running command run generate
  173. 165.87 s gammaloop-nextest-integration> [2026-08-26 08:19:47.091] @gammaloop_api::se... INFO : Starting command block generate
  174. 165.87 s gammaloop-nextest-integration> [2026-08-26 08:19:47.091] @gammaloop_api::se... INFO : Running command import model scalars-default.json
  175. 165.87 s gammaloop-nextest-integration> [2026-08-26 08:19:47.091] @import::model INFO : Loading built-in JSON model scalars-default
  176. 165.87 s gammaloop-nextest-integration> [2026-08-26 08:19:47.095] @gammalooprs::model INFO : The following 2 external parameters were forced to zero by the restriction card:
  177. 165.87 s gammaloop-nextest-integration> width_scalar_1, width_scalar_2
  178. 165.87 s gammaloop-nextest-integration> [2026-08-26 08:19:47.095] @gammaloop_api::se... INFO : Running command remove processes
  179. 165.87 s gammaloop-nextest-integration> [2026-08-26 08:19:47.095] @gammaloop_api::se... INFO : Running command set global kv global.generation.uv.generate_integrated=true
  180. 165.87 s gammaloop-nextest-integration> [2026-08-26 08:19:47.096] @gammaloop_api::se... INFO : Running command import graphs ./tests/resources/graphs/scalar_sunrise.dot -p sunrise_scalar_1 -i scalar_sunrise
  181. 165.87 s gammaloop-nextest-integration> [2026-08-26 08:19:47.096] @commands::import INFO : Loading graphs from '/build/source/tests/resources/graphs/scalar_sunrise.dot'
  182. 165.87 s gammaloop-nextest-integration> [2026-08-26 08:19:47.098] @gammaloop_api::se... INFO : Running command generate existing -p sunrise_scalar_1 -i scalar_sunrise
  183. 165.87 s gammaloop-nextest-integration> [2026-08-26 08:19:47.101] @approx::local_4d [{#uv, #inspect, #integrated}] DEBUG : Rescaled momenta expanded
  184. 165.87 s gammaloop-nextest-integration> field value
  185. 165.87 s gammaloop-nextest-integration> res n-terms: 1, byte size: 777,expr:
  186. 165.87 s gammaloop-nextest-integration> 1/(denom(0,q₀/t,mass_scalar_1²,-mass_scalar_1²+(q₀.q₀)/t²)·denom(1,q₁/t,mass_scalar_1²,-mass_scalar_1²+(q₁.q₁)/t²)
  187. 165.87 s gammaloop-nextest-integration> ·denom(2,q₄-q₀/t-q₁/t,mass_scalar_1²,
  188. 165.87 s gammaloop-nextest-integration> -mass_scalar_1²-2·(q₀.q₄)/t-2·(q₁.q₄)/t+(q₀.q₀)/t²+2·(q₀.q₁)/t²
  189. 165.87 s gammaloop-nextest-integration> +(q₁.q₁)/t²+(q₄.q₄)
  190. 165.87 s gammaloop-nextest-integration> ))
  191. 165.87 s gammaloop-nextest-integration> [2026-08-26 08:19:47.104] @approx::local_4d [{#uv, #inspect, #integrated}] DEBUG : Rescaled momenta expanded
  192. 165.87 s gammaloop-nextest-integration> field value
  193. 165.87 s gammaloop-nextest-integration> res n-terms: 1, byte size: 611,expr:
  194. 165.87 s gammaloop-nextest-integration> 1/(denom(0,q₀/t,mass_scalar_1²,-mass_scalar_1²+(q₀.q₀)/t²)
  195. 165.87 s gammaloop-nextest-integration> ·denom(1,-q₂+q₃-q₀/t,mass_scalar_1²,
  196. 165.87 s gammaloop-nextest-integration> -mass_scalar_1²+2·(q₀.q₂)/t-2·(q₀.q₃)/t+(q₀.q₀)/t²+(q₂.q₂)
  197. 165.87 s gammaloop-nextest-integration> -2·(q₂.q₃)+(q₃.q₃)
  198. 165.87 s gammaloop-nextest-integration> ))
  199. 165.87 s gammaloop-nextest-integration> [2026-08-26 08:19:47.105] @approx::local_4d [{#uv, #inspect, #integrated}] DEBUG : Rescaled momenta expanded
  200. 165.87 s gammaloop-nextest-integration> field value
  201. 165.87 s gammaloop-nextest-integration> res n-terms: 1, byte size: 3,expr:
  202. 165.87 s gammaloop-nextest-integration> 1
  203. 165.87 s gammaloop-nextest-integration> [2026-08-26 08:19:47.106] @approx::local_4d [{#uv, #inspect, #integrated}] DEBUG : Rescaled momenta expanded
  204. 165.87 s gammaloop-nextest-integration> field value
  205. 165.87 s gammaloop-nextest-integration> res n-terms: 1, byte size: 611,expr:
  206. 165.87 s gammaloop-nextest-integration> 1/(denom(1,q₁/t,mass_scalar_1²,-mass_scalar_1²+(q₁.q₁)/t²)
  207. 165.87 s gammaloop-nextest-integration> ·denom(2,-q₀+q₃-q₁/t,mass_scalar_1²,
  208. 165.87 s gammaloop-nextest-integration> -mass_scalar_1²+2·(q₀.q₁)/t-2·(q₁.q₃)/t+(q₁.q₁)/t²+(q₀.q₀)
  209. 165.87 s gammaloop-nextest-integration> -2·(q₀.q₃)+(q₃.q₃)
  210. 165.87 s gammaloop-nextest-integration> ))
  211. 165.87 s gammaloop-nextest-integration> [2026-08-26 08:19:47.108] @approx::local_4d [{#uv, #inspect, #integrated}] DEBUG : Rescaled momenta expanded
  212. 165.87 s gammaloop-nextest-integration> field value
  213. 165.87 s gammaloop-nextest-integration> res n-terms: 1, byte size: 611,expr:
  214. 165.87 s gammaloop-nextest-integration> 1/(denom(0,q₀/t,mass_scalar_1²,-mass_scalar_1²+(q₀.q₀)/t²)
  215. 165.87 s gammaloop-nextest-integration> ·denom(2,-q₁+q₃-q₀/t,mass_scalar_1²,
  216. 165.87 s gammaloop-nextest-integration> -mass_scalar_1²+2·(q₀.q₁)/t-2·(q₀.q₃)/t+(q₀.q₀)/t²+(q₁.q₁)
  217. 165.87 s gammaloop-nextest-integration> -2·(q₁.q₃)+(q₃.q₃)
  218. 165.87 s gammaloop-nextest-integration> ))
  219. 165.87 s gammaloop-nextest-integration> [2026-08-26 08:19:47.109] @approx::final_integrand[{#generation, #profile, #uv, #graph, #summary}] DEBUG : Computed global numerator
  220. 165.87 s gammaloop-nextest-integration> field value
  221. 165.87 s gammaloop-nextest-integration> global_num n-terms: 1, byte size: 3,expr:
  222. 165.87 s gammaloop-nextest-integration> 1
  223. 165.87 s gammaloop-nextest-integration> span build_3d{span_context=true graph=sunrise current=subgraph=0, topo_order=0, dod=0}
  224. 165.87 s gammaloop-nextest-integration> [2026-08-26 08:19:47.111] @uv::approx [{#generation, #uv, #fourd}] DEBUG : Computing 4D
  225. 165.87 s gammaloop-nextest-integration> field value
  226. 165.87 s gammaloop-nextest-integration> simple subgraph(S_47,S_44)*Approx(subgraph(S_44,0)) of sunrise
  227. 165.87 s gammaloop-nextest-integration> span compute_4d{span_context=true graph=sunrise current=subgraph=44, topo_order=1, dod=2 given=subgraph=0, topo_order=0, dod=0 reduced=SubSet { set: BitVec<usize, bitvec::order::Lsb0> { addr: 0x7fffec014950, head: 000000, bits: 8, capacity: 64 } [0, 0, 1, 1, 1, 1, 1, 1], id: PhantomData<linnet::half_edge::involution::Hedge> }}
  228. 165.87 s gammaloop-nextest-integration> [2026-08-26 08:19:47.112] @approx::local_4d [{#uv, #algebra, #integrated, #start}] DEBUG :
  229. 165.87 s gammaloop-nextest-integration> field value
  230. 165.87 s gammaloop-nextest-integration> integrand n-terms: 1, byte size: 322,expr:
  231. 165.87 s gammaloop-nextest-integration> 1/(denom(0,q₀,mass_scalar_1²,-mass_scalar_1²+(q₀.q₀))·denom(1,q₁,mass_scalar_1²,-mass_scalar_1²+(q₁.q₁))
  232. 165.87 s gammaloop-nextest-integration> ·denom(2,q₂,mass_scalar_1²,-mass_scalar_1²+(q₂.q₂)))
  233. 165.87 s gammaloop-nextest-integration> reduced 44
  234. 165.87 s gammaloop-nextest-integration> span grow{span_context=true current=subgraph=44, topo_order=1, dod=2 given=subgraph=0, topo_order=0, dod=0}
  235. 165.87 s gammaloop-nextest-integration> [2026-08-26 08:19:47.112] @approx::local_4d [{#uv, #inspect, #integrated}] DEBUG : Rescaled momenta expanded
  236. 165.87 s gammaloop-nextest-integration> field value
  237. 165.87 s gammaloop-nextest-integration> res n-terms: 1, byte size: 777,expr:
  238. 165.87 s gammaloop-nextest-integration> 1/(denom(0,q₀/t,mass_scalar_1²,-mass_scalar_1²+(q₀.q₀)/t²)·denom(1,q₁/t,mass_scalar_1²,-mass_scalar_1²+(q₁.q₁)/t²)
  239. 165.87 s gammaloop-nextest-integration> ·denom(2,q₄-q₀/t-q₁/t,mass_scalar_1²,
  240. 165.87 s gammaloop-nextest-integration> -mass_scalar_1²-2·(q₀.q₄)/t-2·(q₁.q₄)/t+(q₀.q₀)/t²+2·(q₀.q₁)/t²
  241. 165.87 s gammaloop-nextest-integration> +(q₁.q₁)/t²+(q₄.q₄)
  242. 165.87 s gammaloop-nextest-integration> ))
  243. 165.87 s gammaloop-nextest-integration> span t{span_context=true current=subgraph=44, topo_order=1, dod=2 given=subgraph=0, topo_order=0, dod=0}
  244. 165.87 s gammaloop-nextest-integration> [2026-08-26 08:19:47.113] @approx::local_4d [{#uv, #integrated, #rescaled}] DEBUG : Rescaled expanded
  245. 165.87 s gammaloop-nextest-integration> field value
  246. 165.87 s gammaloop-nextest-integration> n_loops 2
  247. 165.87 s gammaloop-nextest-integration> res n-terms: 1, byte size: 982,expr:
  248. 165.87 s gammaloop-nextest-integration> 1/(t²
  249. 165.87 s gammaloop-nextest-integration> ·denom(2,-q₀-q₁,mUVexp²+t²·mass_scalar_1²,
  250. 165.87 s gammaloop-nextest-integration> -mUV²
  251. 165.87 s gammaloop-nextest-integration> +t²
  252. 165.87 s gammaloop-nextest-integration> ·(-mass_scalar_1²-2·(q₀.q₄)/t-2·(q₁.q₄)/t+(q₀.q₀)/t²+2·(q₀.q₁)/t²
  253. 165.87 s gammaloop-nextest-integration> +(q₁.q₁)/t²+(q₄.q₄)
  254. 165.87 s gammaloop-nextest-integration> )
  255. 165.87 s gammaloop-nextest-integration> +t²·mUVexp²
  256. 165.87 s gammaloop-nextest-integration> )
  257. 165.87 s gammaloop-nextest-integration> ·denom(0,q₀,mUVexp²+t²·mass_scalar_1²,-mUV²+t²·(-mass_scalar_1²+(q₀.q₀)/t²)+t²·mUVexp²)
  258. 165.87 s gammaloop-nextest-integration> ·denom(1,q₁,mUVexp²+t²·mass_scalar_1²,-mUV²+t²·(-mass_scalar_1²+(q₁.q₁)/t²)+t²·mUVexp²))
  259. 165.87 s gammaloop-nextest-integration> span t{span_context=true current=subgraph=44, topo_order=1, dod=2 given=subgraph=0, topo_order=0, dod=0}
  260. 165.87 s gammaloop-nextest-integration> [2026-08-26 08:19:47.114] @approx::local_4d [{#uv, #integrated, #series}] DEBUG : Series expanded
  261. 165.87 s gammaloop-nextest-integration> field value
  262. 165.87 s gammaloop-nextest-integration> res n-terms: 4, byte size: 3187,expr:
  263. 165.87 s gammaloop-nextest-integration> -1/2·(2·mUVexp²-2·mass_scalar_1²)
  264. 165.87 s gammaloop-nextest-integration> /(denom(0,q₀,mUVexp²,-mUV²+(q₀.q₀))·denom(1,q₁,mUVexp²,-mUV²+(q₁.q₁))²
  265. 165.87 s gammaloop-nextest-integration> ·denom(2,-q₀-q₁,mUVexp²,-mUV²+(q₀.q₀)+2·(q₀.q₁)+(q₁.q₁)))
  266. 165.87 s gammaloop-nextest-integration> +(-1/2·(2·mUVexp²-2·mass_scalar_1²)
  267. 165.87 s gammaloop-nextest-integration> /(denom(0,q₀,mUVexp²,-mUV²+(q₀.q₀))²
  268. 165.87 s gammaloop-nextest-integration> ·denom(2,-q₀-q₁,mUVexp²,-mUV²+(q₀.q₀)+2·(q₀.q₁)+(q₁.q₁)))
  269. 165.87 s gammaloop-nextest-integration> +(-1/2·(2·mUVexp²-2·mass_scalar_1²+2·(q₄.q₄))
  270. 165.87 s gammaloop-nextest-integration> /denom(2,-q₀-q₁,mUVexp²,-mUV²+(q₀.q₀)+2·(q₀.q₁)+(q₁.q₁))
  271. 165.87 s gammaloop-nextest-integration> +(-2·(q₀.q₄)-2·(q₁.q₄))²
  272. 165.87 s gammaloop-nextest-integration> /denom(2,-q₀-q₁,mUVexp²,-mUV²+(q₀.q₀)+2·(q₀.q₁)+(q₁.q₁))²
  273. 165.87 s gammaloop-nextest-integration> )
  274. 165.87 s gammaloop-nextest-integration> /(denom(0,q₀,mUVexp²,-mUV²+(q₀.q₀))
  275. 165.87 s gammaloop-nextest-integration> ·denom(2,-q₀-q₁,mUVexp²,-mUV²+(q₀.q₀)+2·(q₀.q₁)+(q₁.q₁)))
  276. 165.87 s gammaloop-nextest-integration> )/denom(1,q₁,mUVexp²,-mUV²+(q₁.q₁))
  277. 165.87 s gammaloop-nextest-integration> -(-2·(q₀.q₄)-2·(q₁.q₄))
  278. 165.87 s gammaloop-nextest-integration> /(t·denom(0,q₀,mUVexp²,-mUV²+(q₀.q₀))·denom(1,q₁,mUVexp²,-mUV²+(q₁.q₁))
  279. 165.87 s gammaloop-nextest-integration> ·denom(2,-q₀-q₁,mUVexp²,-mUV²+(q₀.q₀)+2·(q₀.q₁)+(q₁.q₁))²)
  280. 165.87 s gammaloop-nextest-integration> +1/(t²·denom(0,q₀,mUVexp²,-mUV²+(q₀.q₀))·denom(1,q₁,mUVexp²,-mUV²+(q₁.q₁))
  281. 165.87 s gammaloop-nextest-integration> ·denom(2,-q₀-q₁,mUVexp²,-mUV²+(q₀.q₀)+2·(q₀.q₁)+(q₁.q₁)))
  282. 165.87 s gammaloop-nextest-integration> span t{span_context=true current=subgraph=44, topo_order=1, dod=2 given=subgraph=0, topo_order=0, dod=0}
  283. 165.87 s gammaloop-nextest-integration> [2026-08-26 08:19:47.115] @approx::local_4d [{#uv, #integrated, #series}] DEBUG : Evaluated at t = 1
  284. 165.87 s gammaloop-nextest-integration> field value
  285. 165.87 s gammaloop-nextest-integration> res n-terms: 4, byte size: 3171,expr:
  286. 165.87 s gammaloop-nextest-integration> -1/2·(2·mUVexp²-2·mass_scalar_1²)
  287. 165.87 s gammaloop-nextest-integration> /(denom(0,q₀,mUVexp²,-mUV²+(q₀.q₀))·denom(1,q₁,mUVexp²,-mUV²+(q₁.q₁))²
  288. 165.87 s gammaloop-nextest-integration> ·denom(2,-q₀-q₁,mUVexp²,-mUV²+(q₀.q₀)+2·(q₀.q₁)+(q₁.q₁)))
  289. 165.87 s gammaloop-nextest-integration> -(-2·(q₀.q₄)-2·(q₁.q₄))
  290. 165.87 s gammaloop-nextest-integration> /(denom(0,q₀,mUVexp²,-mUV²+(q₀.q₀))·denom(1,q₁,mUVexp²,-mUV²+(q₁.q₁))
  291. 165.87 s gammaloop-nextest-integration> ... omitted 20090 more lines; see full nextest output above
  292. 165.87 s gammaloop-nextest-integration>
  293. 165.87 s gammaloop-nextest-integration> 9. gammaloop-integration-tests::uv::se1l_uv
  294. 165.87 s gammaloop-nextest-integration> failure: test failure with exit code 101
  295. 165.87 s gammaloop-nextest-integration> system-out
  296. 165.87 s gammaloop-nextest-integration> running 1 test
  297. 165.87 s gammaloop-nextest-integration> test se1l_uv has been running for over 60 seconds
  298. 165.87 s gammaloop-nextest-integration> +------+-----------------+---------+--------+----------+-----------------------------------------------------------------------------------------------------------------------+-------+
  299. 165.87 s gammaloop-nextest-integration> | case | check | graph | status | sigma | threshold | error |
  300. 165.87 s gammaloop-nextest-integration> +------+-----------------+---------+--------+----------+-----------------------------------------------------------------------------------------------------------------------+-------+
  301. 165.87 s gammaloop-nextest-integration> | se1l | uv_profile | - | FAIL | - | - | - |
  302. 165.87 s gammaloop-nextest-integration> +------+-----------------+---------+--------+----------+-----------------------------------------------------------------------------------------------------------------------+-------+
  303. 165.87 s gammaloop-nextest-integration> | se1l | m_uv.inspect | inspect | pass | - | best inspect relative delta 1.097e-1 >= 1000*accuracy 1.000e-7 (accuracy=1.000e-10, exponent=+2.0, seed=1, probes=10) | - |
  304. 165.87 s gammaloop-nextest-integration> +------+-----------------+---------+--------+----------+-----------------------------------------------------------------------------------------------------------------------+-------+
  305. 165.87 s gammaloop-nextest-integration> | se1l | m_uv.integrated | se1l | pass | 0.1sigma | compatible within 2sigma | - |
  306. 165.87 s gammaloop-nextest-integration> +------+-----------------+---------+--------+----------+-----------------------------------------------------------------------------------------------------------------------+-------+
  307. 165.87 s gammaloop-nextest-integration> | se1l | rls.inspect | inspect | pass | - | best inspect relative delta 4.499e-2 >= 1000*accuracy 1.000e-7 (accuracy=1.000e-10, exponent=+2.0, seed=1, probes=10) | - |
  308. 165.87 s gammaloop-nextest-integration> +------+-----------------+---------+--------+----------+-----------------------------------------------------------------------------------------------------------------------+-------+
  309. 165.87 s gammaloop-nextest-integration> | se1l | rls.integrated | se1l | pass | 0.0sigma | compatible within 2sigma | - |
  310. 165.87 s gammaloop-nextest-integration> +------+-----------------+---------+--------+----------+-----------------------------------------------------------------------------------------------------------------------+-------+
  311. 165.87 s gammaloop-nextest-integration> | se1l | mu_r.inspect | inspect | pass | - | best inspect relative delta 1.424e-1 >= 1000*accuracy 1.000e-7 (accuracy=1.000e-10, exponent=+2.0, seed=1, probes=10) | - |
  312. 165.87 s gammaloop-nextest-integration> +------+-----------------+---------+--------+----------+-----------------------------------------------------------------------------------------------------------------------+-------+
  313. 165.87 s gammaloop-nextest-integration> | se1l | target | - | pass | - | 2sigma | - |
  314. 165.88 s gammaloop-nextest-integration> +------+-----------------+---------+--------+----------+-----------------------------------------------------------------------------------------------------------------------+-------+
  315. 165.88 s gammaloop-nextest-integration> test se1l_uv ... FAILED
  316. 165.88 s gammaloop-nextest-integration>
  317. 165.88 s gammaloop-nextest-integration> failures:
  318. 165.88 s gammaloop-nextest-integration>
  319. 165.88 s gammaloop-nextest-integration> failures:
  320. 165.88 s gammaloop-nextest-integration> se1l_uv
  321. 165.88 s gammaloop-nextest-integration>
  322. 165.88 s gammaloop-nextest-integration> test result: FAILED. 0 passed; 1 failed; 0 ignored; 0 measured; 24 filtered out; finished in 116.49s
  323. 165.88 s gammaloop-nextest-integration> system-err
  324. 165.88 s gammaloop-nextest-integration> [2026-08-26 08:19:46.259] @gammaloop_api::se... INFO : Running command run generate
  325. 165.88 s gammaloop-nextest-integration> [2026-08-26 08:19:46.259] @gammaloop_api::se... INFO : Starting command block generate
  326. 165.88 s gammaloop-nextest-integration> [2026-08-26 08:19:46.259] @gammaloop_api::se... INFO : Running command import model sm-default
  327. 165.88 s gammaloop-nextest-integration> [2026-08-26 08:19:46.259] @import::model INFO : Loading built-in JSON model sm-default
  328. 165.88 s gammaloop-nextest-integration> [2026-08-26 08:19:46.310] @gammalooprs::model INFO : The following 11 external parameters were forced to zero by the restriction card:
  329. 165.88 s gammaloop-nextest-integration> lamWS, AWS, rhoWS, etaWS, ymc, yme, ymm, MC, Me, MM, WTau
  330. 165.88 s gammaloop-nextest-integration> [2026-08-26 08:19:46.310] @gammalooprs::model INFO : The following 34 vertex rules were removed by the restriction card:
  331. 165.88 s gammaloop-nextest-integration> V_82 -> (c~, d, G+) | V_83 -> (t~, d, G+) | V_84 -> (c~, s, G+) | V_85 -> (t~, s, G+) | V_86 -> (u~, b, G+) | V_87 -> (c~, b, G+) | V_90 -> (c~, d, W+) | V_91 -> (t~, d, W+) | V_92 -> (u~, s, W+) | V_94 -> (t~, s, W+) | V_95 -> (u~, b, W+) | V_96 -> (c~, b, W+) | V_101 -> (e+, e-, G0) | V_102 -> (mu+, mu-, G0) | V_104 -> (e+, e-, H) | V_105 -> (mu+, mu-, H) | V_110 -> (ve~, e-, G+) | V_111 -> (vm~, mu-, G+) | V_116 -> (b~, u, G-) | V_117 -> (d~, c, G-) | V_118 -> (s~, c, G-) | V_119 -> (b~, c, G-) | V_120 -> (d~, t, G-) | V_121 -> (s~, t, G-) | V_124 -> (s~, u, W-) | V_125 -> (b~, u, W-) | V_126 -> (d~, c, W-) | V_128 -> (b~, c, W-) | V_129 -> (d~, t, W-) | V_130 -> (s~, t, W-) | V_138 -> (c~, c, G0) | V_140 -> (c~, c, H) | V_145 -> (e+, ve, G-) | V_146 -> (mu+, vm, G-)
  332. 165.88 s gammaloop-nextest-integration> [2026-08-26 08:19:46.312] @gammalooprs::model INFO : The following 36 couplings were removed by the restriction card:
  333. 165.88 s gammaloop-nextest-integration> GC_13, GC_14, GC_16, GC_17, GC_18, GC_19, GC_20, GC_22, GC_23, GC_24, GC_25, GC_26, GC_28, GC_29, GC_42, GC_43, GC_44, GC_46, GC_47, GC_48, GC_84, GC_85, GC_86, GC_87, GC_88, GC_89, GC_90, GC_91, GC_92, GC_93, GC_101, GC_102, GC_103, GC_105, GC_106, GC_107
  334. 165.88 s gammaloop-nextest-integration> [2026-08-26 08:19:46.312] @gammaloop_api::se... INFO : Running command remove processes
  335. 165.88 s gammaloop-nextest-integration> [2026-08-26 08:19:46.313] @gammaloop_api::se... INFO : Running command set global kv global.generation.uv.generate_integrated=true
  336. 165.88 s gammaloop-nextest-integration> [2026-08-26 08:19:46.313] @gammaloop_api::se... INFO : Running command import graphs ./tests/resources/graphs/uv_tests/se1l.dot -p se1l -i se1l
  337. 165.88 s gammaloop-nextest-integration> [2026-08-26 08:19:46.313] @commands::import INFO : Loading graphs from '/build/source/tests/resources/graphs/uv_tests/se1l.dot'
  338. 165.88 s gammaloop-nextest-integration> [2026-08-26 08:19:46.321] @gammaloop_api::se... INFO : Running command generate existing -p se1l -i se1l
  339. 165.88 s gammaloop-nextest-integration> [2026-08-26 08:19:48.257] @commands::generate INFO :
  340. 165.88 s gammaloop-nextest-integration> Integrand generation summary
  341. 165.88 s gammaloop-nextest-integration> peak RAM 88.77 MiB | cores 1
  342. 165.88 s gammaloop-nextest-integration> ╭───────────┬───────┬─────────┬─────────────┬─────────────┬────────────────┬─────────────╮
  343. 165.88 s gammaloop-nextest-integration> │ integrand │ graph │ # evals │ expr build │ spenso │ symbolica eval │ compile │
  344. 165.88 s gammaloop-nextest-integration> ├───────────┼───────┼─────────┼─────────────┼─────────────┼────────────────┼─────────────┤
  345. 165.88 s gammaloop-nextest-integration> │ se1l │ se1l │ 5 │ 1.73s (90%) │ 80ms (4.2%) │ 108ms (5.7%) │ 0ms (0.00%) │
  346. 165.88 s gammaloop-nextest-integration> ├───────────┼───────┼─────────┼─────────────┼─────────────┼────────────────┼─────────────┤
  347. 165.88 s gammaloop-nextest-integration> │ Total │ │ 5 │ 1.73s (90%) │ 80ms (4.2%) │ 108ms (5.7%) │ 0ms (0.00%) │
  348. 165.88 s gammaloop-nextest-integration> ╰───────────┴───────┴─────────┴─────────────┴─────────────┴────────────────┴─────────────╯
  349. 165.88 s gammaloop-nextest-integration> [2026-08-26 08:19:48.258] @gammaloop_api::se... INFO : Running command set process -p se1l -i se1l kv general.m_uv=0.2
  350. 165.88 s gammaloop-nextest-integration> [2026-08-26 08:19:48.261] @gammaloop_api::se... INFO : Running command set process -p se1l -i se1l kv general.mu_r=0.2
  351. 165.88 s gammaloop-nextest-integration> [2026-08-26 08:19:48.262] @gammaloop_api::se... INFO : Running command set process -p se1l -i se1l kv general.renormalization_localization_scale=0.2
  352. 165.88 s gammaloop-nextest-integration> [2026-08-26 08:19:48.270] @gammaloop_api::se... INFO : Running command duplicate integrand -p se1l -i se1l --output_process_name se1l --output_integrand_name se1l_muv_shifted
  353. 165.88 s gammaloop-nextest-integration> [2026-08-26 08:19:48.274] @gammaloop_api::se... INFO : Running command set process -p se1l -i se1l_muv_shifted kv general.m_uv=0.5
  354. 165.88 s gammaloop-nextest-integration> [2026-08-26 08:19:48.282] @gammaloop_api::se... INFO : Running command duplicate integrand -p se1l -i se1l --output_process_name se1l --output_integrand_name se1l_rls_shifted
  355. 165.88 s gammaloop-nextest-integration> [2026-08-26 08:19:48.286] @gammaloop_api::se... INFO : Running command set process -p se1l -i se1l_rls_shifted kv general.renormalization_localization_scale=1
  356. 165.88 s gammaloop-nextest-integration> [2026-08-26 08:19:48.289] @gammaloop_api::se... INFO : Running command duplicate integrand -p se1l -i se1l --output_process_name se1l --output_integrand_name se1l_mur_shifted
  357. 165.88 s gammaloop-nextest-integration> [2026-08-26 08:19:48.301] @gammaloop_api::se... INFO : Running command set process -p se1l -i se1l_mur_shifted kv general.mu_r=0.8
  358. 165.88 s gammaloop-nextest-integration> [2026-08-26 08:19:48.326] @process::amplitude WARNING : External state 0 ('g', PDG 21, helicity +) is off shell: p^2 = +2.5e5, expected m^2 = +0e0 (|Δ| = +2.5e5). Fixed-helicity spinor/vector/tensor external states may be ill-defined at this kinematic point.
  359. 165.88 s gammaloop-nextest-integration> field value
  360. 165.88 s gammaloop-nextest-integration> span warm_up{integrand.name=se1l}
  361. 165.88 s gammaloop-nextest-integration> [2026-08-26 08:19:48.327] @process::amplitude WARNING : External state 1 ('g', PDG 21, helicity -) is off shell: p^2 = +2.5e5, expected m^2 = +0e0 (|Δ| = +2.5e5). Fixed-helicity spinor/vector/tensor external states may be ill-defined at this kinematic point.
  362. 165.88 s gammaloop-nextest-integration> field value
  363. 165.88 s gammaloop-nextest-integration> span warm_up{integrand.name=se1l}
  364. 165.88 s gammaloop-nextest-integration> [2026-08-26 08:19:48.328] @process::amplitude INFO : Input is above threshold: 1 existing threshold E-surfaces across 1/1 graph groups
  365. 165.88 s gammaloop-nextest-integration> field value
  366. 165.88 s gammaloop-nextest-integration> existing_esurfaces 1
  367. 165.88 s gammaloop-nextest-integration> group_count 1
  368. 165.88 s gammaloop-nextest-integration> groups_above_threshold 1
  369. 165.88 s gammaloop-nextest-integration> integrand se1l
  370. 165.88 s gammaloop-nextest-integration> span warm_up{integrand.name=se1l}
  371. 165.88 s gammaloop-nextest-integration> threshold_status above threshold
  372. 165.88 s gammaloop-nextest-integration> [2026-08-26 08:19:48.331] @process::amplitude INFO : overlap structure of group 0: [1: [0(2,3)]]
  373. 165.88 s gammaloop-nextest-integration> field value
  374. 165.88 s gammaloop-nextest-integration> span warm_up{integrand.name=se1l}
  375. 165.88 s gammaloop-nextest-integration> [2026-08-26 08:19:48.876] @commands::profile INFO :
  376. 165.88 s gammaloop-nextest-integration> ╭───────┬──────┬──────────┬───────┬─────┬──────────┬───────────╮
  377. 165.88 s gammaloop-nextest-integration> │ fixed │ → ∞ │ slope │ r2 │ DOD │ bare DOD │ inspect │
  378. 165.88 s gammaloop-nextest-integration> ├───────┼──────┼──────────┼───────┼─────┼──────────┼───────────┤
  379. 165.88 s gammaloop-nextest-integration> │ {} │ {e3} │ 1.639236 │ 0.904 │ 2 │ 2 │ arb retry │
  380. 165.88 s gammaloop-nextest-integration> │ {} │ {e2} │ 1.698834 │ 0.902 │ 2 │ 2 │ arb retry │
  381. 165.88 s gammaloop-nextest-integration> ╰───────┴──────┴──────────┴───────┴─────┴──────────┴───────────╯
  382. 165.88 s gammaloop-nextest-integration> [2026-08-26 08:19:48.876] @commands::profile INFO :
  383. 165.88 s gammaloop-nextest-integration> ╭───────┬──────┬─────────────┬──────────┬───────┬─────┬──────────┬───────────╮
  384. 165.88 s gammaloop-nextest-integration> │ fixed │ → ∞ │ orientation │ slope │ r2 │ DOD │ bare DOD │ inspect │
  385. 165.88 s gammaloop-nextest-integration> ├───────┼──────┼─────────────┼──────────┼───────┼─────┼──────────┼───────────┤
  386. 165.88 s gammaloop-nextest-integration> │ {} │ {e3} │ 00-+ │ 0.343429 │ 0.145 │ 0 │ 2 │ arb retry │
  387. 165.88 s gammaloop-nextest-integration> │ {} │ {e3} │ 00+- │ 0.342577 │ 0.135 │ 0 │ 2 │ arb retry │
  388. 165.88 s gammaloop-nextest-integration> │ {} │ {e2} │ 00-+ │ 0.385975 │ 0.161 │ 0 │ 2 │ arb retry │
  389. 165.88 s gammaloop-nextest-integration> │ {} │ {e2} │ 00+- │ 0.384920 │ 0.192 │ 0 │ 2 │ arb retry │
  390. 165.88 s gammaloop-nextest-integration> ╰───────┴──────┴─────────────┴──────────┴───────┴─────┴──────────┴───────────╯
  391. 165.88 s gammaloop-nextest-integration> [2026-08-26 08:19:48.877] @gammaloop_api::se... INFO : Running command set process kv integrator.target_relative_accuracy=0.001 integrator.n_increase=0 integrator.n_start=50000 integrator.n_max=400000 integrator.seed=1337
  392. 165.88 s gammaloop-nextest-integration> [2026-08-26 08:19:48.880] @commands::integrate INFO : Created workspace directory at /build/source/tests/artifacts/se1l/integration_workspace_se1l
  393. 165.88 s gammaloop-nextest-integration> [2026-08-26 08:19:48.936] @commands::integrate INFO : No integration state found, starting new integration
  394. 165.88 s gammaloop-nextest-integration> [2026-08-26 08:19:48.936] @commands::integrate INFO : Gammaloop now integrates se1l@se1l, se1l@se1l_muv_shifted, se1l@se1l_rls_shifted
  395. 165.88 s gammaloop-nextest-integration> [2026-08-26 08:19:48.936] @process::amplitude WARNING : External state 0 ('g', PDG 21, helicity +) is off shell: p^2 = +2.5e5, expected m^2 = +0e0 (|Δ| = +2.5e5). Fixed-helicity spinor/vector/tensor external states may be ill-defined at this kinematic point.
  396. 165.88 s gammaloop-nextest-integration> field value
  397. 165.88 s gammaloop-nextest-integration> span warm_up{integrand.name=se1l}
  398. 165.88 s gammaloop-nextest-integration> [2026-08-26 08:19:48.936] @process::amplitude WARNING : External state 1 ('g', PDG 21, helicity -) is off shell: p^2 = +2.5e5, expected m^2 = +0e0 (|Δ| = +2.5e5). Fixed-helicity spinor/vector/tensor external states may be ill-defined at this kinematic point.
  399. 165.88 s gammaloop-nextest-integration> field value
  400. 165.88 s gammaloop-nextest-integration> span warm_up{integrand.name=se1l}
  401. 165.88 s gammaloop-nextest-integration> [2026-08-26 08:19:48.936] @process::amplitude INFO : Input is above threshold: 1 existing threshold E-surfaces across 1/1 graph groups
  402. 165.88 s gammaloop-nextest-integration> field value
  403. 165.88 s gammaloop-nextest-integration> existing_esurfaces 1
  404. 165.88 s gammaloop-nextest-integration> group_count 1
  405. 165.88 s gammaloop-nextest-integration> groups_above_threshold 1
  406. 165.88 s gammaloop-nextest-integration> integrand se1l
  407. 165.88 s gammaloop-nextest-integration> span warm_up{integrand.name=se1l}
  408. 165.88 s gammaloop-nextest-integration> threshold_status above threshold
  409. 165.88 s gammaloop-nextest-integration> [2026-08-26 08:19:48.936] @process::amplitude INFO : overlap structure of group 0: [1: [0(2,3)]]
  410. 165.88 s gammaloop-nextest-integration> field value
  411. 165.88 s gammaloop-nextest-integration> span warm_up{integrand.name=se1l}
  412. 165.88 s gammaloop-nextest-integration> [2026-08-26 08:19:48.944] @process::amplitude WARNING : External state 0 ('g', PDG 21, helicity +) is off shell: p^2 = +2.5e5, expected m^2 = +0e0 (|Δ| = +2.5e5). Fixed-helicity spinor/vector/tensor external states may be ill-defined at this kinematic point.
  413. 165.88 s gammaloop-nextest-integration> field value
  414. 165.88 s gammaloop-nextest-integration> span warm_up{integrand.name=se1l_muv_shifted}
  415. 165.88 s gammaloop-nextest-integration> [2026-08-26 08:19:48.944] @process::amplitude WARNING : External state 1 ('g', PDG 21, helicity -) is off shell: p^2 = +2.5e5, expected m^2 = +0e0 (|Δ| = +2.5e5). Fixed-helicity spinor/vector/tensor external states may be ill-defined at this kinematic point.
  416. 165.88 s gammaloop-nextest-integration> field value
  417. 165.88 s gammaloop-nextest-integration> span warm_up{integrand.name=se1l_muv_shifted}
  418. 165.88 s gammaloop-nextest-integration> [2026-08-26 08:19:48.944] @process::amplitude INFO : Input is above threshold: 1 existing threshold E-surfaces across 1/1 graph groups
  419. 165.88 s gammaloop-nextest-integration> field value
  420. 165.88 s gammaloop-nextest-integration> existing_esurfaces 1
  421. 165.88 s gammaloop-nextest-integration> group_count 1
  422. 165.88 s gammaloop-nextest-integration> groups_above_threshold 1
  423. 165.88 s gammaloop-nextest-integration> integrand se1l_muv_shifted
  424. 165.88 s gammaloop-nextest-integration> span warm_up{integrand.name=se1l_muv_shifted}
  425. 165.88 s gammaloop-nextest-integration> threshold_status above threshold
  426. 165.88 s gammaloop-nextest-integration> [2026-08-26 08:19:48.944] @process::amplitude INFO : overlap structure of group 0: [1: [0(2,3)]]
  427. 165.88 s gammaloop-nextest-integration> field value
  428. 165.88 s gammaloop-nextest-integration> span warm_up{integrand.name=se1l_muv_shifted}
  429. 165.88 s gammaloop-nextest-integration> [2026-08-26 08:19:48.946] @process::amplitude WARNING : External state 0 ('g', PDG 21, helicity +) is off shell: p^2 = +2.5e5, expected m^2 = +0e0 (|Δ| = +2.5e5). Fixed-helicity spinor/vector/tensor external states may be ill-defined at this kinematic point.
  430. 165.88 s gammaloop-nextest-integration> field value
  431. 165.88 s gammaloop-nextest-integration> span warm_up{integrand.name=se1l_rls_shifted}
  432. 165.88 s gammaloop-nextest-integration> [2026-08-26 08:19:48.946] @process::amplitude WARNING : External state 1 ('g', PDG 21, helicity -) is off shell: p^2 = +2.5e5, expected m^2 = +0e0 (|Δ| = +2.5e5). Fixed-helicity spinor/vector/tensor external states may be ill-defined at this kinematic point.
  433. 165.88 s gammaloop-nextest-integration> field value
  434. 165.88 s gammaloop-nextest-integration> span warm_up{integrand.name=se1l_rls_shifted}
  435. 165.88 s gammaloop-nextest-integration> [2026-08-26 08:19:48.946] @process::amplitude INFO : Input is above threshold: 1 existing threshold E-surfaces across 1/1 graph groups
  436. 165.88 s gammaloop-nextest-integration> field value
  437. 165.88 s gammaloop-nextest-integration> existing_esurfaces 1
  438. 165.88 s gammaloop-nextest-integration> group_count 1
  439. 165.88 s gammaloop-nextest-integration> groups_above_threshold 1
  440. 165.88 s gammaloop-nextest-integration> integrand se1l_rls_shifted
  441. 165.88 s gammaloop-nextest-integration> span warm_up{integrand.name=se1l_rls_shifted}
  442. 165.88 s gammaloop-nextest-integration> threshold_status above threshold
  443. 165.88 s gammaloop-nextest-integration> ... omitted 1410 more lines; see full nextest output above
  444. 165.88 s gammaloop-nextest-integration> =========================================
  445. 166.12 s error: Cannot build '/nix/store/z64pzsmdh7l76572yr3sfrwn8clcnq7n-gammaloop-nextest-integration.drv'.
  446. 166.12 s Reason: builder failed with exit code 100.
  447. 166.12 s Output paths:
  448. 166.12 s /nix/store/ig9divdxs867pdkmxwq7j78q7xgh2c40-gammaloop-nextest-integration
  449. 166.12 s Last 2048 log lines:
  450. 166.12 s > span warm_up{integrand.name=se1l_muv_shifted}
  451. 166.12 s > threshold_status above threshold
  452. 166.12 s > [2026-08-26 08:21:42.331] @process::amplitude INFO : overlap structure of group 0: [1: [0(2,3)]]
  453. 166.12 s > field value
  454. 166.12 s > span warm_up{integrand.name=se1l_muv_shifted}
  455. 166.12 s > [2026-08-26 08:21:42.336] @process::amplitude WARNING : External state 0 ('g', PDG 21, helicity +) is off shell: p^2 = +2.5e5, expected m^2 = +0e0 (|Δ| = +2.5e5). Fixed-helicity spinor/vector/tensor external states may be ill-defined at this kinematic point.
  456. 166.12 s > field value
  457. 166.12 s > span warm_up{integrand.name=se1l}
  458. 166.12 s > [2026-08-26 08:21:42.336] @process::amplitude WARNING : External state 1 ('g', PDG 21, helicity -) is off shell: p^2 = +2.5e5, expected m^2 = +0e0 (|Δ| = +2.5e5). Fixed-helicity spinor/vector/tensor external states may be ill-defined at this kinematic point.
  459. 166.12 s > field value
  460. 166.12 s > span warm_up{integrand.name=se1l}
  461. 166.12 s > [2026-08-26 08:21:42.336] @process::amplitude INFO : Input is above threshold: 1 existing threshold E-surfaces across 1/1 graph groups
  462. 166.12 s > field value
  463. 166.12 s > existing_esurfaces 1
  464. 166.12 s > group_count 1
  465. 166.12 s > groups_above_threshold 1
  466. 166.12 s > integrand se1l
  467. 166.12 s > span warm_up{integrand.name=se1l}
  468. 166.12 s > threshold_status above threshold
  469. 166.12 s > [2026-08-26 08:21:42.336] @process::amplitude INFO : overlap structure of group 0: [1: [0(2,3)]]
  470. 166.12 s > field value
  471. 166.12 s > span warm_up{integrand.name=se1l}
  472. 166.12 s > [2026-08-26 08:21:42.341] @process::amplitude WARNING : External state 0 ('g', PDG 21, helicity +) is off shell: p^2 = +2.5e5, expected m^2 = +0e0 (|Δ| = +2.5e5). Fixed-helicity spinor/vector/tensor external states may be ill-defined at this kinematic point.
  473. 166.12 s > field value
  474. 166.12 s > span warm_up{integrand.name=se1l_muv_shifted}
  475. 166.12 s > [2026-08-26 08:21:42.341] @process::amplitude WARNING : External state 1 ('g', PDG 21, helicity -) is off shell: p^2 = +2.5e5, expected m^2 = +0e0 (|Δ| = +2.5e5). Fixed-helicity spinor/vector/tensor external states may be ill-defined at this kinematic point.
  476. 166.12 s > field value
  477. 166.12 s > span warm_up{integrand.name=se1l_muv_shifted}
  478. 166.12 s > [2026-08-26 08:21:42.341] @process::amplitude INFO : Input is above threshold: 1 existing threshold E-surfaces across 1/1 graph groups
  479. 166.12 s > field value
  480. 166.12 s > existing_esurfaces 1
  481. 166.12 s > group_count 1
  482. 166.12 s > groups_above_threshold 1
  483. 166.12 s > integrand se1l_muv_shifted
  484. 166.12 s > span warm_up{integrand.name=se1l_muv_shifted}
  485. 166.12 s > threshold_status above threshold
  486. 166.12 s > [2026-08-26 08:21:42.341] @process::amplitude INFO : overlap structure of group 0: [1: [0(2,3)]]
  487. 166.12 s > field value
  488. 166.12 s > span warm_up{integrand.name=se1l_muv_shifted}
  489. 166.12 s > [2026-08-26 08:21:42.345] @process::amplitude WARNING : External state 0 ('g', PDG 21, helicity +) is off shell: p^2 = +2.5e5, expected m^2 = +0e0 (|Δ| = +2.5e5). Fixed-helicity spinor/vector/tensor external states may be ill-defined at this kinematic point.
  490. 166.12 s > field value
  491. 166.12 s > span warm_up{integrand.name=se1l}
  492. 166.12 s > [2026-08-26 08:21:42.345] @process::amplitude WARNING : External state 1 ('g', PDG 21, helicity -) is off shell: p^2 = +2.5e5, expected m^2 = +0e0 (|Δ| = +2.5e5). Fixed-helicity spinor/vector/tensor external states may be ill-defined at this kinematic point.
  493. 166.12 s > field value
  494. 166.12 s > span warm_up{integrand.name=se1l}
  495. 166.12 s > [2026-08-26 08:21:42.346] @process::amplitude INFO : Input is above threshold: 1 existing threshold E-surfaces across 1/1 graph groups
  496. 166.12 s > field value
  497. 166.12 s > existing_esurfaces 1
  498. 166.12 s > group_count 1
  499. 166.12 s > groups_above_threshold 1
  500. 166.12 s > integrand se1l
  501. 166.12 s > span warm_up{integrand.name=se1l}
  502. 166.12 s > threshold_status above threshold
  503. 166.12 s > [2026-08-26 08:21:42.346] @process::amplitude INFO : overlap structure of group 0: [1: [0(2,3)]]
  504. 166.12 s > field value
  505. 166.12 s > span warm_up{integrand.name=se1l}
  506. 166.12 s > [2026-08-26 08:21:42.350] @process::amplitude WARNING : External state 0 ('g', PDG 21, helicity +) is off shell: p^2 = +2.5e5, expected m^2 = +0e0 (|Δ| = +2.5e5). Fixed-helicity spinor/vector/tensor external states may be ill-defined at this kinematic point.
  507. 166.12 s > field value
  508. 166.12 s > span warm_up{integrand.name=se1l_muv_shifted}
  509. 166.12 s > [2026-08-26 08:21:42.350] @process::amplitude WARNING : External state 1 ('g', PDG 21, helicity -) is off shell: p^2 = +2.5e5, expected m^2 = +0e0 (|Δ| = +2.5e5). Fixed-helicity spinor/vector/tensor external states may be ill-defined at this kinematic point.
  510. 166.12 s > field value
  511. 166.12 s > span warm_up{integrand.name=se1l_muv_shifted}
  512. 166.12 s > [2026-08-26 08:21:42.350] @process::amplitude INFO : Input is above threshold: 1 existing threshold E-surfaces across 1/1 graph groups
  513. 166.12 s > field value
  514. 166.12 s > existing_esurfaces 1
  515. 166.12 s > group_count 1
  516. 166.12 s > groups_above_threshold 1
  517. 166.12 s > integrand se1l_muv_shifted
  518. 166.12 s > span warm_up{integrand.name=se1l_muv_shifted}
  519. 166.12 s > threshold_status above threshold
  520. 166.12 s > [2026-08-26 08:21:42.350] @process::amplitude INFO : overlap structure of group 0: [1: [0(2,3)]]
  521. 166.12 s > field value
  522. 166.12 s > span warm_up{integrand.name=se1l_muv_shifted}
  523. 166.12 s > [2026-08-26 08:21:42.355] @process::amplitude WARNING : External state 0 ('g', PDG 21, helicity +) is off shell: p^2 = +2.5e5, expected m^2 = +0e0 (|Δ| = +2.5e5). Fixed-helicity spinor/vector/tensor external states may be ill-defined at this kinematic point.
  524. 166.12 s > field value
  525. 166.12 s > span warm_up{integrand.name=se1l}
  526. 166.12 s > [2026-08-26 08:21:42.355] @process::amplitude WARNING : External state 1 ('g', PDG 21, helicity -) is off shell: p^2 = +2.5e5, expected m^2 = +0e0 (|Δ| = +2.5e5). Fixed-helicity spinor/vector/tensor external states may be ill-defined at this kinematic point.
  527. 166.12 s > field value
  528. 166.12 s > span warm_up{integrand.name=se1l}
  529. 166.12 s > [2026-08-26 08:21:42.355] @process::amplitude INFO : Input is above threshold: 1 existing threshold E-surfaces across 1/1 graph groups
  530. 166.12 s > field value
  531. 166.12 s > existing_esurfaces 1
  532. 166.12 s > group_count 1
  533. 166.12 s > groups_above_threshold 1
  534. 166.12 s > integrand se1l
  535. 166.12 s > span warm_up{integrand.name=se1l}
  536. 166.12 s > threshold_status above threshold
  537. 166.12 s > [2026-08-26 08:21:42.355] @process::amplitude INFO : overlap structure of group 0: [1: [0(2,3)]]
  538. 166.12 s > field value
  539. 166.12 s > span warm_up{integrand.name=se1l}
  540. 166.12 s > [2026-08-26 08:21:42.360] @process::amplitude WARNING : External state 0 ('g', PDG 21, helicity +) is off shell: p^2 = +2.5e5, expected m^2 = +0e0 (|Δ| = +2.5e5). Fixed-helicity spinor/vector/tensor external states may be ill-defined at this kinematic point.
  541. 166.12 s > field value
  542. 166.12 s > span warm_up{integrand.name=se1l_muv_shifted}
  543. 166.12 s > [2026-08-26 08:21:42.360] @process::amplitude WARNING : External state 1 ('g', PDG 21, helicity -) is off shell: p^2 = +2.5e5, expected m^2 = +0e0 (|Δ| = +2.5e5). Fixed-helicity spinor/vector/tensor external states may be ill-defined at this kinematic point.
  544. 166.12 s > field value
  545. 166.12 s > span warm_up{integrand.name=se1l_muv_shifted}
  546. 166.12 s > [2026-08-26 08:21:42.360] @process::amplitude INFO : Input is above threshold: 1 existing threshold E-surfaces across 1/1 graph groups
  547. 166.12 s > field value
  548. 166.12 s > existing_esurfaces 1
  549. 166.12 s > group_count 1
  550. 166.12 s > groups_above_threshold 1
  551. 166.12 s > integrand se1l_muv_shifted
  552. 166.12 s > span warm_up{integrand.name=se1l_muv_shifted}
  553. 166.12 s > threshold_status above threshold
  554. 166.12 s > [2026-08-26 08:21:42.360] @process::amplitude INFO : overlap structure of group 0: [1: [0(2,3)]]
  555. 166.12 s > field value
  556. 166.12 s > span warm_up{integrand.name=se1l_muv_shifted}
  557. 166.12 s > [2026-08-26 08:21:42.365] @process::amplitude WARNING : External state 0 ('g', PDG 21, helicity +) is off shell: p^2 = +2.5e5, expected m^2 = +0e0 (|Δ| = +2.5e5). Fixed-helicity spinor/vector/tensor external states may be ill-defined at this kinematic point.
  558. 166.12 s > field value
  559. 166.12 s > span warm_up{integrand.name=se1l}
  560. 166.12 s > [2026-08-26 08:21:42.365] @process::amplitude WARNING : External state 1 ('g', PDG 21, helicity -) is off shell: p^2 = +2.5e5, expected m^2 = +0e0 (|Δ| = +2.5e5). Fixed-helicity spinor/vector/tensor external states may be ill-defined at this kinematic point.
  561. 166.12 s > field value
  562. 166.12 s > span warm_up{integrand.name=se1l}
  563. 166.12 s > [2026-08-26 08:21:42.365] @process::amplitude INFO : Input is above threshold: 1 existing threshold E-surfaces across 1/1 graph groups
  564. 166.12 s > field value
  565. 166.12 s > existing_esurfaces 1
  566. 166.12 s > group_count 1
  567. 166.12 s > groups_above_threshold 1
  568. 166.12 s > integrand se1l
  569. 166.12 s > span warm_up{integrand.name=se1l}
  570. 166.12 s > threshold_status above threshold
  571. 166.12 s > [2026-08-26 08:21:42.365] @process::amplitude INFO : overlap structure of group 0: [1: [0(2,3)]]
  572. 166.12 s > field value
  573. 166.12 s > span warm_up{integrand.name=se1l}
  574. 166.12 s > [2026-08-26 08:21:42.370] @process::amplitude WARNING : External state 0 ('g', PDG 21, helicity +) is off shell: p^2 = +2.5e5, expected m^2 = +0e0 (|Δ| = +2.5e5). Fixed-helicity spinor/vector/tensor external states may be ill-defined at this kinematic point.
  575. 166.12 s > field value
  576. 166.12 s > span warm_up{integrand.name=se1l_rls_shifted}
  577. 166.12 s > [2026-08-26 08:21:42.370] @process::amplitude WARNING : External state 1 ('g', PDG 21, helicity -) is off shell: p^2 = +2.5e5, expected m^2 = +0e0 (|Δ| = +2.5e5). Fixed-helicity spinor/vector/tensor external states may be ill-defined at this kinematic point.
  578. 166.12 s > field value
  579. 166.12 s > span warm_up{integrand.name=se1l_rls_shifted}
  580. 166.12 s > [2026-08-26 08:21:42.370] @process::amplitude INFO : Input is above threshold: 1 existing threshold E-surfaces across 1/1 graph groups
  581. 166.12 s > field value
  582. 166.12 s > existing_esurfaces 1
  583. 166.12 s > group_count 1
  584. 166.12 s > groups_above_threshold 1
  585. 166.12 s > integrand se1l_rls_shifted
  586. 166.12 s > span warm_up{integrand.name=se1l_rls_shifted}
  587. 166.12 s > threshold_status above threshold
  588. 166.12 s > [2026-08-26 08:21:42.370] @process::amplitude INFO : overlap structure of group 0: [1: [0(2,3)]]
  589. 166.12 s > field value
  590. 166.12 s > span warm_up{integrand.name=se1l_rls_shifted}
  591. 166.12 s > [2026-08-26 08:21:42.375] @process::amplitude WARNING : External state 0 ('g', PDG 21, helicity +) is off shell: p^2 = +2.5e5, expected m^2 = +0e0 (|Δ| = +2.5e5). Fixed-helicity spinor/vector/tensor external states may be ill-defined at this kinematic point.
  592. 166.12 s > field value
  593. 166.12 s > span warm_up{integrand.name=se1l}
  594. 166.12 s > [2026-08-26 08:21:42.375] @process::amplitude WARNING : External state 1 ('g', PDG 21, helicity -) is off shell: p^2 = +2.5e5, expected m^2 = +0e0 (|Δ| = +2.5e5). Fixed-helicity spinor/vector/tensor external states may be ill-defined at this kinematic point.
  595. 166.12 s > field value
  596. 166.12 s > span warm_up{integrand.name=se1l}
  597. 166.12 s > [2026-08-26 08:21:42.375] @process::amplitude INFO : Input is above threshold: 1 existing threshold E-surfaces across 1/1 graph groups
  598. 166.12 s > field value
  599. 166.12 s > existing_esurfaces 1
  600. 166.12 s > group_count 1
  601. 166.12 s > groups_above_threshold 1
  602. 166.12 s > integrand se1l
  603. 166.12 s > span warm_up{integrand.name=se1l}
  604. 166.12 s > threshold_status above threshold
  605. 166.12 s > [2026-08-26 08:21:42.375] @process::amplitude INFO : overlap structure of group 0: [1: [0(2,3)]]
  606. 166.12 s > field value
  607. 166.12 s > span warm_up{integrand.name=se1l}
  608. 166.12 s > [2026-08-26 08:21:42.379] @process::amplitude WARNING : External state 0 ('g', PDG 21, helicity +) is off shell: p^2 = +2.5e5, expected m^2 = +0e0 (|Δ| = +2.5e5). Fixed-helicity spinor/vector/tensor external states may be ill-defined at this kinematic point.
  609. 166.12 s > field value
  610. 166.12 s > span warm_up{integrand.name=se1l_rls_shifted}
  611. 166.12 s > [2026-08-26 08:21:42.380] @process::amplitude WARNING : External state 1 ('g', PDG 21, helicity -) is off shell: p^2 = +2.5e5, expected m^2 = +0e0 (|Δ| = +2.5e5). Fixed-helicity spinor/vector/tensor external states may be ill-defined at this kinematic point.
  612. 166.12 s > field value
  613. 166.12 s > span warm_up{integrand.name=se1l_rls_shifted}
  614. 166.12 s > [2026-08-26 08:21:42.380] @process::amplitude INFO : Input is above threshold: 1 existing threshold E-surfaces across 1/1 graph groups
  615. 166.12 s > field value
  616. 166.12 s > existing_esurfaces 1
  617. 166.12 s > group_count 1
  618. 166.12 s > groups_above_threshold 1
  619. 166.12 s > integrand se1l_rls_shifted
  620. 166.12 s > span warm_up{integrand.name=se1l_rls_shifted}
  621. 166.12 s > threshold_status above threshold
  622. 166.12 s > [2026-08-26 08:21:42.380] @process::amplitude INFO : overlap structure of group 0: [1: [0(2,3)]]
  623. 166.12 s > field value
  624. 166.12 s > span warm_up{integrand.name=se1l_rls_shifted}
  625. 166.12 s > [2026-08-26 08:21:42.384] @process::amplitude WARNING : External state 0 ('g', PDG 21, helicity +) is off shell: p^2 = +2.5e5, expected m^2 = +0e0 (|Δ| = +2.5e5). Fixed-helicity spinor/vector/tensor external states may be ill-defined at this kinematic point.
  626. 166.12 s > field value
  627. 166.12 s > span warm_up{integrand.name=se1l}
  628. 166.12 s > [2026-08-26 08:21:42.384] @process::amplitude WARNING : External state 1 ('g', PDG 21, helicity -) is off shell: p^2 = +2.5e5, expected m^2 = +0e0 (|Δ| = +2.5e5). Fixed-helicity spinor/vector/tensor external states may be ill-defined at this kinematic point.
  629. 166.12 s > field value
  630. 166.12 s > span warm_up{integrand.name=se1l}
  631. 166.12 s > [2026-08-26 08:21:42.384] @process::amplitude INFO : Input is above threshold: 1 existing threshold E-surfaces across 1/1 graph groups
  632. 166.12 s > field value
  633. 166.12 s > existing_esurfaces 1
  634. 166.12 s > group_count 1
  635. 166.12 s > groups_above_threshold 1
  636. 166.12 s > integrand se1l
  637. 166.12 s > span warm_up{integrand.name=se1l}
  638. 166.12 s > threshold_status above threshold
  639. 166.12 s > [2026-08-26 08:21:42.384] @process::amplitude INFO : overlap structure of group 0: [1: [0(2,3)]]
  640. 166.12 s > field value
  641. 166.12 s > span warm_up{integrand.name=se1l}
  642. 166.12 s > [2026-08-26 08:21:42.389] @process::amplitude WARNING : External state 0 ('g', PDG 21, helicity +) is off shell: p^2 = +2.5e5, expected m^2 = +0e0 (|Δ| = +2.5e5). Fixed-helicity spinor/vector/tensor external states may be ill-defined at this kinematic point.
  643. 166.12 s > field value
  644. 166.12 s > span warm_up{integrand.name=se1l_rls_shifted}
  645. 166.12 s > [2026-08-26 08:21:42.389] @process::amplitude WARNING : External state 1 ('g', PDG 21, helicity -) is off shell: p^2 = +2.5e5, expected m^2 = +0e0 (|Δ| = +2.5e5). Fixed-helicity spinor/vector/tensor external states may be ill-defined at this kinematic point.
  646. 166.12 s > field value
  647. 166.12 s > span warm_up{integrand.name=se1l_rls_shifted}
  648. 166.12 s > [2026-08-26 08:21:42.389] @process::amplitude INFO : Input is above threshold: 1 existing threshold E-surfaces across 1/1 graph groups
  649. 166.12 s > field value
  650. 166.12 s > existing_esurfaces 1
  651. 166.12 s > group_count 1
  652. 166.12 s > groups_above_threshold 1
  653. 166.12 s > integrand se1l_rls_shifted
  654. 166.12 s > span warm_up{integrand.name=se1l_rls_shifted}
  655. 166.12 s > threshold_status above threshold
  656. 166.12 s > [2026-08-26 08:21:42.389] @process::amplitude INFO : overlap structure of group 0: [1: [0(2,3)]]
  657. 166.12 s > field value
  658. 166.12 s > span warm_up{integrand.name=se1l_rls_shifted}
  659. 166.12 s > [2026-08-26 08:21:42.393] @process::amplitude WARNING : External state 0 ('g', PDG 21, helicity +) is off shell: p^2 = +2.5e5, expected m^2 = +0e0 (|Δ| = +2.5e5). Fixed-helicity spinor/vector/tensor external states may be ill-defined at this kinematic point.
  660. 166.12 s > field value
  661. 166.12 s > span warm_up{integrand.name=se1l}
  662. 166.12 s > [2026-08-26 08:21:42.393] @process::amplitude WARNING : External state 1 ('g', PDG 21, helicity -) is off shell: p^2 = +2.5e5, expected m^2 = +0e0 (|Δ| = +2.5e5). Fixed-helicity spinor/vector/tensor external states may be ill-defined at this kinematic point.
  663. 166.12 s > field value
  664. 166.12 s > span warm_up{integrand.name=se1l}
  665. 166.12 s > [2026-08-26 08:21:42.394] @process::amplitude INFO : Input is above threshold: 1 existing threshold E-surfaces across 1/1 graph groups
  666. 166.12 s > field value
  667. 166.12 s > existing_esurfaces 1
  668. 166.12 s > group_count 1
  669. 166.12 s > groups_above_threshold 1
  670. 166.12 s > integrand se1l
  671. 166.12 s > span warm_up{integrand.name=se1l}
  672. 166.12 s > threshold_status above threshold
  673. 166.12 s > [2026-08-26 08:21:42.394] @process::amplitude INFO : overlap structure of group 0: [1: [0(2,3)]]
  674. 166.12 s > field value
  675. 166.12 s > span warm_up{integrand.name=se1l}
  676. 166.12 s > [2026-08-26 08:21:42.398] @process::amplitude WARNING : External state 0 ('g', PDG 21, helicity +) is off shell: p^2 = +2.5e5, expected m^2 = +0e0 (|Δ| = +2.5e5). Fixed-helicity spinor/vector/tensor external states may be ill-defined at this kinematic point.
  677. 166.12 s > field value
  678. 166.12 s > span warm_up{integrand.name=se1l_rls_shifted}
  679. 166.12 s > [2026-08-26 08:21:42.398] @process::amplitude WARNING : External state 1 ('g', PDG 21, helicity -) is off shell: p^2 = +2.5e5, expected m^2 = +0e0 (|Δ| = +2.5e5). Fixed-helicity spinor/vector/tensor external states may be ill-defined at this kinematic point.
  680. 166.12 s > field value
  681. 166.12 s > span warm_up{integrand.name=se1l_rls_shifted}
  682. 166.12 s > [2026-08-26 08:21:42.398] @process::amplitude INFO : Input is above threshold: 1 existing threshold E-surfaces across 1/1 graph groups
  683. 166.12 s > field value
  684. 166.12 s > existing_esurfaces 1
  685. 166.12 s > group_count 1
  686. 166.12 s > groups_above_threshold 1
  687. 166.12 s > integrand se1l_rls_shifted
  688. 166.12 s > span warm_up{integrand.name=se1l_rls_shifted}
  689. 166.12 s > threshold_status above threshold
  690. 166.12 s > [2026-08-26 08:21:42.398] @process::amplitude INFO : overlap structure of group 0: [1: [0(2,3)]]
  691. 166.12 s > field value
  692. 166.12 s > span warm_up{integrand.name=se1l_rls_shifted}
  693. 166.12 s > [2026-08-26 08:21:42.403] @process::amplitude WARNING : External state 0 ('g', PDG 21, helicity +) is off shell: p^2 = +2.5e5, expected m^2 = +0e0 (|Δ| = +2.5e5). Fixed-helicity spinor/vector/tensor external states may be ill-defined at this kinematic point.
  694. 166.12 s > field value
  695. 166.12 s > span warm_up{integrand.name=se1l}
  696. 166.12 s > [2026-08-26 08:21:42.403] @process::amplitude WARNING : External state 1 ('g', PDG 21, helicity -) is off shell: p^2 = +2.5e5, expected m^2 = +0e0 (|Δ| = +2.5e5). Fixed-helicity spinor/vector/tensor external states may be ill-defined at this kinematic point.
  697. 166.12 s > field value
  698. 166.12 s > span warm_up{integrand.name=se1l}
  699. 166.12 s > [2026-08-26 08:21:42.403] @process::amplitude INFO : Input is above threshold: 1 existing threshold E-surfaces across 1/1 graph groups
  700. 166.12 s > field value
  701. 166.12 s > existing_esurfaces 1
  702. 166.12 s > group_count 1
  703. 166.12 s > groups_above_threshold 1
  704. 166.12 s > integrand se1l
  705. 166.12 s > span warm_up{integrand.name=se1l}
  706. 166.12 s > threshold_status above threshold
  707. 166.12 s > [2026-08-26 08:21:42.403] @process::amplitude INFO : overlap structure of group 0: [1: [0(2,3)]]
  708. 166.12 s > field value
  709. 166.12 s > span warm_up{integrand.name=se1l}
  710. 166.12 s > [2026-08-26 08:21:42.408] @process::amplitude WARNING : External state 0 ('g', PDG 21, helicity +) is off shell: p^2 = +2.5e5, expected m^2 = +0e0 (|Δ| = +2.5e5). Fixed-helicity spinor/vector/tensor external states may be ill-defined at this kinematic point.
  711. 166.12 s > field value
  712. 166.12 s > span warm_up{integrand.name=se1l_rls_shifted}
  713. 166.12 s > [2026-08-26 08:21:42.408] @process::amplitude WARNING : External state 1 ('g', PDG 21, helicity -) is off shell: p^2 = +2.5e5, expected m^2 = +0e0 (|Δ| = +2.5e5). Fixed-helicity spinor/vector/tensor external states may be ill-defined at this kinematic point.
  714. 166.12 s > field value
  715. 166.12 s > span warm_up{integrand.name=se1l_rls_shifted}
  716. 166.12 s > [2026-08-26 08:21:42.408] @process::amplitude INFO : Input is above threshold: 1 existing threshold E-surfaces across 1/1 graph groups
  717. 166.12 s > field value
  718. 166.12 s > existing_esurfaces 1
  719. 166.12 s > group_count 1
  720. 166.12 s > groups_above_threshold 1
  721. 166.12 s > integrand se1l_rls_shifted
  722. 166.12 s > span warm_up{integrand.name=se1l_rls_shifted}
  723. 166.12 s > threshold_status above threshold
  724. 166.12 s > [2026-08-26 08:21:42.408] @process::amplitude INFO : overlap structure of group 0: [1: [0(2,3)]]
  725. 166.12 s > field value
  726. 166.12 s > span warm_up{integrand.name=se1l_rls_shifted}
  727. 166.12 s > [2026-08-26 08:21:42.412] @process::amplitude WARNING : External state 0 ('g', PDG 21, helicity +) is off shell: p^2 = +2.5e5, expected m^2 = +0e0 (|Δ| = +2.5e5). Fixed-helicity spinor/vector/tensor external states may be ill-defined at this kinematic point.
  728. 166.12 s > field value
  729. 166.12 s > span warm_up{integrand.name=se1l}
  730. 166.12 s > [2026-08-26 08:21:42.412] @process::amplitude WARNING : External state 1 ('g', PDG 21, helicity -) is off shell: p^2 = +2.5e5, expected m^2 = +0e0 (|Δ| = +2.5e5). Fixed-helicity spinor/vector/tensor external states may be ill-defined at this kinematic point.
  731. 166.12 s > field value
  732. 166.12 s > span warm_up{integrand.name=se1l}
  733. 166.12 s > [2026-08-26 08:21:42.412] @process::amplitude INFO : Input is above threshold: 1 existing threshold E-surfaces across 1/1 graph groups
  734. 166.12 s > field value
  735. 166.12 s > existing_esurfaces 1
  736. 166.12 s > group_count 1
  737. 166.12 s > groups_above_threshold 1
  738. 166.12 s > integrand se1l
  739. 166.12 s > span warm_up{integrand.name=se1l}
  740. 166.12 s > threshold_status above threshold
  741. 166.13 s > [2026-08-26 08:21:42.413] @process::amplitude INFO : overlap structure of group 0: [1: [0(2,3)]]
  742. 166.13 s > field value
  743. 166.13 s > span warm_up{integrand.name=se1l}
  744. 166.13 s > [2026-08-26 08:21:42.417] @process::amplitude WARNING : External state 0 ('g', PDG 21, helicity +) is off shell: p^2 = +2.5e5, expected m^2 = +0e0 (|Δ| = +2.5e5). Fixed-helicity spinor/vector/tensor external states may be ill-defined at this kinematic point.
  745. 166.13 s > field value
  746. 166.13 s > span warm_up{integrand.name=se1l_rls_shifted}
  747. 166.13 s > [2026-08-26 08:21:42.417] @process::amplitude WARNING : External state 1 ('g', PDG 21, helicity -) is off shell: p^2 = +2.5e5, expected m^2 = +0e0 (|Δ| = +2.5e5). Fixed-helicity spinor/vector/tensor external states may be ill-defined at this kinematic point.
  748. 166.13 s > field value
  749. 166.13 s > span warm_up{integrand.name=se1l_rls_shifted}
  750. 166.13 s > [2026-08-26 08:21:42.417] @process::amplitude INFO : Input is above threshold: 1 existing threshold E-surfaces across 1/1 graph groups
  751. 166.13 s > field value
  752. 166.13 s > existing_esurfaces 1
  753. 166.13 s > group_count 1
  754. 166.13 s > groups_above_threshold 1
  755. 166.13 s > integrand se1l_rls_shifted
  756. 166.13 s > span warm_up{integrand.name=se1l_rls_shifted}
  757. 166.13 s > threshold_status above threshold
  758. 166.13 s > [2026-08-26 08:21:42.417] @process::amplitude INFO : overlap structure of group 0: [1: [0(2,3)]]
  759. 166.13 s > field value
  760. 166.13 s > span warm_up{integrand.name=se1l_rls_shifted}
  761. 166.13 s > [2026-08-26 08:21:42.422] @process::amplitude WARNING : External state 0 ('g', PDG 21, helicity +) is off shell: p^2 = +2.5e5, expected m^2 = +0e0 (|Δ| = +2.5e5). Fixed-helicity spinor/vector/tensor external states may be ill-defined at this kinematic point.
  762. 166.13 s > field value
  763. 166.13 s > span warm_up{integrand.name=se1l}
  764. 166.13 s > [2026-08-26 08:21:42.422] @process::amplitude WARNING : External state 1 ('g', PDG 21, helicity -) is off shell: p^2 = +2.5e5, expected m^2 = +0e0 (|Δ| = +2.5e5). Fixed-helicity spinor/vector/tensor external states may be ill-defined at this kinematic point.
  765. 166.13 s > field value
  766. 166.13 s > span warm_up{integrand.name=se1l}
  767. 166.13 s > [2026-08-26 08:21:42.422] @process::amplitude INFO : Input is above threshold: 1 existing threshold E-surfaces across 1/1 graph groups
  768. 166.13 s > field value
  769. 166.13 s > existing_esurfaces 1
  770. 166.13 s > group_count 1
  771. 166.13 s > groups_above_threshold 1
  772. 166.13 s > integrand se1l
  773. 166.13 s > span warm_up{integrand.name=se1l}
  774. 166.13 s > threshold_status above threshold
  775. 166.13 s > [2026-08-26 08:21:42.422] @process::amplitude INFO : overlap structure of group 0: [1: [0(2,3)]]
  776. 166.13 s > field value
  777. 166.13 s > span warm_up{integrand.name=se1l}
  778. 166.13 s > [2026-08-26 08:21:42.426] @process::amplitude WARNING : External state 0 ('g', PDG 21, helicity +) is off shell: p^2 = +2.5e5, expected m^2 = +0e0 (|Δ| = +2.5e5). Fixed-helicity spinor/vector/tensor external states may be ill-defined at this kinematic point.
  779. 166.13 s > field value
  780. 166.13 s > span warm_up{integrand.name=se1l_rls_shifted}
  781. 166.13 s > [2026-08-26 08:21:42.426] @process::amplitude WARNING : External state 1 ('g', PDG 21, helicity -) is off shell: p^2 = +2.5e5, expected m^2 = +0e0 (|Δ| = +2.5e5). Fixed-helicity spinor/vector/tensor external states may be ill-defined at this kinematic point.
  782. 166.13 s > field value
  783. 166.13 s > span warm_up{integrand.name=se1l_rls_shifted}
  784. 166.13 s > [2026-08-26 08:21:42.426] @process::amplitude INFO : Input is above threshold: 1 existing threshold E-surfaces across 1/1 graph groups
  785. 166.13 s > field value
  786. 166.13 s > existing_esurfaces 1
  787. 166.13 s > group_count 1
  788. 166.13 s > groups_above_threshold 1
  789. 166.13 s > integrand se1l_rls_shifted
  790. 166.13 s > span warm_up{integrand.name=se1l_rls_shifted}
  791. 166.13 s > threshold_status above threshold
  792. 166.13 s > [2026-08-26 08:21:42.427] @process::amplitude INFO : overlap structure of group 0: [1: [0(2,3)]]
  793. 166.13 s > field value
  794. 166.13 s > span warm_up{integrand.name=se1l_rls_shifted}
  795. 166.13 s > [2026-08-26 08:21:42.431] @process::amplitude WARNING : External state 0 ('g', PDG 21, helicity +) is off shell: p^2 = +2.5e5, expected m^2 = +0e0 (|Δ| = +2.5e5). Fixed-helicity spinor/vector/tensor external states may be ill-defined at this kinematic point.
  796. 166.13 s > field value
  797. 166.13 s > span warm_up{integrand.name=se1l}
  798. 166.13 s > [2026-08-26 08:21:42.431] @process::amplitude WARNING : External state 1 ('g', PDG 21, helicity -) is off shell: p^2 = +2.5e5, expected m^2 = +0e0 (|Δ| = +2.5e5). Fixed-helicity spinor/vector/tensor external states may be ill-defined at this kinematic point.
  799. 166.13 s > field value
  800. 166.13 s > span warm_up{integrand.name=se1l}
  801. 166.13 s > [2026-08-26 08:21:42.431] @process::amplitude INFO : Input is above threshold: 1 existing threshold E-surfaces across 1/1 graph groups
  802. 166.13 s > field value
  803. 166.13 s > existing_esurfaces 1
  804. 166.13 s > group_count 1
  805. 166.13 s > groups_above_threshold 1
  806. 166.13 s > integrand se1l
  807. 166.13 s > span warm_up{integrand.name=se1l}
  808. 166.13 s > threshold_status above threshold
  809. 166.13 s > [2026-08-26 08:21:42.431] @process::amplitude INFO : overlap structure of group 0: [1: [0(2,3)]]
  810. 166.13 s > field value
  811. 166.13 s > span warm_up{integrand.name=se1l}
  812. 166.13 s > [2026-08-26 08:21:42.435] @process::amplitude WARNING : External state 0 ('g', PDG 21, helicity +) is off shell: p^2 = +2.5e5, expected m^2 = +0e0 (|Δ| = +2.5e5). Fixed-helicity spinor/vector/tensor external states may be ill-defined at this kinematic point.
  813. 166.13 s > field value
  814. 166.13 s > span warm_up{integrand.name=se1l_rls_shifted}
  815. 166.13 s > [2026-08-26 08:21:42.435] @process::amplitude WARNING : External state 1 ('g', PDG 21, helicity -) is off shell: p^2 = +2.5e5, expected m^2 = +0e0 (|Δ| = +2.5e5). Fixed-helicity spinor/vector/tensor external states may be ill-defined at this kinematic point.
  816. 166.13 s > field value
  817. 166.13 s > span warm_up{integrand.name=se1l_rls_shifted}
  818. 166.13 s > [2026-08-26 08:21:42.436] @process::amplitude INFO : Input is above threshold: 1 existing threshold E-surfaces across 1/1 graph groups
  819. 166.13 s > field value
  820. 166.13 s > existing_esurfaces 1
  821. 166.13 s > group_count 1
  822. 166.13 s > groups_above_threshold 1
  823. 166.13 s > integrand se1l_rls_shifted
  824. 166.13 s > span warm_up{integrand.name=se1l_rls_shifted}
  825. 166.13 s > threshold_status above threshold
  826. 166.13 s > [2026-08-26 08:21:42.436] @process::amplitude INFO : overlap structure of group 0: [1: [0(2,3)]]
  827. 166.13 s > field value
  828. 166.13 s > span warm_up{integrand.name=se1l_rls_shifted}
  829. 166.13 s > [2026-08-26 08:21:42.440] @process::amplitude WARNING : External state 0 ('g', PDG 21, helicity +) is off shell: p^2 = +2.5e5, expected m^2 = +0e0 (|Δ| = +2.5e5). Fixed-helicity spinor/vector/tensor external states may be ill-defined at this kinematic point.
  830. 166.13 s > field value
  831. 166.13 s > span warm_up{integrand.name=se1l}
  832. 166.13 s > [2026-08-26 08:21:42.440] @process::amplitude WARNING : External state 1 ('g', PDG 21, helicity -) is off shell: p^2 = +2.5e5, expected m^2 = +0e0 (|Δ| = +2.5e5). Fixed-helicity spinor/vector/tensor external states may be ill-defined at this kinematic point.
  833. 166.13 s > field value
  834. 166.13 s > span warm_up{integrand.name=se1l}
  835. 166.13 s > [2026-08-26 08:21:42.440] @process::amplitude INFO : Input is above threshold: 1 existing threshold E-surfaces across 1/1 graph groups
  836. 166.13 s > field value
  837. 166.13 s > existing_esurfaces 1
  838. 166.13 s > group_count 1
  839. 166.13 s > groups_above_threshold 1
  840. 166.13 s > integrand se1l
  841. 166.13 s > span warm_up{integrand.name=se1l}
  842. 166.13 s > threshold_status above threshold
  843. 166.13 s > [2026-08-26 08:21:42.440] @process::amplitude INFO : overlap structure of group 0: [1: [0(2,3)]]
  844. 166.13 s > field value
  845. 166.13 s > span warm_up{integrand.name=se1l}
  846. 166.13 s > [2026-08-26 08:21:42.445] @process::amplitude WARNING : External state 0 ('g', PDG 21, helicity +) is off shell: p^2 = +2.5e5, expected m^2 = +0e0 (|Δ| = +2.5e5). Fixed-helicity spinor/vector/tensor external states may be ill-defined at this kinematic point.
  847. 166.13 s > field value
  848. 166.13 s > span warm_up{integrand.name=se1l_rls_shifted}
  849. 166.13 s > [2026-08-26 08:21:42.445] @process::amplitude WARNING : External state 1 ('g', PDG 21, helicity -) is off shell: p^2 = +2.5e5, expected m^2 = +0e0 (|Δ| = +2.5e5). Fixed-helicity spinor/vector/tensor external states may be ill-defined at this kinematic point.
  850. 166.13 s > field value
  851. 166.13 s > span warm_up{integrand.name=se1l_rls_shifted}
  852. 166.13 s > [2026-08-26 08:21:42.445] @process::amplitude INFO : Input is above threshold: 1 existing threshold E-surfaces across 1/1 graph groups
  853. 166.13 s > field value
  854. 166.13 s > existing_esurfaces 1
  855. 166.13 s > group_count 1
  856. 166.13 s > groups_above_threshold 1
  857. 166.13 s > integrand se1l_rls_shifted
  858. 166.13 s > span warm_up{integrand.name=se1l_rls_shifted}
  859. 166.13 s > threshold_status above threshold
  860. 166.13 s > [2026-08-26 08:21:42.445] @process::amplitude INFO : overlap structure of group 0: [1: [0(2,3)]]
  861. 166.13 s > field value
  862. 166.13 s > span warm_up{integrand.name=se1l_rls_shifted}
  863. 166.13 s > [2026-08-26 08:21:42.449] @process::amplitude WARNING : External state 0 ('g', PDG 21, helicity +) is off shell: p^2 = +2.5e5, expected m^2 = +0e0 (|Δ| = +2.5e5). Fixed-helicity spinor/vector/tensor external states may be ill-defined at this kinematic point.
  864. 166.13 s > field value
  865. 166.13 s > span warm_up{integrand.name=se1l}
  866. 166.13 s > [2026-08-26 08:21:42.449] @process::amplitude WARNING : External state 1 ('g', PDG 21, helicity -) is off shell: p^2 = +2.5e5, expected m^2 = +0e0 (|Δ| = +2.5e5). Fixed-helicity spinor/vector/tensor external states may be ill-defined at this kinematic point.
  867. 166.13 s > field value
  868. 166.13 s > span warm_up{integrand.name=se1l}
  869. 166.13 s > [2026-08-26 08:21:42.450] @process::amplitude INFO : Input is above threshold: 1 existing threshold E-surfaces across 1/1 graph groups
  870. 166.13 s > field value
  871. 166.13 s > existing_esurfaces 1
  872. 166.13 s > group_count 1
  873. 166.13 s > groups_above_threshold 1
  874. 166.13 s > integrand se1l
  875. 166.13 s > span warm_up{integrand.name=se1l}
  876. 166.13 s > threshold_status above threshold
  877. 166.13 s > [2026-08-26 08:21:42.450] @process::amplitude INFO : overlap structure of group 0: [1: [0(2,3)]]
  878. 166.13 s > field value
  879. 166.13 s > span warm_up{integrand.name=se1l}
  880. 166.13 s > [2026-08-26 08:21:42.454] @process::amplitude WARNING : External state 0 ('g', PDG 21, helicity +) is off shell: p^2 = +2.5e5, expected m^2 = +0e0 (|Δ| = +2.5e5). Fixed-helicity spinor/vector/tensor external states may be ill-defined at this kinematic point.
  881. 166.13 s > field value
  882. 166.13 s > span warm_up{integrand.name=se1l_rls_shifted}
  883. 166.13 s > [2026-08-26 08:21:42.454] @process::amplitude WARNING : External state 1 ('g', PDG 21, helicity -) is off shell: p^2 = +2.5e5, expected m^2 = +0e0 (|Δ| = +2.5e5). Fixed-helicity spinor/vector/tensor external states may be ill-defined at this kinematic point.
  884. 166.13 s > field value
  885. 166.13 s > span warm_up{integrand.name=se1l_rls_shifted}
  886. 166.13 s > [2026-08-26 08:21:42.454] @process::amplitude INFO : Input is above threshold: 1 existing threshold E-surfaces across 1/1 graph groups
  887. 166.13 s > field value
  888. 166.13 s > existing_esurfaces 1
  889. 166.13 s > group_count 1
  890. 166.13 s > groups_above_threshold 1
  891. 166.13 s > integrand se1l_rls_shifted
  892. 166.13 s > span warm_up{integrand.name=se1l_rls_shifted}
  893. 166.13 s > threshold_status above threshold
  894. 166.13 s > [2026-08-26 08:21:42.454] @process::amplitude INFO : overlap structure of group 0: [1: [0(2,3)]]
  895. 166.13 s > field value
  896. 166.13 s > span warm_up{integrand.name=se1l_rls_shifted}
  897. 166.13 s > [2026-08-26 08:21:42.459] @process::amplitude WARNING : External state 0 ('g', PDG 21, helicity +) is off shell: p^2 = +2.5e5, expected m^2 = +0e0 (|Δ| = +2.5e5). Fixed-helicity spinor/vector/tensor external states may be ill-defined at this kinematic point.
  898. 166.13 s > field value
  899. 166.13 s > span warm_up{integrand.name=se1l}
  900. 166.13 s > [2026-08-26 08:21:42.459] @process::amplitude WARNING : External state 1 ('g', PDG 21, helicity -) is off shell: p^2 = +2.5e5, expected m^2 = +0e0 (|Δ| = +2.5e5). Fixed-helicity spinor/vector/tensor external states may be ill-defined at this kinematic point.
  901. 166.13 s > field value
  902. 166.13 s > span warm_up{integrand.name=se1l}
  903. 166.13 s > [2026-08-26 08:21:42.459] @process::amplitude INFO : Input is above threshold: 1 existing threshold E-surfaces across 1/1 graph groups
  904. 166.13 s > field value
  905. 166.13 s > existing_esurfaces 1
  906. 166.13 s > group_count 1
  907. 166.13 s > groups_above_threshold 1
  908. 166.13 s > integrand se1l
  909. 166.13 s > span warm_up{integrand.name=se1l}
  910. 166.13 s > threshold_status above threshold
  911. 166.13 s > [2026-08-26 08:21:42.459] @process::amplitude INFO : overlap structure of group 0: [1: [0(2,3)]]
  912. 166.13 s > field value
  913. 166.13 s > span warm_up{integrand.name=se1l}
  914. 166.13 s > [2026-08-26 08:21:42.463] @process::amplitude WARNING : External state 0 ('g', PDG 21, helicity +) is off shell: p^2 = +2.5e5, expected m^2 = +0e0 (|Δ| = +2.5e5). Fixed-helicity spinor/vector/tensor external states may be ill-defined at this kinematic point.
  915. 166.13 s > field value
  916. 166.13 s > span warm_up{integrand.name=se1l_mur_shifted}
  917. 166.13 s > [2026-08-26 08:21:42.464] @process::amplitude WARNING : External state 1 ('g', PDG 21, helicity -) is off shell: p^2 = +2.5e5, expected m^2 = +0e0 (|Δ| = +2.5e5). Fixed-helicity spinor/vector/tensor external states may be ill-defined at this kinematic point.
  918. 166.13 s > field value
  919. 166.13 s > span warm_up{integrand.name=se1l_mur_shifted}
  920. 166.13 s > [2026-08-26 08:21:42.464] @process::amplitude INFO : Input is above threshold: 1 existing threshold E-surfaces across 1/1 graph groups
  921. 166.13 s > field value
  922. 166.13 s > existing_esurfaces 1
  923. 166.13 s > group_count 1
  924. 166.13 s > groups_above_threshold 1
  925. 166.13 s > integrand se1l_mur_shifted
  926. 166.13 s > span warm_up{integrand.name=se1l_mur_shifted}
  927. 166.13 s > threshold_status above threshold
  928. 166.13 s > [2026-08-26 08:21:42.464] @process::amplitude INFO : overlap structure of group 0: [1: [0(2,3)]]
  929. 166.13 s > field value
  930. 166.13 s > span warm_up{integrand.name=se1l_mur_shifted}
  931. 166.13 s > [2026-08-26 08:21:42.468] @process::amplitude WARNING : External state 0 ('g', PDG 21, helicity +) is off shell: p^2 = +2.5e5, expected m^2 = +0e0 (|Δ| = +2.5e5). Fixed-helicity spinor/vector/tensor external states may be ill-defined at this kinematic point.
  932. 166.13 s > field value
  933. 166.13 s > span warm_up{integrand.name=se1l}
  934. 166.13 s > [2026-08-26 08:21:42.468] @process::amplitude WARNING : External state 1 ('g', PDG 21, helicity -) is off shell: p^2 = +2.5e5, expected m^2 = +0e0 (|Δ| = +2.5e5). Fixed-helicity spinor/vector/tensor external states may be ill-defined at this kinematic point.
  935. 166.13 s > field value
  936. 166.13 s > span warm_up{integrand.name=se1l}
  937. 166.13 s > [2026-08-26 08:21:42.468] @process::amplitude INFO : Input is above threshold: 1 existing threshold E-surfaces across 1/1 graph groups
  938. 166.13 s > field value
  939. 166.13 s > existing_esurfaces 1
  940. 166.13 s > group_count 1
  941. 166.13 s > groups_above_threshold 1
  942. 166.13 s > integrand se1l
  943. 166.13 s > span warm_up{integrand.name=se1l}
  944. 166.13 s > threshold_status above threshold
  945. 166.13 s > [2026-08-26 08:21:42.468] @process::amplitude INFO : overlap structure of group 0: [1: [0(2,3)]]
  946. 166.13 s > field value
  947. 166.13 s > span warm_up{integrand.name=se1l}
  948. 166.13 s > [2026-08-26 08:21:42.473] @process::amplitude WARNING : External state 0 ('g', PDG 21, helicity +) is off shell: p^2 = +2.5e5, expected m^2 = +0e0 (|Δ| = +2.5e5). Fixed-helicity spinor/vector/tensor external states may be ill-defined at this kinematic point.
  949. 166.13 s > field value
  950. 166.13 s > span warm_up{integrand.name=se1l_mur_shifted}
  951. 166.13 s > [2026-08-26 08:21:42.473] @process::amplitude WARNING : External state 1 ('g', PDG 21, helicity -) is off shell: p^2 = +2.5e5, expected m^2 = +0e0 (|Δ| = +2.5e5). Fixed-helicity spinor/vector/tensor external states may be ill-defined at this kinematic point.
  952. 166.13 s > field value
  953. 166.13 s > span warm_up{integrand.name=se1l_mur_shifted}
  954. 166.13 s > [2026-08-26 08:21:42.473] @process::amplitude INFO : Input is above threshold: 1 existing threshold E-surfaces across 1/1 graph groups
  955. 166.13 s > field value
  956. 166.13 s > existing_esurfaces 1
  957. 166.13 s > group_count 1
  958. 166.13 s > groups_above_threshold 1
  959. 166.13 s > integrand se1l_mur_shifted
  960. 166.13 s > span warm_up{integrand.name=se1l_mur_shifted}
  961. 166.13 s > threshold_status above threshold
  962. 166.13 s > [2026-08-26 08:21:42.473] @process::amplitude INFO : overlap structure of group 0: [1: [0(2,3)]]
  963. 166.13 s > field value
  964. 166.13 s > span warm_up{integrand.name=se1l_mur_shifted}
  965. 166.13 s > [2026-08-26 08:21:42.477] @process::amplitude WARNING : External state 0 ('g', PDG 21, helicity +) is off shell: p^2 = +2.5e5, expected m^2 = +0e0 (|Δ| = +2.5e5). Fixed-helicity spinor/vector/tensor external states may be ill-defined at this kinematic point.
  966. 166.13 s > field value
  967. 166.13 s > span warm_up{integrand.name=se1l}
  968. 166.13 s > [2026-08-26 08:21:42.477] @process::amplitude WARNING : External state 1 ('g', PDG 21, helicity -) is off shell: p^2 = +2.5e5, expected m^2 = +0e0 (|Δ| = +2.5e5). Fixed-helicity spinor/vector/tensor external states may be ill-defined at this kinematic point.
  969. 166.13 s > field value
  970. 166.13 s > span warm_up{integrand.name=se1l}
  971. 166.13 s > [2026-08-26 08:21:42.478] @process::amplitude INFO : Input is above threshold: 1 existing threshold E-surfaces across 1/1 graph groups
  972. 166.13 s > field value
  973. 166.13 s > existing_esurfaces 1
  974. 166.13 s > group_count 1
  975. 166.13 s > groups_above_threshold 1
  976. 166.13 s > integrand se1l
  977. 166.13 s > span warm_up{integrand.name=se1l}
  978. 166.13 s > threshold_status above threshold
  979. 166.13 s > [2026-08-26 08:21:42.478] @process::amplitude INFO : overlap structure of group 0: [1: [0(2,3)]]
  980. 166.13 s > field value
  981. 166.13 s > span warm_up{integrand.name=se1l}
  982. 166.13 s > [2026-08-26 08:21:42.482] @process::amplitude WARNING : External state 0 ('g', PDG 21, helicity +) is off shell: p^2 = +2.5e5, expected m^2 = +0e0 (|Δ| = +2.5e5). Fixed-helicity spinor/vector/tensor external states may be ill-defined at this kinematic point.
  983. 166.13 s > field value
  984. 166.13 s > span warm_up{integrand.name=se1l_mur_shifted}
  985. 166.13 s > [2026-08-26 08:21:42.482] @process::amplitude WARNING : External state 1 ('g', PDG 21, helicity -) is off shell: p^2 = +2.5e5, expected m^2 = +0e0 (|Δ| = +2.5e5). Fixed-helicity spinor/vector/tensor external states may be ill-defined at this kinematic point.
  986. 166.13 s > field value
  987. 166.13 s > span warm_up{integrand.name=se1l_mur_shifted}
  988. 166.13 s > [2026-08-26 08:21:42.482] @process::amplitude INFO : Input is above threshold: 1 existing threshold E-surfaces across 1/1 graph groups
  989. 166.13 s > field value
  990. 166.13 s > existing_esurfaces 1
  991. 166.13 s > group_count 1
  992. 166.13 s > groups_above_threshold 1
  993. 166.13 s > integrand se1l_mur_shifted
  994. 166.13 s > span warm_up{integrand.name=se1l_mur_shifted}
  995. 166.13 s > threshold_status above threshold
  996. 166.13 s > [2026-08-26 08:21:42.482] @process::amplitude INFO : overlap structure of group 0: [1: [0(2,3)]]
  997. 166.13 s > field value
  998. 166.13 s > span warm_up{integrand.name=se1l_mur_shifted}
  999. 166.13 s > [2026-08-26 08:21:42.486] @process::amplitude WARNING : External state 0 ('g', PDG 21, helicity +) is off shell: p^2 = +2.5e5, expected m^2 = +0e0 (|Δ| = +2.5e5). Fixed-helicity spinor/vector/tensor external states may be ill-defined at this kinematic point.
  1000. 166.13 s > field value
  1001. 166.13 s > span warm_up{integrand.name=se1l}
  1002. 166.13 s > [2026-08-26 08:21:42.486] @process::amplitude WARNING : External state 1 ('g', PDG 21, helicity -) is off shell: p^2 = +2.5e5, expected m^2 = +0e0 (|Δ| = +2.5e5). Fixed-helicity spinor/vector/tensor external states may be ill-defined at this kinematic point.
  1003. 166.13 s > field value
  1004. 166.13 s > span warm_up{integrand.name=se1l}
  1005. 166.13 s > [2026-08-26 08:21:42.487] @process::amplitude INFO : Input is above threshold: 1 existing threshold E-surfaces across 1/1 graph groups
  1006. 166.13 s > field value
  1007. 166.13 s > existing_esurfaces 1
  1008. 166.13 s > group_count 1
  1009. 166.13 s > groups_above_threshold 1
  1010. 166.13 s > integrand se1l
  1011. 166.13 s > span warm_up{integrand.name=se1l}
  1012. 166.13 s > threshold_status above threshold
  1013. 166.13 s > [2026-08-26 08:21:42.487] @process::amplitude INFO : overlap structure of group 0: [1: [0(2,3)]]
  1014. 166.13 s > field value
  1015. 166.13 s > span warm_up{integrand.name=se1l}
  1016. 166.13 s > [2026-08-26 08:21:42.491] @process::amplitude WARNING : External state 0 ('g', PDG 21, helicity +) is off shell: p^2 = +2.5e5, expected m^2 = +0e0 (|Δ| = +2.5e5). Fixed-helicity spinor/vector/tensor external states may be ill-defined at this kinematic point.
  1017. 166.13 s > field value
  1018. 166.13 s > span warm_up{integrand.name=se1l_mur_shifted}
  1019. 166.13 s > [2026-08-26 08:21:42.491] @process::amplitude WARNING : External state 1 ('g', PDG 21, helicity -) is off shell: p^2 = +2.5e5, expected m^2 = +0e0 (|Δ| = +2.5e5). Fixed-helicity spinor/vector/tensor external states may be ill-defined at this kinematic point.
  1020. 166.13 s > field value
  1021. 166.13 s > span warm_up{integrand.name=se1l_mur_shifted}
  1022. 166.13 s > [2026-08-26 08:21:42.491] @process::amplitude INFO : Input is above threshold: 1 existing threshold E-surfaces across 1/1 graph groups
  1023. 166.13 s > field value
  1024. 166.13 s > existing_esurfaces 1
  1025. 166.13 s > group_count 1
  1026. 166.13 s > groups_above_threshold 1
  1027. 166.13 s > integrand se1l_mur_shifted
  1028. 166.13 s > span warm_up{integrand.name=se1l_mur_shifted}
  1029. 166.13 s > threshold_status above threshold
  1030. 166.13 s > [2026-08-26 08:21:42.491] @process::amplitude INFO : overlap structure of group 0: [1: [0(2,3)]]
  1031. 166.13 s > field value
  1032. 166.13 s > span warm_up{integrand.name=se1l_mur_shifted}
  1033. 166.13 s > [2026-08-26 08:21:42.495] @process::amplitude WARNING : External state 0 ('g', PDG 21, helicity +) is off shell: p^2 = +2.5e5, expected m^2 = +0e0 (|Δ| = +2.5e5). Fixed-helicity spinor/vector/tensor external states may be ill-defined at this kinematic point.
  1034. 166.13 s > field value
  1035. 166.13 s > span warm_up{integrand.name=se1l}
  1036. 166.13 s > [2026-08-26 08:21:42.495] @process::amplitude WARNING : External state 1 ('g', PDG 21, helicity -) is off shell: p^2 = +2.5e5, expected m^2 = +0e0 (|Δ| = +2.5e5). Fixed-helicity spinor/vector/tensor external states may be ill-defined at this kinematic point.
  1037. 166.13 s > field value
  1038. 166.13 s > span warm_up{integrand.name=se1l}
  1039. 166.13 s > [2026-08-26 08:21:42.496] @process::amplitude INFO : Input is above threshold: 1 existing threshold E-surfaces across 1/1 graph groups
  1040. 166.13 s > field value
  1041. 166.13 s > existing_esurfaces 1
  1042. 166.13 s > group_count 1
  1043. 166.13 s > groups_above_threshold 1
  1044. 166.13 s > integrand se1l
  1045. 166.13 s > span warm_up{integrand.name=se1l}
  1046. 166.13 s > threshold_status above threshold
  1047. 166.13 s > [2026-08-26 08:21:42.496] @process::amplitude INFO : overlap structure of group 0: [1: [0(2,3)]]
  1048. 166.13 s > field value
  1049. 166.13 s > span warm_up{integrand.name=se1l}
  1050. 166.13 s > [2026-08-26 08:21:42.500] @process::amplitude WARNING : External state 0 ('g', PDG 21, helicity +) is off shell: p^2 = +2.5e5, expected m^2 = +0e0 (|Δ| = +2.5e5). Fixed-helicity spinor/vector/tensor external states may be ill-defined at this kinematic point.
  1051. 166.13 s > field value
  1052. 166.13 s > span warm_up{integrand.name=se1l_mur_shifted}
  1053. 166.13 s > [2026-08-26 08:21:42.500] @process::amplitude WARNING : External state 1 ('g', PDG 21, helicity -) is off shell: p^2 = +2.5e5, expected m^2 = +0e0 (|Δ| = +2.5e5). Fixed-helicity spinor/vector/tensor external states may be ill-defined at this kinematic point.
  1054. 166.13 s > field value
  1055. 166.13 s > span warm_up{integrand.name=se1l_mur_shifted}
  1056. 166.13 s > [2026-08-26 08:21:42.500] @process::amplitude INFO : Input is above threshold: 1 existing threshold E-surfaces across 1/1 graph groups
  1057. 166.13 s > field value
  1058. 166.13 s > existing_esurfaces 1
  1059. 166.13 s > group_count 1
  1060. 166.13 s > groups_above_threshold 1
  1061. 166.13 s > integrand se1l_mur_shifted
  1062. 166.13 s > span warm_up{integrand.name=se1l_mur_shifted}
  1063. 166.13 s > threshold_status above threshold
  1064. 166.13 s > [2026-08-26 08:21:42.500] @process::amplitude INFO : overlap structure of group 0: [1: [0(2,3)]]
  1065. 166.13 s > field value
  1066. 166.13 s > span warm_up{integrand.name=se1l_mur_shifted}
  1067. 166.13 s > [2026-08-26 08:21:42.505] @process::amplitude WARNING : External state 0 ('g', PDG 21, helicity +) is off shell: p^2 = +2.5e5, expected m^2 = +0e0 (|Δ| = +2.5e5). Fixed-helicity spinor/vector/tensor external states may be ill-defined at this kinematic point.
  1068. 166.13 s > field value
  1069. 166.13 s > span warm_up{integrand.name=se1l}
  1070. 166.13 s > [2026-08-26 08:21:42.505] @process::amplitude WARNING : External state 1 ('g', PDG 21, helicity -) is off shell: p^2 = +2.5e5, expected m^2 = +0e0 (|Δ| = +2.5e5). Fixed-helicity spinor/vector/tensor external states may be ill-defined at this kinematic point.
  1071. 166.13 s > field value
  1072. 166.13 s > span warm_up{integrand.name=se1l}
  1073. 166.13 s > [2026-08-26 08:21:42.505] @process::amplitude INFO : Input is above threshold: 1 existing threshold E-surfaces across 1/1 graph groups
  1074. 166.13 s > field value
  1075. 166.13 s > existing_esurfaces 1
  1076. 166.13 s > group_count 1
  1077. 166.13 s > groups_above_threshold 1
  1078. 166.13 s > integrand se1l
  1079. 166.13 s > span warm_up{integrand.name=se1l}
  1080. 166.13 s > threshold_status above threshold
  1081. 166.13 s > [2026-08-26 08:21:42.505] @process::amplitude INFO : overlap structure of group 0: [1: [0(2,3)]]
  1082. 166.13 s > field value
  1083. 166.13 s > span warm_up{integrand.name=se1l}
  1084. 166.13 s > [2026-08-26 08:21:42.509] @process::amplitude WARNING : External state 0 ('g', PDG 21, helicity +) is off shell: p^2 = +2.5e5, expected m^2 = +0e0 (|Δ| = +2.5e5). Fixed-helicity spinor/vector/tensor external states may be ill-defined at this kinematic point.
  1085. 166.13 s > field value
  1086. 166.13 s > span warm_up{integrand.name=se1l_mur_shifted}
  1087. 166.13 s > [2026-08-26 08:21:42.509] @process::amplitude WARNING : External state 1 ('g', PDG 21, helicity -) is off shell: p^2 = +2.5e5, expected m^2 = +0e0 (|Δ| = +2.5e5). Fixed-helicity spinor/vector/tensor external states may be ill-defined at this kinematic point.
  1088. 166.13 s > field value
  1089. 166.13 s > span warm_up{integrand.name=se1l_mur_shifted}
  1090. 166.13 s > [2026-08-26 08:21:42.510] @process::amplitude INFO : Input is above threshold: 1 existing threshold E-surfaces across 1/1 graph groups
  1091. 166.13 s > field value
  1092. 166.13 s > existing_esurfaces 1
  1093. 166.13 s > group_count 1
  1094. 166.13 s > groups_above_threshold 1
  1095. 166.13 s > integrand se1l_mur_shifted
  1096. 166.13 s > span warm_up{integrand.name=se1l_mur_shifted}
  1097. 166.13 s > threshold_status above threshold
  1098. 166.13 s > [2026-08-26 08:21:42.510] @process::amplitude INFO : overlap structure of group 0: [1: [0(2,3)]]
  1099. 166.13 s > field value
  1100. 166.13 s > span warm_up{integrand.name=se1l_mur_shifted}
  1101. 166.13 s > [2026-08-26 08:21:42.514] @process::amplitude WARNING : External state 0 ('g', PDG 21, helicity +) is off shell: p^2 = +2.5e5, expected m^2 = +0e0 (|Δ| = +2.5e5). Fixed-helicity spinor/vector/tensor external states may be ill-defined at this kinematic point.
  1102. 166.13 s > field value
  1103. 166.13 s > span warm_up{integrand.name=se1l}
  1104. 166.13 s > [2026-08-26 08:21:42.514] @process::amplitude WARNING : External state 1 ('g', PDG 21, helicity -) is off shell: p^2 = +2.5e5, expected m^2 = +0e0 (|Δ| = +2.5e5). Fixed-helicity spinor/vector/tensor external states may be ill-defined at this kinematic point.
  1105. 166.13 s > field value
  1106. 166.13 s > span warm_up{integrand.name=se1l}
  1107. 166.13 s > [2026-08-26 08:21:42.514] @process::amplitude INFO : Input is above threshold: 1 existing threshold E-surfaces across 1/1 graph groups
  1108. 166.13 s > field value
  1109. 166.13 s > existing_esurfaces 1
  1110. 166.13 s > group_count 1
  1111. 166.13 s > groups_above_threshold 1
  1112. 166.13 s > integrand se1l
  1113. 166.13 s > span warm_up{integrand.name=se1l}
  1114. 166.13 s > threshold_status above threshold
  1115. 166.13 s > [2026-08-26 08:21:42.514] @process::amplitude INFO : overlap structure of group 0: [1: [0(2,3)]]
  1116. 166.13 s > field value
  1117. 166.13 s > span warm_up{integrand.name=se1l}
  1118. 166.13 s > [2026-08-26 08:21:42.519] @process::amplitude WARNING : External state 0 ('g', PDG 21, helicity +) is off shell: p^2 = +2.5e5, expected m^2 = +0e0 (|Δ| = +2.5e5). Fixed-helicity spinor/vector/tensor external states may be ill-defined at this kinematic point.
  1119. 166.13 s > field value
  1120. 166.13 s > span warm_up{integrand.name=se1l_mur_shifted}
  1121. 166.13 s > [2026-08-26 08:21:42.519] @process::amplitude WARNING : External state 1 ('g', PDG 21, helicity -) is off shell: p^2 = +2.5e5, expected m^2 = +0e0 (|Δ| = +2.5e5). Fixed-helicity spinor/vector/tensor external states may be ill-defined at this kinematic point.
  1122. 166.13 s > field value
  1123. 166.13 s > span warm_up{integrand.name=se1l_mur_shifted}
  1124. 166.13 s > [2026-08-26 08:21:42.519] @process::amplitude INFO : Input is above threshold: 1 existing threshold E-surfaces across 1/1 graph groups
  1125. 166.13 s > field value
  1126. 166.13 s > existing_esurfaces 1
  1127. 166.13 s > group_count 1
  1128. 166.13 s > groups_above_threshold 1
  1129. 166.13 s > integrand se1l_mur_shifted
  1130. 166.13 s > span warm_up{integrand.name=se1l_mur_shifted}
  1131. 166.13 s > threshold_status above threshold
  1132. 166.13 s > [2026-08-26 08:21:42.519] @process::amplitude INFO : overlap structure of group 0: [1: [0(2,3)]]
  1133. 166.13 s > field value
  1134. 166.13 s > span warm_up{integrand.name=se1l_mur_shifted}
  1135. 166.13 s > [2026-08-26 08:21:42.523] @process::amplitude WARNING : External state 0 ('g', PDG 21, helicity +) is off shell: p^2 = +2.5e5, expected m^2 = +0e0 (|Δ| = +2.5e5). Fixed-helicity spinor/vector/tensor external states may be ill-defined at this kinematic point.
  1136. 166.13 s > field value
  1137. 166.13 s > span warm_up{integrand.name=se1l}
  1138. 166.13 s > [2026-08-26 08:21:42.523] @process::amplitude WARNING : External state 1 ('g', PDG 21, helicity -) is off shell: p^2 = +2.5e5, expected m^2 = +0e0 (|Δ| = +2.5e5). Fixed-helicity spinor/vector/tensor external states may be ill-defined at this kinematic point.
  1139. 166.13 s > field value
  1140. 166.13 s > span warm_up{integrand.name=se1l}
  1141. 166.13 s > [2026-08-26 08:21:42.524] @process::amplitude INFO : Input is above threshold: 1 existing threshold E-surfaces across 1/1 graph groups
  1142. 166.13 s > field value
  1143. 166.13 s > existing_esurfaces 1
  1144. 166.13 s > group_count 1
  1145. 166.13 s > groups_above_threshold 1
  1146. 166.13 s > integrand se1l
  1147. 166.13 s > span warm_up{integrand.name=se1l}
  1148. 166.13 s > threshold_status above threshold
  1149. 166.13 s > [2026-08-26 08:21:42.524] @process::amplitude INFO : overlap structure of group 0: [1: [0(2,3)]]
  1150. 166.13 s > field value
  1151. 166.13 s > span warm_up{integrand.name=se1l}
  1152. 166.13 s > [2026-08-26 08:21:42.528] @process::amplitude WARNING : External state 0 ('g', PDG 21, helicity +) is off shell: p^2 = +2.5e5, expected m^2 = +0e0 (|Δ| = +2.5e5). Fixed-helicity spinor/vector/tensor external states may be ill-defined at this kinematic point.
  1153. 166.13 s > field value
  1154. 166.13 s > span warm_up{integrand.name=se1l_mur_shifted}
  1155. 166.13 s > [2026-08-26 08:21:42.528] @process::amplitude WARNING : External state 1 ('g', PDG 21, helicity -) is off shell: p^2 = +2.5e5, expected m^2 = +0e0 (|Δ| = +2.5e5). Fixed-helicity spinor/vector/tensor external states may be ill-defined at this kinematic point.
  1156. 166.13 s > field value
  1157. 166.13 s > span warm_up{integrand.name=se1l_mur_shifted}
  1158. 166.13 s > [2026-08-26 08:21:42.528] @process::amplitude INFO : Input is above threshold: 1 existing threshold E-surfaces across 1/1 graph groups
  1159. 166.13 s > field value
  1160. 166.13 s > existing_esurfaces 1
  1161. 166.13 s > group_count 1
  1162. 166.13 s > groups_above_threshold 1
  1163. 166.13 s > integrand se1l_mur_shifted
  1164. 166.13 s > span warm_up{integrand.name=se1l_mur_shifted}
  1165. 166.13 s > threshold_status above threshold
  1166. 166.13 s > [2026-08-26 08:21:42.528] @process::amplitude INFO : overlap structure of group 0: [1: [0(2,3)]]
  1167. 166.13 s > field value
  1168. 166.13 s > span warm_up{integrand.name=se1l_mur_shifted}
  1169. 166.13 s > [2026-08-26 08:21:42.533] @process::amplitude WARNING : External state 0 ('g', PDG 21, helicity +) is off shell: p^2 = +2.5e5, expected m^2 = +0e0 (|Δ| = +2.5e5). Fixed-helicity spinor/vector/tensor external states may be ill-defined at this kinematic point.
  1170. 166.13 s > field value
  1171. 166.13 s > span warm_up{integrand.name=se1l}
  1172. 166.13 s > [2026-08-26 08:21:42.533] @process::amplitude WARNING : External state 1 ('g', PDG 21, helicity -) is off shell: p^2 = +2.5e5, expected m^2 = +0e0 (|Δ| = +2.5e5). Fixed-helicity spinor/vector/tensor external states may be ill-defined at this kinematic point.
  1173. 166.13 s > field value
  1174. 166.13 s > span warm_up{integrand.name=se1l}
  1175. 166.13 s > [2026-08-26 08:21:42.533] @process::amplitude INFO : Input is above threshold: 1 existing threshold E-surfaces across 1/1 graph groups
  1176. 166.13 s > field value
  1177. 166.13 s > existing_esurfaces 1
  1178. 166.13 s > group_count 1
  1179. 166.13 s > groups_above_threshold 1
  1180. 166.13 s > integrand se1l
  1181. 166.13 s > span warm_up{integrand.name=se1l}
  1182. 166.13 s > threshold_status above threshold
  1183. 166.13 s > [2026-08-26 08:21:42.533] @process::amplitude INFO : overlap structure of group 0: [1: [0(2,3)]]
  1184. 166.13 s > field value
  1185. 166.13 s > span warm_up{integrand.name=se1l}
  1186. 166.13 s > [2026-08-26 08:21:42.538] @process::amplitude WARNING : External state 0 ('g', PDG 21, helicity +) is off shell: p^2 = +2.5e5, expected m^2 = +0e0 (|Δ| = +2.5e5). Fixed-helicity spinor/vector/tensor external states may be ill-defined at this kinematic point.
  1187. 166.13 s > field value
  1188. 166.13 s > span warm_up{integrand.name=se1l_mur_shifted}
  1189. 166.13 s > [2026-08-26 08:21:42.538] @process::amplitude WARNING : External state 1 ('g', PDG 21, helicity -) is off shell: p^2 = +2.5e5, expected m^2 = +0e0 (|Δ| = +2.5e5). Fixed-helicity spinor/vector/tensor external states may be ill-defined at this kinematic point.
  1190. 166.13 s > field value
  1191. 166.13 s > span warm_up{integrand.name=se1l_mur_shifted}
  1192. 166.13 s > [2026-08-26 08:21:42.538] @process::amplitude INFO : Input is above threshold: 1 existing threshold E-surfaces across 1/1 graph groups
  1193. 166.13 s > field value
  1194. 166.13 s > existing_esurfaces 1
  1195. 166.13 s > group_count 1
  1196. 166.13 s > groups_above_threshold 1
  1197. 166.13 s > integrand se1l_mur_shifted
  1198. 166.13 s > span warm_up{integrand.name=se1l_mur_shifted}
  1199. 166.13 s > threshold_status above threshold
  1200. 166.13 s > [2026-08-26 08:21:42.538] @process::amplitude INFO : overlap structure of group 0: [1: [0(2,3)]]
  1201. 166.13 s > field value
  1202. 166.13 s > span warm_up{integrand.name=se1l_mur_shifted}
  1203. 166.13 s > [2026-08-26 08:21:42.542] @process::amplitude WARNING : External state 0 ('g', PDG 21, helicity +) is off shell: p^2 = +2.5e5, expected m^2 = +0e0 (|Δ| = +2.5e5). Fixed-helicity spinor/vector/tensor external states may be ill-defined at this kinematic point.
  1204. 166.13 s > field value
  1205. 166.13 s > span warm_up{integrand.name=se1l}
  1206. 166.13 s > [2026-08-26 08:21:42.542] @process::amplitude WARNING : External state 1 ('g', PDG 21, helicity -) is off shell: p^2 = +2.5e5, expected m^2 = +0e0 (|Δ| = +2.5e5). Fixed-helicity spinor/vector/tensor external states may be ill-defined at this kinematic point.
  1207. 166.13 s > field value
  1208. 166.13 s > span warm_up{integrand.name=se1l}
  1209. 166.13 s > [2026-08-26 08:21:42.542] @process::amplitude INFO : Input is above threshold: 1 existing threshold E-surfaces across 1/1 graph groups
  1210. 166.13 s > field value
  1211. 166.13 s > existing_esurfaces 1
  1212. 166.13 s > group_count 1
  1213. 166.13 s > groups_above_threshold 1
  1214. 166.13 s > integrand se1l
  1215. 166.13 s > span warm_up{integrand.name=se1l}
  1216. 166.13 s > threshold_status above threshold
  1217. 166.13 s > [2026-08-26 08:21:42.543] @process::amplitude INFO : overlap structure of group 0: [1: [0(2,3)]]
  1218. 166.13 s > field value
  1219. 166.13 s > span warm_up{integrand.name=se1l}
  1220. 166.13 s > [2026-08-26 08:21:42.547] @process::amplitude WARNING : External state 0 ('g', PDG 21, helicity +) is off shell: p^2 = +2.5e5, expected m^2 = +0e0 (|Δ| = +2.5e5). Fixed-helicity spinor/vector/tensor external states may be ill-defined at this kinematic point.
  1221. 166.13 s > field value
  1222. 166.13 s > span warm_up{integrand.name=se1l_mur_shifted}
  1223. 166.13 s > [2026-08-26 08:21:42.547] @process::amplitude WARNING : External state 1 ('g', PDG 21, helicity -) is off shell: p^2 = +2.5e5, expected m^2 = +0e0 (|Δ| = +2.5e5). Fixed-helicity spinor/vector/tensor external states may be ill-defined at this kinematic point.
  1224. 166.13 s > field value
  1225. 166.13 s > span warm_up{integrand.name=se1l_mur_shifted}
  1226. 166.13 s > [2026-08-26 08:21:42.547] @process::amplitude INFO : Input is above threshold: 1 existing threshold E-surfaces across 1/1 graph groups
  1227. 166.13 s > field value
  1228. 166.13 s > existing_esurfaces 1
  1229. 166.13 s > group_count 1
  1230. 166.13 s > groups_above_threshold 1
  1231. 166.13 s > integrand se1l_mur_shifted
  1232. 166.13 s > span warm_up{integrand.name=se1l_mur_shifted}
  1233. 166.13 s > threshold_status above threshold
  1234. 166.13 s > [2026-08-26 08:21:42.547] @process::amplitude INFO : overlap structure of group 0: [1: [0(2,3)]]
  1235. 166.13 s > field value
  1236. 166.13 s > span warm_up{integrand.name=se1l_mur_shifted}
  1237. 166.13 s > The application panicked (crashed).
  1238. 166.13 s > Message: Integrated UV case failed: se1l
  1239. 166.13 s > Location: tests/tests/uv.rs:1068
  1240. 166.13 s >
  1241. 166.13 s > ━━━━━━━━━━━━━━━━━━━━━━━━━━━━━━━━━━ BACKTRACE ━━━━━━━━━━━━━━━━━━━━━━━━━━━━━━━━━━━
  1242. 166.13 s > 1: <color_eyre[51793ea62743adbd]::config::PanicHook>::panic_report<unknown>
  1243. 166.13 s > at <unknown source file>:<unknown line>
  1244. 166.13 s > 2: <color_eyre[51793ea62743adbd]::config::PanicHook>::into_panic_hook::{closure#0}<unknown>
  1245. 166.13 s > at <unknown source file>:<unknown line>
  1246. 166.13 s > 3: std[bcb96dfbba0ab899]::panicking::panic_with_hook<unknown>
  1247. 166.13 s > at <unknown source file>:<unknown line>
  1248. 166.13 s > 4: std[bcb96dfbba0ab899]::panicking::panic_handler::{closure#0}<unknown>
  1249. 166.13 s > at <unknown source file>:<unknown line>
  1250. 166.13 s > 5: std[bcb96dfbba0ab899]::sys::backtrace::__rust_end_short_backtrace::<std[bcb96dfbba0ab899]::panicking::panic_handler::{closure#0}, !><unknown>
  1251. 166.13 s > at <unknown source file>:<unknown line>
  1252. 166.13 s > 6: __rustc[6c289b9f9c454d21]::rust_begin_unwind<unknown>
  1253. 166.13 s > at <unknown source file>:<unknown line>
  1254. 166.13 s > 7: core[940e698046960fd5]::panicking::panic_fmt<unknown>
  1255. 166.13 s > at <unknown source file>:<unknown line>
  1256. 166.13 s > 8: uv[52cf2b63f0104e31]::run_single_integrated_uv_case<unknown>
  1257. 166.13 s > at <unknown source file>:<unknown line>
  1258. 166.13 s > 9: <uv[52cf2b63f0104e31]::se1l_uv::{closure#0} as core[940e698046960fd5]::ops::function::FnOnce<()>>::call_once<unknown>
  1259. 166.13 s > at <unknown source file>:<unknown line>
  1260. 166.13 s > 10: test[75d6903177b1d7e9]::__rust_begin_short_backtrace::<core[940e698046960fd5]::result::Result<(), alloc[2ea6bcb46fca0c42]::string::String>, fn() -> core[940e698046960fd5]::result::Result<(), alloc[2ea6bcb46fca0c42]::string::String>><unknown>
  1261. 166.13 s > at <unknown source file>:<unknown line>
  1262. 166.13 s > 11: test[75d6903177b1d7e9]::run_test::{closure#0}<unknown>
  1263. 166.13 s > at <unknown source file>:<unknown line>
  1264. 166.13 s > 12: std[bcb96dfbba0ab899]::sys::backtrace::__rust_begin_short_backtrace::<test[75d6903177b1d7e9]::run_test::{closure#1}, ()><unknown>
  1265. 166.13 s > at <unknown source file>:<unknown line>
  1266. 166.13 s > 13: <std[bcb96dfbba0ab899]::thread::lifecycle::spawn_unchecked<test[75d6903177b1d7e9]::run_test::{closure#1}, ()>::{closure#1} as core[940e698046960fd5]::ops::function::FnOnce<()>>::call_once::{shim:vtable#0}<unknown>
  1267. 166.13 s > at <unknown source file>:<unknown line>
  1268. 166.13 s > 14: <std[bcb96dfbba0ab899]::sys::thread::unix::Thread>::new::thread_start<unknown>
  1269. 166.13 s > at <unknown source file>:<unknown line>
  1270. 166.13 s > 15: start_thread<unknown>
  1271. 166.13 s > at <unknown source file>:<unknown line>
  1272. 166.13 s > 16: __clone3<unknown>
  1273. 166.13 s > at <unknown source file>:<unknown line>
  1274. 166.13 s >
  1275. 166.13 s > Run with COLORBT_SHOW_HIDDEN=1 environment variable to disable frame filtering.
  1276. 166.13 s > Run with RUST_BACKTRACE=full to include source snippets.
  1277. 166.13 s >
  1278. 166.13 s > error: test run failed
  1279. 166.13 s >
  1280. 166.13 s > ========== nextest test summary ==========
  1281. 166.13 s > report: target/nextest/ci_gammaloop/junit.xml
  1282. 166.13 s > tests: 106, failures: 9, errors: 0
  1283. 166.13 s >
  1284. 166.13 s > 1. gammaloop-integration-tests::test_runs::approach::approach_momentum_space_reports_incomplete_triplet_cleanly
  1285. 166.13 s > failure: test failure with exit code 101
  1286. 166.13 s > system-out
  1287. 166.13 s > running 1 test
  1288. 166.13 s > test approach::approach_momentum_space_reports_incomplete_triplet_cleanly ... FAILED
  1289. 166.13 s >
  1290. 166.13 s > failures:
  1291. 166.13 s >
  1292. 166.13 s > failures:
  1293. 166.13 s > approach::approach_momentum_space_reports_incomplete_triplet_cleanly
  1294. 166.13 s >
  1295. 166.13 s > test result: FAILED. 0 passed; 1 failed; 0 ignored; 0 measured; 82 filtered out; finished in 1.21s
  1296. 166.13 s > system-err
  1297. 166.13 s > [2026-08-26 08:19:31.386] @gammaloop_api::se... INFO : Running command import model scalars-default.json
  1298. 166.13 s > [2026-08-26 08:19:31.387] @import::model INFO : Loading built-in JSON model scalars-default
  1299. 166.13 s > [2026-08-26 08:19:31.398] @gammalooprs::model INFO : The following 2 external parameters were forced to zero by the restriction card:
  1300. 166.13 s > width_scalar_1, width_scalar_2
  1301. 166.13 s > [2026-08-26 08:19:31.399] @gammaloop_api::se... INFO : Running command remove processes
  1302. 166.13 s > [2026-08-26 08:19:31.400] @gammaloop_api::se... INFO : Running command generate amp scalar_1 > scalar_0 scalar_0 [{1}] --allowed-vertex-interactions V_3_SCALAR_022 V_3_SCALAR_122 -p triangle -i scalar_tri
  1303. 166.13 s > [2026-08-26 08:19:31.402] @feyngen::diagram_... INFO : 0s | Δ=0s | Starting Feynman graph generation with Symbolica...
  1304. 166.13 s > [2026-08-26 08:19:31.402] @feyngen::diagram_... INFO : 0s | Δ=0s | Number of graphs resulting from Symbolica generation: 1
  1305. 166.13 s > [2026-08-26 08:19:31.402] @feyngen::diagram_... INFO : 0s | Δ=0s | Number of graphs retained after removal of vetoed topologies: 1
  1306. 166.13 s > [2026-08-26 08:19:31.404] @feyngen::diagram_... INFO : 0s | Δ=0s | Number of graphs after vertex info assignment: 1
  1307. 166.13 s > [2026-08-26 08:19:31.404] @feyngen::diagram_... INFO : 0s | Δ=0s | Number of graphs after all complete graphs filters are applied: 1
  1308. 166.13 s > [2026-08-26 08:19:31.407] @feyngen::diagram_... INFO : 0s | Δ=0s | Number of graphs after closed fermion chains analysis: 1
  1309. 166.13 s > [2026-08-26 08:19:31.407] @feyngen::diagram_... INFO : 0s | Δ=0s | Number of graphs after symmetrization of external states: 1
  1310. 166.13 s > [2026-08-26 08:19:31.411] @feyngen::diagram_... INFO : 0s | Δ=0s | Number of graphs after canonization of vertices, edges and flows (graph labels assigned here): 1
  1311. 166.13 s > [2026-08-26 08:19:31.427] @feyngen::diagram_... INFO : 0s | Δ=0s | Number of graphs after numerator-aware grouping with strategy 'up to a scalar rescaling': 1 (1 isomorphically unique graph, 0 color zero, 0 lorentz zero, 0 grouped and 0 cancellation)
  1312. 166.13 s > [2026-08-26 08:19:31.427] @feyngen::diagram_... INFO : ( Sum of the symmetry factors from each graph generated = 1 )
  1313. 166.13 s > [2026-08-26 08:19:31.427] @commands::generate INFO : Generated amplitude 1 graphs.
  1314. 166.13 s > [2026-08-26 08:19:31.521] @settings::runtime WARNING : No external kinematics were provided; using default-generated external momenta and helicities.
  1315. 166.13 s > [2026-08-26 08:19:31.539] @commands::generate INFO :
  1316. 166.13 s > Integrand generation summary
  1317. 166.13 s > peak RAM 65.74 MiB | cores 1
  1318. 166.13 s > ╭────────────┬───────┬─────────┬────────────┬────────────┬────────────────┬─────────────╮
  1319. 166.13 s > │ integrand │ graph │ # evals │ expr build │ spenso │ symbolica eval │ compile │
  1320. 166.13 s > ├────────────┼───────┼─────────┼────────────┼────────────┼────────────────┼─────────────┤
  1321. 166.13 s > │ scalar_tri │ GL0 │ 9 │ 64ms (72%) │ 3ms (3.8%) │ 21ms (25%) │ 0ms (0.00%) │
  1322. 166.13 s > ├────────────┼───────┼─────────┼────────────┼────────────┼────────────────┼─────────────┤
  1323. 166.13 s > │ Total │ │ 9 │ 64ms (72%) │ 3ms (3.8%) │ 21ms (25%) │ 0ms (0.00%) │
  1324. 166.13 s > ╰────────────┴───────┴─────────┴────────────┴────────────┴────────────────┴─────────────╯
  1325. 166.13 s > [2026-08-26 08:19:31.541] @gammaloop_api::se... INFO : Running command generate amp scalar_0 scalar_0 > scalar_0 scalar_0 [{1}] --allowed-vertex-interactions V_3_SCALAR_022 -p box -i scalar_box --select-graphs GL0
  1326. 166.13 s > [2026-08-26 08:19:31.545] @feyngen::diagram_... INFO : 0s | Δ=0s | Starting Feynman graph generation with Symbolica...
  1327. 166.13 s > [2026-08-26 08:19:31.545] @feyngen::diagram_... INFO : 0s | Δ=0s | Number of graphs resulting from Symbolica generation: 3
  1328. 166.13 s > [2026-08-26 08:19:31.549] @feyngen::diagram_... INFO : 0s | Δ=0s | Number of graphs retained after removal of vetoed topologies: 3
  1329. 166.13 s > [2026-08-26 08:19:31.553] @feyngen::diagram_... INFO : 0s | Δ=0s | Number of graphs after vertex info assignment: 3
  1330. 166.13 s > [2026-08-26 08:19:31.553] @feyngen::diagram_... INFO : 0s | Δ=0s | Number of graphs after all complete graphs filters are applied: 3
  1331. 166.13 s > [2026-08-26 08:19:31.559] @feyngen::diagram_... INFO : 0s | Δ=0s | Number of graphs after closed fermion chains analysis: 3
  1332. 166.13 s > [2026-08-26 08:19:31.559] @feyngen::diagram_... INFO : 0s | Δ=0s | Number of graphs after symmetrization of external states: 3
  1333. 166.13 s > [2026-08-26 08:19:31.565] @feyngen::diagram_... INFO : 0s | Δ=0s | Number of graphs after canonization of vertices, edges and flows (graph labels assigned here): 3
  1334. 166.13 s > [2026-08-26 08:19:31.586] @feyngen::diagram_... INFO : 0s | Δ=0s | Number of graphs after numerator-aware grouping with strategy 'up to a scalar rescaling': 1 (1 isomorphically unique graph, 0 color zero, 0 lorentz zero, 0 grouped and 0 cancellation)
  1335. 166.13 s > [2026-08-26 08:19:31.586] @feyngen::diagram_... INFO : ( Sum of the symmetry factors from each graph generated = 1 )
  1336. 166.13 s > [2026-08-26 08:19:31.587] @commands::generate INFO : Generated amplitude 1 graphs.
  1337. 166.13 s > [2026-08-26 08:19:31.896] @settings::runtime WARNING : No external kinematics were provided; using default-generated external momenta and helicities.
  1338. 166.13 s > [2026-08-26 08:19:31.914] @commands::generate INFO :
  1339. 166.13 s > Integrand generation summary
  1340. 166.13 s > peak RAM 69.82 MiB | cores 1
  1341. 166.13 s > ╭────────────┬───────┬─────────┬─────────────┬─────────────┬────────────────┬─────────────╮
  1342. 166.13 s > │ integrand │ graph │ # evals │ expr build │ spenso │ symbolica eval │ compile │
  1343. 166.13 s > ├────────────┼───────┼─────────┼─────────────┼─────────────┼────────────────┼─────────────┤
  1344. 166.13 s > │ scalar_box │ GL0 │ 13 │ 158ms (53%) │ 29ms (9.9%) │ 109ms (37%) │ 0ms (0.00%) │
  1345. 166.13 s > ├────────────┼───────┼─────────┼─────────────┼─────────────┼────────────────┼─────────────┤
  1346. 166.13 s > │ Total │ │ 13 │ 158ms (53%) │ 29ms (9.9%) │ 109ms (37%) │ 0ms (0.00%) │
  1347. 166.13 s > ╰────────────┴───────┴─────────┴─────────────┴─────────────┴────────────────┴─────────────╯
  1348. 166.13 s > [2026-08-26 08:19:31.916] @gammaloop_api::se... INFO : Running command generate
  1349. 166.13 s > [2026-08-26 08:19:32.302] @settings::runtime WARNING : No external kinematics were provided; using default-generated external momenta and helicities.
  1350. 166.13 s > [2026-08-26 08:19:32.443] @settings::runtime WARNING : No external kinematics were provided; using default-generated external momenta and helicities.
  1351. 166.13 s > [2026-08-26 08:19:32.458] @commands::generate INFO :
  1352. 166.13 s > Integrand generation summary
  1353. 166.13 s > peak RAM 71.57 MiB | cores 1
  1354. 166.13 s > ╭────────────┬───────┬─────────┬─────────────┬─────────────┬────────────────┬─────────────╮
  1355. 166.13 s > │ integrand │ graph │ # evals │ expr build │ spenso │ symbolica eval │ compile │
  1356. 166.13 s > ├────────────┼───────┼─────────┼─────────────┼─────────────┼────────────────┼─────────────┤
  1357. 166.13 s > │ scalar_tri │ GL0 │ 9 │ 155ms (82%) │ 15ms (8.2%) │ 19ms (10%) │ 0ms (0.00%) │
  1358. 166.13 s > │ scalar_box │ GL0 │ 13 │ 182ms (58%) │ 23ms (7.6%) │ 108ms (34%) │ 0ms (0.00%) │
  1359. 166.13 s > ├────────────┼───────┼─────────┼─────────────┼─────────────┼────────────────┼─────────────┤
  1360. 166.13 s > │ Total │ │ 22 │ 337ms (67%) │ 39ms (7.8%) │ 128ms (25%) │ 0ms (0.00%) │
  1361. 166.13 s > ╰────────────┴───────┴─────────┴─────────────┴─────────────┴────────────────┴─────────────╯
  1362. 166.13 s > [2026-08-26 08:19:32.459] @gammaloop_api::se... INFO : Running command set model mass_scalar_2=2.0
  1363. 166.13 s > [2026-08-26 08:19:32.460] @gammaloop_api::se... INFO : Running command set model mass_scalar_1=1.0
  1364. 166.13 s > [2026-08-26 08:19:32.461] @gammaloop_api::se... INFO : Running command set process -p triangle -i scalar_tri string '
  1365. 166.13 s > [kinematics.externals]
  1366. 166.13 s > type = "constant"
  1367. 166.13 s >
  1368. 166.13 s > [kinematics.externals.data]
  1369. 166.13 s > [...]
  1370. 166.13 s > [2026-08-26 08:19:32.462] @gammaloop_api::se... INFO : Running command set process -p box -i scalar_box string '
  1371. 166.13 s > [kinematics.externals]
  1372. 166.13 s > type = "constant"
  1373. 166.13 s >
  1374. 166.13 s > [kinematics.externals.data]
  1375. 166.13 s > [...]
  1376. 166.13 s > [2026-08-26 08:19:32.463] @gammaloop_api::se... INFO : Running command approach -x 1.0000000000000001e-1,2.0000000000000001e-1,2.9999999999999999e-1,4.0000000000000002e-1 --approach-axis 1.0000000000000000e-3,0.0000000000000000e0,0.0000000000000000e0,0.0000000000000000e0 --n-points 1 --n-cores 1 --output-results /build/source/tests/artifacts/scalar_box_invalid_momentum_approach/approach_momentum.json --momentum-space --graph-id 0
  1377. 166.13 s > The application panicked (crashed).
  1378. 166.13 s > Message: There are 2 processes available. Please specify a process.
  1379. 166.13 s > Location: tests/tests/test_runs/approach.rs:332
  1380. 166.13 s >
  1381. 166.13 s > ━━━━━━━━━━━━━━━━━━━━━━━━━━━━━━━━━━ BACKTRACE ━━━━━━━━━━━━━━━━━━━━━━━━━━━━━━━━━━━
  1382. 166.13 s > 1: <color_eyre[51793ea62743adbd]::config::PanicHook>::panic_report<unknown>
  1383. 166.13 s > at <unknown source file>:<unknown line>
  1384. 166.13 s > 2: <color_eyre[51793ea62743adbd]::config::PanicHook>::into_panic_hook::{closure#0}<unknown>
  1385. 166.13 s > at <unknown source file>:<unknown line>
  1386. 166.13 s > 3: std[bcb96dfbba0ab899]::panicking::panic_with_hook<unknown>
  1387. 166.13 s > at <unknown source file>:<unknown line>
  1388. 166.13 s > 4: std[bcb96dfbba0ab899]::panicking::panic_handler::{closure#0}<unknown>
  1389. 166.13 s > at <unknown source file>:<unknown line>
  1390. 166.13 s > 5: std[bcb96dfbba0ab899]::sys::backtrace::__rust_end_short_backtrace::<std[bcb96dfbba0ab899]::panicking::panic_handler::{closure#0}, !><unknown>
  1391. 166.13 s > at <unknown source file>:<unknown line>
  1392. 166.13 s > 6: __rustc[6c289b9f9c454d21]::rust_begin_unwind<unknown>
  1393. 166.13 s > at <unknown source file>:<unknown line>
  1394. 166.13 s > 7: core[940e698046960fd5]::panicking::panic_fmt<unknown>
  1395. 166.13 s > at <unknown source file>:<unknown line>
  1396. 166.13 s > 8: test_runs[3e7a390caee4e338]::approach::approach_momentum_space_reports_incomplete_triplet_cleanly<unknown>
  1397. 166.13 s > at <unknown source file>:<unknown line>
  1398. 166.13 s > 9: <test_runs[3e7a390caee4e338]::approach::approach_momentum_space_reports_incomplete_triplet_cleanly::{closure#0} as core[940e698046960fd5]::ops::function::FnOnce<()>>::call_once<unknown>
  1399. 166.13 s > at <unknown source file>:<unknown line>
  1400. 166.13 s > 10: test[75d6903177b1d7e9]::__rust_begin_short_backtrace::<core[940e698046960fd5]::result::Result<(), alloc[2ea6bcb46fca0c42]::string::String>, fn() -> core[940e698046960fd5]::result::Result<(), alloc[2ea6bcb46fca0c42]::string::String>><unknown>
  1401. 166.13 s > at <unknown source file>:<unknown line>
  1402. 166.13 s > 11: test[75d6903177b1d7e9]::run_test::{closure#0}<unknown>
  1403. 166.13 s > at <unknown source file>:<unknown line>
  1404. 166.13 s > 12: std[bcb96dfbba0ab899]::sys::backtrace::__rust_begin_short_backtrace::<test[75d6903177b1d7e9]::run_test::{closure#1}, ()><unknown>
  1405. 166.13 s > at <unknown source file>:<unknown line>
  1406. 166.13 s > 13: <std[bcb96dfbba0ab899]::thread::lifecycle::spawn_unchecked<test[75d6903177b1d7e9]::run_test::{closure#1}, ()>::{closure#1} as core[940e698046960fd5]::ops::function::FnOnce<()>>::call_once::{shim:vtable#0}<unknown>
  1407. 166.13 s > at <unknown source file>:<unknown line>
  1408. 166.13 s > 14: <std[bcb96dfbba0ab899]::sys::thread::unix::Thread>::new::thread_start<unknown>
  1409. 166.13 s > at <unknown source file>:<unknown line>
  1410. 166.13 s > 15: start_thread<unknown>
  1411. 166.13 s > at <unknown source file>:<unknown line>
  1412. 166.13 s > 16: __clone3<unknown>
  1413. 166.13 s > at <unknown source file>:<unknown line>
  1414. 166.13 s >
  1415. 166.13 s > Run with COLORBT_SHOW_HIDDEN=1 environment variable to disable frame filtering.
  1416. 166.13 s > ... omitted 1 more lines; see full nextest output above
  1417. 166.13 s >
  1418. 166.13 s > 2. gammaloop-integration-tests::test_runs::profile_bulk::dotted_bubble_amp_bulk_profile_passes
  1419. 166.13 s > failure: test failure with exit code 101
  1420. 166.13 s > Error:
  1421. 166.13 s > 0: IR profiling requested arbitrary precision but received a quad-precision result
  1422. 166.13 s >
  1423. 166.13 s > Location:
  1424. 166.13 s > crates/gammalooprs/src/integrands/process/ir.rs:2123
  1425. 166.13 s >
  1426. 166.13 s > ━━━━━━━━━━━━━━━━━━━━━━━━━━━━━━━━━━ BACKTRACE ━━━━━━━━━━━━━━━━━━━━━━━━━━━━━━━━━━━
  1427. 166.13 s > 1: <color_eyre[51793ea62743adbd]::config::EyreHook>::into_eyre_hook::{closure#0}<unknown>
  1428. 166.13 s > at <unknown source file>:<unknown line>
  1429. 166.13 s > 2: eyre[cb2fd339c0c40fca]::capture_handler<unknown>
  1430. 166.13 s > at <unknown source file>:<unknown line>
  1431. 166.13 s > 3: eyre[cb2fd339c0c40fca]::private::format_err<unknown>
  1432. 166.13 s > at <unknown source file>:<unknown line>
  1433. 166.13 s > 4: gammalooprs[d7a7c067ebd19583]::integrands::process::ir::evaluate_profile_momentum_point_arb::<gammalooprs[d7a7c067ebd19583]::integrands::process::amplitude::AmplitudeIntegrand><unknown>
  1434. 166.13 s > at <unknown source file>:<unknown line>
  1435. 166.13 s > 5: <gammalooprs[d7a7c067ebd19583]::integrands::process::amplitude::AmplitudeIntegrand>::test_single_ir_limit_impl<unknown>
  1436. 166.13 s > at <unknown source file>:<unknown line>
  1437. 166.13 s > 6: gammalooprs[d7a7c067ebd19583]::integrands::process::ir::run_ir_profile::<gammalooprs[d7a7c067ebd19583]::integrands::process::amplitude::AmplitudeIntegrand, <gammalooprs[d7a7c067ebd19583]::integrands::process::amplitude::AmplitudeIntegrand>::enumerate_ir_limits, <gammalooprs[d7a7c067ebd19583]::integrands::process::amplitude::AmplitudeIntegrand>::graph_cut_definitions, <gammalooprs[d7a7c067ebd19583]::integrands::process::amplitude::AmplitudeIntegrand>::test_single_ir_limit_impl><unknown>
  1438. 166.13 s > at <unknown source file>:<unknown line>
  1439. 166.13 s > 7: <gammalooprs[d7a7c067ebd19583]::integrands::process::amplitude::AmplitudeIntegrand>::test_ir<unknown>
  1440. 166.13 s > at <unknown source file>:<unknown line>
  1441. 166.13 s > 8: <gammaloop_api[92ae732909e47e14]::commands::profile::Profile>::run<unknown>
  1442. 166.13 s > at <unknown source file>:<unknown line>
  1443. 166.13 s > 9: test_runs[3e7a390caee4e338]::profile_bulk::dotted_bubble_amp_bulk_profile_passes<unknown>
  1444. 166.13 s > at <unknown source file>:<unknown line>
  1445. 166.13 s > 10: <test_runs[3e7a390caee4e338]::profile_bulk::dotted_bubble_amp_bulk_profile_passes::{closure#0} as core[940e698046960fd5]::ops::function::FnOnce<()>>::call_once<unknown>
  1446. 166.13 s > at <unknown source file>:<unknown line>
  1447. 166.13 s > 11: test[75d6903177b1d7e9]::__rust_begin_short_backtrace::<core[940e698046960fd5]::result::Result<(), alloc[2ea6bcb46fca0c42]::string::String>, fn() -> core[940e698046960fd5]::result::Result<(), alloc[2ea6bcb46fca0c42]::string::String>><unknown>
  1448. 166.13 s > at <unknown source file>:<unknown line>
  1449. 166.13 s > 12: test[75d6903177b1d7e9]::run_test::{closure#0}<unknown>
  1450. 166.13 s > at <unknown source file>:<unknown line>
  1451. 166.13 s > 13: std[bcb96dfbba0ab899]::sys::backtrace::__rust_begin_short_backtrace::<test[75d6903177b1d7e9]::run_test::{closure#1}, ()><unknown>
  1452. 166.13 s > at <unknown source file>:<unknown line>
  1453. 166.13 s > 14: <std[bcb96dfbba0ab899]::thread::lifecycle::spawn_unchecked<test[75d6903177b1d7e9]::run_test::{closure#1}, ()>::{closure#1} as core[940e698046960fd5]::ops::function::FnOnce<()>>::call_once::{shim:vtable#0}<unknown>
  1454. 166.13 s > at <unknown source file>:<unknown line>
  1455. 166.13 s > 15: <std[bcb96dfbba0ab899]::sys::thread::unix::Thread>::new::thread_start<unknown>
  1456. 166.13 s > at <unknown source file>:<unknown line>
  1457. 166.13 s > 16: start_thread<unknown>
  1458. 166.13 s > at <unknown source file>:<unknown line>
  1459. 166.13 s > 17: __clone3<unknown>
  1460. 166.13 s > at <unknown source file>:<unknown line>
  1461. 166.13 s >
  1462. 166.13 s > Run with COLORBT_SHOW_HIDDEN=1 environment variable to disable frame filtering.
  1463. 166.13 s > Run with RUST_BACKTRACE=full to include source snippets.
  1464. 166.13 s > Warning: SpanTrace capture is Unsupported.
  1465. 166.13 s > Ensure that you've setup a tracing-error ErrorLayer and the semver versions are compatible
  1466. 166.13 s > system-out
  1467. 166.13 s > running 1 test
  1468. 166.13 s > test profile_bulk::dotted_bubble_amp_bulk_profile_passes ... FAILED
  1469. 166.13 s >
  1470. 166.13 s > failures:
  1471. 166.13 s >
  1472. 166.13 s > failures:
  1473. 166.13 s > profile_bulk::dotted_bubble_amp_bulk_profile_passes
  1474. 166.13 s >
  1475. 166.13 s > test result: FAILED. 0 passed; 1 failed; 0 ignored; 0 measured; 82 filtered out; finished in 0.36s
  1476. 166.13 s > system-err
  1477. 166.13 s > [2026-08-26 08:19:34.668] @gammaloop_api::se... INFO : Running command import model ./assets/models/json/scalars/scalars_2p_3p.json
  1478. 166.13 s > [2026-08-26 08:19:34.668] @import::model INFO : Loading JSON model scalars_2p_3p-default from /build/source/assets/models/json/scalars/scalars_2p_3p
  1479. 166.13 s > [2026-08-26 08:19:34.671] @gammaloop_api::se... INFO : Running command import graphs ./tests/resources/graphs/dotted_bubble_amp.dot
  1480. 166.13 s > [2026-08-26 08:19:34.671] @commands::import INFO : Loading graphs from '/build/source/tests/resources/graphs/dotted_bubble_amp.dot'
  1481. 166.13 s > [2026-08-26 08:19:34.675] @gammaloop_api::se... INFO : Running command generate
  1482. 166.13 s > [2026-08-26 08:19:34.786] @commands::generate INFO :
  1483. 166.13 s > Integrand generation summary
  1484. 166.13 s > peak RAM 62.05 MiB | cores 1
  1485. 166.13 s > ╭───────────┬───────────────────┬─────────┬────────────┬────────────┬────────────────┬─────────────╮
  1486. 166.13 s > │ integrand │ graph │ # evals │ expr build │ spenso │ symbolica eval │ compile │
  1487. 166.13 s > ├───────────┼───────────────────┼─────────┼────────────┼────────────┼────────────────┼─────────────┤
  1488. 166.13 s > │ default │ dotted_bubble_amp │ 8 │ 24ms (64%) │ 1ms (3.8%) │ 12ms (32%) │ 0ms (0.00%) │
  1489. 166.13 s > ├───────────┼───────────────────┼─────────┼────────────┼────────────┼────────────────┼─────────────┤
  1490. 166.13 s > │ Total │ │ 8 │ 24ms (64%) │ 1ms (3.8%) │ 12ms (32%) │ 0ms (0.00%) │
  1491. 166.13 s > ╰───────────┴───────────────────┴─────────┴────────────┴────────────┴────────────────┴─────────────╯
  1492. 166.13 s > [2026-08-26 08:19:34.788] @process::amplitude INFO : Input is above threshold: 1 existing threshold E-surfaces across 1/1 graph groups
  1493. 166.13 s > [2026-08-26 08:19:34.788] @process::amplitude INFO : overlap structure of group 0: [1: [1(1,3)]]
  1494. 166.13 s > Error:
  1495. 166.13 s > 0: IR profiling requested arbitrary precision but received a quad-precision result
  1496. 166.13 s >
  1497. 166.13 s > Location:
  1498. 166.13 s > crates/gammalooprs/src/integrands/process/ir.rs:2123
  1499. 166.13 s >
  1500. 166.13 s > ━━━━━━━━━━━━━━━━━━━━━━━━━━━━━━━━━━ BACKTRACE ━━━━━━━━━━━━━━━━━━━━━━━━━━━━━━━━━━━
  1501. 166.13 s > 1: <color_eyre[51793ea62743adbd]::config::EyreHook>::into_eyre_hook::{closure#0}<unknown>
  1502. 166.13 s > at <unknown source file>:<unknown line>
  1503. 166.13 s > 2: eyre[cb2fd339c0c40fca]::capture_handler<unknown>
  1504. 166.13 s > at <unknown source file>:<unknown line>
  1505. 166.13 s > 3: eyre[cb2fd339c0c40fca]::private::format_err<unknown>
  1506. 166.13 s > at <unknown source file>:<unknown line>
  1507. 166.13 s > 4: gammalooprs[d7a7c067ebd19583]::integrands::process::ir::evaluate_profile_momentum_point_arb::<gammalooprs[d7a7c067ebd19583]::integrands::process::amplitude::AmplitudeIntegrand><unknown>
  1508. 166.13 s > at <unknown source file>:<unknown line>
  1509. 166.13 s > 5: <gammalooprs[d7a7c067ebd19583]::integrands::process::amplitude::AmplitudeIntegrand>::test_single_ir_limit_impl<unknown>
  1510. 166.13 s > at <unknown source file>:<unknown line>
  1511. 166.13 s > 6: gammalooprs[d7a7c067ebd19583]::integrands::process::ir::run_ir_profile::<gammalooprs[d7a7c067ebd19583]::integrands::process::amplitude::AmplitudeIntegrand, <gammalooprs[d7a7c067ebd19583]::integrands::process::amplitude::AmplitudeIntegrand>::enumerate_ir_limits, <gammalooprs[d7a7c067ebd19583]::integrands::process::amplitude::AmplitudeIntegrand>::graph_cut_definitions, <gammalooprs[d7a7c067ebd19583]::integrands::process::amplitude::AmplitudeIntegrand>::test_single_ir_limit_impl><unknown>
  1512. 166.13 s > at <unknown source file>:<unknown line>
  1513. 166.13 s > 7: <gammalooprs[d7a7c067ebd19583]::integrands::process::amplitude::AmplitudeIntegrand>::test_ir<unknown>
  1514. 166.13 s > at <unknown source file>:<unknown line>
  1515. 166.13 s > 8: <gammaloop_api[92ae732909e47e14]::commands::profile::Profile>::run<unknown>
  1516. 166.13 s > at <unknown source file>:<unknown line>
  1517. 166.13 s > 9: test_runs[3e7a390caee4e338]::profile_bulk::dotted_bubble_amp_bulk_profile_passes<unknown>
  1518. 166.13 s > at <unknown source file>:<unknown line>
  1519. 166.13 s > 10: <test_runs[3e7a390caee4e338]::profile_bulk::dotted_bubble_amp_bulk_profile_passes::{closure#0} as core[940e698046960fd5]::ops::function::FnOnce<()>>::call_once<unknown>
  1520. 166.13 s > at <unknown source file>:<unknown line>
  1521. 166.13 s > 11: test[75d6903177b1d7e9]::__rust_begin_short_backtrace::<core[940e698046960fd5]::result::Result<(), alloc[2ea6bcb46fca0c42]::string::String>, fn() -> core[940e698046960fd5]::result::Result<(), alloc[2ea6bcb46fca0c42]::string::String>><unknown>
  1522. 166.13 s > at <unknown source file>:<unknown line>
  1523. 166.13 s > 12: test[75d6903177b1d7e9]::run_test::{closure#0}<unknown>
  1524. 166.13 s > at <unknown source file>:<unknown line>
  1525. 166.13 s > 13: std[bcb96dfbba0ab899]::sys::backtrace::__rust_begin_short_backtrace::<test[75d6903177b1d7e9]::run_test::{closure#1}, ()><unknown>
  1526. 166.13 s > at <unknown source file>:<unknown line>
  1527. 166.13 s > 14: <std[bcb96dfbba0ab899]::thread::lifecycle::spawn_unchecked<test[75d6903177b1d7e9]::run_test::{closure#1}, ()>::{closure#1} as core[940e698046960fd5]::ops::function::FnOnce<()>>::call_once::{shim:vtable#0}<unknown>
  1528. 166.13 s > at <unknown source file>:<unknown line>
  1529. 166.13 s > 15: <std[bcb96dfbba0ab899]::sys::thread::unix::Thread>::new::thread_start<unknown>
  1530. 166.13 s > at <unknown source file>:<unknown line>
  1531. 166.13 s > 16: start_thread<unknown>
  1532. 166.13 s > at <unknown source file>:<unknown line>
  1533. 166.13 s > 17: __clone3<unknown>
  1534. 166.13 s > at <unknown source file>:<unknown line>
  1535. 166.13 s >
  1536. 166.13 s > Run with COLORBT_SHOW_HIDDEN=1 environment variable to disable frame filtering.
  1537. 166.13 s > Run with RUST_BACKTRACE=full to include source snippets.
  1538. 166.13 s > Warning: SpanTrace capture is Unsupported.
  1539. 166.13 s > Ensure that you've setup a tracing-error ErrorLayer and the semver versions are compatible
  1540. 166.13 s >
  1541. 166.13 s > 3. gammaloop-integration-tests::test_runs::profile_bulk::massless_triangle_bulk_profile_passes
  1542. 166.13 s > failure: test failure with exit code 101
  1543. 166.13 s > Error:
  1544. 166.13 s > 0: IR profiling requested arbitrary precision but received a quad-precision result
  1545. 166.13 s >
  1546. 166.13 s > Location:
  1547. 166.13 s > crates/gammalooprs/src/integrands/process/ir.rs:2123
  1548. 166.13 s >
  1549. 166.13 s > ━━━━━━━━━━━━━━━━━━━━━━━━━━━━━━━━━━ BACKTRACE ━━━━━━━━━━━━━━━━━━━━━━━━━━━━━━━━━━━
  1550. 166.13 s > 1: <color_eyre[51793ea62743adbd]::config::EyreHook>::into_eyre_hook::{closure#0}<unknown>
  1551. 166.13 s > at <unknown source file>:<unknown line>
  1552. 166.13 s > 2: eyre[cb2fd339c0c40fca]::capture_handler<unknown>
  1553. 166.13 s > at <unknown source file>:<unknown line>
  1554. 166.13 s > 3: eyre[cb2fd339c0c40fca]::private::format_err<unknown>
  1555. 166.13 s > at <unknown source file>:<unknown line>
  1556. 166.13 s > 4: gammalooprs[d7a7c067ebd19583]::integrands::process::ir::evaluate_profile_momentum_point_arb::<gammalooprs[d7a7c067ebd19583]::integrands::process::amplitude::AmplitudeIntegrand><unknown>
  1557. 166.13 s > at <unknown source file>:<unknown line>
  1558. 166.13 s > 5: <gammalooprs[d7a7c067ebd19583]::integrands::process::amplitude::AmplitudeIntegrand>::test_single_ir_limit_impl<unknown>
  1559. 166.13 s > at <unknown source file>:<unknown line>
  1560. 166.13 s > 6: gammalooprs[d7a7c067ebd19583]::integrands::process::ir::run_ir_profile::<gammalooprs[d7a7c067ebd19583]::integrands::process::amplitude::AmplitudeIntegrand, <gammalooprs[d7a7c067ebd19583]::integrands::process::amplitude::AmplitudeIntegrand>::enumerate_ir_limits, <gammalooprs[d7a7c067ebd19583]::integrands::process::amplitude::AmplitudeIntegrand>::graph_cut_definitions, <gammalooprs[d7a7c067ebd19583]::integrands::process::amplitude::AmplitudeIntegrand>::test_single_ir_limit_impl><unknown>
  1561. 166.13 s > at <unknown source file>:<unknown line>
  1562. 166.13 s > 7: <gammalooprs[d7a7c067ebd19583]::integrands::process::amplitude::AmplitudeIntegrand>::test_ir<unknown>
  1563. 166.13 s > at <unknown source file>:<unknown line>
  1564. 166.13 s > 8: <gammaloop_api[92ae732909e47e14]::commands::profile::Profile>::run<unknown>
  1565. 166.13 s > at <unknown source file>:<unknown line>
  1566. 166.13 s > 9: test_runs[3e7a390caee4e338]::profile_bulk::massless_triangle_bulk_profile_passes<unknown>
  1567. 166.13 s > at <unknown source file>:<unknown line>
  1568. 166.13 s > 10: <test_runs[3e7a390caee4e338]::profile_bulk::massless_triangle_bulk_profile_passes::{closure#0} as core[940e698046960fd5]::ops::function::FnOnce<()>>::call_once<unknown>
  1569. 166.13 s > at <unknown source file>:<unknown line>
  1570. 166.13 s > 11: test[75d6903177b1d7e9]::__rust_begin_short_backtrace::<core[940e698046960fd5]::result::Result<(), alloc[2ea6bcb46fca0c42]::string::String>, fn() -> core[940e698046960fd5]::result::Result<(), alloc[2ea6bcb46fca0c42]::string::String>><unknown>
  1571. 166.13 s > at <unknown source file>:<unknown line>
  1572. 166.13 s > 12: test[75d6903177b1d7e9]::run_test::{closure#0}<unknown>
  1573. 166.13 s > at <unknown source file>:<unknown line>
  1574. 166.13 s > 13: std[bcb96dfbba0ab899]::sys::backtrace::__rust_begin_short_backtrace::<test[75d6903177b1d7e9]::run_test::{closure#1}, ()><unknown>
  1575. 166.13 s > at <unknown source file>:<unknown line>
  1576. 166.13 s > 14: <std[bcb96dfbba0ab899]::thread::lifecycle::spawn_unchecked<test[75d6903177b1d7e9]::run_test::{closure#1}, ()>::{closure#1} as core[940e698046960fd5]::ops::function::FnOnce<()>>::call_once::{shim:vtable#0}<unknown>
  1577. 166.13 s > at <unknown source file>:<unknown line>
  1578. 166.13 s > 15: <std[bcb96dfbba0ab899]::sys::thread::unix::Thread>::new::thread_start<unknown>
  1579. 166.13 s > at <unknown source file>:<unknown line>
  1580. 166.13 s > 16: start_thread<unknown>
  1581. 166.13 s > at <unknown source file>:<unknown line>
  1582. 166.13 s > 17: __clone3<unknown>
  1583. 166.13 s > at <unknown source file>:<unknown line>
  1584. 166.13 s >
  1585. 166.13 s > Run with COLORBT_SHOW_HIDDEN=1 environment variable to disable frame filtering.
  1586. 166.13 s > Run with RUST_BACKTRACE=full to include source snippets.
  1587. 166.13 s > Warning: SpanTrace capture is Unsupported.
  1588. 166.13 s > Ensure that you've setup a tracing-error ErrorLayer and the semver versions are compatible
  1589. 166.13 s > system-out
  1590. 166.13 s > running 1 test
  1591. 166.13 s > test profile_bulk::massless_triangle_bulk_profile_passes ... FAILED
  1592. 166.13 s >
  1593. 166.13 s > failures:
  1594. 166.13 s >
  1595. 166.13 s > failures:
  1596. 166.13 s > profile_bulk::massless_triangle_bulk_profile_passes
  1597. 166.13 s >
  1598. 166.13 s > test result: FAILED. 0 passed; 1 failed; 0 ignored; 0 measured; 82 filtered out; finished in 0.29s
  1599. 166.13 s > system-err
  1600. 166.13 s > [2026-08-26 08:19:35.030] @gammaloop_api::se... INFO : Running command import model scalars
  1601. 166.13 s > [2026-08-26 08:19:35.030] @import::model INFO : Loading built-in JSON model scalars-default
  1602. 166.13 s > [2026-08-26 08:19:35.034] @gammalooprs::model INFO : The following 2 external parameters were forced to zero by the restriction card:
  1603. 166.13 s > width_scalar_1, width_scalar_2
  1604. 166.13 s > [2026-08-26 08:19:35.035] @gammaloop_api::se... INFO : Running command import graphs ./tests/resources/graphs/massless_triangle.dot
  1605. 166.13 s > [2026-08-26 08:19:35.035] @commands::import INFO : Loading graphs from '/build/source/tests/resources/graphs/massless_triangle.dot'
  1606. 166.13 s > [2026-08-26 08:19:35.038] @gammaloop_api::se... INFO : Running command generate
  1607. 166.13 s > [2026-08-26 08:19:35.143] @commands::generate INFO :
  1608. 166.13 s > Integrand generation summary
  1609. 166.13 s > peak RAM 62.21 MiB | cores 1
  1610. 166.13 s > ╭───────────┬─────────────────────┬─────────┬────────────┬────────────┬────────────────┬─────────────╮
  1611. 166.13 s > │ integrand │ graph │ # evals │ expr build │ spenso │ symbolica eval │ compile │
  1612. 166.13 s > ├───────────┼─────────────────────┼─────────┼────────────┼────────────┼────────────────┼─────────────┤
  1613. 166.13 s > │ default │ massless_triangle_0 │ 9 │ 19ms (52%) │ 3ms (8.6%) │ 14ms (39%) │ 0ms (0.00%) │
  1614. 166.13 s > ├───────────┼─────────────────────┼─────────┼────────────┼────────────┼────────────────┼─────────────┤
  1615. 166.13 s > │ Total │ │ 9 │ 19ms (52%) │ 3ms (8.6%) │ 14ms (39%) │ 0ms (0.00%) │
  1616. 166.13 s > ╰───────────┴─────────────────────┴─────────┴────────────┴────────────┴────────────────┴─────────────╯
  1617. 166.13 s > [2026-08-26 08:19:35.148] @process::amplitude INFO : Input is above threshold: 2 existing threshold E-surfaces across 1/1 graph groups
  1618. 166.13 s > [2026-08-26 08:19:35.148] @process::amplitude INFO : overlap structure of group 0: [2: [0(1,5), 1(1,3)]]
  1619. 166.13 s > Error:
  1620. 166.13 s > 0: IR profiling requested arbitrary precision but received a quad-precision result
  1621. 166.13 s >
  1622. 166.13 s > Location:
  1623. 166.13 s > crates/gammalooprs/src/integrands/process/ir.rs:2123
  1624. 166.13 s >
  1625. 166.13 s > ━━━━━━━━━━━━━━━━━━━━━━━━━━━━━━━━━━ BACKTRACE ━━━━━━━━━━━━━━━━━━━━━━━━━━━━━━━━━━━
  1626. 166.13 s > 1: <color_eyre[51793ea62743adbd]::config::EyreHook>::into_eyre_hook::{closure#0}<unknown>
  1627. 166.13 s > at <unknown source file>:<unknown line>
  1628. 166.13 s > 2: eyre[cb2fd339c0c40fca]::capture_handler<unknown>
  1629. 166.13 s > at <unknown source file>:<unknown line>
  1630. 166.13 s > 3: eyre[cb2fd339c0c40fca]::private::format_err<unknown>
  1631. 166.13 s > at <unknown source file>:<unknown line>
  1632. 166.13 s > 4: gammalooprs[d7a7c067ebd19583]::integrands::process::ir::evaluate_profile_momentum_point_arb::<gammalooprs[d7a7c067ebd19583]::integrands::process::amplitude::AmplitudeIntegrand><unknown>
  1633. 166.13 s > at <unknown source file>:<unknown line>
  1634. 166.13 s > 5: <gammalooprs[d7a7c067ebd19583]::integrands::process::amplitude::AmplitudeIntegrand>::test_single_ir_limit_impl<unknown>
  1635. 166.13 s > at <unknown source file>:<unknown line>
  1636. 166.13 s > 6: gammalooprs[d7a7c067ebd19583]::integrands::process::ir::run_ir_profile::<gammalooprs[d7a7c067ebd19583]::integrands::process::amplitude::AmplitudeIntegrand, <gammalooprs[d7a7c067ebd19583]::integrands::process::amplitude::AmplitudeIntegrand>::enumerate_ir_limits, <gammalooprs[d7a7c067ebd19583]::integrands::process::amplitude::AmplitudeIntegrand>::graph_cut_definitions, <gammalooprs[d7a7c067ebd19583]::integrands::process::amplitude::AmplitudeIntegrand>::test_single_ir_limit_impl><unknown>
  1637. 166.13 s > at <unknown source file>:<unknown line>
  1638. 166.13 s > 7: <gammalooprs[d7a7c067ebd19583]::integrands::process::amplitude::AmplitudeIntegrand>::test_ir<unknown>
  1639. 166.13 s > at <unknown source file>:<unknown line>
  1640. 166.13 s > 8: <gammaloop_api[92ae732909e47e14]::commands::profile::Profile>::run<unknown>
  1641. 166.13 s > at <unknown source file>:<unknown line>
  1642. 166.13 s > 9: test_runs[3e7a390caee4e338]::profile_bulk::massless_triangle_bulk_profile_passes<unknown>
  1643. 166.13 s > at <unknown source file>:<unknown line>
  1644. 166.13 s > 10: <test_runs[3e7a390caee4e338]::profile_bulk::massless_triangle_bulk_profile_passes::{closure#0} as core[940e698046960fd5]::ops::function::FnOnce<()>>::call_once<unknown>
  1645. 166.13 s > at <unknown source file>:<unknown line>
  1646. 166.13 s > 11: test[75d6903177b1d7e9]::__rust_begin_short_backtrace::<core[940e698046960fd5]::result::Result<(), alloc[2ea6bcb46fca0c42]::string::String>, fn() -> core[940e698046960fd5]::result::Result<(), alloc[2ea6bcb46fca0c42]::string::String>><unknown>
  1647. 166.13 s > at <unknown source file>:<unknown line>
  1648. 166.13 s > 12: test[75d6903177b1d7e9]::run_test::{closure#0}<unknown>
  1649. 166.13 s > at <unknown source file>:<unknown line>
  1650. 166.13 s > 13: std[bcb96dfbba0ab899]::sys::backtrace::__rust_begin_short_backtrace::<test[75d6903177b1d7e9]::run_test::{closure#1}, ()><unknown>
  1651. 166.13 s > at <unknown source file>:<unknown line>
  1652. 166.13 s > 14: <std[bcb96dfbba0ab899]::thread::lifecycle::spawn_unchecked<test[75d6903177b1d7e9]::run_test::{closure#1}, ()>::{closure#1} as core[940e698046960fd5]::ops::function::FnOnce<()>>::call_once::{shim:vtable#0}<unknown>
  1653. 166.13 s > at <unknown source file>:<unknown line>
  1654. 166.13 s > 15: <std[bcb96dfbba0ab899]::sys::thread::unix::Thread>::new::thread_start<unknown>
  1655. 166.13 s > at <unknown source file>:<unknown line>
  1656. 166.13 s > 16: start_thread<unknown>
  1657. 166.13 s > at <unknown source file>:<unknown line>
  1658. 166.13 s > 17: __clone3<unknown>
  1659. 166.13 s > at <unknown source file>:<unknown line>
  1660. 166.13 s >
  1661. 166.13 s > Run with COLORBT_SHOW_HIDDEN=1 environment variable to disable frame filtering.
  1662. 166.13 s > Run with RUST_BACKTRACE=full to include source snippets.
  1663. 166.13 s > Warning: SpanTrace capture is Unsupported.
  1664. 166.13 s > Ensure that you've setup a tracing-error ErrorLayer and the semver versions are compatible
  1665. 166.13 s >
  1666. 166.13 s > 4. gammaloop-integration-tests::test_runs::profile_bulk::box_4e_bulk_profile_passes
  1667. 166.13 s > failure: test failure with exit code 101
  1668. 166.13 s > Error:
  1669. 166.13 s > 0: IR profiling requested arbitrary precision but received a quad-precision result
  1670. 166.13 s >
  1671. 166.13 s > Location:
  1672. 166.13 s > crates/gammalooprs/src/integrands/process/ir.rs:2123
  1673. 166.13 s >
  1674. 166.13 s > ━━━━━━━━━━━━━━━━━━━━━━━━━━━━━━━━━━ BACKTRACE ━━━━━━━━━━━━━━━━━━━━━━━━━━━━━━━━━━━
  1675. 166.13 s > 1: <color_eyre[51793ea62743adbd]::config::EyreHook>::into_eyre_hook::{closure#0}<unknown>
  1676. 166.13 s > at <unknown source file>:<unknown line>
  1677. 166.13 s > 2: eyre[cb2fd339c0c40fca]::capture_handler<unknown>
  1678. 166.13 s > at <unknown source file>:<unknown line>
  1679. 166.13 s > 3: eyre[cb2fd339c0c40fca]::private::format_err<unknown>
  1680. 166.13 s > at <unknown source file>:<unknown line>
  1681. 166.13 s > 4: gammalooprs[d7a7c067ebd19583]::integrands::process::ir::evaluate_profile_momentum_point_arb::<gammalooprs[d7a7c067ebd19583]::integrands::process::amplitude::AmplitudeIntegrand><unknown>
  1682. 166.13 s > at <unknown source file>:<unknown line>
  1683. 166.13 s > 5: <gammalooprs[d7a7c067ebd19583]::integrands::process::amplitude::AmplitudeIntegrand>::test_single_ir_limit_impl<unknown>
  1684. 166.13 s > at <unknown source file>:<unknown line>
  1685. 166.13 s > 6: gammalooprs[d7a7c067ebd19583]::integrands::process::ir::run_ir_profile::<gammalooprs[d7a7c067ebd19583]::integrands::process::amplitude::AmplitudeIntegrand, <gammalooprs[d7a7c067ebd19583]::integrands::process::amplitude::AmplitudeIntegrand>::enumerate_ir_limits, <gammalooprs[d7a7c067ebd19583]::integrands::process::amplitude::AmplitudeIntegrand>::graph_cut_definitions, <gammalooprs[d7a7c067ebd19583]::integrands::process::amplitude::AmplitudeIntegrand>::test_single_ir_limit_impl><unknown>
  1686. 166.13 s > at <unknown source file>:<unknown line>
  1687. 166.13 s > 7: <gammalooprs[d7a7c067ebd19583]::integrands::process::amplitude::AmplitudeIntegrand>::test_ir<unknown>
  1688. 166.13 s > at <unknown source file>:<unknown line>
  1689. 166.13 s > 8: <gammaloop_api[92ae732909e47e14]::commands::profile::Profile>::run<unknown>
  1690. 166.13 s > at <unknown source file>:<unknown line>
  1691. 166.13 s > 9: test_runs[3e7a390caee4e338]::profile_bulk::box_4e_bulk_profile_passes<unknown>
  1692. 166.13 s > at <unknown source file>:<unknown line>
  1693. 166.13 s > 10: <test_runs[3e7a390caee4e338]::profile_bulk::box_4e_bulk_profile_passes::{closure#0} as core[940e698046960fd5]::ops::function::FnOnce<()>>::call_once<unknown>
  1694. 166.13 s > at <unknown source file>:<unknown line>
  1695. 166.13 s > 11: test[75d6903177b1d7e9]::__rust_begin_short_backtrace::<core[940e698046960fd5]::result::Result<(), alloc[2ea6bcb46fca0c42]::string::String>, fn() -> core[940e698046960fd5]::result::Result<(), alloc[2ea6bcb46fca0c42]::string::String>><unknown>
  1696. 166.13 s > at <unknown source file>:<unknown line>
  1697. 166.13 s > 12: test[75d6903177b1d7e9]::run_test::{closure#0}<unknown>
  1698. 166.13 s > at <unknown source file>:<unknown line>
  1699. 166.13 s > 13: std[bcb96dfbba0ab899]::sys::backtrace::__rust_begin_short_backtrace::<test[75d6903177b1d7e9]::run_test::{closure#1}, ()><unknown>
  1700. 166.13 s > at <unknown source file>:<unknown line>
  1701. 166.13 s > 14: <std[bcb96dfbba0ab899]::thread::lifecycle::spawn_unchecked<test[75d6903177b1d7e9]::run_test::{closure#1}, ()>::{closure#1} as core[940e698046960fd5]::ops::function::FnOnce<()>>::call_once::{shim:vtable#0}<unknown>
  1702. 166.13 s > at <unknown source file>:<unknown line>
  1703. 166.13 s > 15: <std[bcb96dfbba0ab899]::sys::thread::unix::Thread>::new::thread_start<unknown>
  1704. 166.13 s > at <unknown source file>:<unknown line>
  1705. 166.13 s > 16: start_thread<unknown>
  1706. 166.13 s > at <unknown source file>:<unknown line>
  1707. 166.13 s > 17: __clone3<unknown>
  1708. 166.13 s > at <unknown source file>:<unknown line>
  1709. 166.13 s >
  1710. 166.13 s > Run with COLORBT_SHOW_HIDDEN=1 environment variable to disable frame filtering.
  1711. 166.13 s > Run with RUST_BACKTRACE=full to include source snippets.
  1712. 166.13 s > Warning: SpanTrace capture is Unsupported.
  1713. 166.13 s > Ensure that you've setup a tracing-error ErrorLayer and the semver versions are compatible
  1714. 166.13 s > system-out
  1715. 166.13 s > running 1 test
  1716. 166.13 s > test profile_bulk::box_4e_bulk_profile_passes ... FAILED
  1717. 166.13 s >
  1718. 166.13 s > failures:
  1719. 166.13 s >
  1720. 166.13 s > failures:
  1721. 166.13 s > profile_bulk::box_4e_bulk_profile_passes
  1722. 166.13 s >
  1723. 166.13 s > test result: FAILED. 0 passed; 1 failed; 0 ignored; 0 measured; 82 filtered out; finished in 1.12s
  1724. 166.13 s > system-err
  1725. 166.13 s > [2026-08-26 08:19:34.384] @gammaloop_api::se... INFO : Running command import model ./assets/models/json/scalars/scalars.json
  1726. 166.13 s > [2026-08-26 08:19:34.384] @import::model INFO : Loading JSON model scalars-default from /build/source/assets/models/json/scalars/scalars
  1727. 166.13 s > [2026-08-26 08:19:34.394] @gammalooprs::model INFO : The following 2 external parameters were forced to zero by the restriction card:
  1728. 166.13 s > width_scalar_1, width_scalar_2
  1729. 166.13 s > [2026-08-26 08:19:34.396] @gammaloop_api::se... INFO : Running command import graphs ./tests/resources/graphs/massless_box.dot
  1730. 166.13 s > [2026-08-26 08:19:34.396] @commands::import INFO : Loading graphs from '/build/source/tests/resources/graphs/massless_box.dot'
  1731. 166.13 s > [2026-08-26 08:19:34.403] @gammaloop_api::se... INFO : Running command generate
  1732. 166.13 s > [2026-08-26 08:19:35.153] @commands::generate INFO :
  1733. 166.13 s > Integrand generation summary
  1734. 166.13 s > peak RAM 68.53 MiB | cores 1
  1735. 166.13 s > ╭───────────┬────────────────┬─────────┬─────────────┬─────────────┬────────────────┬─────────────╮
  1736. 166.13 s > │ integrand │ graph │ # evals │ expr build │ spenso │ symbolica eval │ compile │
  1737. 166.13 s > ├───────────┼────────────────┼─────────┼─────────────┼─────────────┼────────────────┼─────────────┤
  1738. 166.13 s > │ default │ massless_box_0 │ 14 │ 532ms (84%) │ 44ms (7.0%) │ 54ms (8.7%) │ 0ms (0.00%) │
  1739. 166.13 s > ├───────────┼────────────────┼─────────┼─────────────┼─────────────┼────────────────┼─────────────┤
  1740. 166.13 s > │ Total │ │ 14 │ 532ms (84%) │ 44ms (7.0%) │ 54ms (8.7%) │ 0ms (0.00%) │
  1741. 166.13 s > ╰───────────┴────────────────┴─────────┴─────────────┴─────────────┴────────────────┴─────────────╯
  1742. 166.13 s > [2026-08-26 08:19:35.166] @process::amplitude INFO : Input is above threshold: 4 existing threshold E-surfaces across 1/1 graph groups
  1743. 166.13 s > [2026-08-26 08:19:35.178] @process::amplitude INFO : overlap structure of group 0: [2: [4(3,4), 9(3,5)], 2: [9(3,5), 11(5,6)], 2: [8(4,6), 11(5,6)], 2: [4(3,4), 8(4,6)]]
  1744. 166.13 s > Error:
  1745. 166.13 s > 0: IR profiling requested arbitrary precision but received a quad-precision result
  1746. 166.13 s >
  1747. 166.13 s > Location:
  1748. 166.13 s > crates/gammalooprs/src/integrands/process/ir.rs:2123
  1749. 166.13 s >
  1750. 166.13 s > ━━━━━━━━━━━━━━━━━━━━━━━━━━━━━━━━━━ BACKTRACE ━━━━━━━━━━━━━━━━━━━━━━━━━━━━━━━━━━━
  1751. 166.13 s > 1: <color_eyre[51793ea62743adbd]::config::EyreHook>::into_eyre_hook::{closure#0}<unknown>
  1752. 166.13 s > at <unknown source file>:<unknown line>
  1753. 166.13 s > 2: eyre[cb2fd339c0c40fca]::capture_handler<unknown>
  1754. 166.13 s > at <unknown source file>:<unknown line>
  1755. 166.13 s > 3: eyre[cb2fd339c0c40fca]::private::format_err<unknown>
  1756. 166.13 s > at <unknown source file>:<unknown line>
  1757. 166.13 s > 4: gammalooprs[d7a7c067ebd19583]::integrands::process::ir::evaluate_profile_momentum_point_arb::<gammalooprs[d7a7c067ebd19583]::integrands::process::amplitude::AmplitudeIntegrand><unknown>
  1758. 166.13 s > at <unknown source file>:<unknown line>
  1759. 166.13 s > 5: <gammalooprs[d7a7c067ebd19583]::integrands::process::amplitude::AmplitudeIntegrand>::test_single_ir_limit_impl<unknown>
  1760. 166.13 s > at <unknown source file>:<unknown line>
  1761. 166.13 s > 6: gammalooprs[d7a7c067ebd19583]::integrands::process::ir::run_ir_profile::<gammalooprs[d7a7c067ebd19583]::integrands::process::amplitude::AmplitudeIntegrand, <gammalooprs[d7a7c067ebd19583]::integrands::process::amplitude::AmplitudeIntegrand>::enumerate_ir_limits, <gammalooprs[d7a7c067ebd19583]::integrands::process::amplitude::AmplitudeIntegrand>::graph_cut_definitions, <gammalooprs[d7a7c067ebd19583]::integrands::process::amplitude::AmplitudeIntegrand>::test_single_ir_limit_impl><unknown>
  1762. 166.13 s > at <unknown source file>:<unknown line>
  1763. 166.13 s > 7: <gammalooprs[d7a7c067ebd19583]::integrands::process::amplitude::AmplitudeIntegrand>::test_ir<unknown>
  1764. 166.13 s > at <unknown source file>:<unknown line>
  1765. 166.13 s > 8: <gammaloop_api[92ae732909e47e14]::commands::profile::Profile>::run<unknown>
  1766. 166.13 s > at <unknown source file>:<unknown line>
  1767. 166.13 s > 9: test_runs[3e7a390caee4e338]::profile_bulk::box_4e_bulk_profile_passes<unknown>
  1768. 166.13 s > at <unknown source file>:<unknown line>
  1769. 166.13 s > 10: <test_runs[3e7a390caee4e338]::profile_bulk::box_4e_bulk_profile_passes::{closure#0} as core[940e698046960fd5]::ops::function::FnOnce<()>>::call_once<unknown>
  1770. 166.13 s > at <unknown source file>:<unknown line>
  1771. 166.13 s > 11: test[75d6903177b1d7e9]::__rust_begin_short_backtrace::<core[940e698046960fd5]::result::Result<(), alloc[2ea6bcb46fca0c42]::string::String>, fn() -> core[940e698046960fd5]::result::Result<(), alloc[2ea6bcb46fca0c42]::string::String>><unknown>
  1772. 166.13 s > at <unknown source file>:<unknown line>
  1773. 166.13 s > 12: test[75d6903177b1d7e9]::run_test::{closure#0}<unknown>
  1774. 166.13 s > at <unknown source file>:<unknown line>
  1775. 166.13 s > 13: std[bcb96dfbba0ab899]::sys::backtrace::__rust_begin_short_backtrace::<test[75d6903177b1d7e9]::run_test::{closure#1}, ()><unknown>
  1776. 166.13 s > at <unknown source file>:<unknown line>
  1777. 166.13 s > 14: <std[bcb96dfbba0ab899]::thread::lifecycle::spawn_unchecked<test[75d6903177b1d7e9]::run_test::{closure#1}, ()>::{closure#1} as core[940e698046960fd5]::ops::function::FnOnce<()>>::call_once::{shim:vtable#0}<unknown>
  1778. 166.13 s > at <unknown source file>:<unknown line>
  1779. 166.13 s > 15: <std[bcb96dfbba0ab899]::sys::thread::unix::Thread>::new::thread_start<unknown>
  1780. 166.13 s > at <unknown source file>:<unknown line>
  1781. 166.13 s > 16: start_thread<unknown>
  1782. 166.13 s > at <unknown source file>:<unknown line>
  1783. 166.13 s > 17: __clone3<unknown>
  1784. 166.13 s > at <unknown source file>:<unknown line>
  1785. 166.13 s >
  1786. 166.13 s > Run with COLORBT_SHOW_HIDDEN=1 environment variable to disable frame filtering.
  1787. 166.13 s > Run with RUST_BACKTRACE=full to include source snippets.
  1788. 166.13 s > Warning: SpanTrace capture is Unsupported.
  1789. 166.13 s > Ensure that you've setup a tracing-error ErrorLayer and the semver versions are compatible
  1790. 166.13 s >
  1791. 166.13 s > 5. gammaloop-integration-tests::test_runs::profile_bulk::double_dotted_bubble_amp_bulk_profile_passes
  1792. 166.13 s > failure: test failure with exit code 101
  1793. 166.13 s > Error:
  1794. 166.13 s > 0: IR profiling requested arbitrary precision but received a quad-precision result
  1795. 166.13 s >
  1796. 166.13 s > Location:
  1797. 166.13 s > crates/gammalooprs/src/integrands/process/ir.rs:2123
  1798. 166.13 s >
  1799. 166.13 s > ━━━━━━━━━━━━━━━━━━━━━━━━━━━━━━━━━━ BACKTRACE ━━━━━━━━━━━━━━━━━━━━━━━━━━━━━━━━━━━
  1800. 166.13 s > 1: <color_eyre[51793ea62743adbd]::config::EyreHook>::into_eyre_hook::{closure#0}<unknown>
  1801. 166.13 s > at <unknown source file>:<unknown line>
  1802. 166.13 s > 2: eyre[cb2fd339c0c40fca]::capture_handler<unknown>
  1803. 166.13 s > at <unknown source file>:<unknown line>
  1804. 166.13 s > 3: eyre[cb2fd339c0c40fca]::private::format_err<unknown>
  1805. 166.13 s > at <unknown source file>:<unknown line>
  1806. 166.13 s > 4: gammalooprs[d7a7c067ebd19583]::integrands::process::ir::evaluate_profile_momentum_point_arb::<gammalooprs[d7a7c067ebd19583]::integrands::process::amplitude::AmplitudeIntegrand><unknown>
  1807. 166.13 s > at <unknown source file>:<unknown line>
  1808. 166.13 s > 5: <gammalooprs[d7a7c067ebd19583]::integrands::process::amplitude::AmplitudeIntegrand>::test_single_ir_limit_impl<unknown>
  1809. 166.13 s > at <unknown source file>:<unknown line>
  1810. 166.13 s > 6: gammalooprs[d7a7c067ebd19583]::integrands::process::ir::run_ir_profile::<gammalooprs[d7a7c067ebd19583]::integrands::process::amplitude::AmplitudeIntegrand, <gammalooprs[d7a7c067ebd19583]::integrands::process::amplitude::AmplitudeIntegrand>::enumerate_ir_limits, <gammalooprs[d7a7c067ebd19583]::integrands::process::amplitude::AmplitudeIntegrand>::graph_cut_definitions, <gammalooprs[d7a7c067ebd19583]::integrands::process::amplitude::AmplitudeIntegrand>::test_single_ir_limit_impl><unknown>
  1811. 166.13 s > at <unknown source file>:<unknown line>
  1812. 166.13 s > 7: <gammalooprs[d7a7c067ebd19583]::integrands::process::amplitude::AmplitudeIntegrand>::test_ir<unknown>
  1813. 166.13 s > at <unknown source file>:<unknown line>
  1814. 166.13 s > 8: <gammaloop_api[92ae732909e47e14]::commands::profile::Profile>::run<unknown>
  1815. 166.13 s > at <unknown source file>:<unknown line>
  1816. 166.13 s > 9: test_runs[3e7a390caee4e338]::profile_bulk::double_dotted_bubble_amp_bulk_profile_passes<unknown>
  1817. 166.13 s > at <unknown source file>:<unknown line>
  1818. 166.13 s > 10: <test_runs[3e7a390caee4e338]::profile_bulk::double_dotted_bubble_amp_bulk_profile_passes::{closure#0} as core[940e698046960fd5]::ops::function::FnOnce<()>>::call_once<unknown>
  1819. 166.13 s > at <unknown source file>:<unknown line>
  1820. 166.13 s > 11: test[75d6903177b1d7e9]::__rust_begin_short_backtrace::<core[940e698046960fd5]::result::Result<(), alloc[2ea6bcb46fca0c42]::string::String>, fn() -> core[940e698046960fd5]::result::Result<(), alloc[2ea6bcb46fca0c42]::string::String>><unknown>
  1821. 166.13 s > at <unknown source file>:<unknown line>
  1822. 166.13 s > 12: test[75d6903177b1d7e9]::run_test::{closure#0}<unknown>
  1823. 166.13 s > at <unknown source file>:<unknown line>
  1824. 166.13 s > 13: std[bcb96dfbba0ab899]::sys::backtrace::__rust_begin_short_backtrace::<test[75d6903177b1d7e9]::run_test::{closure#1}, ()><unknown>
  1825. 166.13 s > at <unknown source file>:<unknown line>
  1826. 166.13 s > 14: <std[bcb96dfbba0ab899]::thread::lifecycle::spawn_unchecked<test[75d6903177b1d7e9]::run_test::{closure#1}, ()>::{closure#1} as core[940e698046960fd5]::ops::function::FnOnce<()>>::call_once::{shim:vtable#0}<unknown>
  1827. 166.13 s > at <unknown source file>:<unknown line>
  1828. 166.13 s > 15: <std[bcb96dfbba0ab899]::sys::thread::unix::Thread>::new::thread_start<unknown>
  1829. 166.13 s > at <unknown source file>:<unknown line>
  1830. 166.13 s > 16: start_thread<unknown>
  1831. 166.13 s > at <unknown source file>:<unknown line>
  1832. 166.13 s > 17: __clone3<unknown>
  1833. 166.13 s > at <unknown source file>:<unknown line>
  1834. 166.13 s >
  1835. 166.13 s > Run with COLORBT_SHOW_HIDDEN=1 environment variable to disable frame filtering.
  1836. 166.13 s > Run with RUST_BACKTRACE=full to include source snippets.
  1837. 166.13 s > Warning: SpanTrace capture is Unsupported.
  1838. 166.13 s > Ensure that you've setup a tracing-error ErrorLayer and the semver versions are compatible
  1839. 166.13 s > system-out
  1840. 166.13 s > running 1 test
  1841. 166.13 s > test profile_bulk::double_dotted_bubble_amp_bulk_profile_passes ... FAILED
  1842. 166.13 s >
  1843. 166.13 s > failures:
  1844. 166.13 s >
  1845. 166.13 s > failures:
  1846. 166.13 s > profile_bulk::double_dotted_bubble_amp_bulk_profile_passes
  1847. 166.13 s >
  1848. 166.13 s > test result: FAILED. 0 passed; 1 failed; 0 ignored; 0 measured; 82 filtered out; finished in 0.61s
  1849. 166.13 s > system-err
  1850. 166.13 s > [2026-08-26 08:19:35.269] @gammaloop_api::se... INFO : Running command import model ./assets/models/json/scalars/scalars_2p_3p.json
  1851. 166.13 s > [2026-08-26 08:19:35.269] @import::model INFO : Loading JSON model scalars_2p_3p-default from /build/source/assets/models/json/scalars/scalars_2p_3p
  1852. 166.13 s > [2026-08-26 08:19:35.271] @gammaloop_api::se... INFO : Running command import graphs ./tests/resources/graphs/double_dotted_bubble_amp.dot
  1853. 166.13 s > [2026-08-26 08:19:35.271] @commands::import INFO : Loading graphs from '/build/source/tests/resources/graphs/double_dotted_bubble_amp.dot'
  1854. 166.13 s > [2026-08-26 08:19:35.276] @gammaloop_api::se... INFO : Running command generate
  1855. 166.13 s > [2026-08-26 08:19:35.502] @commands::generate INFO :
  1856. 166.13 s > Integrand generation summary
  1857. 166.13 s > peak RAM 66.54 MiB | cores 1
  1858. 166.13 s > ╭───────────┬──────────────────────────┬─────────┬────────────┬────────────┬────────────────┬─────────────╮
  1859. 166.13 s > │ integrand │ graph │ # evals │ expr build │ spenso │ symbolica eval │ compile │
  1860. 166.13 s > ├───────────┼──────────────────────────┼─────────┼────────────┼────────────┼────────────────┼─────────────┤
  1861. 166.13 s > │ default │ double_dotted_bubble_amp │ 11 │ 90ms (57%) │ 5ms (3.2%) │ 62ms (39%) │ 0ms (0.00%) │
  1862. 166.13 s > ├───────────┼──────────────────────────┼─────────┼────────────┼────────────┼────────────────┼─────────────┤
  1863. 166.13 s > │ Total │ │ 11 │ 90ms (57%) │ 5ms (3.2%) │ 62ms (39%) │ 0ms (0.00%) │
  1864. 166.13 s > ╰───────────┴──────────────────────────┴─────────┴────────────┴────────────┴────────────────┴─────────────╯
  1865. 166.13 s > [2026-08-26 08:19:35.504] @process::amplitude INFO : Input is above threshold: 1 existing threshold E-surfaces across 1/1 graph groups
  1866. 166.13 s > [2026-08-26 08:19:35.504] @process::amplitude INFO : overlap structure of group 0: [1: [1(1,4)]]
  1867. 166.13 s > Error:
  1868. 166.13 s > 0: IR profiling requested arbitrary precision but received a quad-precision result
  1869. 166.13 s >
  1870. 166.13 s > Location:
  1871. 166.13 s > crates/gammalooprs/src/integrands/process/ir.rs:2123
  1872. 166.13 s >
  1873. 166.13 s > ━━━━━━━━━━━━━━━━━━━━━━━━━━━━━━━━━━ BACKTRACE ━━━━━━━━━━━━━━━━━━━━━━━━━━━━━━━━━━━
  1874. 166.13 s > 1: <color_eyre[51793ea62743adbd]::config::EyreHook>::into_eyre_hook::{closure#0}<unknown>
  1875. 166.13 s > at <unknown source file>:<unknown line>
  1876. 166.13 s > 2: eyre[cb2fd339c0c40fca]::capture_handler<unknown>
  1877. 166.13 s > at <unknown source file>:<unknown line>
  1878. 166.13 s > 3: eyre[cb2fd339c0c40fca]::private::format_err<unknown>
  1879. 166.13 s > at <unknown source file>:<unknown line>
  1880. 166.13 s > 4: gammalooprs[d7a7c067ebd19583]::integrands::process::ir::evaluate_profile_momentum_point_arb::<gammalooprs[d7a7c067ebd19583]::integrands::process::amplitude::AmplitudeIntegrand><unknown>
  1881. 166.13 s > at <unknown source file>:<unknown line>
  1882. 166.13 s > 5: <gammalooprs[d7a7c067ebd19583]::integrands::process::amplitude::AmplitudeIntegrand>::test_single_ir_limit_impl<unknown>
  1883. 166.13 s > at <unknown source file>:<unknown line>
  1884. 166.13 s > 6: gammalooprs[d7a7c067ebd19583]::integrands::process::ir::run_ir_profile::<gammalooprs[d7a7c067ebd19583]::integrands::process::amplitude::AmplitudeIntegrand, <gammalooprs[d7a7c067ebd19583]::integrands::process::amplitude::AmplitudeIntegrand>::enumerate_ir_limits, <gammalooprs[d7a7c067ebd19583]::integrands::process::amplitude::AmplitudeIntegrand>::graph_cut_definitions, <gammalooprs[d7a7c067ebd19583]::integrands::process::amplitude::AmplitudeIntegrand>::test_single_ir_limit_impl><unknown>
  1885. 166.13 s > at <unknown source file>:<unknown line>
  1886. 166.13 s > 7: <gammalooprs[d7a7c067ebd19583]::integrands::process::amplitude::AmplitudeIntegrand>::test_ir<unknown>
  1887. 166.13 s > at <unknown source file>:<unknown line>
  1888. 166.13 s > 8: <gammaloop_api[92ae732909e47e14]::commands::profile::Profile>::run<unknown>
  1889. 166.13 s > at <unknown source file>:<unknown line>
  1890. 166.13 s > 9: test_runs[3e7a390caee4e338]::profile_bulk::double_dotted_bubble_amp_bulk_profile_passes<unknown>
  1891. 166.13 s > at <unknown source file>:<unknown line>
  1892. 166.13 s > 10: <test_runs[3e7a390caee4e338]::profile_bulk::double_dotted_bubble_amp_bulk_profile_passes::{closure#0} as core[940e698046960fd5]::ops::function::FnOnce<()>>::call_once<unknown>
  1893. 166.13 s > at <unknown source file>:<unknown line>
  1894. 166.13 s > 11: test[75d6903177b1d7e9]::__rust_begin_short_backtrace::<core[940e698046960fd5]::result::Result<(), alloc[2ea6bcb46fca0c42]::string::String>, fn() -> core[940e698046960fd5]::result::Result<(), alloc[2ea6bcb46fca0c42]::string::String>><unknown>
  1895. 166.13 s > at <unknown source file>:<unknown line>
  1896. 166.13 s > 12: test[75d6903177b1d7e9]::run_test::{closure#0}<unknown>
  1897. 166.13 s > at <unknown source file>:<unknown line>
  1898. 166.13 s > 13: std[bcb96dfbba0ab899]::sys::backtrace::__rust_begin_short_backtrace::<test[75d6903177b1d7e9]::run_test::{closure#1}, ()><unknown>
  1899. 166.13 s > at <unknown source file>:<unknown line>
  1900. 166.13 s > 14: <std[bcb96dfbba0ab899]::thread::lifecycle::spawn_unchecked<test[75d6903177b1d7e9]::run_test::{closure#1}, ()>::{closure#1} as core[940e698046960fd5]::ops::function::FnOnce<()>>::call_once::{shim:vtable#0}<unknown>
  1901. 166.13 s > at <unknown source file>:<unknown line>
  1902. 166.13 s > 15: <std[bcb96dfbba0ab899]::sys::thread::unix::Thread>::new::thread_start<unknown>
  1903. 166.13 s > at <unknown source file>:<unknown line>
  1904. 166.13 s > 16: start_thread<unknown>
  1905. 166.13 s > at <unknown source file>:<unknown line>
  1906. 166.13 s > 17: __clone3<unknown>
  1907. 166.13 s > at <unknown source file>:<unknown line>
  1908. 166.13 s >
  1909. 166.13 s > Run with COLORBT_SHOW_HIDDEN=1 environment variable to disable frame filtering.
  1910. 166.13 s > Run with RUST_BACKTRACE=full to include source snippets.
  1911. 166.13 s > Warning: SpanTrace capture is Unsupported.
  1912. 166.13 s > Ensure that you've setup a tracing-error ErrorLayer and the semver versions are compatible
  1913. 166.13 s >
  1914. 166.13 s > 6. gammaloop-integration-tests::test_runs::profile_bulk::scalar_self_energy_amp_bulk_profile_passes
  1915. 166.13 s > failure: test failure with exit code 101
  1916. 166.13 s > Error:
  1917. 166.13 s > 0: IR profiling requested arbitrary precision but received a quad-precision result
  1918. 166.13 s >
  1919. 166.13 s > Location:
  1920. 166.13 s > crates/gammalooprs/src/integrands/process/ir.rs:2123
  1921. 166.13 s >
  1922. 166.13 s > ━━━━━━━━━━━━━━━━━━━━━━━━━━━━━━━━━━ BACKTRACE ━━━━━━━━━━━━━━━━━━━━━━━━━━━━━━━━━━━
  1923. 166.13 s > 1: <color_eyre[51793ea62743adbd]::config::EyreHook>::into_eyre_hook::{closure#0}<unknown>
  1924. 166.13 s > at <unknown source file>:<unknown line>
  1925. 166.13 s > 2: eyre[cb2fd339c0c40fca]::capture_handler<unknown>
  1926. 166.13 s > at <unknown source file>:<unknown line>
  1927. 166.13 s > 3: eyre[cb2fd339c0c40fca]::private::format_err<unknown>
  1928. 166.13 s > at <unknown source file>:<unknown line>
  1929. 166.13 s > 4: gammalooprs[d7a7c067ebd19583]::integrands::process::ir::evaluate_profile_momentum_point_arb::<gammalooprs[d7a7c067ebd19583]::integrands::process::amplitude::AmplitudeIntegrand><unknown>
  1930. 166.13 s > at <unknown source file>:<unknown line>
  1931. 166.13 s > 5: <gammalooprs[d7a7c067ebd19583]::integrands::process::amplitude::AmplitudeIntegrand>::test_single_ir_limit_impl<unknown>
  1932. 166.13 s > at <unknown source file>:<unknown line>
  1933. 166.13 s > 6: gammalooprs[d7a7c067ebd19583]::integrands::process::ir::run_ir_profile::<gammalooprs[d7a7c067ebd19583]::integrands::process::amplitude::AmplitudeIntegrand, <gammalooprs[d7a7c067ebd19583]::integrands::process::amplitude::AmplitudeIntegrand>::enumerate_ir_limits, <gammalooprs[d7a7c067ebd19583]::integrands::process::amplitude::AmplitudeIntegrand>::graph_cut_definitions, <gammalooprs[d7a7c067ebd19583]::integrands::process::amplitude::AmplitudeIntegrand>::test_single_ir_limit_impl><unknown>
  1934. 166.13 s > at <unknown source file>:<unknown line>
  1935. 166.13 s > 7: <gammalooprs[d7a7c067ebd19583]::integrands::process::amplitude::AmplitudeIntegrand>::test_ir<unknown>
  1936. 166.13 s > at <unknown source file>:<unknown line>
  1937. 166.13 s > 8: <gammaloop_api[92ae732909e47e14]::commands::profile::Profile>::run<unknown>
  1938. 166.13 s > at <unknown source file>:<unknown line>
  1939. 166.13 s > 9: test_runs[3e7a390caee4e338]::profile_bulk::scalar_self_energy_amp_bulk_profile_passes<unknown>
  1940. 166.13 s > at <unknown source file>:<unknown line>
  1941. 166.13 s > 10: <test_runs[3e7a390caee4e338]::profile_bulk::scalar_self_energy_amp_bulk_profile_passes::{closure#0} as core[940e698046960fd5]::ops::function::FnOnce<()>>::call_once<unknown>
  1942. 166.13 s > at <unknown source file>:<unknown line>
  1943. 166.13 s > 11: test[75d6903177b1d7e9]::__rust_begin_short_backtrace::<core[940e698046960fd5]::result::Result<(), alloc[2ea6bcb46fca0c42]::string::String>, fn() -> core[940e698046960fd5]::result::Result<(), alloc[2ea6bcb46fca0c42]::string::String>><unknown>
  1944. 166.13 s > at <unknown source file>:<unknown line>
  1945. 166.13 s > 12: test[75d6903177b1d7e9]::run_test::{closure#0}<unknown>
  1946. 166.13 s > at <unknown source file>:<unknown line>
  1947. 166.13 s > 13: std[bcb96dfbba0ab899]::sys::backtrace::__rust_begin_short_backtrace::<test[75d6903177b1d7e9]::run_test::{closure#1}, ()><unknown>
  1948. 166.13 s > at <unknown source file>:<unknown line>
  1949. 166.13 s > 14: <std[bcb96dfbba0ab899]::thread::lifecycle::spawn_unchecked<test[75d6903177b1d7e9]::run_test::{closure#1}, ()>::{closure#1} as core[940e698046960fd5]::ops::function::FnOnce<()>>::call_once::{shim:vtable#0}<unknown>
  1950. 166.13 s > at <unknown source file>:<unknown line>
  1951. 166.13 s > 15: <std[bcb96dfbba0ab899]::sys::thread::unix::Thread>::new::thread_start<unknown>
  1952. 166.13 s > at <unknown source file>:<unknown line>
  1953. 166.13 s > 16: start_thread<unknown>
  1954. 166.13 s > at <unknown source file>:<unknown line>
  1955. 166.13 s > 17: __clone3<unknown>
  1956. 166.13 s > at <unknown source file>:<unknown line>
  1957. 166.13 s >
  1958. 166.13 s > Run with COLORBT_SHOW_HIDDEN=1 environment variable to disable frame filtering.
  1959. 166.13 s > Run with RUST_BACKTRACE=full to include source snippets.
  1960. 166.13 s > Warning: SpanTrace capture is Unsupported.
  1961. 166.13 s > Ensure that you've setup a tracing-error ErrorLayer and the semver versions are compatible
  1962. 166.13 s > system-out
  1963. 166.13 s > running 1 test
  1964. 166.13 s > test profile_bulk::scalar_self_energy_amp_bulk_profile_passes ... FAILED
  1965. 166.13 s >
  1966. 166.13 s > failures:
  1967. 166.13 s >
  1968. 166.13 s > failures:
  1969. 166.13 s > profile_bulk::scalar_self_energy_amp_bulk_profile_passes
  1970. 166.13 s >
  1971. 166.13 s > test result: FAILED. 0 passed; 1 failed; 0 ignored; 0 measured; 82 filtered out; finished in 0.98s
  1972. 166.13 s > system-err
  1973. 166.13 s > [2026-08-26 08:19:35.370] @gammaloop_api::se... INFO : Running command import model ./assets/models/json/scalars/scalars.json
  1974. 166.13 s > [2026-08-26 08:19:35.370] @import::model INFO : Loading JSON model scalars-default from /build/source/assets/models/json/scalars/scalars
  1975. 166.13 s > [2026-08-26 08:19:35.374] @gammalooprs::model INFO : The following 2 external parameters were forced to zero by the restriction card:
  1976. 166.13 s > width_scalar_1, width_scalar_2
  1977. 166.13 s > [2026-08-26 08:19:35.375] @gammaloop_api::se... INFO : Running command import graphs ./tests/resources/graphs/scalar_self_energy_amp.dot
  1978. 166.13 s > [2026-08-26 08:19:35.375] @commands::import INFO : Loading graphs from '/build/source/tests/resources/graphs/scalar_self_energy_amp.dot'
  1979. 166.13 s > [2026-08-26 08:19:35.390] @gammaloop_api::se... INFO : Running command generate
  1980. 166.13 s > [2026-08-26 08:19:36.039] @commands::generate INFO :
  1981. 166.13 s > Integrand generation summary
  1982. 166.13 s > peak RAM 71.10 MiB | cores 1
  1983. 166.13 s > ╭───────────┬────────────────────────┬─────────┬─────────────┬─────────────┬────────────────┬─────────────╮
  1984. 166.13 s > │ integrand │ graph │ # evals │ expr build │ spenso │ symbolica eval │ compile │
  1985. 166.13 s > ├───────────┼────────────────────────┼─────────┼─────────────┼─────────────┼────────────────┼─────────────┤
  1986. 166.13 s > │ default │ scalar_self_energy_amp │ 6 │ 524ms (96%) │ 11ms (2.1%) │ 11ms (2.1%) │ 0ms (0.00%) │
  1987. 166.13 s > ├───────────┼────────────────────────┼─────────┼─────────────┼─────────────┼────────────────┼─────────────┤
  1988. 166.13 s > │ Total │ │ 6 │ 524ms (96%) │ 11ms (2.1%) │ 11ms (2.1%) │ 0ms (0.00%) │
  1989. 166.13 s > ╰───────────┴────────────────────────┴─────────┴─────────────┴─────────────┴────────────────┴─────────────╯
  1990. 166.13 s > [2026-08-26 08:19:36.041] @process::amplitude INFO : Input is above threshold: 2 existing threshold E-surfaces across 1/1 graph groups
  1991. 166.13 s > [2026-08-26 08:19:36.041] @process::amplitude INFO : overlap structure of group 0: [2: [2(1,5), 4(2,3,5)]]
  1992. 166.13 s > Error:
  1993. 166.13 s > 0: IR profiling requested arbitrary precision but received a quad-precision result
  1994. 166.13 s >
  1995. 166.13 s > Location:
  1996. 166.13 s > crates/gammalooprs/src/integrands/process/ir.rs:2123
  1997. 166.13 s >
  1998. 166.13 s > ━━━━━━━━━━━━━━━━━━━━━━━━━━━━━━━━━━ BACKTRACE ━━━━━━━━━━━━━━━━━━━━━━━━━━━━━━━━━━━
  1999. 166.13 s > 1: <color_eyre[51793ea62743adbd]::config::EyreHook>::into_eyre_hook::{closure#0}<unknown>
  2000. 166.13 s > at <unknown source file>:<unknown line>
  2001. 166.13 s > 2: eyre[cb2fd339c0c40fca]::capture_handler<unknown>
  2002. 166.13 s > at <unknown source file>:<unknown line>
  2003. 166.13 s > 3: eyre[cb2fd339c0c40fca]::private::format_err<unknown>
  2004. 166.13 s > at <unknown source file>:<unknown line>
  2005. 166.13 s > 4: gammalooprs[d7a7c067ebd19583]::integrands::process::ir::evaluate_profile_momentum_point_arb::<gammalooprs[d7a7c067ebd19583]::integrands::process::amplitude::AmplitudeIntegrand><unknown>
  2006. 166.13 s > at <unknown source file>:<unknown line>
  2007. 166.13 s > 5: <gammalooprs[d7a7c067ebd19583]::integrands::process::amplitude::AmplitudeIntegrand>::test_single_ir_limit_impl<unknown>
  2008. 166.13 s > at <unknown source file>:<unknown line>
  2009. 166.13 s > 6: gammalooprs[d7a7c067ebd19583]::integrands::process::ir::run_ir_profile::<gammalooprs[d7a7c067ebd19583]::integrands::process::amplitude::AmplitudeIntegrand, <gammalooprs[d7a7c067ebd19583]::integrands::process::amplitude::AmplitudeIntegrand>::enumerate_ir_limits, <gammalooprs[d7a7c067ebd19583]::integrands::process::amplitude::AmplitudeIntegrand>::graph_cut_definitions, <gammalooprs[d7a7c067ebd19583]::integrands::process::amplitude::AmplitudeIntegrand>::test_single_ir_limit_impl><unknown>
  2010. 166.13 s > at <unknown source file>:<unknown line>
  2011. 166.13 s > 7: <gammalooprs[d7a7c067ebd19583]::integrands::process::amplitude::AmplitudeIntegrand>::test_ir<unknown>
  2012. 166.13 s > at <unknown source file>:<unknown line>
  2013. 166.13 s > 8: <gammaloop_api[92ae732909e47e14]::commands::profile::Profile>::run<unknown>
  2014. 166.13 s > at <unknown source file>:<unknown line>
  2015. 166.13 s > 9: test_runs[3e7a390caee4e338]::profile_bulk::scalar_self_energy_amp_bulk_profile_passes<unknown>
  2016. 166.13 s > at <unknown source file>:<unknown line>
  2017. 166.13 s > 10: <test_runs[3e7a390caee4e338]::profile_bulk::scalar_self_energy_amp_bulk_profile_passes::{closure#0} as core[940e698046960fd5]::ops::function::FnOnce<()>>::call_once<unknown>
  2018. 166.13 s > at <unknown source file>:<unknown line>
  2019. 166.13 s > 11: test[75d6903177b1d7e9]::__rust_begin_short_backtrace::<core[940e698046960fd5]::result::Result<(), alloc[2ea6bcb46fca0c42]::string::String>, fn() -> core[940e698046960fd5]::result::Result<(), alloc[2ea6bcb46fca0c42]::string::String>><unknown>
  2020. 166.13 s > at <unknown source file>:<unknown line>
  2021. 166.13 s > 12: test[75d6903177b1d7e9]::run_test::{closure#0}<unknown>
  2022. 166.13 s > at <unknown source file>:<unknown line>
  2023. 166.13 s > 13: std[bcb96dfbba0ab899]::sys::backtrace::__rust_begin_short_backtrace::<test[75d6903177b1d7e9]::run_test::{closure#1}, ()><unknown>
  2024. 166.13 s > at <unknown source file>:<unknown line>
  2025. 166.13 s > 14: <std[bcb96dfbba0ab899]::thread::lifecycle::spawn_unchecked<test[75d6903177b1d7e9]::run_test::{closure#1}, ()>::{closure#1} as core[940e698046960fd5]::ops::function::FnOnce<()>>::call_once::{shim:vtable#0}<unknown>
  2026. 166.13 s > at <unknown source file>:<unknown line>
  2027. 166.13 s > 15: <std[bcb96dfbba0ab899]::sys::thread::unix::Thread>::new::thread_start<unknown>
  2028. 166.13 s > at <unknown source file>:<unknown line>
  2029. 166.13 s > 16: start_thread<unknown>
  2030. 166.13 s > at <unknown source file>:<unknown line>
  2031. 166.13 s > 17: __clone3<unknown>
  2032. 166.13 s > at <unknown source file>:<unknown line>
  2033. 166.13 s >
  2034. 166.13 s > Run with COLORBT_SHOW_HIDDEN=1 environment variable to disable frame filtering.
  2035. 166.13 s > Run with RUST_BACKTRACE=full to include source snippets.
  2036. 166.13 s > Warning: SpanTrace capture is Unsupported.
  2037. 166.13 s > Ensure that you've setup a tracing-error ErrorLayer and the semver versions are compatible
  2038. 166.13 s >
  2039. 166.13 s > 7. gammaloop-integration-tests::uv::dod2_bubble_uv
  2040. 166.13 s > failure: test failure with exit code 101
  2041. 166.13 s > system-out
  2042. 166.13 s > running 1 test
  2043. 166.13 s > +-------------+-----------------+---------+--------+----------+-----------------------------------------------------------------------------------------------------------------------+-------+
  2044. 166.13 s > | case | check | graph | status | sigma | threshold | error |
  2045. 166.13 s > +-------------+-----------------+---------+--------+----------+-----------------------------------------------------------------------------------------------------------------------+-------+
  2046. 166.13 s > | dod2_bubble | uv_profile | - | FAIL | - | - | - |
  2047. 166.13 s > +-------------+-----------------+---------+--------+----------+-----------------------------------------------------------------------------------------------------------------------+-------+
  2048. 166.13 s > | dod2_bubble | m_uv.inspect | inspect | pass | - | best inspect relative delta 1.000e0 >= 1000*accuracy 1.000e-7 (accuracy=1.000e-10, exponent=+8.0, seed=0, probes=10) | - |
  2049. 166.13 s > +-------------+-----------------+---------+--------+----------+-----------------------------------------------------------------------------------------------------------------------+-------+
  2050. 166.13 s > | dod2_bubble | m_uv.integrated | GL0 | pass | 0.0sigma | compatible within 2sigma | - |
  2051. 166.13 s > +-------------+-----------------+---------+--------+----------+-----------------------------------------------------------------------------------------------------------------------+-------+
  2052. 166.13 s > | dod2_bubble | rls.inspect | inspect | pass | - | best inspect relative delta 2.822e-3 >= 1000*accuracy 1.000e-7 (accuracy=1.000e-10, exponent=+2.0, seed=1, probes=10) | - |
  2053. 166.13 s > +-------------+-----------------+---------+--------+----------+-----------------------------------------------------------------------------------------------------------------------+-------+
  2054. 166.13 s > | dod2_bubble | rls.integrated | GL0 | pass | 0.0sigma | compatible within 2sigma | - |
  2055. 166.13 s > +-------------+-----------------+---------+--------+----------+-----------------------------------------------------------------------------------------------------------------------+-------+
  2056. 166.13 s > | dod2_bubble | mu_r.inspect | inspect | pass | - | best inspect relative delta 6.951e-1 >= 1000*accuracy 1.000e-7 (accuracy=1.000e-10, exponent=+0.0, seed=0, probes=10) | - |
  2057. 166.13 s > +-------------+-----------------+---------+--------+----------+-----------------------------------------------------------------------------------------------------------------------+-------+
  2058. 166.13 s > | dod2_bubble | target | - | pass | - | 2sigma | - |
  2059. 166.13 s > +-------------+-----------------+---------+--------+----------+-----------------------------------------------------------------------------------------------------------------------+-------+
  2060. 166.13 s > test dod2_bubble_uv ... FAILED
  2061. 166.13 s >
  2062. 166.13 s > failures:
  2063. 166.13 s >
  2064. 166.13 s > failures:
  2065. 166.13 s > dod2_bubble_uv
  2066. 166.13 s >
  2067. 166.13 s > test result: FAILED. 0 passed; 1 failed; 0 ignored; 0 measured; 24 filtered out; finished in 52.46s
  2068. 166.13 s > system-err
  2069. 166.13 s > [2026-08-26 08:19:37.806] @gammaloop_api::se... INFO : Running command run generate
  2070. 166.13 s > [2026-08-26 08:19:37.807] @gammaloop_api::se... INFO : Starting command block generate
  2071. 166.13 s > [2026-08-26 08:19:37.807] @gammaloop_api::se... INFO : Running command import model scalars-default.json
  2072. 166.13 s > [2026-08-26 08:19:37.807] @import::model INFO : Loading built-in JSON model scalars-default
  2073. 166.13 s > [2026-08-26 08:19:37.811] @gammalooprs::model INFO : The following 2 external parameters were forced to zero by the restriction card:
  2074. 166.13 s > width_scalar_1, width_scalar_2
  2075. 166.13 s > [2026-08-26 08:19:37.811] @gammaloop_api::se... INFO : Running command remove processes
  2076. 166.13 s > [2026-08-26 08:19:37.812] @gammaloop_api::se... INFO : Running command set global kv global.generation.uv.generate_integrated=true
  2077. 166.13 s > [2026-08-26 08:19:37.812] @gammaloop_api::se... INFO : Running command import graphs ./tests/resources/graphs/scalar/dod2_bubble.dot -p bubble_dod2 -i scalar_bubble_below_thres
  2078. 166.13 s > [2026-08-26 08:19:37.812] @commands::import INFO : Loading graphs from '/build/source/tests/resources/graphs/scalar/dod2_bubble.dot'
  2079. 166.13 s > [2026-08-26 08:19:37.818] @gammaloop_api::se... INFO : Running command generate existing -p bubble_dod2 -i scalar_bubble_below_thres
  2080. 166.13 s > [2026-08-26 08:19:37.820] @approx::local_4d [{#uv, #inspect, #integrated}] DEBUG : Rescaled momenta expanded
  2081. 166.13 s > field value
  2082. 166.13 s > res n-terms: 1, byte size: 585,expr:
  2083. 166.13 s > -SCALAR_COUPLING²·q₀(αᵉ².¹)·q₀(αᵉ³.¹)·q₂(αᵉ².¹)·q₂(αᵉ³.¹)
  2084. 166.13 s > /(t²·denom(3,-q₀-q₂/t,mass_scalar_2²,-mass_scalar_2²+2·(q₀.q₂)/t+(q₂.q₂)/t²+(q₀.q₀))
  2085. 166.13 s > ·denom(2,q₂/t,mass_scalar_2²,-mass_scalar_2²+(q₂.q₂)/t²))
  2086. 166.13 s > [2026-08-26 08:19:37.828] @approx::local_4d [{#uv, #inspect, #integrated}] DEBUG : Rescaled momenta expanded
  2087. 166.13 s > field value
  2088. 166.13 s > res n-terms: 1, byte size: 3,expr:
  2089. 166.13 s > 1
  2090. 166.13 s > [2026-08-26 08:19:37.829] @approx::final_integrand[{#generation, #profile, #uv, #graph, #summary}] DEBUG : Computed global numerator
  2091. 166.13 s > field value
  2092. 166.13 s > global_num n-terms: 1, byte size: 4,expr:
  2093. 166.13 s > 1/2
  2094. 166.13 s > span build_3d{span_context=true graph=GL0 current=subgraph=0, topo_order=0, dod=0}
  2095. 166.13 s > [2026-08-26 08:19:37.835] @uv::approx [{#generation, #uv, #fourd}] DEBUG : Computing 4D
  2096. 166.13 s > field value
  2097. 166.13 s > simple subgraph(S_11,S_y)*Approx(subgraph(S_y,0)) of GL0
  2098. 166.13 s > span compute_4d{span_context=true graph=GL0 current=subgraph=y, topo_order=1, dod=2 given=subgraph=0, topo_order=0, dod=0 reduced=SubSet { set: BitVec<usize, bitvec::order::Lsb0> { addr: 0x7fffe0017290, head: 000000, bits: 6, capacity: 64 } [0, 0, 1, 1, 1, 1], id: PhantomData<linnet::half_edge::involution::Hedge> }}
  2099. 166.13 s > [2026-08-26 08:19:37.839] @approx::local_4d [{#uv, #algebra, #integrated, #start}] DEBUG :
  2100. 166.13 s > field value
  2101. 166.13 s > integrand n-terms: 1, byte size: 409,expr:
  2102. 166.13 s > SCALAR_COUPLING²·(q₀(αᵉ³.¹)+q₃(αᵉ³.¹))·q₀(αᵉ².¹)·q₀(αᵉ³.¹)·q₂(αᵉ².¹)
  2103. 166.13 s > /(denom(2,q₂,mass_scalar_2²,-mass_scalar_2²+(q₂.q₂))·denom(3,q₃,mass_scalar_2²,-mass_scalar_2²+(q₃.q₃)))
  2104. 166.13 s > reduced y
  2105. 166.13 s > span grow{span_context=true current=subgraph=y, topo_order=1, dod=2 given=subgraph=0, topo_order=0, dod=0}
  2106. 166.13 s > [2026-08-26 08:19:37.839] @approx::local_4d [{#uv, #inspect, #integrated}] DEBUG : Rescaled momenta expanded
  2107. 166.13 s > field value
  2108. 166.13 s > res n-terms: 1, byte size: 585,expr:
  2109. 166.13 s > -SCALAR_COUPLING²·q₀(αᵉ².¹)·q₀(αᵉ³.¹)·q₂(αᵉ².¹)·q₂(αᵉ³.¹)
  2110. 166.13 s > /(t²·denom(3,-q₀-q₂/t,mass_scalar_2²,-mass_scalar_2²+2·(q₀.q₂)/t+(q₂.q₂)/t²+(q₀.q₀))
  2111. 166.13 s > ·denom(2,q₂/t,mass_scalar_2²,-mass_scalar_2²+(q₂.q₂)/t²))
  2112. 166.13 s > span t{span_context=true current=subgraph=y, topo_order=1, dod=2 given=subgraph=0, topo_order=0, dod=0}
  2113. 166.13 s > [2026-08-26 08:19:37.839] @approx::local_4d [{#uv, #integrated, #rescaled}] DEBUG : Rescaled expanded
  2114. 166.13 s > field value
  2115. 166.13 s > n_loops 1
  2116. 166.13 s > res n-terms: 1, byte size: 707,expr:
  2117. 166.13 s > -SCALAR_COUPLING²·q₀(αᵉ².¹)·q₀(αᵉ³.¹)·q₂(αᵉ².¹)·q₂(αᵉ³.¹)
  2118. 166.13 s > /(t²·denom(3,-q₂,mUVexp²+t²·mass_scalar_2²,-mUV²+t²·(-mass_scalar_2²+2·(q₀.q₂)/t+(q₂.q₂)/t²+(q₀.q₀))+t²·mUVexp²)
  2119. 166.13 s > ·denom(2,q₂,mUVexp²+t²·mass_scalar_2²,-mUV²+t²·(-mass_scalar_2²+(q₂.q₂)/t²)+t²·mUVexp²))
  2120. 166.13 s > span t{span_context=true current=subgraph=y, topo_order=1, dod=2 given=subgraph=0, topo_order=0, dod=0}
  2121. 166.13 s > [2026-08-26 08:19:37.841] @approx::local_4d [{#uv, #integrated, #series}] DEBUG : Series expanded
  2122. 166.13 s > field value
  2123. 166.13 s > res n-terms: 3, byte size: 1896,expr:
  2124. 166.13 s > (1/2·SCALAR_COUPLING²·(2·mUVexp²-2·mass_scalar_2²)/(denom(2,q₂,mUVexp²,-mUV²+(q₂.q₂))²·denom(3,-q₂,mUVexp²,-mUV²+(q₂.q₂)))
  2125. 166.13 s > -SCALAR_COUPLING²
  2126. 166.13 s > ·(-1/2·(2·mUVexp²-2·mass_scalar_2²+2·(q₀.q₀))/denom(3,-q₂,mUVexp²,-mUV²+(q₂.q₂))
  2127. 166.13 s > +4·(q₀.q₂)²/denom(3,-q₂,mUVexp²,-mUV²+(q₂.q₂))²
  2128. 166.13 s > )/(denom(2,q₂,mUVexp²,-mUV²+(q₂.q₂))·denom(3,-q₂,mUVexp²,-mUV²+(q₂.q₂)))
  2129. 166.13 s > )·q₀(αᵉ².¹)·q₀(αᵉ³.¹)·q₂(αᵉ².¹)·q₂(αᵉ³.¹)
  2130. 166.13 s > +2·SCALAR_COUPLING²·(q₀.q₂)·q₀(αᵉ².¹)·q₀(αᵉ³.¹)·q₂(αᵉ².¹)·q₂(αᵉ³.¹)
  2131. 166.13 s > /(t·denom(2,q₂,mUVexp²,-mUV²+(q₂.q₂))·denom(3,-q₂,mUVexp²,-mUV²+(q₂.q₂))²)
  2132. 166.13 s > -SCALAR_COUPLING²·q₀(αᵉ².¹)·q₀(αᵉ³.¹)·q₂(αᵉ².¹)·q₂(αᵉ³.¹)
  2133. 166.13 s > /(t²·denom(2,q₂,mUVexp²,-mUV²+(q₂.q₂))·denom(3,-q₂,mUVexp²,-mUV²+(q₂.q₂)))
  2134. 166.13 s > span t{span_context=true current=subgraph=y, topo_order=1, dod=2 given=subgraph=0, topo_order=0, dod=0}
  2135. 166.13 s > [2026-08-26 08:19:37.841] @approx::local_4d [{#uv, #integrated, #series}] DEBUG : Evaluated at t = 1
  2136. 166.13 s > field value
  2137. 166.13 s > res n-terms: 3, byte size: 1880,expr:
  2138. 166.13 s > (1/2·SCALAR_COUPLING²·(2·mUVexp²-2·mass_scalar_2²)/(denom(2,q₂,mUVexp²,-mUV²+(q₂.q₂))²·denom(3,-q₂,mUVexp²,-mUV²+(q₂.q₂)))
  2139. 166.13 s > -SCALAR_COUPLING²
  2140. 166.13 s > ·(-1/2·(2·mUVexp²-2·mass_scalar_2²+2·(q₀.q₀))/denom(3,-q₂,mUVexp²,-mUV²+(q₂.q₂))
  2141. 166.13 s > +4·(q₀.q₂)²/denom(3,-q₂,mUVexp²,-mUV²+(q₂.q₂))²
  2142. 166.13 s > )/(denom(2,q₂,mUVexp²,-mUV²+(q₂.q₂))·denom(3,-q₂,mUVexp²,-mUV²+(q₂.q₂)))
  2143. 166.13 s > )·q₀(αᵉ².¹)·q₀(αᵉ³.¹)·q₂(αᵉ².¹)·q₂(αᵉ³.¹)
  2144. 166.13 s > -SCALAR_COUPLING²·q₀(αᵉ².¹)·q₀(αᵉ³.¹)·q₂(αᵉ².¹)·q₂(αᵉ³.¹)
  2145. 166.13 s > /(denom(2,q₂,mUVexp²,-mUV²+(q₂.q₂))·denom(3,-q₂,mUVexp²,-mUV²+(q₂.q₂)))
  2146. 166.13 s > +2·SCALAR_COUPLING²·(q₀.q₂)·q₀(αᵉ².¹)·q₀(αᵉ³.¹)·q₂(αᵉ².¹)·q₂(αᵉ³.¹)
  2147. 166.13 s > /(denom(2,q₂,mUVexp²,-mUV²+(q₂.q₂))·denom(3,-q₂,mUVexp²,-mUV²+(q₂.q₂))²)
  2148. 166.13 s > span t{span_context=true current=subgraph=y, topo_order=1, dod=2 given=subgraph=0, topo_order=0, dod=0}
  2149. 166.13 s > [2026-08-26 08:19:37.846] @approx::local_4d [{#uv, #collect, #integrated}] DEBUG : After gamma chain collection
  2150. 166.13 s > field value
  2151. 166.13 s > expr n-terms: 3, byte size: 1880,expr:
  2152. 166.13 s > (1/2·SCALAR_COUPLING²·(2·mUVexp²-2·mass_scalar_2²)/(denom(2,q₂,mUVexp²,-mUV²+(q₂.q₂))²·denom(3,-q₂,mUVexp²,-mUV²+(q₂.q₂)))
  2153. 166.13 s > -SCALAR_COUPLING²
  2154. 166.13 s > ·(-1/2·(2·mUVexp²-2·mass_scalar_2²+2·(q₀.q₀))/denom(3,-q₂,mUVexp²,-mUV²+(q₂.q₂))
  2155. 166.13 s > +4·(q₀.q₂)²/denom(3,-q₂,mUVexp²,-mUV²+(q₂.q₂))²
  2156. 166.13 s > )/(denom(2,q₂,mUVexp²,-mUV²+(q₂.q₂))·denom(3,-q₂,mUVexp²,-mUV²+(q₂.q₂)))
  2157. 166.13 s > )·q₀(αᵉ².¹)·q₀(αᵉ³.¹)·q₂(αᵉ².¹)·q₂(αᵉ³.¹)
  2158. 166.13 s > -SCALAR_COUPLING²·q₀(αᵉ².¹)·q₀(αᵉ³.¹)·q₂(αᵉ².¹)·q₂(αᵉ³.¹)
  2159. 166.13 s > /(denom(2,q₂,mUVexp²,-mUV²+(q₂.q₂))·denom(3,-q₂,mUVexp²,-mUV²+(q₂.q₂)))
  2160. 166.13 s > +2·SCALAR_COUPLING²·(q₀.q₂)·q₀(αᵉ².¹)·q₀(αᵉ³.¹)·q₂(αᵉ².¹)·q₂(αᵉ³.¹)
  2161. 166.13 s > /(denom(2,q₂,mUVexp²,-mUV²+(q₂.q₂))·denom(3,-q₂,mUVexp²,-mUV²+(q₂.q₂))²)
  2162. 166.13 s > span t{span_context=true current=subgraph=y, topo_order=1, dod=2 given=subgraph=0, topo_order=0, dod=0}
  2163. 166.13 s > [2026-08-26 08:19:37.852] @approx::local_4d [{#profile, #uv, #collect, #integrated, #start, #trace}] DEBUG : After gamma schoonschip
  2164. 166.13 s > field value
  2165. 166.13 s > expr n-terms: 3, byte size: 1631,expr:
  2166. 166.13 s > (1/2·SCALAR_COUPLING²·(2·mUVexp²-2·mass_scalar_2²)/(denom(2,q₂,mUVexp²,-mUV²+(q₂.q₂))²·denom(3,-q₂,mUVexp²,-mUV²+(q₂.q₂)))
  2167. 166.13 s > -SCALAR_COUPLING²
  2168. 166.13 s > ·(-1/2·(2·mUVexp²-2·mass_scalar_2²+2·(q₀.q₀))/denom(3,-q₂,mUVexp²,-mUV²+(q₂.q₂))
  2169. 166.13 s > +4·(q₀.q₂)²/denom(3,-q₂,mUVexp²,-mUV²+(q₂.q₂))²
  2170. 166.13 s > )/(denom(2,q₂,mUVexp²,-mUV²+(q₂.q₂))·denom(3,-q₂,mUVexp²,-mUV²+(q₂.q₂)))
  2171. 166.13 s > )·(q₀.q₂)²
  2172. 166.13 s > -SCALAR_COUPLING²·(q₀.q₂)²/(denom(2,q₂,mUVexp²,-mUV²+(q₂.q₂))·denom(3,-q₂,mUVexp²,-mUV²+(q₂.q₂)))
  2173. 166.13 s > +2·SCALAR_COUPLING²·(q₀.q₂)·(q₀.q₂)²
  2174. 166.14 s > /(denom(2,q₂,mUVexp²,-mUV²+(q₂.q₂))·denom(3,-q₂,mUVexp²,-mUV²+(q₂.q₂))²)
  2175. 166.14 s > span t{span_context=true current=subgraph=y, topo_order=1, dod=2 given=subgraph=0, topo_order=0, dod=0}
  2176. 166.14 s > [2026-08-26 08:19:37.857] @approx::local_4d [{#profile, #uv, #collect, #integrated, #start, #trace}] DEBUG : After gamma collection
  2177. 166.14 s > field value
  2178. 166.14 s > expr n-terms: 1, byte size: 1347,expr:
  2179. 166.14 s > SCALAR_COUPLING²
  2180. 166.14 s > ·(-denom(2,q₂,mUVexp²,-mUV²+(q₂.q₂))·denom(3,-q₂,mUVexp²,-mUV²+(q₂.q₂))²
  2181. 166.14 s > +1/2·(2·mUVexp²-2·mass_scalar_2²)·denom(3,-q₂,mUVexp²,-mUV²+(q₂.q₂))²
  2182. 166.14 s > -(-1/2·(2·mUVexp²-2·mass_scalar_2²+2·(q₀.q₀))·denom(3,-q₂,mUVexp²,-mUV²+(q₂.q₂))+4·(q₀.q₂)²)
  2183. 166.14 s > ·denom(2,q₂,mUVexp²,-mUV²+(q₂.q₂))
  2184. 166.14 s > +2·(q₀.q₂)·denom(2,q₂,mUVexp²,-mUV²+(q₂.q₂))·denom(3,-q₂,mUVexp²,-mUV²+(q₂.q₂))
  2185. 166.14 s > )·(q₀.q₂)²/(denom(2,q₂,mUVexp²,-mUV²+(q₂.q₂))²·denom(3,-q₂,mUVexp²,-mUV²+(q₂.q₂))³)
  2186. 166.14 s > span t{span_context=true current=subgraph=y, topo_order=1, dod=2 given=subgraph=0, topo_order=0, dod=0}
  2187. 166.14 s > [2026-08-26 08:19:37.858] @approx::local_4d [{#profile, #uv, #gamma, #integrated, #start, #trace, #vakint}] DEBUG : After gamma simplification
  2188. 166.14 s > ... omitted 3263 more lines; see full nextest output above
  2189. 166.14 s >
  2190. 166.14 s > 8. gammaloop-integration-tests::uv::sunrise_scalar_1_uv
  2191. 166.14 s > failure: test failure with exit code 101
  2192. 166.14 s > system-out
  2193. 166.14 s > running 1 test
  2194. 166.14 s > test sunrise_scalar_1_uv has been running for over 60 seconds
  2195. 166.14 s > +------------------+------------------------+--------------+--------+----------+----------------------------------------------------------------------------------------------------------------------+-------+
  2196. 166.14 s > | case | check | graph | status | sigma | threshold | error |
  2197. 166.14 s > +------------------+------------------------+--------------+--------+----------+----------------------------------------------------------------------------------------------------------------------+-------+
  2198. 166.14 s > | sunrise_scalar_1 | uv_profile | - | FAIL | - | - | - |
  2199. 166.14 s > +------------------+------------------------+--------------+--------+----------+----------------------------------------------------------------------------------------------------------------------+-------+
  2200. 166.14 s > | sunrise_scalar_1 | m_uv.inspect | inspect | pass | - | best inspect relative delta 1.624e0 >= 1000*accuracy 1.000e-3 (accuracy=1.000e-6, exponent=+1.0, seed=1, probes=10) | - |
  2201. 166.14 s > +------------------+------------------------+--------------+--------+----------+----------------------------------------------------------------------------------------------------------------------+-------+
  2202. 166.14 s > | sunrise_scalar_1 | m_uv.integrated | sunrise | pass | 0.1sigma | compatible within 2sigma | - |
  2203. 166.14 s > +------------------+------------------------+--------------+--------+----------+----------------------------------------------------------------------------------------------------------------------+-------+
  2204. 166.14 s > | sunrise_scalar_1 | rls.inspect | inspect | pass | - | best inspect relative delta 8.682e-1 >= 1000*accuracy 1.000e-3 (accuracy=1.000e-6, exponent=+1.0, seed=1, probes=10) | - |
  2205. 166.14 s > +------------------+------------------------+--------------+--------+----------+----------------------------------------------------------------------------------------------------------------------+-------+
  2206. 166.14 s > | sunrise_scalar_1 | rls.integrated | sunrise | pass | 0.0sigma | compatible within 2sigma | - |
  2207. 166.14 s > +------------------+------------------------+--------------+--------+----------+----------------------------------------------------------------------------------------------------------------------+-------+
  2208. 166.14 s > | sunrise_scalar_1 | mu_r.inspect | inspect | pass | - | best inspect relative delta 1.752e0 >= 1000*accuracy 1.000e-3 (accuracy=1.000e-6, exponent=+1.0, seed=1, probes=10) | - |
  2209. 166.14 s > +------------------+------------------------+--------------+--------+----------+----------------------------------------------------------------------------------------------------------------------+-------+
  2210. 166.14 s > | sunrise_scalar_1 | integrated.relerr | integrated | pass | - | relative error 9.20% <= 10.00% | - |
  2211. 166.14 s > +------------------+------------------------+--------------+--------+----------+----------------------------------------------------------------------------------------------------------------------+-------+
  2212. 166.14 s > | sunrise_scalar_1 | m_uv.integrated.relerr | m_uv-shifted | pass | - | relative error 5.89% <= 10.00% | - |
  2213. 166.14 s > +------------------+------------------------+--------------+--------+----------+----------------------------------------------------------------------------------------------------------------------+-------+
  2214. 166.14 s > | sunrise_scalar_1 | target | - | pass | - | 2sigma | - |
  2215. 166.14 s > +------------------+------------------------+--------------+--------+----------+----------------------------------------------------------------------------------------------------------------------+-------+
  2216. 166.14 s > test sunrise_scalar_1_uv ... FAILED
  2217. 166.14 s >
  2218. 166.14 s > failures:
  2219. 166.14 s >
  2220. 166.14 s > failures:
  2221. 166.14 s > sunrise_scalar_1_uv
  2222. 166.14 s >
  2223. 166.14 s > test result: FAILED. 0 passed; 1 failed; 0 ignored; 0 measured; 24 filtered out; finished in 105.63s
  2224. 166.14 s > system-err
  2225. 166.14 s > [2026-08-26 08:19:47.091] @gammaloop_api::se... INFO : Running command run generate
  2226. 166.14 s > [2026-08-26 08:19:47.091] @gammaloop_api::se... INFO : Starting command block generate
  2227. 166.14 s > [2026-08-26 08:19:47.091] @gammaloop_api::se... INFO : Running command import model scalars-default.json
  2228. 166.14 s > [2026-08-26 08:19:47.091] @import::model INFO : Loading built-in JSON model scalars-default
  2229. 166.14 s > [2026-08-26 08:19:47.095] @gammalooprs::model INFO : The following 2 external parameters were forced to zero by the restriction card:
  2230. 166.14 s > width_scalar_1, width_scalar_2
  2231. 166.14 s > [2026-08-26 08:19:47.095] @gammaloop_api::se... INFO : Running command remove processes
  2232. 166.14 s > [2026-08-26 08:19:47.095] @gammaloop_api::se... INFO : Running command set global kv global.generation.uv.generate_integrated=true
  2233. 166.14 s > [2026-08-26 08:19:47.096] @gammaloop_api::se... INFO : Running command import graphs ./tests/resources/graphs/scalar_sunrise.dot -p sunrise_scalar_1 -i scalar_sunrise
  2234. 166.14 s > [2026-08-26 08:19:47.096] @commands::import INFO : Loading graphs from '/build/source/tests/resources/graphs/scalar_sunrise.dot'
  2235. 166.14 s > [2026-08-26 08:19:47.098] @gammaloop_api::se... INFO : Running command generate existing -p sunrise_scalar_1 -i scalar_sunrise
  2236. 166.14 s > [2026-08-26 08:19:47.101] @approx::local_4d [{#uv, #inspect, #integrated}] DEBUG : Rescaled momenta expanded
  2237. 166.14 s > field value
  2238. 166.14 s > res n-terms: 1, byte size: 777,expr:
  2239. 166.14 s > 1/(denom(0,q₀/t,mass_scalar_1²,-mass_scalar_1²+(q₀.q₀)/t²)·denom(1,q₁/t,mass_scalar_1²,-mass_scalar_1²+(q₁.q₁)/t²)
  2240. 166.14 s > ·denom(2,q₄-q₀/t-q₁/t,mass_scalar_1²,
  2241. 166.14 s > -mass_scalar_1²-2·(q₀.q₄)/t-2·(q₁.q₄)/t+(q₀.q₀)/t²+2·(q₀.q₁)/t²
  2242. 166.14 s > +(q₁.q₁)/t²+(q₄.q₄)
  2243. 166.14 s > ))
  2244. 166.14 s > [2026-08-26 08:19:47.104] @approx::local_4d [{#uv, #inspect, #integrated}] DEBUG : Rescaled momenta expanded
  2245. 166.14 s > field value
  2246. 166.14 s > res n-terms: 1, byte size: 611,expr:
  2247. 166.14 s > 1/(denom(0,q₀/t,mass_scalar_1²,-mass_scalar_1²+(q₀.q₀)/t²)
  2248. 166.14 s > ·denom(1,-q₂+q₃-q₀/t,mass_scalar_1²,
  2249. 166.14 s > -mass_scalar_1²+2·(q₀.q₂)/t-2·(q₀.q₃)/t+(q₀.q₀)/t²+(q₂.q₂)
  2250. 166.14 s > -2·(q₂.q₃)+(q₃.q₃)
  2251. 166.14 s > ))
  2252. 166.14 s > [2026-08-26 08:19:47.105] @approx::local_4d [{#uv, #inspect, #integrated}] DEBUG : Rescaled momenta expanded
  2253. 166.14 s > field value
  2254. 166.14 s > res n-terms: 1, byte size: 3,expr:
  2255. 166.14 s > 1
  2256. 166.14 s > [2026-08-26 08:19:47.106] @approx::local_4d [{#uv, #inspect, #integrated}] DEBUG : Rescaled momenta expanded
  2257. 166.14 s > field value
  2258. 166.14 s > res n-terms: 1, byte size: 611,expr:
  2259. 166.14 s > 1/(denom(1,q₁/t,mass_scalar_1²,-mass_scalar_1²+(q₁.q₁)/t²)
  2260. 166.14 s > ·denom(2,-q₀+q₃-q₁/t,mass_scalar_1²,
  2261. 166.14 s > -mass_scalar_1²+2·(q₀.q₁)/t-2·(q₁.q₃)/t+(q₁.q₁)/t²+(q₀.q₀)
  2262. 166.14 s > -2·(q₀.q₃)+(q₃.q₃)
  2263. 166.14 s > ))
  2264. 166.14 s > [2026-08-26 08:19:47.108] @approx::local_4d [{#uv, #inspect, #integrated}] DEBUG : Rescaled momenta expanded
  2265. 166.14 s > field value
  2266. 166.14 s > res n-terms: 1, byte size: 611,expr:
  2267. 166.14 s > 1/(denom(0,q₀/t,mass_scalar_1²,-mass_scalar_1²+(q₀.q₀)/t²)
  2268. 166.14 s > ·denom(2,-q₁+q₃-q₀/t,mass_scalar_1²,
  2269. 166.14 s > -mass_scalar_1²+2·(q₀.q₁)/t-2·(q₀.q₃)/t+(q₀.q₀)/t²+(q₁.q₁)
  2270. 166.14 s > -2·(q₁.q₃)+(q₃.q₃)
  2271. 166.14 s > ))
  2272. 166.14 s > [2026-08-26 08:19:47.109] @approx::final_integrand[{#generation, #profile, #uv, #graph, #summary}] DEBUG : Computed global numerator
  2273. 166.14 s > field value
  2274. 166.14 s > global_num n-terms: 1, byte size: 3,expr:
  2275. 166.14 s > 1
  2276. 166.14 s > span build_3d{span_context=true graph=sunrise current=subgraph=0, topo_order=0, dod=0}
  2277. 166.14 s > [2026-08-26 08:19:47.111] @uv::approx [{#generation, #uv, #fourd}] DEBUG : Computing 4D
  2278. 166.14 s > field value
  2279. 166.14 s > simple subgraph(S_47,S_44)*Approx(subgraph(S_44,0)) of sunrise
  2280. 166.14 s > span compute_4d{span_context=true graph=sunrise current=subgraph=44, topo_order=1, dod=2 given=subgraph=0, topo_order=0, dod=0 reduced=SubSet { set: BitVec<usize, bitvec::order::Lsb0> { addr: 0x7fffec014950, head: 000000, bits: 8, capacity: 64 } [0, 0, 1, 1, 1, 1, 1, 1], id: PhantomData<linnet::half_edge::involution::Hedge> }}
  2281. 166.14 s > [2026-08-26 08:19:47.112] @approx::local_4d [{#uv, #algebra, #integrated, #start}] DEBUG :
  2282. 166.14 s > field value
  2283. 166.14 s > integrand n-terms: 1, byte size: 322,expr:
  2284. 166.14 s > 1/(denom(0,q₀,mass_scalar_1²,-mass_scalar_1²+(q₀.q₀))·denom(1,q₁,mass_scalar_1²,-mass_scalar_1²+(q₁.q₁))
  2285. 166.14 s > ·denom(2,q₂,mass_scalar_1²,-mass_scalar_1²+(q₂.q₂)))
  2286. 166.14 s > reduced 44
  2287. 166.14 s > span grow{span_context=true current=subgraph=44, topo_order=1, dod=2 given=subgraph=0, topo_order=0, dod=0}
  2288. 166.14 s > [2026-08-26 08:19:47.112] @approx::local_4d [{#uv, #inspect, #integrated}] DEBUG : Rescaled momenta expanded
  2289. 166.14 s > field value
  2290. 166.14 s > res n-terms: 1, byte size: 777,expr:
  2291. 166.14 s > 1/(denom(0,q₀/t,mass_scalar_1²,-mass_scalar_1²+(q₀.q₀)/t²)·denom(1,q₁/t,mass_scalar_1²,-mass_scalar_1²+(q₁.q₁)/t²)
  2292. 166.14 s > ·denom(2,q₄-q₀/t-q₁/t,mass_scalar_1²,
  2293. 166.14 s > -mass_scalar_1²-2·(q₀.q₄)/t-2·(q₁.q₄)/t+(q₀.q₀)/t²+2·(q₀.q₁)/t²
  2294. 166.14 s > +(q₁.q₁)/t²+(q₄.q₄)
  2295. 166.14 s > ))
  2296. 166.14 s > span t{span_context=true current=subgraph=44, topo_order=1, dod=2 given=subgraph=0, topo_order=0, dod=0}
  2297. 166.14 s > [2026-08-26 08:19:47.113] @approx::local_4d [{#uv, #integrated, #rescaled}] DEBUG : Rescaled expanded
  2298. 166.14 s > field value
  2299. 166.14 s > n_loops 2
  2300. 166.14 s > res n-terms: 1, byte size: 982,expr:
  2301. 166.14 s > 1/(t²
  2302. 166.14 s > ·denom(2,-q₀-q₁,mUVexp²+t²·mass_scalar_1²,
  2303. 166.14 s > -mUV²
  2304. 166.14 s > +t²
  2305. 166.14 s > ·(-mass_scalar_1²-2·(q₀.q₄)/t-2·(q₁.q₄)/t+(q₀.q₀)/t²+2·(q₀.q₁)/t²
  2306. 166.14 s > +(q₁.q₁)/t²+(q₄.q₄)
  2307. 166.14 s > )
  2308. 166.14 s > +t²·mUVexp²
  2309. 166.14 s > )
  2310. 166.14 s > ·denom(0,q₀,mUVexp²+t²·mass_scalar_1²,-mUV²+t²·(-mass_scalar_1²+(q₀.q₀)/t²)+t²·mUVexp²)
  2311. 166.14 s > ·denom(1,q₁,mUVexp²+t²·mass_scalar_1²,-mUV²+t²·(-mass_scalar_1²+(q₁.q₁)/t²)+t²·mUVexp²))
  2312. 166.14 s > span t{span_context=true current=subgraph=44, topo_order=1, dod=2 given=subgraph=0, topo_order=0, dod=0}
  2313. 166.14 s > [2026-08-26 08:19:47.114] @approx::local_4d [{#uv, #integrated, #series}] DEBUG : Series expanded
  2314. 166.14 s > field value
  2315. 166.14 s > res n-terms: 4, byte size: 3187,expr:
  2316. 166.14 s > -1/2·(2·mUVexp²-2·mass_scalar_1²)
  2317. 166.14 s > /(denom(0,q₀,mUVexp²,-mUV²+(q₀.q₀))·denom(1,q₁,mUVexp²,-mUV²+(q₁.q₁))²
  2318. 166.14 s > ·denom(2,-q₀-q₁,mUVexp²,-mUV²+(q₀.q₀)+2·(q₀.q₁)+(q₁.q₁)))
  2319. 166.14 s > +(-1/2·(2·mUVexp²-2·mass_scalar_1²)
  2320. 166.14 s > /(denom(0,q₀,mUVexp²,-mUV²+(q₀.q₀))²
  2321. 166.14 s > ·denom(2,-q₀-q₁,mUVexp²,-mUV²+(q₀.q₀)+2·(q₀.q₁)+(q₁.q₁)))
  2322. 166.14 s > +(-1/2·(2·mUVexp²-2·mass_scalar_1²+2·(q₄.q₄))
  2323. 166.14 s > /denom(2,-q₀-q₁,mUVexp²,-mUV²+(q₀.q₀)+2·(q₀.q₁)+(q₁.q₁))
  2324. 166.14 s > +(-2·(q₀.q₄)-2·(q₁.q₄))²
  2325. 166.14 s > /denom(2,-q₀-q₁,mUVexp²,-mUV²+(q₀.q₀)+2·(q₀.q₁)+(q₁.q₁))²
  2326. 166.14 s > )
  2327. 166.14 s > /(denom(0,q₀,mUVexp²,-mUV²+(q₀.q₀))
  2328. 166.14 s > ·denom(2,-q₀-q₁,mUVexp²,-mUV²+(q₀.q₀)+2·(q₀.q₁)+(q₁.q₁)))
  2329. 166.14 s > )/denom(1,q₁,mUVexp²,-mUV²+(q₁.q₁))
  2330. 166.14 s > -(-2·(q₀.q₄)-2·(q₁.q₄))
  2331. 166.14 s > /(t·denom(0,q₀,mUVexp²,-mUV²+(q₀.q₀))·denom(1,q₁,mUVexp²,-mUV²+(q₁.q₁))
  2332. 166.14 s > ·denom(2,-q₀-q₁,mUVexp²,-mUV²+(q₀.q₀)+2·(q₀.q₁)+(q₁.q₁))²)
  2333. 166.14 s > +1/(t²·denom(0,q₀,mUVexp²,-mUV²+(q₀.q₀))·denom(1,q₁,mUVexp²,-mUV²+(q₁.q₁))
  2334. 166.14 s > ·denom(2,-q₀-q₁,mUVexp²,-mUV²+(q₀.q₀)+2·(q₀.q₁)+(q₁.q₁)))
  2335. 166.14 s > span t{span_context=true current=subgraph=44, topo_order=1, dod=2 given=subgraph=0, topo_order=0, dod=0}
  2336. 166.14 s > [2026-08-26 08:19:47.115] @approx::local_4d [{#uv, #integrated, #series}] DEBUG : Evaluated at t = 1
  2337. 166.14 s > field value
  2338. 166.14 s > res n-terms: 4, byte size: 3171,expr:
  2339. 166.14 s > -1/2·(2·mUVexp²-2·mass_scalar_1²)
  2340. 166.14 s > /(denom(0,q₀,mUVexp²,-mUV²+(q₀.q₀))·denom(1,q₁,mUVexp²,-mUV²+(q₁.q₁))²
  2341. 166.14 s > ·denom(2,-q₀-q₁,mUVexp²,-mUV²+(q₀.q₀)+2·(q₀.q₁)+(q₁.q₁)))
  2342. 166.14 s > -(-2·(q₀.q₄)-2·(q₁.q₄))
  2343. 166.14 s > /(denom(0,q₀,mUVexp²,-mUV²+(q₀.q₀))·denom(1,q₁,mUVexp²,-mUV²+(q₁.q₁))
  2344. 166.14 s > ... omitted 20090 more lines; see full nextest output above
  2345. 166.14 s >
  2346. 166.14 s > 9. gammaloop-integration-tests::uv::se1l_uv
  2347. 166.14 s > failure: test failure with exit code 101
  2348. 166.14 s > system-out
  2349. 166.14 s > running 1 test
  2350. 166.14 s > test se1l_uv has been running for over 60 seconds
  2351. 166.14 s > +------+-----------------+---------+--------+----------+-----------------------------------------------------------------------------------------------------------------------+-------+
  2352. 166.14 s > | case | check | graph | status | sigma | threshold | error |
  2353. 166.14 s > +------+-----------------+---------+--------+----------+-----------------------------------------------------------------------------------------------------------------------+-------+
  2354. 166.14 s > | se1l | uv_profile | - | FAIL | - | - | - |
  2355. 166.14 s > +------+-----------------+---------+--------+----------+-----------------------------------------------------------------------------------------------------------------------+-------+
  2356. 166.14 s > | se1l | m_uv.inspect | inspect | pass | - | best inspect relative delta 1.097e-1 >= 1000*accuracy 1.000e-7 (accuracy=1.000e-10, exponent=+2.0, seed=1, probes=10) | - |
  2357. 166.14 s > +------+-----------------+---------+--------+----------+-----------------------------------------------------------------------------------------------------------------------+-------+
  2358. 166.14 s > | se1l | m_uv.integrated | se1l | pass | 0.1sigma | compatible within 2sigma | - |
  2359. 166.14 s > +------+-----------------+---------+--------+----------+-----------------------------------------------------------------------------------------------------------------------+-------+
  2360. 166.14 s > | se1l | rls.inspect | inspect | pass | - | best inspect relative delta 4.499e-2 >= 1000*accuracy 1.000e-7 (accuracy=1.000e-10, exponent=+2.0, seed=1, probes=10) | - |
  2361. 166.14 s > +------+-----------------+---------+--------+----------+-----------------------------------------------------------------------------------------------------------------------+-------+
  2362. 166.14 s > | se1l | rls.integrated | se1l | pass | 0.0sigma | compatible within 2sigma | - |
  2363. 166.14 s > +------+-----------------+---------+--------+----------+-----------------------------------------------------------------------------------------------------------------------+-------+
  2364. 166.14 s > | se1l | mu_r.inspect | inspect | pass | - | best inspect relative delta 1.424e-1 >= 1000*accuracy 1.000e-7 (accuracy=1.000e-10, exponent=+2.0, seed=1, probes=10) | - |
  2365. 166.14 s > +------+-----------------+---------+--------+----------+-----------------------------------------------------------------------------------------------------------------------+-------+
  2366. 166.14 s > | se1l | target | - | pass | - | 2sigma | - |
  2367. 166.14 s > +------+-----------------+---------+--------+----------+-----------------------------------------------------------------------------------------------------------------------+-------+
  2368. 166.14 s > test se1l_uv ... FAILED
  2369. 166.14 s >
  2370. 166.14 s > failures:
  2371. 166.14 s >
  2372. 166.14 s > failures:
  2373. 166.14 s > se1l_uv
  2374. 166.14 s >
  2375. 166.14 s > test result: FAILED. 0 passed; 1 failed; 0 ignored; 0 measured; 24 filtered out; finished in 116.49s
  2376. 166.14 s > system-err
  2377. 166.14 s > [2026-08-26 08:19:46.259] @gammaloop_api::se... INFO : Running command run generate
  2378. 166.14 s > [2026-08-26 08:19:46.259] @gammaloop_api::se... INFO : Starting command block generate
  2379. 166.14 s > [2026-08-26 08:19:46.259] @gammaloop_api::se... INFO : Running command import model sm-default
  2380. 166.14 s > [2026-08-26 08:19:46.259] @import::model INFO : Loading built-in JSON model sm-default
  2381. 166.14 s > [2026-08-26 08:19:46.310] @gammalooprs::model INFO : The following 11 external parameters were forced to zero by the restriction card:
  2382. 166.14 s > lamWS, AWS, rhoWS, etaWS, ymc, yme, ymm, MC, Me, MM, WTau
  2383. 166.14 s > [2026-08-26 08:19:46.310] @gammalooprs::model INFO : The following 34 vertex rules were removed by the restriction card:
  2384. 166.14 s > V_82 -> (c~, d, G+) | V_83 -> (t~, d, G+) | V_84 -> (c~, s, G+) | V_85 -> (t~, s, G+) | V_86 -> (u~, b, G+) | V_87 -> (c~, b, G+) | V_90 -> (c~, d, W+) | V_91 -> (t~, d, W+) | V_92 -> (u~, s, W+) | V_94 -> (t~, s, W+) | V_95 -> (u~, b, W+) | V_96 -> (c~, b, W+) | V_101 -> (e+, e-, G0) | V_102 -> (mu+, mu-, G0) | V_104 -> (e+, e-, H) | V_105 -> (mu+, mu-, H) | V_110 -> (ve~, e-, G+) | V_111 -> (vm~, mu-, G+) | V_116 -> (b~, u, G-) | V_117 -> (d~, c, G-) | V_118 -> (s~, c, G-) | V_119 -> (b~, c, G-) | V_120 -> (d~, t, G-) | V_121 -> (s~, t, G-) | V_124 -> (s~, u, W-) | V_125 -> (b~, u, W-) | V_126 -> (d~, c, W-) | V_128 -> (b~, c, W-) | V_129 -> (d~, t, W-) | V_130 -> (s~, t, W-) | V_138 -> (c~, c, G0) | V_140 -> (c~, c, H) | V_145 -> (e+, ve, G-) | V_146 -> (mu+, vm, G-)
  2385. 166.14 s > [2026-08-26 08:19:46.312] @gammalooprs::model INFO : The following 36 couplings were removed by the restriction card:
  2386. 166.14 s > GC_13, GC_14, GC_16, GC_17, GC_18, GC_19, GC_20, GC_22, GC_23, GC_24, GC_25, GC_26, GC_28, GC_29, GC_42, GC_43, GC_44, GC_46, GC_47, GC_48, GC_84, GC_85, GC_86, GC_87, GC_88, GC_89, GC_90, GC_91, GC_92, GC_93, GC_101, GC_102, GC_103, GC_105, GC_106, GC_107
  2387. 166.14 s > [2026-08-26 08:19:46.312] @gammaloop_api::se... INFO : Running command remove processes
  2388. 166.14 s > [2026-08-26 08:19:46.313] @gammaloop_api::se... INFO : Running command set global kv global.generation.uv.generate_integrated=true
  2389. 166.14 s > [2026-08-26 08:19:46.313] @gammaloop_api::se... INFO : Running command import graphs ./tests/resources/graphs/uv_tests/se1l.dot -p se1l -i se1l
  2390. 166.14 s > [2026-08-26 08:19:46.313] @commands::import INFO : Loading graphs from '/build/source/tests/resources/graphs/uv_tests/se1l.dot'
  2391. 166.14 s > [2026-08-26 08:19:46.321] @gammaloop_api::se... INFO : Running command generate existing -p se1l -i se1l
  2392. 166.14 s > [2026-08-26 08:19:48.257] @commands::generate INFO :
  2393. 166.14 s > Integrand generation summary
  2394. 166.14 s > peak RAM 88.77 MiB | cores 1
  2395. 166.14 s > ╭───────────┬───────┬─────────┬─────────────┬─────────────┬────────────────┬─────────────╮
  2396. 166.14 s > │ integrand │ graph │ # evals │ expr build │ spenso │ symbolica eval │ compile │
  2397. 166.14 s > ├───────────┼───────┼─────────┼─────────────┼─────────────┼────────────────┼─────────────┤
  2398. 166.14 s > │ se1l │ se1l │ 5 │ 1.73s (90%) │ 80ms (4.2%) │ 108ms (5.7%) │ 0ms (0.00%) │
  2399. 166.14 s > ├───────────┼───────┼─────────┼─────────────┼─────────────┼────────────────┼─────────────┤
  2400. 166.14 s > │ Total │ │ 5 │ 1.73s (90%) │ 80ms (4.2%) │ 108ms (5.7%) │ 0ms (0.00%) │
  2401. 166.14 s > ╰───────────┴───────┴─────────┴─────────────┴─────────────┴────────────────┴─────────────╯
  2402. 166.14 s > [2026-08-26 08:19:48.258] @gammaloop_api::se... INFO : Running command set process -p se1l -i se1l kv general.m_uv=0.2
  2403. 166.14 s > [2026-08-26 08:19:48.261] @gammaloop_api::se... INFO : Running command set process -p se1l -i se1l kv general.mu_r=0.2
  2404. 166.14 s > [2026-08-26 08:19:48.262] @gammaloop_api::se... INFO : Running command set process -p se1l -i se1l kv general.renormalization_localization_scale=0.2
  2405. 166.14 s > [2026-08-26 08:19:48.270] @gammaloop_api::se... INFO : Running command duplicate integrand -p se1l -i se1l --output_process_name se1l --output_integrand_name se1l_muv_shifted
  2406. 166.14 s > [2026-08-26 08:19:48.274] @gammaloop_api::se... INFO : Running command set process -p se1l -i se1l_muv_shifted kv general.m_uv=0.5
  2407. 166.14 s > [2026-08-26 08:19:48.282] @gammaloop_api::se... INFO : Running command duplicate integrand -p se1l -i se1l --output_process_name se1l --output_integrand_name se1l_rls_shifted
  2408. 166.14 s > [2026-08-26 08:19:48.286] @gammaloop_api::se... INFO : Running command set process -p se1l -i se1l_rls_shifted kv general.renormalization_localization_scale=1
  2409. 166.14 s > [2026-08-26 08:19:48.289] @gammaloop_api::se... INFO : Running command duplicate integrand -p se1l -i se1l --output_process_name se1l --output_integrand_name se1l_mur_shifted
  2410. 166.14 s > [2026-08-26 08:19:48.301] @gammaloop_api::se... INFO : Running command set process -p se1l -i se1l_mur_shifted kv general.mu_r=0.8
  2411. 166.14 s > [2026-08-26 08:19:48.326] @process::amplitude WARNING : External state 0 ('g', PDG 21, helicity +) is off shell: p^2 = +2.5e5, expected m^2 = +0e0 (|Δ| = +2.5e5). Fixed-helicity spinor/vector/tensor external states may be ill-defined at this kinematic point.
  2412. 166.14 s > field value
  2413. 166.14 s > span warm_up{integrand.name=se1l}
  2414. 166.14 s > [2026-08-26 08:19:48.327] @process::amplitude WARNING : External state 1 ('g', PDG 21, helicity -) is off shell: p^2 = +2.5e5, expected m^2 = +0e0 (|Δ| = +2.5e5). Fixed-helicity spinor/vector/tensor external states may be ill-defined at this kinematic point.
  2415. 166.14 s > field value
  2416. 166.14 s > span warm_up{integrand.name=se1l}
  2417. 166.14 s > [2026-08-26 08:19:48.328] @process::amplitude INFO : Input is above threshold: 1 existing threshold E-surfaces across 1/1 graph groups
  2418. 166.14 s > field value
  2419. 166.14 s > existing_esurfaces 1
  2420. 166.14 s > group_count 1
  2421. 166.14 s > groups_above_threshold 1
  2422. 166.14 s > integrand se1l
  2423. 166.14 s > span warm_up{integrand.name=se1l}
  2424. 166.14 s > threshold_status above threshold
  2425. 166.14 s > [2026-08-26 08:19:48.331] @process::amplitude INFO : overlap structure of group 0: [1: [0(2,3)]]
  2426. 166.14 s > field value
  2427. 166.14 s > span warm_up{integrand.name=se1l}
  2428. 166.14 s > [2026-08-26 08:19:48.876] @commands::profile INFO :
  2429. 166.14 s > ╭───────┬──────┬──────────┬───────┬─────┬──────────┬───────────╮
  2430. 166.14 s > │ fixed │ → ∞ │ slope │ r2 │ DOD │ bare DOD │ inspect │
  2431. 166.14 s > ├───────┼──────┼──────────┼───────┼─────┼──────────┼───────────┤
  2432. 166.14 s > │ {} │ {e3} │ 1.639236 │ 0.904 │ 2 │ 2 │ arb retry │
  2433. 166.14 s > │ {} │ {e2} │ 1.698834 │ 0.902 │ 2 │ 2 │ arb retry │
  2434. 166.14 s > ╰───────┴──────┴──────────┴───────┴─────┴──────────┴───────────╯
  2435. 166.14 s > [2026-08-26 08:19:48.876] @commands::profile INFO :
  2436. 166.14 s > ╭───────┬──────┬─────────────┬──────────┬───────┬─────┬──────────┬───────────╮
  2437. 166.14 s > │ fixed │ → ∞ │ orientation │ slope │ r2 │ DOD │ bare DOD │ inspect │
  2438. 166.14 s > ├───────┼──────┼─────────────┼──────────┼───────┼─────┼──────────┼───────────┤
  2439. 166.14 s > │ {} │ {e3} │ 00-+ │ 0.343429 │ 0.145 │ 0 │ 2 │ arb retry │
  2440. 166.14 s > │ {} │ {e3} │ 00+- │ 0.342577 │ 0.135 │ 0 │ 2 │ arb retry │
  2441. 166.14 s > │ {} │ {e2} │ 00-+ │ 0.385975 │ 0.161 │ 0 │ 2 │ arb retry │
  2442. 166.14 s > │ {} │ {e2} │ 00+- │ 0.384920 │ 0.192 │ 0 │ 2 │ arb retry │
  2443. 166.14 s > ╰───────┴──────┴─────────────┴──────────┴───────┴─────┴──────────┴───────────╯
  2444. 166.14 s > [2026-08-26 08:19:48.877] @gammaloop_api::se... INFO : Running command set process kv integrator.target_relative_accuracy=0.001 integrator.n_increase=0 integrator.n_start=50000 integrator.n_max=400000 integrator.seed=1337
  2445. 166.14 s > [2026-08-26 08:19:48.880] @commands::integrate INFO : Created workspace directory at /build/source/tests/artifacts/se1l/integration_workspace_se1l
  2446. 166.14 s > [2026-08-26 08:19:48.936] @commands::integrate INFO : No integration state found, starting new integration
  2447. 166.14 s > [2026-08-26 08:19:48.936] @commands::integrate INFO : Gammaloop now integrates se1l@se1l, se1l@se1l_muv_shifted, se1l@se1l_rls_shifted
  2448. 166.14 s > [2026-08-26 08:19:48.936] @process::amplitude WARNING : External state 0 ('g', PDG 21, helicity +) is off shell: p^2 = +2.5e5, expected m^2 = +0e0 (|Δ| = +2.5e5). Fixed-helicity spinor/vector/tensor external states may be ill-defined at this kinematic point.
  2449. 166.14 s > field value
  2450. 166.14 s > span warm_up{integrand.name=se1l}
  2451. 166.14 s > [2026-08-26 08:19:48.936] @process::amplitude WARNING : External state 1 ('g', PDG 21, helicity -) is off shell: p^2 = +2.5e5, expected m^2 = +0e0 (|Δ| = +2.5e5). Fixed-helicity spinor/vector/tensor external states may be ill-defined at this kinematic point.
  2452. 166.14 s > field value
  2453. 166.14 s > span warm_up{integrand.name=se1l}
  2454. 166.14 s > [2026-08-26 08:19:48.936] @process::amplitude INFO : Input is above threshold: 1 existing threshold E-surfaces across 1/1 graph groups
  2455. 166.14 s > field value
  2456. 166.14 s > existing_esurfaces 1
  2457. 166.14 s > group_count 1
  2458. 166.14 s > groups_above_threshold 1
  2459. 166.14 s > integrand se1l
  2460. 166.14 s > span warm_up{integrand.name=se1l}
  2461. 166.14 s > threshold_status above threshold
  2462. 166.14 s > [2026-08-26 08:19:48.936] @process::amplitude INFO : overlap structure of group 0: [1: [0(2,3)]]
  2463. 166.14 s > field value
  2464. 166.14 s > span warm_up{integrand.name=se1l}
  2465. 166.14 s > [2026-08-26 08:19:48.944] @process::amplitude WARNING : External state 0 ('g', PDG 21, helicity +) is off shell: p^2 = +2.5e5, expected m^2 = +0e0 (|Δ| = +2.5e5). Fixed-helicity spinor/vector/tensor external states may be ill-defined at this kinematic point.
  2466. 166.14 s > field value
  2467. 166.14 s > span warm_up{integrand.name=se1l_muv_shifted}
  2468. 166.14 s > [2026-08-26 08:19:48.944] @process::amplitude WARNING : External state 1 ('g', PDG 21, helicity -) is off shell: p^2 = +2.5e5, expected m^2 = +0e0 (|Δ| = +2.5e5). Fixed-helicity spinor/vector/tensor external states may be ill-defined at this kinematic point.
  2469. 166.14 s > field value
  2470. 166.14 s > span warm_up{integrand.name=se1l_muv_shifted}
  2471. 166.14 s > [2026-08-26 08:19:48.944] @process::amplitude INFO : Input is above threshold: 1 existing threshold E-surfaces across 1/1 graph groups
  2472. 166.14 s > field value
  2473. 166.14 s > existing_esurfaces 1
  2474. 166.14 s > group_count 1
  2475. 166.14 s > groups_above_threshold 1
  2476. 166.14 s > integrand se1l_muv_shifted
  2477. 166.14 s > span warm_up{integrand.name=se1l_muv_shifted}
  2478. 166.14 s > threshold_status above threshold
  2479. 166.14 s > [2026-08-26 08:19:48.944] @process::amplitude INFO : overlap structure of group 0: [1: [0(2,3)]]
  2480. 166.14 s > field value
  2481. 166.14 s > span warm_up{integrand.name=se1l_muv_shifted}
  2482. 166.14 s > [2026-08-26 08:19:48.946] @process::amplitude WARNING : External state 0 ('g', PDG 21, helicity +) is off shell: p^2 = +2.5e5, expected m^2 = +0e0 (|Δ| = +2.5e5). Fixed-helicity spinor/vector/tensor external states may be ill-defined at this kinematic point.
  2483. 166.14 s > field value
  2484. 166.14 s > span warm_up{integrand.name=se1l_rls_shifted}
  2485. 166.14 s > [2026-08-26 08:19:48.946] @process::amplitude WARNING : External state 1 ('g', PDG 21, helicity -) is off shell: p^2 = +2.5e5, expected m^2 = +0e0 (|Δ| = +2.5e5). Fixed-helicity spinor/vector/tensor external states may be ill-defined at this kinematic point.
  2486. 166.14 s > field value
  2487. 166.14 s > span warm_up{integrand.name=se1l_rls_shifted}
  2488. 166.14 s > [2026-08-26 08:19:48.946] @process::amplitude INFO : Input is above threshold: 1 existing threshold E-surfaces across 1/1 graph groups
  2489. 166.14 s > field value
  2490. 166.14 s > existing_esurfaces 1
  2491. 166.14 s > group_count 1
  2492. 166.14 s > groups_above_threshold 1
  2493. 166.14 s > integrand se1l_rls_shifted
  2494. 166.14 s > span warm_up{integrand.name=se1l_rls_shifted}
  2495. 166.14 s > threshold_status above threshold
  2496. 166.14 s > ... omitted 1410 more lines; see full nextest output above
  2497. 166.14 s > =========================================
  2498. 166.14 s For full logs, run:
  2499. 166.14 s nix log /nix/store/z64pzsmdh7l76572yr3sfrwn8clcnq7n-gammaloop-nextest-integration.drv
  2500. 166.26 s [0 built (1 failed), 1 cRun failed.