test packages.x86_64-linux.nix-ci-check-gammaloop-nextest-core

Reproduce this run
Original Run
  1. 0.01 s $ /nix/store/9ypz3flqsrl5xl495mm8h645gadjsxi1-coreutils-9.11/bin/timeout --kill-after=15s 7200s /nix/store/23zk8sgzamrbmj1fday15szf7f2279s8-nix-2.34.7/bin/nix --extra-experimental-features nix-command --extra-experimental-features flakes flake clone git+https://github.com/alphal00p/gammaloop --dest /tmp/nix-ci-worker/stable-pwd/repo/
  2. 0.62 s Cloning into '/tmp/nix-ci-worker/stable-pwd/repo'...
  3. 1.64 s remote: Enumerating objects: 86206, done.
  4. 1.74 s remote: Counting objects: 0% (1/8688) remote: Counting objects: 1% (87/8688) remote: Counting objects: 2% (174/8688) remote: Counting objects: 3% (261/8688) remote: Counting objects: 4% (348/8688) remote: Counting objects: 5% (435/8688) remote: Counting objects: 6% (522/8688) remote: Counting objects: 7% (609/8688) remote: Counting objects: 8% (696/8688) remote: Counting objects: 9% (782/8688) remote: Counting objects: 10% (869/8688) remote: Counting objects: 11% (956/8688) remote: Counting objects: 12% (1043/8688) remote: Counting objects: 13% (1130/8688) remote: Counting objects: 14% (1217/8688) remote: Counting objects: 15% (1304/8688) remote: Counting objects: 16% (1391/8688) remote: Counting objects: 17% (1477/8688) remote: Counting objects: 18% (1564/8688) remote: Counting objects: 19% (1651/8688) remote: Counting objects: 20% (1738/8688) remote: Counting objects: 21% (1825/8688) remote: Counting objects: 22% (1912/8688) remote: Counting objects: 23% (1999/8688) remote: Counting objects: 24% (2086/8688) remote: Counting objects: 25% (2172/8688) remote: Counting objects: 26% (2259/8688) remote: Counting objects: 27% (2346/8688) remote: Counting objects: 28% (2433/8688) remote: Counting objects: 29% (2520/8688) remote: Counting objects: 30% (2607/8688) remote: Counting objects: 31% (2694/8688) remote: Counting objects: 32% (2781/8688) remote: Counting objects: 33% (2868/8688) remote: Counting objects: 34% (2954/8688) remote: Counting objects: 35% (3041/8688) remote: Counting objects: 36% (3128/8688) remote: Counting objects: 37% (3215/8688) remote: Counting objects: 38% (3302/8688) remote: Counting objects: 39% (3389/8688) remote: Counting objects: 40% (3476/8688) remote: Counting objects: 41% (3563/8688) remote: Counting objects: 42% (3649/8688) remote: Counting objects: 43% (3736/8688) remote: Counting objects: 44% (3823/8688) remote: Counting objects: 45% (3910/8688) remote: Counting objects: 46% (3997/8688) remote: Counting objects: 47% (4084/8688) remote: Counting objects: 48% (4171/8688) remote: Counting objects: 49% (4258/8688) remote: Counting objects: 50% (4344/8688) remote: Counting objects: 51% (4431/8688) remote: Counting objects: 52% (4518/8688) remote: Counting objects: 53% (4605/8688) remote: Counting objects: 54% (4692/8688) remote: Counting objects: 55% (4779/8688) remote: Counting objects: 56% (4866/8688) remote: Counting objects: 57% (4953/8688) remote: Counting objects: 58% (5040/8688) remote: Counting objects: 59% (5126/8688) remote: Counting objects: 60% (5213/8688) remote: Counting objects: 61% (5300/8688) remote: Counting objects: 62% (5387/8688) remote: Counting objects: 63% (5474/8688) remote: Counting objects: 64% (5561/8688) remote: Counting objects: 65% (5648/8688) remote: Counting objects: 66% (5735/8688) remote: Counting objects: 67% (5821/8688) remote: Counting objects: 68% (5908/8688) remote: Counting objects: 69% (5995/8688) remote: Counting objects: 70% (6082/8688) remote: Counting objects: 71% (6169/8688) remote: Counting objects: 72% (6256/8688) remote: Counting objects: 73% (6343/8688) remote: Counting objects: 74% (6430/8688) remote: Counting objects: 75% (6516/8688) remote: Counting objects: 76% (6603/8688) remote: Counting objects: 77% (6690/8688) remote: Counting objects: 78% (6777/8688) remote: Counting objects: 79% (6864/8688) remote: Counting objects: 80% (6951/8688) remote: Counting objects: 81% (7038/8688) remote: Counting objects: 82% (7125/8688) remote: Counting objects: 83% (7212/8688) remote: Counting objects: 84% (7298/8688) remote: Counting objects: 85% (7385/8688) remote: Counting objects: 86% (7472/8688) remote: Counting objects: 87% (7559/8688) remote: Counting objects: 88% (7646/8688) remote: Counting objects: 89% (7733/8688) remote: Counting objects: 90% (7820/8688) remote: Counting objects: 91% (7907/8688) remote: Counting objects: 92% (7993/8688) remote: Counting objects: 93% (8080/8688) remote: Counting objects: 94% (8167/8688) remote: Counting objects: 95% (8254/8688) remote: Counting objects: 96% (8341/8688) remote: Counting objects: 97% (8428/8688) remote: Counting objects: 98% (8515/8688) remote: Counting objects: 99% (8602/8688) remote: Counting objects: 100% (8688/8688) remote: Counting objects: 100% (8688/8688), done.
  5. 3.71 s remote: Compressing objects: 0% (1/1782) remote: Compressing objects: 1% (18/1782) remote: Compressing objects: 2% (36/1782) remote: Compressing objects: 3% (54/1782) remote: Compressing objects: 4% (72/1782) remote: Compressing objects: 5% (90/1782) remote: Compressing objects: 6% (107/1782) remote: Compressing objects: 7% (125/1782) remote: Compressing objects: 8% (143/1782) remote: Compressing objects: 9% (161/1782) remote: Compressing objects: 10% (179/1782) remote: Compressing objects: 10% (182/1782) remote: Compressing objects: 11% (197/1782) remote: Compressing objects: 12% (214/1782) remote: Compressing objects: 13% (232/1782) remote: Compressing objects: 14% (250/1782) remote: Compressing objects: 15% (268/1782) remote: Compressing objects: 16% (286/1782) remote: Compressing objects: 17% (303/1782) remote: Compressing objects: 18% (321/1782) remote: Compressing objects: 19% (339/1782) remote: Compressing objects: 20% (357/1782) remote: Compressing objects: 21% (375/1782) remote: Compressing objects: 22% (393/1782) remote: Compressing objects: 23% (410/1782) remote: Compressing objects: 24% (428/1782) remote: Compressing objects: 25% (446/1782) remote: Compressing objects: 26% (464/1782) remote: Compressing objects: 27% (482/1782) remote: Compressing objects: 28% (499/1782) remote: Compressing objects: 29% (517/1782) remote: Compressing objects: 30% (535/1782) remote: Compressing objects: 31% (553/1782) remote: Compressing objects: 32% (571/1782) remote: Compressing objects: 33% (589/1782) remote: Compressing objects: 34% (606/1782) remote: Compressing objects: 35% (624/1782) remote: Compressing objects: 36% (642/1782) remote: Compressing objects: 36% (651/1782) remote: Compressing objects: 37% (660/1782) remote: Compressing objects: 38% (678/1782) remote: Compressing objects: 39% (695/1782) remote: Compressing objects: 40% (713/1782) remote: Compressing objects: 41% (731/1782) remote: Compressing objects: 42% (749/1782) remote: Compressing objects: 43% (767/1782) remote: Compressing objects: 44% (785/1782) remote: Compressing objects: 45% (802/1782) remote: Compressing objects: 46% (820/1782) remote: Compressing objects: 47% (838/1782) remote: Compressing objects: 48% (856/1782) remote: Compressing objects: 49% (874/1782) remote: Compressing objects: 50% (891/1782) remote: Compressing objects: 51% (909/1782) remote: Compressing objects: 52% (927/1782) remote: Compressing objects: 53% (945/1782) remote: Compressing objects: 54% (963/1782) remote: Compressing objects: 55% (981/1782) remote: Compressing objects: 56% (998/1782) remote: Compressing objects: 57% (1016/1782) remote: Compressing objects: 58% (1034/1782) remote: Compressing objects: 59% (1052/1782) remote: Compressing objects: 60% (1070/1782) remote: Compressing objects: 61% (1088/1782) remote: Compressing objects: 62% (1105/1782) remote: Compressing objects: 63% (1123/1782) remote: Compressing objects: 64% (1141/1782) remote: Compressing objects: 65% (1159/1782) remote: Compressing objects: 66% (1177/1782) remote: Compressing objects: 67% (1194/1782) remote: Compressing objects: 68% (1212/1782) remote: Compressing objects: 69% (1230/1782) remote: Compressing objects: 70% (1248/1782) remote: Compressing objects: 71% (1266/1782) remote: Compressing objects: 72% (1284/1782) remote: Compressing objects: 73% (1301/1782) remote: Compressing objects: 74% (1319/1782) remote: Compressing objects: 75% (1337/1782) remote: Compressing objects: 76% (1355/1782) remote: Compressing objects: 77% (1373/1782) remote: Compressing objects: 78% (1390/1782) remote: Compressing objects: 79% (1408/1782) remote: Compressing objects: 80% (1426/1782) remote: Compressing objects: 81% (1444/1782) remote: Compressing objects: 82% (1462/1782) remote: Compressing objects: 83% (1480/1782) remote: Compressing objects: 84% (1497/1782) remote: Compressing objects: 85% (1515/1782) remote: Compressing objects: 86% (1533/1782) remote: Compressing objects: 87% (1551/1782) remote: Compressing objects: 88% (1569/1782) remote: Compressing objects: 89% (1586/1782) remote: Compressing objects: 90% (1604/1782) remote: Compressing objects: 91% (1622/1782) remote: Compressing objects: 92% (1640/1782) remote: Compressing objects: 93% (1658/1782) remote: Compressing objects: 94% (1676/1782) remote: Compressing objects: 95% (1693/1782) remote: Compressing objects: 96% (1711/1782) remote: Compressing objects: 97% (1729/1782) remote: Compressing objects: 98% (1747/1782) remote: Compressing objects: 99% (1765/1782) remote: Compressing objects: 100% (1782/1782) remote: Compressing objects: 100% (1782/1782), done.
  6. 8.98 s Receiving objects: 0% (1/86206) Receiving objects: 1% (863/86206) Receiving objects: 2% (1725/86206) Receiving objects: 3% (2587/86206) Receiving objects: 4% (3449/86206) Receiving objects: 5% (4311/86206) Receiving objects: 6% (5173/86206), 8.61 MiB | 17.09 MiB/s Receiving objects: 7% (6035/86206), 8.61 MiB | 17.09 MiB/s Receiving objects: 8% (6897/86206), 8.61 MiB | 17.09 MiB/s Receiving objects: 8% (7153/86206), 14.57 MiB | 14.48 MiB/s Receiving objects: 9% (7759/86206), 14.57 MiB | 14.48 MiB/s Receiving objects: 10% (8621/86206), 14.57 MiB | 14.48 MiB/s Receiving objects: 11% (9483/86206), 14.57 MiB | 14.48 MiB/s Receiving objects: 12% (10345/86206), 14.57 MiB | 14.48 MiB/s Receiving objects: 13% (11207/86206), 19.17 MiB | 12.73 MiB/s Receiving objects: 14% (12069/86206), 19.17 MiB | 12.73 MiB/s Receiving objects: 15% (12931/86206), 19.17 MiB | 12.73 MiB/s Receiving objects: 16% (13793/86206), 19.17 MiB | 12.73 MiB/s Receiving objects: 17% (14656/86206), 19.17 MiB | 12.73 MiB/s Receiving objects: 18% (15518/86206), 19.17 MiB | 12.73 MiB/s Receiving objects: 19% (16380/86206), 19.17 MiB | 12.73 MiB/s Receiving objects: 20% (17242/86206), 19.17 MiB | 12.73 MiB/s Receiving objects: 21% (18104/86206), 19.17 MiB | 12.73 MiB/s Receiving objects: 22% (18966/86206), 19.17 MiB | 12.73 MiB/s Receiving objects: 23% (19828/86206), 19.17 MiB | 12.73 MiB/s Receiving objects: 24% (20690/86206), 19.17 MiB | 12.73 MiB/s Receiving objects: 25% (21552/86206), 19.17 MiB | 12.73 MiB/s Receiving objects: 26% (22414/86206), 19.17 MiB | 12.73 MiB/s Receiving objects: 27% (23276/86206), 19.17 MiB | 12.73 MiB/s Receiving objects: 28% (24138/86206), 19.17 MiB | 12.73 MiB/s Receiving objects: 29% (25000/86206), 19.17 MiB | 12.73 MiB/s Receiving objects: 30% (25862/86206), 19.17 MiB | 12.73 MiB/s Receiving objects: 31% (26724/86206), 19.17 MiB | 12.73 MiB/s Receiving objects: 32% (27586/86206), 19.17 MiB | 12.73 MiB/s Receiving objects: 33% (28448/86206), 19.17 MiB | 12.73 MiB/s Receiving objects: 34% (29311/86206), 19.17 MiB | 12.73 MiB/s Receiving objects: 35% (30173/86206), 19.17 MiB | 12.73 MiB/s Receiving objects: 36% (31035/86206), 19.17 MiB | 12.73 MiB/s Receiving objects: 37% (31897/86206), 19.17 MiB | 12.73 MiB/s Receiving objects: 38% (32759/86206), 19.17 MiB | 12.73 MiB/s Receiving objects: 39% (33621/86206), 19.17 MiB | 12.73 MiB/s Receiving objects: 40% (34483/86206), 19.17 MiB | 12.73 MiB/s Receiving objects: 40% (34696/86206), 19.17 MiB | 12.73 MiB/s Receiving objects: 41% (35345/86206), 36.64 MiB | 18.26 MiB/s Receiving objects: 42% (36207/86206), 36.64 MiB | 18.26 MiB/s Receiving objects: 43% (37069/86206), 36.64 MiB | 18.26 MiB/s Receiving objects: 44% (37931/86206), 36.64 MiB | 18.26 MiB/s Receiving objects: 45% (38793/86206), 36.64 MiB | 18.26 MiB/s Receiving objects: 46% (39655/86206), 36.64 MiB | 18.26 MiB/s Receiving objects: 47% (40517/86206), 36.64 MiB | 18.26 MiB/s Receiving objects: 48% (41379/86206), 36.64 MiB | 18.26 MiB/s Receiving objects: 49% (42241/86206), 36.64 MiB | 18.26 MiB/s Receiving objects: 50% (43103/86206), 36.64 MiB | 18.26 MiB/s Receiving objects: 51% (43966/86206), 36.64 MiB | 18.26 MiB/s Receiving objects: 52% (44828/86206), 36.64 MiB | 18.26 MiB/s Receiving objects: 53% (45690/86206), 36.64 MiB | 18.26 MiB/s Receiving objects: 54% (46552/86206), 36.64 MiB | 18.26 MiB/s Receiving objects: 55% (47414/86206), 58.89 MiB | 23.50 MiB/s Receiving objects: 56% (48276/86206), 58.89 MiB | 23.50 MiB/s Receiving objects: 57% (49138/86206), 58.89 MiB | 23.50 MiB/s Receiving objects: 58% (50000/86206), 58.89 MiB | 23.50 MiB/s Receiving objects: 59% (50862/86206), 58.89 MiB | 23.50 MiB/s Receiving objects: 60% (51724/86206), 58.89 MiB | 23.50 MiB/s Receiving objects: 60% (52315/86206), 58.89 MiB | 23.50 MiB/s Receiving objects: 61% (52586/86206), 58.89 MiB | 23.50 MiB/s Receiving objects: 62% (53448/86206), 75.93 MiB | 25.26 MiB/s Receiving objects: 63% (54310/86206), 75.93 MiB | 25.26 MiB/s Receiving objects: 64% (55172/86206), 75.93 MiB | 25.26 MiB/s Receiving objects: 65% (56034/86206), 75.93 MiB | 25.26 MiB/s Receiving objects: 66% (56896/86206), 75.93 MiB | 25.26 MiB/s Receiving objects: 67% (57759/86206), 94.03 MiB | 26.82 MiB/s Receiving objects: 68% (58621/86206), 94.03 MiB | 26.82 MiB/s Receiving objects: 68% (59354/86206), 94.03 MiB | 26.82 MiB/s Receiving objects: 69% (59483/86206), 109.22 MiB | 27.26 MiB/s Receiving objects: 70% (60345/86206), 109.22 MiB | 27.26 MiB/s Receiving objects: 71% (61207/86206), 109.22 MiB | 27.26 MiB/s Receiving objects: 72% (62069/86206), 109.22 MiB | 27.26 MiB/s Receiving objects: 73% (62931/86206), 109.22 MiB | 27.26 MiB/s Receiving objects: 74% (63793/86206), 109.22 MiB | 27.26 MiB/s Receiving objects: 75% (64655/86206), 128.85 MiB | 28.59 MiB/s Receiving objects: 76% (65517/86206), 128.85 MiB | 28.59 MiB/s Receiving objects: 77% (66379/86206), 128.85 MiB | 28.59 MiB/s Receiving objects: 78% (67241/86206), 128.85 MiB | 28.59 MiB/s Receiving objects: 79% (68103/86206), 128.85 MiB | 28.59 MiB/s Receiving objects: 80% (68965/86206), 128.85 MiB | 28.59 MiB/s Receiving objects: 81% (69827/86206), 128.85 MiB | 28.59 MiB/s Receiving objects: 82% (70689/86206), 128.85 MiB | 28.59 MiB/s Receiving objects: 83% (71551/86206), 128.85 MiB | 28.59 MiB/s Receiving objects: 84% (72414/86206), 128.85 MiB | 28.59 MiB/s Receiving objects: 85% (73276/86206), 128.85 MiB | 28.59 MiB/s Receiving objects: 86% (74138/86206), 128.85 MiB | 28.59 MiB/s Receiving objects: 87% (75000/86206), 128.85 MiB | 28.59 MiB/s Receiving objects: 87% (75754/86206), 128.85 MiB | 28.59 MiB/s Receiving objects: 88% (75862/86206), 148.36 MiB | 31.04 MiB/s Receiving objects: 89% (76724/86206), 148.36 MiB | 31.04 MiB/s Receiving objects: 90% (77586/86206), 148.36 MiB | 31.04 MiB/s Receiving objects: 91% (78448/86206), 148.36 MiB | 31.04 MiB/s Receiving objects: 92% (79310/86206), 148.36 MiB | 31.04 MiB/s Receiving objects: 93% (80172/86206), 148.36 MiB | 31.04 MiB/s Receiving objects: 94% (81034/86206), 148.36 MiB | 31.04 MiB/s Receiving objects: 95% (81896/86206), 148.36 MiB | 31.04 MiB/s Receiving objects: 96% (82758/86206), 148.36 MiB | 31.04 MiB/s Receiving objects: 97% (83620/86206), 148.36 MiB | 31.04 MiB/s Receiving objects: 98% (84482/86206), 148.36 MiB | 31.04 MiB/s Receiving objects: 99% (85344/86206), 148.36 MiB | 31.04 MiB/s remote: Total 86206 (delta 7571), reused 6970 (delta 6905), pack-reused 77518 (from 3)
  7. 8.98 s Receiving objects: 100% (86206/86206), 148.36 MiB | 31.04 MiB/s Receiving objects: 100% (86206/86206), 156.19 MiB | 29.66 MiB/s, done.
  8. 12.90 s Resolving deltas: 0% (0/58528) Resolving deltas: 1% (586/58528) Resolving deltas: 2% (1172/58528) Resolving deltas: 3% (1756/58528) Resolving deltas: 4% (2342/58528) Resolving deltas: 5% (2927/58528) Resolving deltas: 6% (3512/58528) Resolving deltas: 7% (4097/58528) Resolving deltas: 8% (4683/58528) Resolving deltas: 9% (5268/58528) Resolving deltas: 10% (5853/58528) Resolving deltas: 11% (6439/58528) Resolving deltas: 12% (7024/58528) Resolving deltas: 13% (7609/58528) Resolving deltas: 14% (8194/58528) Resolving deltas: 15% (8780/58528) Resolving deltas: 16% (9365/58528) Resolving deltas: 17% (9950/58528) Resolving deltas: 18% (10536/58528) Resolving deltas: 19% (11121/58528) Resolving deltas: 20% (11706/58528) Resolving deltas: 21% (12291/58528) Resolving deltas: 22% (12877/58528) Resolving deltas: 23% (13462/58528) Resolving deltas: 24% (14047/58528) Resolving deltas: 25% (14632/58528) Resolving deltas: 26% (15218/58528) Resolving deltas: 27% (15803/58528) Resolving deltas: 28% (16388/58528) Resolving deltas: 29% (16974/58528) Resolving deltas: 30% (17559/58528) Resolving deltas: 31% (18144/58528) Resolving deltas: 32% (18729/58528) Resolving deltas: 33% (19315/58528) Resolving deltas: 34% (19900/58528) Resolving deltas: 35% (20485/58528) Resolving deltas: 36% (21071/58528) Resolving deltas: 37% (21656/58528) Resolving deltas: 37% (21737/58528) Resolving deltas: 38% (22241/58528) Resolving deltas: 39% (22826/58528) Resolving deltas: 40% (23412/58528) Resolving deltas: 41% (23997/58528) Resolving deltas: 42% (24582/58528) Resolving deltas: 43% (25168/58528) Resolving deltas: 44% (25753/58528) Resolving deltas: 45% (26338/58528) Resolving deltas: 46% (26923/58528) Resolving deltas: 47% (27509/58528) Resolving deltas: 48% (28094/58528) Resolving deltas: 49% (28679/58528) Resolving deltas: 50% (29264/58528) Resolving deltas: 51% (29850/58528) Resolving deltas: 52% (30435/58528) Resolving deltas: 53% (31020/58528) Resolving deltas: 54% (31607/58528) Resolving deltas: 55% (32191/58528) Resolving deltas: 56% (32776/58528) Resolving deltas: 57% (33361/58528) Resolving deltas: 57% (33855/58528) Resolving deltas: 58% (33947/58528) Resolving deltas: 59% (34532/58528) Resolving deltas: 60% (35117/58528) Resolving deltas: 61% (35703/58528) Resolving deltas: 62% (36288/58528) Resolving deltas: 63% (36873/58528) Resolving deltas: 64% (37458/58528) Resolving deltas: 65% (38044/58528) Resolving deltas: 66% (38629/58528) Resolving deltas: 67% (39215/58528) Resolving deltas: 68% (39800/58528) Resolving deltas: 69% (40385/58528) Resolving deltas: 70% (40970/58528) Resolving deltas: 71% (41555/58528) Resolving deltas: 72% (42141/58528) Resolving deltas: 73% (42726/58528) Resolving deltas: 74% (43311/58528) Resolving deltas: 75% (43897/58528) Resolving deltas: 76% (44482/58528) Resolving deltas: 77% (45067/58528) Resolving deltas: 78% (45652/58528) Resolving deltas: 78% (45924/58528) Resolving deltas: 79% (46238/58528) Resolving deltas: 80% (46823/58528) Resolving deltas: 81% (47408/58528) Resolving deltas: 82% (47993/58528) Resolving deltas: 83% (48581/58528) Resolving deltas: 84% (49164/58528) Resolving deltas: 85% (49749/58528) Resolving deltas: 86% (50335/58528) Resolving deltas: 87% (50920/58528) Resolving deltas: 88% (51505/58528) Resolving deltas: 89% (52090/58528) Resolving deltas: 90% (52676/58528) Resolving deltas: 91% (53261/58528) Resolving deltas: 92% (53846/58528) Resolving deltas: 93% (54432/58528) Resolving deltas: 94% (55017/58528) Resolving deltas: 95% (55602/58528) Resolving deltas: 96% (56190/58528) Resolving deltas: 97% (56773/58528) Resolving deltas: 98% (57358/58528) Resolving deltas: 99% (57943/58528) Resolving deltas: 100% (58528/58528) Resolving deltas: 100% (58528/58528), done.
  9. 14.04 s Fetching commit 433612c2c94b3cb8af96df35d262f890e6b33813 for faster_uv_from_4d ...
  10. 14.04 s $ /nix/store/bcnisk3ydfgv26v2gw3zlky24g00yww2-git-2.54.0/bin/git fetch origin 433612c2c94b3cb8af96df35d262f890e6b33813
  11. 14.72 s From https://github.com/alphal00p/gammaloop
  12. 14.72 s * branch 433612c2c94b3cb8af96df35d262f890e6b33813 -> FETCH_HEAD
  13. 14.80 s $ /nix/store/9ypz3flqsrl5xl495mm8h645gadjsxi1-coreutils-9.11/bin/timeout --kill-after=15s 7200s /nix/store/bcnisk3ydfgv26v2gw3zlky24g00yww2-git-2.54.0/bin/git -c advice.detachedHead=false checkout 433612c2c94b3cb8af96df35d262f890e6b33813
  14. 15.42 s HEAD is now at 433612c2c record GL00 acceptance and GL262 evaluator failure
  15. 15.44 s $ /nix/store/9ypz3flqsrl5xl495mm8h645gadjsxi1-coreutils-9.11/bin/timeout --kill-after=15s 7200s /nix/store/23zk8sgzamrbmj1fday15szf7f2279s8-nix-2.34.7/bin/nix --extra-experimental-features nix-command --extra-experimental-features flakes --log-format internal-json run .#packages.x86_64-linux.nix-ci-check-gammaloop-nextest-core --print-build-logs
  16. 25.26 s
  17. 38.42 s evaluating derivation 'g copying '/nix/store/rcwk evaluating derivation 'g copying '/nix/store/rcwk evaluating derivation 'g copying '/nix/store/rcwk evaluating derivation 'g copying '/nix/store/rcwk evaluating derivation 'g copying '/nix/store/rcwk evaluating derivation 'g copying '/nix/store/rcwk evaluating derivation 'g copying '/nix/store/rcwk evaluating derivation 'g copying '/nix/store/rcwk evaluating derivation 'g copying '/nix/store/rcwk evaluating derivation 'g copying '/nix/store/rcwk evaluating derivation 'g copying '/nix/store/rcwk evaluating derivation 'g copying '/nix/store/rcwk evaluating derivation 'g copying '/nix/store/rcwk evaluating derivation 'g querying gammaloop-nexte [0.0 KiB DL] [0/1 built, 0.0 KiB DL] [1/0/1 built, 0.0 KiB DLgammaloop-nextest-core> Extracting 4 binaries (including 1 non-test binary), 1 build script output directory, and 2 linked paths to /build/nextest-archive-PvuG9f
  18. 39.65 s gammaloop-nextest-core> Extracted 20 files to /build/nextest-archive-PvuG9f in 1.24s
  19. 39.73 s gammaloop-nextest-core> ------------
  20. 39.73 s gammaloop-nextest-core> Nextest run ID eafd1560-d69d-4c8f-9e9b-36b177b5154d with nextest profile: ci_gammaloop
  21. 39.73 s gammaloop-nextest-core> Starting 379 tests across 3 binaries
  22. 42.35 s gammaloop-nextest-core> ------------
  23. 42.35 s gammaloop-nextest-core> Summary [ 2.621s] 379 tests run: 379 passed, 0 skipped
  24. 42.61 s gammaloop-nextest-core>
  25. 42.61 s gammaloop-nextest-core> ========== nextest test summary ==========
  26. 42.61 s gammaloop-nextest-core> report: target/nextest/ci_gammaloop/junit.xml
  27. 42.61 s gammaloop-nextest-core> tests: 379, failures: 0, errors: 0
  28. 42.61 s gammaloop-nextest-core> No failing testcases found.
  29. 42.61 s gammaloop-nextest-core> =========================================
  30. 42.66 s gammaloop-nextest-core> Extracting 1 binary and 1 linked path to /build/nextest-archive-8T7jmd
  31. 42.79 s gammaloop-nextest-core> Extracted 7 files to /build/nextest-archive-8T7jmd in 0.13s
  32. 42.83 s gammaloop-nextest-core> ------------
  33. 42.83 s gammaloop-nextest-core> Nextest run ID 34eaa46b-9291-42d6-ad08-49a18ced8b73 with nextest profile: ci_gammaloop
  34. 42.83 s gammaloop-nextest-core> Starting 19 tests across 1 binary
  35. 42.87 s gammaloop-nextest-core> ------------
  36. 42.87 s gammaloop-nextest-core> Summary [ 0.042s] 19 tests run: 19 passed, 0 skipped
  37. 42.95 s gammaloop-nextest-core>
  38. 42.95 s gammaloop-nextest-core> ========== nextest test summary ==========
  39. 42.95 s gammaloop-nextest-core> report: target/nextest/ci_gammaloop/junit.xml
  40. 42.95 s gammaloop-nextest-core> tests: 19, failures: 0, errors: 0
  41. 42.95 s gammaloop-nextest-core> No failing testcases found.
  42. 42.95 s gammaloop-nextest-core> =========================================
  43. 42.99 s gammaloop-nextest-core> Extracting 1 binary to /build/nextest-archive-MEgPC2
  44. 43.06 s gammaloop-nextest-core> Extracted 4 files to /build/nextest-archive-MEgPC2 in 0.08s
  45. 43.09 s gammaloop-nextest-core> ------------
  46. 43.09 s gammaloop-nextest-core> Nextest run ID fe3e3cfd-dfec-4fa1-9326-17eeed7734e6 with nextest profile: ci_gammaloop
  47. 43.09 s gammaloop-nextest-core> Starting 0 tests across 1 binary
  48. 43.09 s gammaloop-nextest-core> ------------
  49. 43.09 s gammaloop-nextest-core> Summary [ 0.001s] 0 tests run: 0 passed, 0 skipped
  50. 43.17 s gammaloop-nextest-core>
  51. 43.17 s gammaloop-nextest-core> ========== nextest test summary ==========
  52. 43.17 s gammaloop-nextest-core> report: target/nextest/ci_gammaloop/junit.xml
  53. 43.17 s gammaloop-nextest-core> tests: 0, failures: 0, errors: 0
  54. 43.17 s gammaloop-nextest-core> No failing testcases found.
  55. 43.17 s gammaloop-nextest-core> =========================================
  56. 43.20 s gammaloop-nextest-core> Extracting 4 binaries, 1 build script output directory, and 2 linked paths to /build/nextest-archive-0UByLX
  57. 44.22 s gammaloop-nextest-core> Extracted 18 files to /build/nextest-archive-0UByLX in 1.03s
  58. 44.28 s gammaloop-nextest-core> ------------
  59. 44.28 s gammaloop-nextest-core> Nextest run ID 214958b6-2b3c-41ff-a0aa-bc0565c37c68 with nextest profile: ci_gammaloop
  60. 44.28 s gammaloop-nextest-core> Starting 706 tests across 4 binaries (60 tests skipped, including 59 tests via profile.ci_gammaloop.default-filter)
  61. 59.13 s gammaloop-nextest-core> FAIL [ 6.781s] (701/706) gammalooprs::test_renormalization finite_part_ghost_2loop
  62. 59.13 s gammaloop-nextest-core> stdout ---
  63. 59.13 s gammaloop-nextest-core>
  64. 59.13 s gammaloop-nextest-core> running 1 test
  65. 59.13 s gammaloop-nextest-core> test finite_part_ghost_2loop ... FAILED
  66. 59.13 s gammaloop-nextest-core>
  67. 59.13 s gammaloop-nextest-core> failures:
  68. 59.13 s gammaloop-nextest-core>
  69. 59.13 s gammaloop-nextest-core> failures:
  70. 59.13 s gammaloop-nextest-core> finite_part_ghost_2loop
  71. 59.13 s gammaloop-nextest-core>
  72. 59.13 s gammaloop-nextest-core> test result: FAILED. 0 passed; 1 failed; 0 ignored; 0 measured; 6 filtered out; finished in 6.74s
  73. 59.13 s gammaloop-nextest-core>
  74. 59.13 s gammaloop-nextest-core> stderr ---
  75. 59.13 s gammaloop-nextest-core> The application panicked (crashed).
  76. 59.13 s gammaloop-nextest-core> Message: assertion failed: (align_to_rqft(&a, &model) - expected).expand().is_zero()
  77. 59.13 s gammaloop-nextest-core> Location: crates/gammalooprs/tests/test_renormalization.rs:583
  78. 59.13 s gammaloop-nextest-core>
  79. 59.13 s gammaloop-nextest-core> ━━━━━━━━━━━━━━━━━━━━━━━━━━━━━━━━━━ BACKTRACE ━━━━━━━━━━━━━━━━━━━━━━━━━━━━━━━━━━━
  80. 59.13 s gammaloop-nextest-core> 1: <color_eyre[51793ea62743adbd]::config::PanicHook>::panic_report<unknown>
  81. 59.13 s gammaloop-nextest-core> at <unknown source file>:<unknown line>
  82. 59.13 s gammaloop-nextest-core> 2: <color_eyre[51793ea62743adbd]::config::PanicHook>::into_panic_hook::{closure#0}<unknown>
  83. 59.13 s gammaloop-nextest-core> at <unknown source file>:<unknown line>
  84. 59.13 s gammaloop-nextest-core> 3: std[bcb96dfbba0ab899]::panicking::panic_with_hook<unknown>
  85. 59.13 s gammaloop-nextest-core> at <unknown source file>:<unknown line>
  86. 59.13 s gammaloop-nextest-core> 4: std[bcb96dfbba0ab899]::panicking::panic_handler::{closure#0}<unknown>
  87. 59.13 s gammaloop-nextest-core> at <unknown source file>:<unknown line>
  88. 59.13 s gammaloop-nextest-core> 5: std[bcb96dfbba0ab899]::sys::backtrace::__rust_end_short_backtrace::<std[bcb96dfbba0ab899]::panicking::panic_handler::{closure#0}, !><unknown>
  89. 59.13 s gammaloop-nextest-core> at <unknown source file>:<unknown line>
  90. 59.13 s gammaloop-nextest-core> 6: __rustc[6c289b9f9c454d21]::rust_begin_unwind<unknown>
  91. 59.13 s gammaloop-nextest-core> at <unknown source file>:<unknown line>
  92. 59.13 s gammaloop-nextest-core> 7: core[940e698046960fd5]::panicking::panic_fmt<unknown>
  93. 59.13 s gammaloop-nextest-core> at <unknown source file>:<unknown line>
  94. 59.13 s gammaloop-nextest-core> 8: core[940e698046960fd5]::panicking::panic<unknown>
  95. 59.13 s gammaloop-nextest-core> at <unknown source file>:<unknown line>
  96. 59.13 s gammaloop-nextest-core> 9: <test_renormalization[5812939ef1a04d89]::finite_part_ghost_2loop::{closure#0} as core[940e698046960fd5]::ops::function::FnOnce<()>>::call_once<unknown>
  97. 59.13 s gammaloop-nextest-core> at <unknown source file>:<unknown line>
  98. 59.13 s gammaloop-nextest-core> 10: test[75d6903177b1d7e9]::__rust_begin_short_backtrace::<core[940e698046960fd5]::result::Result<(), alloc[2ea6bcb46fca0c42]::string::String>, fn() -> core[940e698046960fd5]::result::Result<(), alloc[2ea6bcb46fca0c42]::string::String>><unknown>
  99. 59.13 s gammaloop-nextest-core> at <unknown source file>:<unknown line>
  100. 59.13 s gammaloop-nextest-core> 11: test[75d6903177b1d7e9]::run_test::{closure#0}<unknown>
  101. 59.13 s gammaloop-nextest-core> at <unknown source file>:<unknown line>
  102. 59.13 s gammaloop-nextest-core> 12: std[bcb96dfbba0ab899]::sys::backtrace::__rust_begin_short_backtrace::<test[75d6903177b1d7e9]::run_test::{closure#1}, ()><unknown>
  103. 59.13 s gammaloop-nextest-core> at <unknown source file>:<unknown line>
  104. 59.13 s gammaloop-nextest-core> 13: <std[bcb96dfbba0ab899]::thread::lifecycle::spawn_unchecked<test[75d6903177b1d7e9]::run_test::{closure#1}, ()>::{closure#1} as core[940e698046960fd5]::ops::function::FnOnce<()>>::call_once::{shim:vtable#0}<unknown>
  105. 59.13 s gammaloop-nextest-core> at <unknown source file>:<unknown line>
  106. 59.13 s gammaloop-nextest-core> 14: <std[bcb96dfbba0ab899]::sys::thread::unix::Thread>::new::thread_start<unknown>
  107. 59.13 s gammaloop-nextest-core> at <unknown source file>:<unknown line>
  108. 59.13 s gammaloop-nextest-core> 15: start_thread<unknown>
  109. 59.13 s gammaloop-nextest-core> at <unknown source file>:<unknown line>
  110. 59.13 s gammaloop-nextest-core> 16: __clone3<unknown>
  111. 59.13 s gammaloop-nextest-core> at <unknown source file>:<unknown line>
  112. 59.13 s gammaloop-nextest-core>
  113. 59.13 s gammaloop-nextest-core> Run with COLORBT_SHOW_HIDDEN=1 environment variable to disable frame filtering.
  114. 59.13 s gammaloop-nextest-core> Run with RUST_BACKTRACE=full to include source snippets.
  115. 59.13 s gammaloop-nextest-core>
  116. 63.96 s gammaloop-nextest-core> ------------
  117. 63.96 s gammaloop-nextest-core> Summary [ 19.679s] 706 tests run: 705 passed, 1 failed, 60 skipped
  118. 63.96 s gammaloop-nextest-core> FAIL [ 6.781s] (701/706) gammalooprs::test_renormalization finite_part_ghost_2loop
  119. 63.96 s gammaloop-nextest-core> stdout ---
  120. 63.96 s gammaloop-nextest-core>
  121. 63.96 s gammaloop-nextest-core> running 1 test
  122. 63.96 s gammaloop-nextest-core> test finite_part_ghost_2loop ... FAILED
  123. 63.96 s gammaloop-nextest-core>
  124. 63.96 s gammaloop-nextest-core> failures:
  125. 63.96 s gammaloop-nextest-core>
  126. 63.96 s gammaloop-nextest-core> failures:
  127. 63.96 s gammaloop-nextest-core> finite_part_ghost_2loop
  128. 63.96 s gammaloop-nextest-core>
  129. 63.96 s gammaloop-nextest-core> test result: FAILED. 0 passed; 1 failed; 0 ignored; 0 measured; 6 filtered out; finished in 6.74s
  130. 63.96 s gammaloop-nextest-core>
  131. 63.96 s gammaloop-nextest-core> stderr ---
  132. 63.96 s gammaloop-nextest-core> The application panicked (crashed).
  133. 63.96 s gammaloop-nextest-core> Message: assertion failed: (align_to_rqft(&a, &model) - expected).expand().is_zero()
  134. 63.96 s gammaloop-nextest-core> Location: crates/gammalooprs/tests/test_renormalization.rs:583
  135. 63.96 s gammaloop-nextest-core>
  136. 63.96 s gammaloop-nextest-core> ━━━━━━━━━━━━━━━━━━━━━━━━━━━━━━━━━━ BACKTRACE ━━━━━━━━━━━━━━━━━━━━━━━━━━━━━━━━━━━
  137. 63.96 s gammaloop-nextest-core> 1: <color_eyre[51793ea62743adbd]::config::PanicHook>::panic_report<unknown>
  138. 63.96 s gammaloop-nextest-core> at <unknown source file>:<unknown line>
  139. 63.96 s gammaloop-nextest-core> 2: <color_eyre[51793ea62743adbd]::config::PanicHook>::into_panic_hook::{closure#0}<unknown>
  140. 63.96 s gammaloop-nextest-core> at <unknown source file>:<unknown line>
  141. 63.96 s gammaloop-nextest-core> 3: std[bcb96dfbba0ab899]::panicking::panic_with_hook<unknown>
  142. 63.96 s gammaloop-nextest-core> at <unknown source file>:<unknown line>
  143. 63.96 s gammaloop-nextest-core> 4: std[bcb96dfbba0ab899]::panicking::panic_handler::{closure#0}<unknown>
  144. 63.96 s gammaloop-nextest-core> at <unknown source file>:<unknown line>
  145. 63.96 s gammaloop-nextest-core> 5: std[bcb96dfbba0ab899]::sys::backtrace::__rust_end_short_backtrace::<std[bcb96dfbba0ab899]::panicking::panic_handler::{closure#0}, !><unknown>
  146. 63.96 s gammaloop-nextest-core> at <unknown source file>:<unknown line>
  147. 63.96 s gammaloop-nextest-core> 6: __rustc[6c289b9f9c454d21]::rust_begin_unwind<unknown>
  148. 63.96 s gammaloop-nextest-core> at <unknown source file>:<unknown line>
  149. 63.96 s gammaloop-nextest-core> 7: core[940e698046960fd5]::panicking::panic_fmt<unknown>
  150. 63.96 s gammaloop-nextest-core> at <unknown source file>:<unknown line>
  151. 63.96 s gammaloop-nextest-core> 8: core[940e698046960fd5]::panicking::panic<unknown>
  152. 63.96 s gammaloop-nextest-core> at <unknown source file>:<unknown line>
  153. 63.96 s gammaloop-nextest-core> 9: <test_renormalization[5812939ef1a04d89]::finite_part_ghost_2loop::{closure#0} as core[940e698046960fd5]::ops::function::FnOnce<()>>::call_once<unknown>
  154. 63.96 s gammaloop-nextest-core> at <unknown source file>:<unknown line>
  155. 63.96 s gammaloop-nextest-core> 10: test[75d6903177b1d7e9]::__rust_begin_short_backtrace::<core[940e698046960fd5]::result::Result<(), alloc[2ea6bcb46fca0c42]::string::String>, fn() -> core[940e698046960fd5]::result::Result<(), alloc[2ea6bcb46fca0c42]::string::String>><unknown>
  156. 63.96 s gammaloop-nextest-core> at <unknown source file>:<unknown line>
  157. 63.96 s gammaloop-nextest-core> 11: test[75d6903177b1d7e9]::run_test::{closure#0}<unknown>
  158. 63.96 s gammaloop-nextest-core> at <unknown source file>:<unknown line>
  159. 63.96 s gammaloop-nextest-core> 12: std[bcb96dfbba0ab899]::sys::backtrace::__rust_begin_short_backtrace::<test[75d6903177b1d7e9]::run_test::{closure#1}, ()><unknown>
  160. 63.96 s gammaloop-nextest-core> at <unknown source file>:<unknown line>
  161. 63.96 s gammaloop-nextest-core> 13: <std[bcb96dfbba0ab899]::thread::lifecycle::spawn_unchecked<test[75d6903177b1d7e9]::run_test::{closure#1}, ()>::{closure#1} as core[940e698046960fd5]::ops::function::FnOnce<()>>::call_once::{shim:vtable#0}<unknown>
  162. 63.96 s gammaloop-nextest-core> at <unknown source file>:<unknown line>
  163. 63.96 s gammaloop-nextest-core> 14: <std[bcb96dfbba0ab899]::sys::thread::unix::Thread>::new::thread_start<unknown>
  164. 63.96 s gammaloop-nextest-core> at <unknown source file>:<unknown line>
  165. 63.96 s gammaloop-nextest-core> 15: start_thread<unknown>
  166. 63.96 s gammaloop-nextest-core> at <unknown source file>:<unknown line>
  167. 63.96 s gammaloop-nextest-core> 16: __clone3<unknown>
  168. 63.96 s gammaloop-nextest-core> at <unknown source file>:<unknown line>
  169. 63.96 s gammaloop-nextest-core>
  170. 63.96 s gammaloop-nextest-core> Run with COLORBT_SHOW_HIDDEN=1 environment variable to disable frame filtering.
  171. 63.96 s gammaloop-nextest-core> Run with RUST_BACKTRACE=full to include source snippets.
  172. 63.96 s gammaloop-nextest-core>
  173. 64.04 s gammaloop-nextest-core> error: test run failed
  174. 64.06 s gammaloop-nextest-core>
  175. 64.06 s gammaloop-nextest-core> ========== nextest test summary ==========
  176. 64.06 s gammaloop-nextest-core> report: target/nextest/ci_gammaloop/junit.xml
  177. 64.06 s gammaloop-nextest-core> tests: 706, failures: 1, errors: 0
  178. 64.06 s gammaloop-nextest-core>
  179. 64.06 s gammaloop-nextest-core> 1. gammalooprs::test_renormalization::finite_part_ghost_2loop
  180. 64.06 s gammaloop-nextest-core> failure: test failure with exit code 101
  181. 64.06 s gammaloop-nextest-core> system-out
  182. 64.06 s gammaloop-nextest-core> running 1 test
  183. 64.06 s gammaloop-nextest-core> test finite_part_ghost_2loop ... FAILED
  184. 64.06 s gammaloop-nextest-core>
  185. 64.06 s gammaloop-nextest-core> failures:
  186. 64.06 s gammaloop-nextest-core>
  187. 64.06 s gammaloop-nextest-core> failures:
  188. 64.06 s gammaloop-nextest-core> finite_part_ghost_2loop
  189. 64.06 s gammaloop-nextest-core>
  190. 64.06 s gammaloop-nextest-core> test result: FAILED. 0 passed; 1 failed; 0 ignored; 0 measured; 6 filtered out; finished in 6.74s
  191. 64.06 s gammaloop-nextest-core> system-err
  192. 64.06 s gammaloop-nextest-core> The application panicked (crashed).
  193. 64.06 s gammaloop-nextest-core> Message: assertion failed: (align_to_rqft(&a, &model) - expected).expand().is_zero()
  194. 64.06 s gammaloop-nextest-core> Location: crates/gammalooprs/tests/test_renormalization.rs:583
  195. 64.06 s gammaloop-nextest-core>
  196. 64.06 s gammaloop-nextest-core> ━━━━━━━━━━━━━━━━━━━━━━━━━━━━━━━━━━ BACKTRACE ━━━━━━━━━━━━━━━━━━━━━━━━━━━━━━━━━━━
  197. 64.06 s gammaloop-nextest-core> 1: <color_eyre[51793ea62743adbd]::config::PanicHook>::panic_report<unknown>
  198. 64.06 s gammaloop-nextest-core> at <unknown source file>:<unknown line>
  199. 64.06 s gammaloop-nextest-core> 2: <color_eyre[51793ea62743adbd]::config::PanicHook>::into_panic_hook::{closure#0}<unknown>
  200. 64.06 s gammaloop-nextest-core> at <unknown source file>:<unknown line>
  201. 64.06 s gammaloop-nextest-core> 3: std[bcb96dfbba0ab899]::panicking::panic_with_hook<unknown>
  202. 64.06 s gammaloop-nextest-core> at <unknown source file>:<unknown line>
  203. 64.06 s gammaloop-nextest-core> 4: std[bcb96dfbba0ab899]::panicking::panic_handler::{closure#0}<unknown>
  204. 64.06 s gammaloop-nextest-core> at <unknown source file>:<unknown line>
  205. 64.06 s gammaloop-nextest-core> 5: std[bcb96dfbba0ab899]::sys::backtrace::__rust_end_short_backtrace::<std[bcb96dfbba0ab899]::panicking::panic_handler::{closure#0}, !><unknown>
  206. 64.06 s gammaloop-nextest-core> at <unknown source file>:<unknown line>
  207. 64.06 s gammaloop-nextest-core> 6: __rustc[6c289b9f9c454d21]::rust_begin_unwind<unknown>
  208. 64.06 s gammaloop-nextest-core> at <unknown source file>:<unknown line>
  209. 64.06 s gammaloop-nextest-core> 7: core[940e698046960fd5]::panicking::panic_fmt<unknown>
  210. 64.06 s gammaloop-nextest-core> at <unknown source file>:<unknown line>
  211. 64.06 s gammaloop-nextest-core> 8: core[940e698046960fd5]::panicking::panic<unknown>
  212. 64.06 s gammaloop-nextest-core> at <unknown source file>:<unknown line>
  213. 64.06 s gammaloop-nextest-core> 9: <test_renormalization[5812939ef1a04d89]::finite_part_ghost_2loop::{closure#0} as core[940e698046960fd5]::ops::function::FnOnce<()>>::call_once<unknown>
  214. 64.06 s gammaloop-nextest-core> at <unknown source file>:<unknown line>
  215. 64.06 s gammaloop-nextest-core> 10: test[75d6903177b1d7e9]::__rust_begin_short_backtrace::<core[940e698046960fd5]::result::Result<(), alloc[2ea6bcb46fca0c42]::string::String>, fn() -> core[940e698046960fd5]::result::Result<(), alloc[2ea6bcb46fca0c42]::string::String>><unknown>
  216. 64.06 s gammaloop-nextest-core> at <unknown source file>:<unknown line>
  217. 64.06 s gammaloop-nextest-core> 11: test[75d6903177b1d7e9]::run_test::{closure#0}<unknown>
  218. 64.06 s gammaloop-nextest-core> at <unknown source file>:<unknown line>
  219. 64.06 s gammaloop-nextest-core> 12: std[bcb96dfbba0ab899]::sys::backtrace::__rust_begin_short_backtrace::<test[75d6903177b1d7e9]::run_test::{closure#1}, ()><unknown>
  220. 64.06 s gammaloop-nextest-core> at <unknown source file>:<unknown line>
  221. 64.06 s gammaloop-nextest-core> 13: <std[bcb96dfbba0ab899]::thread::lifecycle::spawn_unchecked<test[75d6903177b1d7e9]::run_test::{closure#1}, ()>::{closure#1} as core[940e698046960fd5]::ops::function::FnOnce<()>>::call_once::{shim:vtable#0}<unknown>
  222. 64.06 s gammaloop-nextest-core> at <unknown source file>:<unknown line>
  223. 64.06 s gammaloop-nextest-core> 14: <std[bcb96dfbba0ab899]::sys::thread::unix::Thread>::new::thread_start<unknown>
  224. 64.06 s gammaloop-nextest-core> at <unknown source file>:<unknown line>
  225. 64.06 s gammaloop-nextest-core> 15: start_thread<unknown>
  226. 64.06 s gammaloop-nextest-core> at <unknown source file>:<unknown line>
  227. 64.06 s gammaloop-nextest-core> 16: __clone3<unknown>
  228. 64.06 s gammaloop-nextest-core> at <unknown source file>:<unknown line>
  229. 64.06 s gammaloop-nextest-core>
  230. 64.06 s gammaloop-nextest-core> Run with COLORBT_SHOW_HIDDEN=1 environment variable to disable frame filtering.
  231. 64.06 s gammaloop-nextest-core> Run with RUST_BACKTRACE=full to include source snippets.
  232. 64.06 s gammaloop-nextest-core> =========================================
  233. 64.08 s gammaloop-nextest-core> Extracting 1 binary, 1 build script output directory, and 1 linked path to /build/nextest-archive-ZzetWn
  234. 64.15 s gammaloop-nextest-core> Extracted 7 files to /build/nextest-archive-ZzetWn in 0.07s
  235. 64.16 s gammaloop-nextest-core> ------------
  236. 64.16 s gammaloop-nextest-core> Nextest run ID d752b071-a6e2-43aa-9a4a-f196abefaf66 with nextest profile: ci_gammaloop
  237. 64.16 s gammaloop-nextest-core> Starting 105 tests across 1 binary
  238. 82.41 s gammaloop-nextest-core> ------------
  239. 82.41 s gammaloop-nextest-core> Summary [ 18.249s] 105 tests run: 105 passed, 0 skipped
  240. 82.47 s gammaloop-nextest-core>
  241. 82.47 s gammaloop-nextest-core> ========== nextest test summary ==========
  242. 82.47 s gammaloop-nextest-core> report: target/nextest/ci_gammaloop/junit.xml
  243. 82.47 s gammaloop-nextest-core> tests: 105, failures: 0, errors: 0
  244. 82.47 s gammaloop-nextest-core> No failing testcases found.
  245. 82.47 s gammaloop-nextest-core> =========================================
  246. 82.54 s error: Cannot build '/nix/store/gfw8irsajvc73r64ijh06rb30gc2744x-gammaloop-nextest-core.drv'.
  247. 82.54 s Reason: builder failed with exit code 100.
  248. 82.54 s Output paths:
  249. 82.54 s /nix/store/p3ayrsjin2c2zsszczl860szaj7271z8-gammaloop-nextest-core
  250. 82.54 s Last 229 log lines:
  251. 82.54 s > Extracting 4 binaries (including 1 non-test binary), 1 build script output directory, and 2 linked paths to /build/nextest-archive-PvuG9f
  252. 82.54 s > Extracted 20 files to /build/nextest-archive-PvuG9f in 1.24s
  253. 82.54 s > ------------
  254. 82.54 s > Nextest run ID eafd1560-d69d-4c8f-9e9b-36b177b5154d with nextest profile: ci_gammaloop
  255. 82.54 s > Starting 379 tests across 3 binaries
  256. 82.54 s > ------------
  257. 82.54 s > Summary [ 2.621s] 379 tests run: 379 passed, 0 skipped
  258. 82.54 s >
  259. 82.54 s > ========== nextest test summary ==========
  260. 82.54 s > report: target/nextest/ci_gammaloop/junit.xml
  261. 82.54 s > tests: 379, failures: 0, errors: 0
  262. 82.54 s > No failing testcases found.
  263. 82.54 s > =========================================
  264. 82.54 s > Extracting 1 binary and 1 linked path to /build/nextest-archive-8T7jmd
  265. 82.54 s > Extracted 7 files to /build/nextest-archive-8T7jmd in 0.13s
  266. 82.54 s > ------------
  267. 82.54 s > Nextest run ID 34eaa46b-9291-42d6-ad08-49a18ced8b73 with nextest profile: ci_gammaloop
  268. 82.54 s > Starting 19 tests across 1 binary
  269. 82.54 s > ------------
  270. 82.54 s > Summary [ 0.042s] 19 tests run: 19 passed, 0 skipped
  271. 82.54 s >
  272. 82.54 s > ========== nextest test summary ==========
  273. 82.54 s > report: target/nextest/ci_gammaloop/junit.xml
  274. 82.54 s > tests: 19, failures: 0, errors: 0
  275. 82.54 s > No failing testcases found.
  276. 82.54 s > =========================================
  277. 82.54 s > Extracting 1 binary to /build/nextest-archive-MEgPC2
  278. 82.54 s > Extracted 4 files to /build/nextest-archive-MEgPC2 in 0.08s
  279. 82.54 s > ------------
  280. 82.54 s > Nextest run ID fe3e3cfd-dfec-4fa1-9326-17eeed7734e6 with nextest profile: ci_gammaloop
  281. 82.54 s > Starting 0 tests across 1 binary
  282. 82.54 s > ------------
  283. 82.54 s > Summary [ 0.001s] 0 tests run: 0 passed, 0 skipped
  284. 82.54 s >
  285. 82.54 s > ========== nextest test summary ==========
  286. 82.54 s > report: target/nextest/ci_gammaloop/junit.xml
  287. 82.54 s > tests: 0, failures: 0, errors: 0
  288. 82.54 s > No failing testcases found.
  289. 82.54 s > =========================================
  290. 82.54 s > Extracting 4 binaries, 1 build script output directory, and 2 linked paths to /build/nextest-archive-0UByLX
  291. 82.54 s > Extracted 18 files to /build/nextest-archive-0UByLX in 1.03s
  292. 82.54 s > ------------
  293. 82.54 s > Nextest run ID 214958b6-2b3c-41ff-a0aa-bc0565c37c68 with nextest profile: ci_gammaloop
  294. 82.54 s > Starting 706 tests across 4 binaries (60 tests skipped, including 59 tests via profile.ci_gammaloop.default-filter)
  295. 82.54 s > FAIL [ 6.781s] (701/706) gammalooprs::test_renormalization finite_part_ghost_2loop
  296. 82.54 s > stdout ---
  297. 82.54 s >
  298. 82.54 s > running 1 test
  299. 82.54 s > test finite_part_ghost_2loop ... FAILED
  300. 82.54 s >
  301. 82.54 s > failures:
  302. 82.54 s >
  303. 82.54 s > failures:
  304. 82.54 s > finite_part_ghost_2loop
  305. 82.54 s >
  306. 82.54 s > test result: FAILED. 0 passed; 1 failed; 0 ignored; 0 measured; 6 filtered out; finished in 6.74s
  307. 82.54 s >
  308. 82.54 s > stderr ---
  309. 82.54 s > The application panicked (crashed).
  310. 82.54 s > Message: assertion failed: (align_to_rqft(&a, &model) - expected).expand().is_zero()
  311. 82.54 s > Location: crates/gammalooprs/tests/test_renormalization.rs:583
  312. 82.54 s >
  313. 82.54 s > ━━━━━━━━━━━━━━━━━━━━━━━━━━━━━━━━━━ BACKTRACE ━━━━━━━━━━━━━━━━━━━━━━━━━━━━━━━━━━━
  314. 82.54 s > 1: <color_eyre[51793ea62743adbd]::config::PanicHook>::panic_report<unknown>
  315. 82.54 s > at <unknown source file>:<unknown line>
  316. 82.54 s > 2: <color_eyre[51793ea62743adbd]::config::PanicHook>::into_panic_hook::{closure#0}<unknown>
  317. 82.54 s > at <unknown source file>:<unknown line>
  318. 82.54 s > 3: std[bcb96dfbba0ab899]::panicking::panic_with_hook<unknown>
  319. 82.54 s > at <unknown source file>:<unknown line>
  320. 82.54 s > 4: std[bcb96dfbba0ab899]::panicking::panic_handler::{closure#0}<unknown>
  321. 82.54 s > at <unknown source file>:<unknown line>
  322. 82.54 s > 5: std[bcb96dfbba0ab899]::sys::backtrace::__rust_end_short_backtrace::<std[bcb96dfbba0ab899]::panicking::panic_handler::{closure#0}, !><unknown>
  323. 82.54 s > at <unknown source file>:<unknown line>
  324. 82.54 s > 6: __rustc[6c289b9f9c454d21]::rust_begin_unwind<unknown>
  325. 82.54 s > at <unknown source file>:<unknown line>
  326. 82.54 s > 7: core[940e698046960fd5]::panicking::panic_fmt<unknown>
  327. 82.54 s > at <unknown source file>:<unknown line>
  328. 82.54 s > 8: core[940e698046960fd5]::panicking::panic<unknown>
  329. 82.54 s > at <unknown source file>:<unknown line>
  330. 82.54 s > 9: <test_renormalization[5812939ef1a04d89]::finite_part_ghost_2loop::{closure#0} as core[940e698046960fd5]::ops::function::FnOnce<()>>::call_once<unknown>
  331. 82.54 s > at <unknown source file>:<unknown line>
  332. 82.54 s > 10: test[75d6903177b1d7e9]::__rust_begin_short_backtrace::<core[940e698046960fd5]::result::Result<(), alloc[2ea6bcb46fca0c42]::string::String>, fn() -> core[940e698046960fd5]::result::Result<(), alloc[2ea6bcb46fca0c42]::string::String>><unknown>
  333. 82.54 s > at <unknown source file>:<unknown line>
  334. 82.54 s > 11: test[75d6903177b1d7e9]::run_test::{closure#0}<unknown>
  335. 82.54 s > at <unknown source file>:<unknown line>
  336. 82.54 s > 12: std[bcb96dfbba0ab899]::sys::backtrace::__rust_begin_short_backtrace::<test[75d6903177b1d7e9]::run_test::{closure#1}, ()><unknown>
  337. 82.54 s > at <unknown source file>:<unknown line>
  338. 82.54 s > 13: <std[bcb96dfbba0ab899]::thread::lifecycle::spawn_unchecked<test[75d6903177b1d7e9]::run_test::{closure#1}, ()>::{closure#1} as core[940e698046960fd5]::ops::function::FnOnce<()>>::call_once::{shim:vtable#0}<unknown>
  339. 82.54 s > at <unknown source file>:<unknown line>
  340. 82.54 s > 14: <std[bcb96dfbba0ab899]::sys::thread::unix::Thread>::new::thread_start<unknown>
  341. 82.54 s > at <unknown source file>:<unknown line>
  342. 82.54 s > 15: start_thread<unknown>
  343. 82.54 s > at <unknown source file>:<unknown line>
  344. 82.54 s > 16: __clone3<unknown>
  345. 82.54 s > at <unknown source file>:<unknown line>
  346. 82.54 s >
  347. 82.54 s > Run with COLORBT_SHOW_HIDDEN=1 environment variable to disable frame filtering.
  348. 82.54 s > Run with RUST_BACKTRACE=full to include source snippets.
  349. 82.54 s >
  350. 82.54 s > ------------
  351. 82.54 s > Summary [ 19.679s] 706 tests run: 705 passed, 1 failed, 60 skipped
  352. 82.54 s > FAIL [ 6.781s] (701/706) gammalooprs::test_renormalization finite_part_ghost_2loop
  353. 82.54 s > stdout ---
  354. 82.54 s >
  355. 82.54 s > running 1 test
  356. 82.54 s > test finite_part_ghost_2loop ... FAILED
  357. 82.54 s >
  358. 82.54 s > failures:
  359. 82.54 s >
  360. 82.54 s > failures:
  361. 82.54 s > finite_part_ghost_2loop
  362. 82.54 s >
  363. 82.54 s > test result: FAILED. 0 passed; 1 failed; 0 ignored; 0 measured; 6 filtered out; finished in 6.74s
  364. 82.54 s >
  365. 82.54 s > stderr ---
  366. 82.54 s > The application panicked (crashed).
  367. 82.54 s > Message: assertion failed: (align_to_rqft(&a, &model) - expected).expand().is_zero()
  368. 82.54 s > Location: crates/gammalooprs/tests/test_renormalization.rs:583
  369. 82.54 s >
  370. 82.54 s > ━━━━━━━━━━━━━━━━━━━━━━━━━━━━━━━━━━ BACKTRACE ━━━━━━━━━━━━━━━━━━━━━━━━━━━━━━━━━━━
  371. 82.54 s > 1: <color_eyre[51793ea62743adbd]::config::PanicHook>::panic_report<unknown>
  372. 82.54 s > at <unknown source file>:<unknown line>
  373. 82.54 s > 2: <color_eyre[51793ea62743adbd]::config::PanicHook>::into_panic_hook::{closure#0}<unknown>
  374. 82.54 s > at <unknown source file>:<unknown line>
  375. 82.54 s > 3: std[bcb96dfbba0ab899]::panicking::panic_with_hook<unknown>
  376. 82.54 s > at <unknown source file>:<unknown line>
  377. 82.54 s > 4: std[bcb96dfbba0ab899]::panicking::panic_handler::{closure#0}<unknown>
  378. 82.54 s > at <unknown source file>:<unknown line>
  379. 82.54 s > 5: std[bcb96dfbba0ab899]::sys::backtrace::__rust_end_short_backtrace::<std[bcb96dfbba0ab899]::panicking::panic_handler::{closure#0}, !><unknown>
  380. 82.54 s > at <unknown source file>:<unknown line>
  381. 82.54 s > 6: __rustc[6c289b9f9c454d21]::rust_begin_unwind<unknown>
  382. 82.54 s > at <unknown source file>:<unknown line>
  383. 82.54 s > 7: core[940e698046960fd5]::panicking::panic_fmt<unknown>
  384. 82.54 s > at <unknown source file>:<unknown line>
  385. 82.54 s > 8: core[940e698046960fd5]::panicking::panic<unknown>
  386. 82.54 s > at <unknown source file>:<unknown line>
  387. 82.54 s > 9: <test_renormalization[5812939ef1a04d89]::finite_part_ghost_2loop::{closure#0} as core[940e698046960fd5]::ops::function::FnOnce<()>>::call_once<unknown>
  388. 82.54 s > at <unknown source file>:<unknown line>
  389. 82.54 s > 10: test[75d6903177b1d7e9]::__rust_begin_short_backtrace::<core[940e698046960fd5]::result::Result<(), alloc[2ea6bcb46fca0c42]::string::String>, fn() -> core[940e698046960fd5]::result::Result<(), alloc[2ea6bcb46fca0c42]::string::String>><unknown>
  390. 82.54 s > at <unknown source file>:<unknown line>
  391. 82.54 s > 11: test[75d6903177b1d7e9]::run_test::{closure#0}<unknown>
  392. 82.54 s > at <unknown source file>:<unknown line>
  393. 82.54 s > 12: std[bcb96dfbba0ab899]::sys::backtrace::__rust_begin_short_backtrace::<test[75d6903177b1d7e9]::run_test::{closure#1}, ()><unknown>
  394. 82.54 s > at <unknown source file>:<unknown line>
  395. 82.54 s > 13: <std[bcb96dfbba0ab899]::thread::lifecycle::spawn_unchecked<test[75d6903177b1d7e9]::run_test::{closure#1}, ()>::{closure#1} as core[940e698046960fd5]::ops::function::FnOnce<()>>::call_once::{shim:vtable#0}<unknown>
  396. 82.54 s > at <unknown source file>:<unknown line>
  397. 82.54 s > 14: <std[bcb96dfbba0ab899]::sys::thread::unix::Thread>::new::thread_start<unknown>
  398. 82.54 s > at <unknown source file>:<unknown line>
  399. 82.54 s > 15: start_thread<unknown>
  400. 82.54 s > at <unknown source file>:<unknown line>
  401. 82.54 s > 16: __clone3<unknown>
  402. 82.54 s > at <unknown source file>:<unknown line>
  403. 82.54 s >
  404. 82.54 s > Run with COLORBT_SHOW_HIDDEN=1 environment variable to disable frame filtering.
  405. 82.54 s > Run with RUST_BACKTRACE=full to include source snippets.
  406. 82.54 s >
  407. 82.54 s > error: test run failed
  408. 82.54 s >
  409. 82.54 s > ========== nextest test summary ==========
  410. 82.54 s > report: target/nextest/ci_gammaloop/junit.xml
  411. 82.54 s > tests: 706, failures: 1, errors: 0
  412. 82.54 s >
  413. 82.54 s > 1. gammalooprs::test_renormalization::finite_part_ghost_2loop
  414. 82.54 s > failure: test failure with exit code 101
  415. 82.54 s > system-out
  416. 82.54 s > running 1 test
  417. 82.54 s > test finite_part_ghost_2loop ... FAILED
  418. 82.54 s >
  419. 82.54 s > failures:
  420. 82.54 s >
  421. 82.54 s > failures:
  422. 82.54 s > finite_part_ghost_2loop
  423. 82.54 s >
  424. 82.54 s > test result: FAILED. 0 passed; 1 failed; 0 ignored; 0 measured; 6 filtered out; finished in 6.74s
  425. 82.54 s > system-err
  426. 82.54 s > The application panicked (crashed).
  427. 82.54 s > Message: assertion failed: (align_to_rqft(&a, &model) - expected).expand().is_zero()
  428. 82.54 s > Location: crates/gammalooprs/tests/test_renormalization.rs:583
  429. 82.54 s >
  430. 82.54 s > ━━━━━━━━━━━━━━━━━━━━━━━━━━━━━━━━━━ BACKTRACE ━━━━━━━━━━━━━━━━━━━━━━━━━━━━━━━━━━━
  431. 82.54 s > 1: <color_eyre[51793ea62743adbd]::config::PanicHook>::panic_report<unknown>
  432. 82.54 s > at <unknown source file>:<unknown line>
  433. 82.54 s > 2: <color_eyre[51793ea62743adbd]::config::PanicHook>::into_panic_hook::{closure#0}<unknown>
  434. 82.54 s > at <unknown source file>:<unknown line>
  435. 82.54 s > 3: std[bcb96dfbba0ab899]::panicking::panic_with_hook<unknown>
  436. 82.54 s > at <unknown source file>:<unknown line>
  437. 82.54 s > 4: std[bcb96dfbba0ab899]::panicking::panic_handler::{closure#0}<unknown>
  438. 82.54 s > at <unknown source file>:<unknown line>
  439. 82.54 s > 5: std[bcb96dfbba0ab899]::sys::backtrace::__rust_end_short_backtrace::<std[bcb96dfbba0ab899]::panicking::panic_handler::{closure#0}, !><unknown>
  440. 82.54 s > at <unknown source file>:<unknown line>
  441. 82.54 s > 6: __rustc[6c289b9f9c454d21]::rust_begin_unwind<unknown>
  442. 82.54 s > at <unknown source file>:<unknown line>
  443. 82.54 s > 7: core[940e698046960fd5]::panicking::panic_fmt<unknown>
  444. 82.54 s > at <unknown source file>:<unknown line>
  445. 82.54 s > 8: core[940e698046960fd5]::panicking::panic<unknown>
  446. 82.54 s > at <unknown source file>:<unknown line>
  447. 82.54 s > 9: <test_renormalization[5812939ef1a04d89]::finite_part_ghost_2loop::{closure#0} as core[940e698046960fd5]::ops::function::FnOnce<()>>::call_once<unknown>
  448. 82.54 s > at <unknown source file>:<unknown line>
  449. 82.54 s > 10: test[75d6903177b1d7e9]::__rust_begin_short_backtrace::<core[940e698046960fd5]::result::Result<(), alloc[2ea6bcb46fca0c42]::string::String>, fn() -> core[940e698046960fd5]::result::Result<(), alloc[2ea6bcb46fca0c42]::string::String>><unknown>
  450. 82.54 s > at <unknown source file>:<unknown line>
  451. 82.54 s > 11: test[75d6903177b1d7e9]::run_test::{closure#0}<unknown>
  452. 82.54 s > at <unknown source file>:<unknown line>
  453. 82.54 s > 12: std[bcb96dfbba0ab899]::sys::backtrace::__rust_begin_short_backtrace::<test[75d6903177b1d7e9]::run_test::{closure#1}, ()><unknown>
  454. 82.54 s > at <unknown source file>:<unknown line>
  455. 82.54 s > 13: <std[bcb96dfbba0ab899]::thread::lifecycle::spawn_unchecked<test[75d6903177b1d7e9]::run_test::{closure#1}, ()>::{closure#1} as core[940e698046960fd5]::ops::function::FnOnce<()>>::call_once::{shim:vtable#0}<unknown>
  456. 82.54 s > at <unknown source file>:<unknown line>
  457. 82.54 s > 14: <std[bcb96dfbba0ab899]::sys::thread::unix::Thread>::new::thread_start<unknown>
  458. 82.54 s > at <unknown source file>:<unknown line>
  459. 82.54 s > 15: start_thread<unknown>
  460. 82.54 s > at <unknown source file>:<unknown line>
  461. 82.54 s > 16: __clone3<unknown>
  462. 82.54 s > at <unknown source file>:<unknown line>
  463. 82.54 s >
  464. 82.54 s > Run with COLORBT_SHOW_HIDDEN=1 environment variable to disable frame filtering.
  465. 82.54 s > Run with RUST_BACKTRACE=full to include source snippets.
  466. 82.54 s > =========================================
  467. 82.54 s > Extracting 1 binary, 1 build script output directory, and 1 linked path to /build/nextest-archive-ZzetWn
  468. 82.54 s > Extracted 7 files to /build/nextest-archive-ZzetWn in 0.07s
  469. 82.54 s > ------------
  470. 82.54 s > Nextest run ID d752b071-a6e2-43aa-9a4a-f196abefaf66 with nextest profile: ci_gammaloop
  471. 82.54 s > Starting 105 tests across 1 binary
  472. 82.54 s > ------------
  473. 82.54 s > Summary [ 18.249s] 105 tests run: 105 passed, 0 skipped
  474. 82.54 s >
  475. 82.54 s > ========== nextest test summary ==========
  476. 82.54 s > report: target/nextest/ci_gammaloop/junit.xml
  477. 82.54 s > tests: 105, failures: 0, errors: 0
  478. 82.54 s > No failing testcases found.
  479. 82.54 s > =========================================
  480. 82.54 s For full logs, run:
  481. 82.54 s nix log /nix/store/gfw8irsajvc73r64ijh06rb30gc2744x-gammaloop-nextest-core.drv
  482. 82.71 s [0 built (1 failed), 0.0Run failed.