test packages.x86_64-linux.nix-ci-check-gammaloop-nextest-core

Reproduce this run
Retry Run
  1. 0.00 s $ /nix/store/9ypz3flqsrl5xl495mm8h645gadjsxi1-coreutils-9.11/bin/timeout --kill-after=15s 7200s /nix/store/23zk8sgzamrbmj1fday15szf7f2279s8-nix-2.34.7/bin/nix --extra-experimental-features nix-command --extra-experimental-features flakes flake clone git+https://github.com/alphal00p/gammaloop --dest /tmp/nix-ci-worker/stable-pwd/repo/
  2. 0.08 s Cloning into '/tmp/nix-ci-worker/stable-pwd/repo'...
  3. 0.87 s remote: Enumerating objects: 86206, done.
  4. 0.98 s remote: Counting objects: 0% (1/8660) remote: Counting objects: 1% (87/8660) remote: Counting objects: 2% (174/8660) remote: Counting objects: 3% (260/8660) remote: Counting objects: 4% (347/8660) remote: Counting objects: 5% (433/8660) remote: Counting objects: 6% (520/8660) remote: Counting objects: 7% (607/8660) remote: Counting objects: 8% (693/8660) remote: Counting objects: 9% (780/8660) remote: Counting objects: 10% (866/8660) remote: Counting objects: 11% (953/8660) remote: Counting objects: 12% (1040/8660) remote: Counting objects: 13% (1126/8660) remote: Counting objects: 14% (1213/8660) remote: Counting objects: 15% (1299/8660) remote: Counting objects: 16% (1386/8660) remote: Counting objects: 17% (1473/8660) remote: Counting objects: 18% (1559/8660) remote: Counting objects: 19% (1646/8660) remote: Counting objects: 20% (1732/8660) remote: Counting objects: 21% (1819/8660) remote: Counting objects: 22% (1906/8660) remote: Counting objects: 23% (1992/8660) remote: Counting objects: 24% (2079/8660) remote: Counting objects: 25% (2165/8660) remote: Counting objects: 26% (2252/8660) remote: Counting objects: 27% (2339/8660) remote: Counting objects: 28% (2425/8660) remote: Counting objects: 29% (2512/8660) remote: Counting objects: 30% (2598/8660) remote: Counting objects: 31% (2685/8660) remote: Counting objects: 32% (2772/8660) remote: Counting objects: 33% (2858/8660) remote: Counting objects: 34% (2945/8660) remote: Counting objects: 35% (3031/8660) remote: Counting objects: 36% (3118/8660) remote: Counting objects: 37% (3205/8660) remote: Counting objects: 38% (3291/8660) remote: Counting objects: 39% (3378/8660) remote: Counting objects: 40% (3464/8660) remote: Counting objects: 41% (3551/8660) remote: Counting objects: 42% (3638/8660) remote: Counting objects: 43% (3724/8660) remote: Counting objects: 44% (3811/8660) remote: Counting objects: 45% (3897/8660) remote: Counting objects: 46% (3984/8660) remote: Counting objects: 47% (4071/8660) remote: Counting objects: 48% (4157/8660) remote: Counting objects: 49% (4244/8660) remote: Counting objects: 50% (4330/8660) remote: Counting objects: 51% (4417/8660) remote: Counting objects: 52% (4504/8660) remote: Counting objects: 53% (4590/8660) remote: Counting objects: 54% (4677/8660) remote: Counting objects: 55% (4763/8660) remote: Counting objects: 56% (4850/8660) remote: Counting objects: 57% (4937/8660) remote: Counting objects: 58% (5023/8660) remote: Counting objects: 59% (5110/8660) remote: Counting objects: 60% (5196/8660) remote: Counting objects: 61% (5283/8660) remote: Counting objects: 62% (5370/8660) remote: Counting objects: 63% (5456/8660) remote: Counting objects: 64% (5543/8660) remote: Counting objects: 65% (5629/8660) remote: Counting objects: 66% (5716/8660) remote: Counting objects: 67% (5803/8660) remote: Counting objects: 68% (5889/8660) remote: Counting objects: 69% (5976/8660) remote: Counting objects: 70% (6062/8660) remote: Counting objects: 71% (6149/8660) remote: Counting objects: 72% (6236/8660) remote: Counting objects: 73% (6322/8660) remote: Counting objects: 74% (6409/8660) remote: Counting objects: 75% (6495/8660) remote: Counting objects: 76% (6582/8660) remote: Counting objects: 77% (6669/8660) remote: Counting objects: 78% (6755/8660) remote: Counting objects: 79% (6842/8660) remote: Counting objects: 80% (6928/8660) remote: Counting objects: 81% (7015/8660) remote: Counting objects: 82% (7102/8660) remote: Counting objects: 83% (7188/8660) remote: Counting objects: 84% (7275/8660) remote: Counting objects: 85% (7361/8660) remote: Counting objects: 86% (7448/8660) remote: Counting objects: 87% (7535/8660) remote: Counting objects: 88% (7621/8660) remote: Counting objects: 89% (7708/8660) remote: Counting objects: 90% (7794/8660) remote: Counting objects: 91% (7881/8660) remote: Counting objects: 92% (7968/8660) remote: Counting objects: 93% (8054/8660) remote: Counting objects: 94% (8141/8660) remote: Counting objects: 95% (8227/8660) remote: Counting objects: 96% (8314/8660) remote: Counting objects: 97% (8401/8660) remote: Counting objects: 98% (8487/8660) remote: Counting objects: 99% (8574/8660) remote: Counting objects: 100% (8660/8660) remote: Counting objects: 100% (8660/8660), done.
  5. 2.83 s remote: Compressing objects: 0% (1/1779) remote: Compressing objects: 1% (18/1779) remote: Compressing objects: 2% (36/1779) remote: Compressing objects: 3% (54/1779) remote: Compressing objects: 4% (72/1779) remote: Compressing objects: 5% (89/1779) remote: Compressing objects: 6% (107/1779) remote: Compressing objects: 7% (125/1779) remote: Compressing objects: 8% (143/1779) remote: Compressing objects: 9% (161/1779) remote: Compressing objects: 10% (178/1779) remote: Compressing objects: 10% (191/1779) remote: Compressing objects: 11% (196/1779) remote: Compressing objects: 12% (214/1779) remote: Compressing objects: 13% (232/1779) remote: Compressing objects: 14% (250/1779) remote: Compressing objects: 15% (267/1779) remote: Compressing objects: 16% (285/1779) remote: Compressing objects: 17% (303/1779) remote: Compressing objects: 18% (321/1779) remote: Compressing objects: 19% (339/1779) remote: Compressing objects: 20% (356/1779) remote: Compressing objects: 21% (374/1779) remote: Compressing objects: 22% (392/1779) remote: Compressing objects: 23% (410/1779) remote: Compressing objects: 24% (427/1779) remote: Compressing objects: 25% (445/1779) remote: Compressing objects: 26% (463/1779) remote: Compressing objects: 27% (481/1779) remote: Compressing objects: 28% (499/1779) remote: Compressing objects: 29% (516/1779) remote: Compressing objects: 30% (534/1779) remote: Compressing objects: 31% (552/1779) remote: Compressing objects: 32% (570/1779) remote: Compressing objects: 33% (588/1779) remote: Compressing objects: 34% (605/1779) remote: Compressing objects: 35% (623/1779) remote: Compressing objects: 36% (641/1779) remote: Compressing objects: 37% (659/1779) remote: Compressing objects: 38% (677/1779) remote: Compressing objects: 39% (694/1779) remote: Compressing objects: 40% (712/1779) remote: Compressing objects: 41% (730/1779) remote: Compressing objects: 42% (748/1779) remote: Compressing objects: 43% (765/1779) remote: Compressing objects: 44% (783/1779) remote: Compressing objects: 45% (801/1779) remote: Compressing objects: 46% (819/1779) remote: Compressing objects: 47% (837/1779) remote: Compressing objects: 48% (854/1779) remote: Compressing objects: 49% (872/1779) remote: Compressing objects: 50% (890/1779) remote: Compressing objects: 51% (908/1779) remote: Compressing objects: 52% (926/1779) remote: Compressing objects: 53% (943/1779) remote: Compressing objects: 54% (961/1779) remote: Compressing objects: 55% (979/1779) remote: Compressing objects: 56% (997/1779) remote: Compressing objects: 57% (1015/1779) remote: Compressing objects: 58% (1032/1779) remote: Compressing objects: 59% (1050/1779) remote: Compressing objects: 60% (1068/1779) remote: Compressing objects: 61% (1086/1779) remote: Compressing objects: 62% (1103/1779) remote: Compressing objects: 63% (1121/1779) remote: Compressing objects: 64% (1139/1779) remote: Compressing objects: 65% (1157/1779) remote: Compressing objects: 66% (1175/1779) remote: Compressing objects: 67% (1192/1779) remote: Compressing objects: 68% (1210/1779) remote: Compressing objects: 69% (1228/1779) remote: Compressing objects: 70% (1246/1779) remote: Compressing objects: 71% (1264/1779) remote: Compressing objects: 72% (1281/1779) remote: Compressing objects: 73% (1299/1779) remote: Compressing objects: 74% (1317/1779) remote: Compressing objects: 75% (1335/1779) remote: Compressing objects: 76% (1353/1779) remote: Compressing objects: 77% (1370/1779) remote: Compressing objects: 78% (1388/1779) remote: Compressing objects: 79% (1406/1779) remote: Compressing objects: 80% (1424/1779) remote: Compressing objects: 81% (1441/1779) remote: Compressing objects: 82% (1459/1779) remote: Compressing objects: 83% (1477/1779) remote: Compressing objects: 84% (1495/1779) remote: Compressing objects: 85% (1513/1779) remote: Compressing objects: 86% (1530/1779) remote: Compressing objects: 87% (1548/1779) remote: Compressing objects: 88% (1566/1779) remote: Compressing objects: 89% (1584/1779) remote: Compressing objects: 90% (1602/1779) remote: Compressing objects: 91% (1619/1779) remote: Compressing objects: 92% (1637/1779) remote: Compressing objects: 93% (1655/1779) remote: Compressing objects: 94% (1673/1779) remote: Compressing objects: 95% (1691/1779) remote: Compressing objects: 96% (1708/1779) remote: Compressing objects: 97% (1726/1779) remote: Compressing objects: 98% (1744/1779) remote: Compressing objects: 99% (1762/1779) remote: Compressing objects: 100% (1779/1779) remote: Compressing objects: 100% (1779/1779), done.
  6. 7.57 s Receiving objects: 0% (1/86206) Receiving objects: 1% (863/86206) Receiving objects: 2% (1725/86206) Receiving objects: 3% (2587/86206) Receiving objects: 4% (3449/86206) Receiving objects: 5% (4311/86206) Receiving objects: 6% (5173/86206) Receiving objects: 7% (6035/86206) Receiving objects: 8% (6897/86206) Receiving objects: 9% (7759/86206), 10.66 MiB | 21.30 MiB/s Receiving objects: 10% (8621/86206), 10.66 MiB | 21.30 MiB/s Receiving objects: 11% (9483/86206), 10.66 MiB | 21.30 MiB/s Receiving objects: 12% (10345/86206), 10.66 MiB | 21.30 MiB/s Receiving objects: 13% (11207/86206), 10.66 MiB | 21.30 MiB/s Receiving objects: 14% (12069/86206), 10.66 MiB | 21.30 MiB/s Receiving objects: 15% (12931/86206), 10.66 MiB | 21.30 MiB/s Receiving objects: 16% (13793/86206), 10.66 MiB | 21.30 MiB/s Receiving objects: 17% (14656/86206), 10.66 MiB | 21.30 MiB/s Receiving objects: 18% (15518/86206), 10.66 MiB | 21.30 MiB/s Receiving objects: 19% (16380/86206), 10.66 MiB | 21.30 MiB/s Receiving objects: 20% (17242/86206), 10.66 MiB | 21.30 MiB/s Receiving objects: 21% (18104/86206), 10.66 MiB | 21.30 MiB/s Receiving objects: 22% (18966/86206), 10.66 MiB | 21.30 MiB/s Receiving objects: 23% (19828/86206), 10.66 MiB | 21.30 MiB/s Receiving objects: 24% (20690/86206), 10.66 MiB | 21.30 MiB/s Receiving objects: 25% (21552/86206), 10.66 MiB | 21.30 MiB/s Receiving objects: 26% (22414/86206), 10.66 MiB | 21.30 MiB/s Receiving objects: 27% (23276/86206), 10.66 MiB | 21.30 MiB/s Receiving objects: 28% (24138/86206), 10.66 MiB | 21.30 MiB/s Receiving objects: 29% (25000/86206), 10.66 MiB | 21.30 MiB/s Receiving objects: 30% (25862/86206), 10.66 MiB | 21.30 MiB/s Receiving objects: 31% (26724/86206), 10.66 MiB | 21.30 MiB/s Receiving objects: 32% (27586/86206), 10.66 MiB | 21.30 MiB/s Receiving objects: 33% (28448/86206), 10.66 MiB | 21.30 MiB/s Receiving objects: 34% (29311/86206), 10.66 MiB | 21.30 MiB/s Receiving objects: 35% (30173/86206), 10.66 MiB | 21.30 MiB/s Receiving objects: 36% (31035/86206), 10.66 MiB | 21.30 MiB/s Receiving objects: 37% (31897/86206), 10.66 MiB | 21.30 MiB/s Receiving objects: 37% (32648/86206), 30.04 MiB | 30.03 MiB/s Receiving objects: 38% (32759/86206), 30.04 MiB | 30.03 MiB/s Receiving objects: 39% (33621/86206), 30.04 MiB | 30.03 MiB/s Receiving objects: 40% (34483/86206), 30.04 MiB | 30.03 MiB/s Receiving objects: 41% (35345/86206), 30.04 MiB | 30.03 MiB/s Receiving objects: 42% (36207/86206), 30.04 MiB | 30.03 MiB/s Receiving objects: 43% (37069/86206), 30.04 MiB | 30.03 MiB/s Receiving objects: 44% (37931/86206), 30.04 MiB | 30.03 MiB/s Receiving objects: 45% (38793/86206), 30.04 MiB | 30.03 MiB/s Receiving objects: 46% (39655/86206), 30.04 MiB | 30.03 MiB/s Receiving objects: 47% (40517/86206), 46.80 MiB | 31.19 MiB/s Receiving objects: 48% (41379/86206), 46.80 MiB | 31.19 MiB/s Receiving objects: 49% (42241/86206), 46.80 MiB | 31.19 MiB/s Receiving objects: 50% (43103/86206), 46.80 MiB | 31.19 MiB/s Receiving objects: 51% (43966/86206), 46.80 MiB | 31.19 MiB/s Receiving objects: 52% (44828/86206), 46.80 MiB | 31.19 MiB/s Receiving objects: 53% (45690/86206), 46.80 MiB | 31.19 MiB/s Receiving objects: 54% (46552/86206), 46.80 MiB | 31.19 MiB/s Receiving objects: 55% (47414/86206), 46.80 MiB | 31.19 MiB/s Receiving objects: 56% (48276/86206), 46.80 MiB | 31.19 MiB/s Receiving objects: 56% (48754/86206), 63.43 MiB | 31.59 MiB/s Receiving objects: 57% (49138/86206), 63.43 MiB | 31.59 MiB/s Receiving objects: 58% (50000/86206), 63.43 MiB | 31.59 MiB/s Receiving objects: 59% (50862/86206), 63.43 MiB | 31.59 MiB/s Receiving objects: 60% (51724/86206), 63.43 MiB | 31.59 MiB/s Receiving objects: 61% (52586/86206), 63.43 MiB | 31.59 MiB/s Receiving objects: 62% (53448/86206), 63.43 MiB | 31.59 MiB/s Receiving objects: 63% (54310/86206), 63.43 MiB | 31.59 MiB/s Receiving objects: 64% (55172/86206), 80.66 MiB | 32.16 MiB/s Receiving objects: 65% (56034/86206), 80.66 MiB | 32.16 MiB/s Receiving objects: 66% (56896/86206), 80.66 MiB | 32.16 MiB/s Receiving objects: 66% (57371/86206), 97.82 MiB | 32.52 MiB/s Receiving objects: 67% (57759/86206), 97.82 MiB | 32.52 MiB/s Receiving objects: 68% (58621/86206), 97.82 MiB | 32.52 MiB/s Receiving objects: 69% (59483/86206), 97.82 MiB | 32.52 MiB/s Receiving objects: 70% (60345/86206), 97.82 MiB | 32.52 MiB/s Receiving objects: 71% (61207/86206), 97.82 MiB | 32.52 MiB/s Receiving objects: 72% (62069/86206), 97.82 MiB | 32.52 MiB/s Receiving objects: 73% (62931/86206), 115.32 MiB | 32.87 MiB/s Receiving objects: 74% (63793/86206), 115.32 MiB | 32.87 MiB/s Receiving objects: 75% (64655/86206), 115.32 MiB | 32.87 MiB/s Receiving objects: 75% (65210/86206), 131.73 MiB | 32.87 MiB/s Receiving objects: 76% (65517/86206), 131.73 MiB | 32.87 MiB/s Receiving objects: 77% (66379/86206), 131.73 MiB | 32.87 MiB/s Receiving objects: 78% (67241/86206), 131.73 MiB | 32.87 MiB/s Receiving objects: 79% (68103/86206), 131.73 MiB | 32.87 MiB/s Receiving objects: 80% (68965/86206), 131.73 MiB | 32.87 MiB/s Receiving objects: 81% (69827/86206), 131.73 MiB | 32.87 MiB/s Receiving objects: 82% (70689/86206), 131.73 MiB | 32.87 MiB/s Receiving objects: 83% (71551/86206), 131.73 MiB | 32.87 MiB/s Receiving objects: 84% (72414/86206), 131.73 MiB | 32.87 MiB/s Receiving objects: 85% (73276/86206), 131.73 MiB | 32.87 MiB/s Receiving objects: 86% (74138/86206), 131.73 MiB | 32.87 MiB/s Receiving objects: 87% (75000/86206), 131.73 MiB | 32.87 MiB/s Receiving objects: 88% (75862/86206), 131.73 MiB | 32.87 MiB/s Receiving objects: 89% (76724/86206), 149.29 MiB | 33.11 MiB/s Receiving objects: 90% (77586/86206), 149.29 MiB | 33.11 MiB/s Receiving objects: 91% (78448/86206), 149.29 MiB | 33.11 MiB/s Receiving objects: 92% (79310/86206), 149.29 MiB | 33.11 MiB/s Receiving objects: 93% (80172/86206), 149.29 MiB | 33.11 MiB/s Receiving objects: 94% (81034/86206), 149.29 MiB | 33.11 MiB/s Receiving objects: 95% (81896/86206), 149.29 MiB | 33.11 MiB/s Receiving objects: 96% (82758/86206), 149.29 MiB | 33.11 MiB/s Receiving objects: 97% (83620/86206), 149.29 MiB | 33.11 MiB/s Receiving objects: 98% (84482/86206), 149.29 MiB | 33.11 MiB/s Receiving objects: 99% (85344/86206), 149.29 MiB | 33.11 MiB/s remote: Total 86206 (delta 7543), reused 6945 (delta 6880), pack-reused 77546 (from 3)
  7. 7.57 s Receiving objects: 100% (86206/86206), 149.29 MiB | 33.11 MiB/s Receiving objects: 100% (86206/86206), 156.19 MiB | 33.14 MiB/s, done.
  8. 8.53 s Resolving deltas: 0% (0/58528) Resolving deltas: 1% (586/58528) Resolving deltas: 2% (1171/58528) Resolving deltas: 3% (1757/58528) Resolving deltas: 4% (2342/58528) Resolving deltas: 5% (2931/58528) Resolving deltas: 6% (3514/58528) Resolving deltas: 7% (4097/58528) Resolving deltas: 8% (4683/58528) Resolving deltas: 9% (5271/58528) Resolving deltas: 10% (5853/58528) Resolving deltas: 11% (6441/58528) Resolving deltas: 12% (7024/58528) Resolving deltas: 13% (7609/58528) Resolving deltas: 14% (8194/58528) Resolving deltas: 15% (8780/58528) Resolving deltas: 16% (9365/58528) Resolving deltas: 17% (9950/58528) Resolving deltas: 18% (10537/58528) Resolving deltas: 19% (11121/58528) Resolving deltas: 20% (11706/58528) Resolving deltas: 21% (12291/58528) Resolving deltas: 22% (12877/58528) Resolving deltas: 23% (13463/58528) Resolving deltas: 24% (14047/58528) Resolving deltas: 25% (14633/58528) Resolving deltas: 26% (15218/58528) Resolving deltas: 27% (15803/58528) Resolving deltas: 28% (16388/58528) Resolving deltas: 29% (16974/58528) Resolving deltas: 30% (17560/58528) Resolving deltas: 31% (18144/58528) Resolving deltas: 32% (18729/58528) Resolving deltas: 33% (19316/58528) Resolving deltas: 34% (19900/58528) Resolving deltas: 35% (20485/58528) Resolving deltas: 36% (21073/58528) Resolving deltas: 37% (21656/58528) Resolving deltas: 38% (22241/58528) Resolving deltas: 39% (22826/58528) Resolving deltas: 40% (23412/58528) Resolving deltas: 41% (23997/58528) Resolving deltas: 42% (24583/58528) Resolving deltas: 43% (25169/58528) Resolving deltas: 44% (25753/58528) Resolving deltas: 45% (26338/58528) Resolving deltas: 46% (26924/58528) Resolving deltas: 47% (27509/58528) Resolving deltas: 48% (28095/58528) Resolving deltas: 49% (28679/58528) Resolving deltas: 50% (29264/58528) Resolving deltas: 51% (29850/58528) Resolving deltas: 52% (30435/58528) Resolving deltas: 53% (31020/58528) Resolving deltas: 54% (31606/58528) Resolving deltas: 55% (32191/58528) Resolving deltas: 56% (32776/58528) Resolving deltas: 57% (33361/58528) Resolving deltas: 58% (33948/58528) Resolving deltas: 59% (34535/58528) Resolving deltas: 60% (35117/58528) Resolving deltas: 61% (35703/58528) Resolving deltas: 62% (36289/58528) Resolving deltas: 63% (36873/58528) Resolving deltas: 64% (37458/58528) Resolving deltas: 65% (38044/58528) Resolving deltas: 66% (38629/58528) Resolving deltas: 67% (39214/58528) Resolving deltas: 68% (39800/58528) Resolving deltas: 69% (40385/58528) Resolving deltas: 70% (40970/58528) Resolving deltas: 71% (41555/58528) Resolving deltas: 72% (42141/58528) Resolving deltas: 73% (42729/58528) Resolving deltas: 74% (43312/58528) Resolving deltas: 75% (43896/58528) Resolving deltas: 76% (44482/58528) Resolving deltas: 77% (45068/58528) Resolving deltas: 78% (45652/58528) Resolving deltas: 79% (46238/58528) Resolving deltas: 80% (46823/58528) Resolving deltas: 81% (47408/58528) Resolving deltas: 82% (47994/58528) Resolving deltas: 83% (48580/58528) Resolving deltas: 84% (49164/58528) Resolving deltas: 85% (49749/58528) Resolving deltas: 86% (50335/58528) Resolving deltas: 87% (50920/58528) Resolving deltas: 88% (51505/58528) Resolving deltas: 89% (52090/58528) Resolving deltas: 90% (52676/58528) Resolving deltas: 91% (53261/58528) Resolving deltas: 92% (53847/58528) Resolving deltas: 93% (54434/58528) Resolving deltas: 94% (55019/58528) Resolving deltas: 95% (55602/58528) Resolving deltas: 96% (56187/58528) Resolving deltas: 97% (56773/58528) Resolving deltas: 98% (57358/58528) Resolving deltas: 99% (57944/58528) Resolving deltas: 100% (58528/58528) Resolving deltas: 100% (58528/58528), done.
  9. 8.96 s Fetching commit 433612c2c94b3cb8af96df35d262f890e6b33813 for faster_uv_from_4d ...
  10. 8.96 s $ /nix/store/bcnisk3ydfgv26v2gw3zlky24g00yww2-git-2.54.0/bin/git fetch origin 433612c2c94b3cb8af96df35d262f890e6b33813
  11. 9.44 s From https://github.com/alphal00p/gammaloop
  12. 9.44 s * branch 433612c2c94b3cb8af96df35d262f890e6b33813 -> FETCH_HEAD
  13. 9.46 s $ /nix/store/9ypz3flqsrl5xl495mm8h645gadjsxi1-coreutils-9.11/bin/timeout --kill-after=15s 7200s /nix/store/bcnisk3ydfgv26v2gw3zlky24g00yww2-git-2.54.0/bin/git -c advice.detachedHead=false checkout 433612c2c94b3cb8af96df35d262f890e6b33813
  14. 9.79 s HEAD is now at 433612c2c record GL00 acceptance and GL262 evaluator failure
  15. 9.80 s $ /nix/store/9ypz3flqsrl5xl495mm8h645gadjsxi1-coreutils-9.11/bin/timeout --kill-after=15s 7200s /nix/store/23zk8sgzamrbmj1fday15szf7f2279s8-nix-2.34.7/bin/nix --extra-experimental-features nix-command --extra-experimental-features flakes --log-format internal-json run .#packages.x86_64-linux.nix-ci-check-gammaloop-nextest-core --print-build-logs
  16. 16.26 s
  17. 16.43 s Downloading cached gammaloop-nextest-binaries-core-gammaloop-tracing-filter from https://cache.nix-ci.com
  18. 16.43 s Downloading cached gammaloop-nextest-binaries-core-gammaloop-api from https://cache.nix-ci.com
  19. 16.43 s Downloading cached gammaloop-nextest-binaries-core-gammalooprs from https://cache.nix-ci.com
  20. 16.83 s Downloaded cached gammaloop-nextest-binaries-core-gammaloop-tracing-filter (8.1 MiB) in 405ms
  21. 16.84 s Progress: 0 of 1 built, 1 of 5 downloaded from cache (2 downloading)
  22. 18.81 s Downloaded cached gammaloop-nextest-binaries-core-gammalooprs (88.4 MiB) in 2.3s
  23. 18.81 s Progress: 0 of 1 built, 2 of 5 downloaded from cache (1 downloading)
  24. 19.52 s Downloaded cached gammaloop-nextest-binaries-core-gammaloop-api (120.8 MiB) in 3.0s
  25. 19.52 s Progress: 0 of 1 built, 3 of 5 downloaded from cache
  26. 19.52 s Downloading cached gammaloop-nextest-binaries-core from https://cache.nix-ci.com
  27. 19.57 s Downloaded cached gammaloop-nextest-binaries-core (2032 B) in 47ms
  28. 19.57 s Progress: 0 of 1 built, 4 of 5 downloaded from cache
  29. 19.58 s Downloading cached nix-ci-check-gammaloop-nextest-core from https://cache.nix-ci.com
  30. 19.63 s Downloaded cached nix-ci-check-gammaloop-nextest-core (1016 B) in 53ms
  31. 19.63 s Progress: 0 of 1 built, 5 of 5 downloaded from cache
  32. 25.68 s evaluating derivation 'g copying '/nix/store/rcwk evaluating derivation 'g copying '/nix/store/rcwk evaluating derivation 'g copying '/nix/store/rcwk evaluating derivation 'g copying '/nix/store/rcwk evaluating derivation 'g copying '/nix/store/rcwk evaluating derivation 'g querying gammaloop-nexte [0.0 KiB DL] querying in [0/1 built, 0.0 KiB DL] [1/0/1 built, 0.0 KiB DLgammaloop-nextest-core> Extracting 4 binaries (including 1 non-test binary), 1 build script output directory, and 2 linked paths to /build/nextest-archive-wQHDPn
  33. 26.39 s gammaloop-nextest-core> Extracted 20 files to /build/nextest-archive-wQHDPn in 0.71s
  34. 26.40 s gammaloop-nextest-core> ------------
  35. 26.40 s gammaloop-nextest-core> Nextest run ID 6503c353-af5f-4e9d-9ffa-47d9f72097f1 with nextest profile: ci_gammaloop
  36. 26.40 s gammaloop-nextest-core> Starting 379 tests across 3 binaries
  37. 27.75 s gammaloop-nextest-core> ------------
  38. 27.75 s gammaloop-nextest-core> Summary [ 1.348s] 379 tests run: 379 passed, 0 skipped
  39. 27.90 s gammaloop-nextest-core>
  40. 27.90 s gammaloop-nextest-core> ========== nextest test summary ==========
  41. 27.90 s gammaloop-nextest-core> report: target/nextest/ci_gammaloop/junit.xml
  42. 27.90 s gammaloop-nextest-core> tests: 379, failures: 0, errors: 0
  43. 27.90 s gammaloop-nextest-core> No failing testcases found.
  44. 27.90 s gammaloop-nextest-core> =========================================
  45. 27.91 s gammaloop-nextest-core> Extracting 1 binary and 1 linked path to /build/nextest-archive-mvApRu
  46. 27.98 s gammaloop-nextest-core> Extracted 7 files to /build/nextest-archive-mvApRu in 0.06s
  47. 27.99 s gammaloop-nextest-core> ------------
  48. 27.99 s gammaloop-nextest-core> Nextest run ID ce555873-67be-4610-a7b7-7e3cd91393cc with nextest profile: ci_gammaloop
  49. 27.99 s gammaloop-nextest-core> Starting 19 tests across 1 binary
  50. 28.00 s gammaloop-nextest-core> ------------
  51. 28.00 s gammaloop-nextest-core> Summary [ 0.012s] 19 tests run: 19 passed, 0 skipped
  52. 28.04 s gammaloop-nextest-core>
  53. 28.04 s gammaloop-nextest-core> ========== nextest test summary ==========
  54. 28.04 s gammaloop-nextest-core> report: target/nextest/ci_gammaloop/junit.xml
  55. 28.04 s gammaloop-nextest-core> tests: 19, failures: 0, errors: 0
  56. 28.04 s gammaloop-nextest-core> No failing testcases found.
  57. 28.04 s gammaloop-nextest-core> =========================================
  58. 28.06 s gammaloop-nextest-core> Extracting 1 binary to /build/nextest-archive-X3Wx12
  59. 28.09 s gammaloop-nextest-core> Extracted 4 files to /build/nextest-archive-X3Wx12 in 0.03s
  60. 28.10 s gammaloop-nextest-core> ------------
  61. 28.10 s gammaloop-nextest-core> Nextest run ID 101a19e2-3962-4ba1-98ca-e73f2e2d86ea with nextest profile: ci_gammaloop
  62. 28.10 s gammaloop-nextest-core> Starting 0 tests across 1 binary
  63. 28.10 s gammaloop-nextest-core> ------------
  64. 28.10 s gammaloop-nextest-core> Summary [ 0.000s] 0 tests run: 0 passed, 0 skipped
  65. 28.12 s gammaloop-nextest-core>
  66. 28.13 s gammaloop-nextest-core> ========== nextest test summary ==========
  67. 28.13 s gammaloop-nextest-core> report: target/nextest/ci_gammaloop/junit.xml
  68. 28.13 s gammaloop-nextest-core> tests: 0, failures: 0, errors: 0
  69. 28.13 s gammaloop-nextest-core> No failing testcases found.
  70. 28.13 s gammaloop-nextest-core> =========================================
  71. 28.14 s gammaloop-nextest-core> Extracting 4 binaries, 1 build script output directory, and 2 linked paths to /build/nextest-archive-kvpvvd
  72. 28.62 s gammaloop-nextest-core> Extracted 18 files to /build/nextest-archive-kvpvvd in 0.48s
  73. 28.64 s gammaloop-nextest-core> ------------
  74. 28.64 s gammaloop-nextest-core> Nextest run ID 541ba704-2349-4f88-bdee-0829b1d092f3 with nextest profile: ci_gammaloop
  75. 28.64 s gammaloop-nextest-core> Starting 706 tests across 4 binaries (60 tests skipped, including 59 tests via profile.ci_gammaloop.default-filter)
  76. 35.82 s gammaloop-nextest-core> FAIL [ 3.082s] (701/706) gammalooprs::test_renormalization finite_part_ghost_2loop
  77. 35.82 s gammaloop-nextest-core> stdout ---
  78. 35.82 s gammaloop-nextest-core>
  79. 35.82 s gammaloop-nextest-core> running 1 test
  80. 35.82 s gammaloop-nextest-core> test finite_part_ghost_2loop ... FAILED
  81. 35.82 s gammaloop-nextest-core>
  82. 35.82 s gammaloop-nextest-core> failures:
  83. 35.82 s gammaloop-nextest-core>
  84. 35.82 s gammaloop-nextest-core> failures:
  85. 35.82 s gammaloop-nextest-core> finite_part_ghost_2loop
  86. 35.82 s gammaloop-nextest-core>
  87. 35.82 s gammaloop-nextest-core> test result: FAILED. 0 passed; 1 failed; 0 ignored; 0 measured; 6 filtered out; finished in 3.07s
  88. 35.82 s gammaloop-nextest-core>
  89. 35.82 s gammaloop-nextest-core> stderr ---
  90. 35.82 s gammaloop-nextest-core> The application panicked (crashed).
  91. 35.82 s gammaloop-nextest-core> Message: assertion failed: (align_to_rqft(&a, &model) - expected).expand().is_zero()
  92. 35.82 s gammaloop-nextest-core> Location: crates/gammalooprs/tests/test_renormalization.rs:583
  93. 35.82 s gammaloop-nextest-core>
  94. 35.82 s gammaloop-nextest-core> ━━━━━━━━━━━━━━━━━━━━━━━━━━━━━━━━━━ BACKTRACE ━━━━━━━━━━━━━━━━━━━━━━━━━━━━━━━━━━━
  95. 35.82 s gammaloop-nextest-core> 1: <color_eyre[51793ea62743adbd]::config::PanicHook>::panic_report<unknown>
  96. 35.82 s gammaloop-nextest-core> at <unknown source file>:<unknown line>
  97. 35.82 s gammaloop-nextest-core> 2: <color_eyre[51793ea62743adbd]::config::PanicHook>::into_panic_hook::{closure#0}<unknown>
  98. 35.82 s gammaloop-nextest-core> at <unknown source file>:<unknown line>
  99. 35.82 s gammaloop-nextest-core> 3: std[bcb96dfbba0ab899]::panicking::panic_with_hook<unknown>
  100. 35.82 s gammaloop-nextest-core> at <unknown source file>:<unknown line>
  101. 35.82 s gammaloop-nextest-core> 4: std[bcb96dfbba0ab899]::panicking::panic_handler::{closure#0}<unknown>
  102. 35.82 s gammaloop-nextest-core> at <unknown source file>:<unknown line>
  103. 35.82 s gammaloop-nextest-core> 5: std[bcb96dfbba0ab899]::sys::backtrace::__rust_end_short_backtrace::<std[bcb96dfbba0ab899]::panicking::panic_handler::{closure#0}, !><unknown>
  104. 35.82 s gammaloop-nextest-core> at <unknown source file>:<unknown line>
  105. 35.82 s gammaloop-nextest-core> 6: __rustc[6c289b9f9c454d21]::rust_begin_unwind<unknown>
  106. 35.82 s gammaloop-nextest-core> at <unknown source file>:<unknown line>
  107. 35.82 s gammaloop-nextest-core> 7: core[940e698046960fd5]::panicking::panic_fmt<unknown>
  108. 35.82 s gammaloop-nextest-core> at <unknown source file>:<unknown line>
  109. 35.82 s gammaloop-nextest-core> 8: core[940e698046960fd5]::panicking::panic<unknown>
  110. 35.82 s gammaloop-nextest-core> at <unknown source file>:<unknown line>
  111. 35.82 s gammaloop-nextest-core> 9: <test_renormalization[5812939ef1a04d89]::finite_part_ghost_2loop::{closure#0} as core[940e698046960fd5]::ops::function::FnOnce<()>>::call_once<unknown>
  112. 35.82 s gammaloop-nextest-core> at <unknown source file>:<unknown line>
  113. 35.82 s gammaloop-nextest-core> 10: test[75d6903177b1d7e9]::__rust_begin_short_backtrace::<core[940e698046960fd5]::result::Result<(), alloc[2ea6bcb46fca0c42]::string::String>, fn() -> core[940e698046960fd5]::result::Result<(), alloc[2ea6bcb46fca0c42]::string::String>><unknown>
  114. 35.82 s gammaloop-nextest-core> at <unknown source file>:<unknown line>
  115. 35.82 s gammaloop-nextest-core> 11: test[75d6903177b1d7e9]::run_test::{closure#0}<unknown>
  116. 35.82 s gammaloop-nextest-core> at <unknown source file>:<unknown line>
  117. 35.82 s gammaloop-nextest-core> 12: std[bcb96dfbba0ab899]::sys::backtrace::__rust_begin_short_backtrace::<test[75d6903177b1d7e9]::run_test::{closure#1}, ()><unknown>
  118. 35.82 s gammaloop-nextest-core> at <unknown source file>:<unknown line>
  119. 35.82 s gammaloop-nextest-core> 13: <std[bcb96dfbba0ab899]::thread::lifecycle::spawn_unchecked<test[75d6903177b1d7e9]::run_test::{closure#1}, ()>::{closure#1} as core[940e698046960fd5]::ops::function::FnOnce<()>>::call_once::{shim:vtable#0}<unknown>
  120. 35.82 s gammaloop-nextest-core> at <unknown source file>:<unknown line>
  121. 35.82 s gammaloop-nextest-core> 14: <std[bcb96dfbba0ab899]::sys::thread::unix::Thread>::new::thread_start<unknown>
  122. 35.82 s gammaloop-nextest-core> at <unknown source file>:<unknown line>
  123. 35.82 s gammaloop-nextest-core> 15: start_thread<unknown>
  124. 35.82 s gammaloop-nextest-core> at <unknown source file>:<unknown line>
  125. 35.82 s gammaloop-nextest-core> 16: __clone3<unknown>
  126. 35.82 s gammaloop-nextest-core> at <unknown source file>:<unknown line>
  127. 35.82 s gammaloop-nextest-core>
  128. 35.82 s gammaloop-nextest-core> Run with COLORBT_SHOW_HIDDEN=1 environment variable to disable frame filtering.
  129. 35.82 s gammaloop-nextest-core> Run with RUST_BACKTRACE=full to include source snippets.
  130. 35.82 s gammaloop-nextest-core>
  131. 40.21 s gammaloop-nextest-core> ------------
  132. 40.21 s gammaloop-nextest-core> Summary [ 11.576s] 706 tests run: 705 passed, 1 failed, 60 skipped
  133. 40.21 s gammaloop-nextest-core> FAIL [ 3.082s] (701/706) gammalooprs::test_renormalization finite_part_ghost_2loop
  134. 40.21 s gammaloop-nextest-core> stdout ---
  135. 40.21 s gammaloop-nextest-core>
  136. 40.21 s gammaloop-nextest-core> running 1 test
  137. 40.21 s gammaloop-nextest-core> test finite_part_ghost_2loop ... FAILED
  138. 40.21 s gammaloop-nextest-core>
  139. 40.21 s gammaloop-nextest-core> failures:
  140. 40.21 s gammaloop-nextest-core>
  141. 40.21 s gammaloop-nextest-core> failures:
  142. 40.21 s gammaloop-nextest-core> finite_part_ghost_2loop
  143. 40.21 s gammaloop-nextest-core>
  144. 40.21 s gammaloop-nextest-core> test result: FAILED. 0 passed; 1 failed; 0 ignored; 0 measured; 6 filtered out; finished in 3.07s
  145. 40.21 s gammaloop-nextest-core>
  146. 40.21 s gammaloop-nextest-core> stderr ---
  147. 40.21 s gammaloop-nextest-core> The application panicked (crashed).
  148. 40.21 s gammaloop-nextest-core> Message: assertion failed: (align_to_rqft(&a, &model) - expected).expand().is_zero()
  149. 40.21 s gammaloop-nextest-core> Location: crates/gammalooprs/tests/test_renormalization.rs:583
  150. 40.21 s gammaloop-nextest-core>
  151. 40.21 s gammaloop-nextest-core> ━━━━━━━━━━━━━━━━━━━━━━━━━━━━━━━━━━ BACKTRACE ━━━━━━━━━━━━━━━━━━━━━━━━━━━━━━━━━━━
  152. 40.21 s gammaloop-nextest-core> 1: <color_eyre[51793ea62743adbd]::config::PanicHook>::panic_report<unknown>
  153. 40.21 s gammaloop-nextest-core> at <unknown source file>:<unknown line>
  154. 40.21 s gammaloop-nextest-core> 2: <color_eyre[51793ea62743adbd]::config::PanicHook>::into_panic_hook::{closure#0}<unknown>
  155. 40.21 s gammaloop-nextest-core> at <unknown source file>:<unknown line>
  156. 40.21 s gammaloop-nextest-core> 3: std[bcb96dfbba0ab899]::panicking::panic_with_hook<unknown>
  157. 40.21 s gammaloop-nextest-core> at <unknown source file>:<unknown line>
  158. 40.21 s gammaloop-nextest-core> 4: std[bcb96dfbba0ab899]::panicking::panic_handler::{closure#0}<unknown>
  159. 40.21 s gammaloop-nextest-core> at <unknown source file>:<unknown line>
  160. 40.21 s gammaloop-nextest-core> 5: std[bcb96dfbba0ab899]::sys::backtrace::__rust_end_short_backtrace::<std[bcb96dfbba0ab899]::panicking::panic_handler::{closure#0}, !><unknown>
  161. 40.21 s gammaloop-nextest-core> at <unknown source file>:<unknown line>
  162. 40.21 s gammaloop-nextest-core> 6: __rustc[6c289b9f9c454d21]::rust_begin_unwind<unknown>
  163. 40.21 s gammaloop-nextest-core> at <unknown source file>:<unknown line>
  164. 40.21 s gammaloop-nextest-core> 7: core[940e698046960fd5]::panicking::panic_fmt<unknown>
  165. 40.21 s gammaloop-nextest-core> at <unknown source file>:<unknown line>
  166. 40.21 s gammaloop-nextest-core> 8: core[940e698046960fd5]::panicking::panic<unknown>
  167. 40.21 s gammaloop-nextest-core> at <unknown source file>:<unknown line>
  168. 40.21 s gammaloop-nextest-core> 9: <test_renormalization[5812939ef1a04d89]::finite_part_ghost_2loop::{closure#0} as core[940e698046960fd5]::ops::function::FnOnce<()>>::call_once<unknown>
  169. 40.21 s gammaloop-nextest-core> at <unknown source file>:<unknown line>
  170. 40.21 s gammaloop-nextest-core> 10: test[75d6903177b1d7e9]::__rust_begin_short_backtrace::<core[940e698046960fd5]::result::Result<(), alloc[2ea6bcb46fca0c42]::string::String>, fn() -> core[940e698046960fd5]::result::Result<(), alloc[2ea6bcb46fca0c42]::string::String>><unknown>
  171. 40.21 s gammaloop-nextest-core> at <unknown source file>:<unknown line>
  172. 40.21 s gammaloop-nextest-core> 11: test[75d6903177b1d7e9]::run_test::{closure#0}<unknown>
  173. 40.21 s gammaloop-nextest-core> at <unknown source file>:<unknown line>
  174. 40.21 s gammaloop-nextest-core> 12: std[bcb96dfbba0ab899]::sys::backtrace::__rust_begin_short_backtrace::<test[75d6903177b1d7e9]::run_test::{closure#1}, ()><unknown>
  175. 40.21 s gammaloop-nextest-core> at <unknown source file>:<unknown line>
  176. 40.21 s gammaloop-nextest-core> 13: <std[bcb96dfbba0ab899]::thread::lifecycle::spawn_unchecked<test[75d6903177b1d7e9]::run_test::{closure#1}, ()>::{closure#1} as core[940e698046960fd5]::ops::function::FnOnce<()>>::call_once::{shim:vtable#0}<unknown>
  177. 40.21 s gammaloop-nextest-core> at <unknown source file>:<unknown line>
  178. 40.21 s gammaloop-nextest-core> 14: <std[bcb96dfbba0ab899]::sys::thread::unix::Thread>::new::thread_start<unknown>
  179. 40.21 s gammaloop-nextest-core> at <unknown source file>:<unknown line>
  180. 40.21 s gammaloop-nextest-core> 15: start_thread<unknown>
  181. 40.21 s gammaloop-nextest-core> at <unknown source file>:<unknown line>
  182. 40.21 s gammaloop-nextest-core> 16: __clone3<unknown>
  183. 40.21 s gammaloop-nextest-core> at <unknown source file>:<unknown line>
  184. 40.21 s gammaloop-nextest-core>
  185. 40.21 s gammaloop-nextest-core> Run with COLORBT_SHOW_HIDDEN=1 environment variable to disable frame filtering.
  186. 40.21 s gammaloop-nextest-core> Run with RUST_BACKTRACE=full to include source snippets.
  187. 40.21 s gammaloop-nextest-core>
  188. 40.29 s gammaloop-nextest-core> error: test run failed
  189. 40.32 s gammaloop-nextest-core>
  190. 40.32 s gammaloop-nextest-core> ========== nextest test summary ==========
  191. 40.32 s gammaloop-nextest-core> report: target/nextest/ci_gammaloop/junit.xml
  192. 40.32 s gammaloop-nextest-core> tests: 706, failures: 1, errors: 0
  193. 40.32 s gammaloop-nextest-core>
  194. 40.32 s gammaloop-nextest-core> 1. gammalooprs::test_renormalization::finite_part_ghost_2loop
  195. 40.32 s gammaloop-nextest-core> failure: test failure with exit code 101
  196. 40.32 s gammaloop-nextest-core> system-out
  197. 40.32 s gammaloop-nextest-core> running 1 test
  198. 40.32 s gammaloop-nextest-core> test finite_part_ghost_2loop ... FAILED
  199. 40.32 s gammaloop-nextest-core>
  200. 40.32 s gammaloop-nextest-core> failures:
  201. 40.32 s gammaloop-nextest-core>
  202. 40.32 s gammaloop-nextest-core> failures:
  203. 40.32 s gammaloop-nextest-core> finite_part_ghost_2loop
  204. 40.32 s gammaloop-nextest-core>
  205. 40.32 s gammaloop-nextest-core> test result: FAILED. 0 passed; 1 failed; 0 ignored; 0 measured; 6 filtered out; finished in 3.07s
  206. 40.32 s gammaloop-nextest-core> system-err
  207. 40.32 s gammaloop-nextest-core> The application panicked (crashed).
  208. 40.32 s gammaloop-nextest-core> Message: assertion failed: (align_to_rqft(&a, &model) - expected).expand().is_zero()
  209. 40.32 s gammaloop-nextest-core> Location: crates/gammalooprs/tests/test_renormalization.rs:583
  210. 40.32 s gammaloop-nextest-core>
  211. 40.32 s gammaloop-nextest-core> ━━━━━━━━━━━━━━━━━━━━━━━━━━━━━━━━━━ BACKTRACE ━━━━━━━━━━━━━━━━━━━━━━━━━━━━━━━━━━━
  212. 40.32 s gammaloop-nextest-core> 1: <color_eyre[51793ea62743adbd]::config::PanicHook>::panic_report<unknown>
  213. 40.32 s gammaloop-nextest-core> at <unknown source file>:<unknown line>
  214. 40.32 s gammaloop-nextest-core> 2: <color_eyre[51793ea62743adbd]::config::PanicHook>::into_panic_hook::{closure#0}<unknown>
  215. 40.32 s gammaloop-nextest-core> at <unknown source file>:<unknown line>
  216. 40.32 s gammaloop-nextest-core> 3: std[bcb96dfbba0ab899]::panicking::panic_with_hook<unknown>
  217. 40.32 s gammaloop-nextest-core> at <unknown source file>:<unknown line>
  218. 40.32 s gammaloop-nextest-core> 4: std[bcb96dfbba0ab899]::panicking::panic_handler::{closure#0}<unknown>
  219. 40.32 s gammaloop-nextest-core> at <unknown source file>:<unknown line>
  220. 40.32 s gammaloop-nextest-core> 5: std[bcb96dfbba0ab899]::sys::backtrace::__rust_end_short_backtrace::<std[bcb96dfbba0ab899]::panicking::panic_handler::{closure#0}, !><unknown>
  221. 40.32 s gammaloop-nextest-core> at <unknown source file>:<unknown line>
  222. 40.32 s gammaloop-nextest-core> 6: __rustc[6c289b9f9c454d21]::rust_begin_unwind<unknown>
  223. 40.32 s gammaloop-nextest-core> at <unknown source file>:<unknown line>
  224. 40.32 s gammaloop-nextest-core> 7: core[940e698046960fd5]::panicking::panic_fmt<unknown>
  225. 40.32 s gammaloop-nextest-core> at <unknown source file>:<unknown line>
  226. 40.32 s gammaloop-nextest-core> 8: core[940e698046960fd5]::panicking::panic<unknown>
  227. 40.32 s gammaloop-nextest-core> at <unknown source file>:<unknown line>
  228. 40.32 s gammaloop-nextest-core> 9: <test_renormalization[5812939ef1a04d89]::finite_part_ghost_2loop::{closure#0} as core[940e698046960fd5]::ops::function::FnOnce<()>>::call_once<unknown>
  229. 40.32 s gammaloop-nextest-core> at <unknown source file>:<unknown line>
  230. 40.32 s gammaloop-nextest-core> 10: test[75d6903177b1d7e9]::__rust_begin_short_backtrace::<core[940e698046960fd5]::result::Result<(), alloc[2ea6bcb46fca0c42]::string::String>, fn() -> core[940e698046960fd5]::result::Result<(), alloc[2ea6bcb46fca0c42]::string::String>><unknown>
  231. 40.32 s gammaloop-nextest-core> at <unknown source file>:<unknown line>
  232. 40.32 s gammaloop-nextest-core> 11: test[75d6903177b1d7e9]::run_test::{closure#0}<unknown>
  233. 40.32 s gammaloop-nextest-core> at <unknown source file>:<unknown line>
  234. 40.32 s gammaloop-nextest-core> 12: std[bcb96dfbba0ab899]::sys::backtrace::__rust_begin_short_backtrace::<test[75d6903177b1d7e9]::run_test::{closure#1}, ()><unknown>
  235. 40.32 s gammaloop-nextest-core> at <unknown source file>:<unknown line>
  236. 40.32 s gammaloop-nextest-core> 13: <std[bcb96dfbba0ab899]::thread::lifecycle::spawn_unchecked<test[75d6903177b1d7e9]::run_test::{closure#1}, ()>::{closure#1} as core[940e698046960fd5]::ops::function::FnOnce<()>>::call_once::{shim:vtable#0}<unknown>
  237. 40.32 s gammaloop-nextest-core> at <unknown source file>:<unknown line>
  238. 40.32 s gammaloop-nextest-core> 14: <std[bcb96dfbba0ab899]::sys::thread::unix::Thread>::new::thread_start<unknown>
  239. 40.32 s gammaloop-nextest-core> at <unknown source file>:<unknown line>
  240. 40.32 s gammaloop-nextest-core> 15: start_thread<unknown>
  241. 40.32 s gammaloop-nextest-core> at <unknown source file>:<unknown line>
  242. 40.32 s gammaloop-nextest-core> 16: __clone3<unknown>
  243. 40.32 s gammaloop-nextest-core> at <unknown source file>:<unknown line>
  244. 40.32 s gammaloop-nextest-core>
  245. 40.32 s gammaloop-nextest-core> Run with COLORBT_SHOW_HIDDEN=1 environment variable to disable frame filtering.
  246. 40.32 s gammaloop-nextest-core> Run with RUST_BACKTRACE=full to include source snippets.
  247. 40.32 s gammaloop-nextest-core> =========================================
  248. 40.33 s gammaloop-nextest-core> Extracting 1 binary, 1 build script output directory, and 1 linked path to /build/nextest-archive-pAFac6
  249. 40.40 s gammaloop-nextest-core> Extracted 7 files to /build/nextest-archive-pAFac6 in 0.07s
  250. 40.41 s gammaloop-nextest-core> ------------
  251. 40.41 s gammaloop-nextest-core> Nextest run ID abdc6ef1-d01a-4a7e-8c5e-3aff4b73c04b with nextest profile: ci_gammaloop
  252. 40.41 s gammaloop-nextest-core> Starting 105 tests across 1 binary
  253. 56.35 s gammaloop-nextest-core> ------------
  254. 56.35 s gammaloop-nextest-core> Summary [ 15.938s] 105 tests run: 105 passed, 0 skipped
  255. 56.39 s gammaloop-nextest-core>
  256. 56.39 s gammaloop-nextest-core> ========== nextest test summary ==========
  257. 56.39 s gammaloop-nextest-core> report: target/nextest/ci_gammaloop/junit.xml
  258. 56.39 s gammaloop-nextest-core> tests: 105, failures: 0, errors: 0
  259. 56.39 s gammaloop-nextest-core> No failing testcases found.
  260. 56.39 s gammaloop-nextest-core> =========================================
  261. 56.44 s [0 built (1 failed), 0.0error: Cannot build '/nix/store/gfw8irsajvc73r64ijh06rb30gc2744x-gammaloop-nextest-core.drv'.
  262. 56.44 s Reason: builder failed with exit code 100.
  263. 56.44 s Output paths:
  264. 56.44 s /nix/store/p3ayrsjin2c2zsszczl860szaj7271z8-gammaloop-nextest-core
  265. 56.44 s Last 229 log lines:
  266. 56.44 s > Extracting 4 binaries (including 1 non-test binary), 1 build script output directory, and 2 linked paths to /build/nextest-archive-wQHDPn
  267. 56.44 s > Extracted 20 files to /build/nextest-archive-wQHDPn in 0.71s
  268. 56.44 s > ------------
  269. 56.44 s > Nextest run ID 6503c353-af5f-4e9d-9ffa-47d9f72097f1 with nextest profile: ci_gammaloop
  270. 56.44 s > Starting 379 tests across 3 binaries
  271. 56.44 s > ------------
  272. 56.44 s > Summary [ 1.348s] 379 tests run: 379 passed, 0 skipped
  273. 56.44 s >
  274. 56.44 s > ========== nextest test summary ==========
  275. 56.44 s > report: target/nextest/ci_gammaloop/junit.xml
  276. 56.44 s > tests: 379, failures: 0, errors: 0
  277. 56.44 s > No failing testcases found.
  278. 56.44 s > =========================================
  279. 56.44 s > Extracting 1 binary and 1 linked path to /build/nextest-archive-mvApRu
  280. 56.44 s > Extracted 7 files to /build/nextest-archive-mvApRu in 0.06s
  281. 56.44 s > ------------
  282. 56.44 s > Nextest run ID ce555873-67be-4610-a7b7-7e3cd91393cc with nextest profile: ci_gammaloop
  283. 56.44 s > Starting 19 tests across 1 binary
  284. 56.44 s > ------------
  285. 56.44 s > Summary [ 0.012s] 19 tests run: 19 passed, 0 skipped
  286. 56.44 s >
  287. 56.44 s > ========== nextest test summary ==========
  288. 56.44 s > report: target/nextest/ci_gammaloop/junit.xml
  289. 56.44 s > tests: 19, failures: 0, errors: 0
  290. 56.44 s > No failing testcases found.
  291. 56.44 s > =========================================
  292. 56.44 s > Extracting 1 binary to /build/nextest-archive-X3Wx12
  293. 56.44 s > Extracted 4 files to /build/nextest-archive-X3Wx12 in 0.03s
  294. 56.44 s > ------------
  295. 56.44 s > Nextest run ID 101a19e2-3962-4ba1-98ca-e73f2e2d86ea with nextest profile: ci_gammaloop
  296. 56.44 s > Starting 0 tests across 1 binary
  297. 56.44 s > ------------
  298. 56.44 s > Summary [ 0.000s] 0 tests run: 0 passed, 0 skipped
  299. 56.44 s >
  300. 56.44 s > ========== nextest test summary ==========
  301. 56.44 s > report: target/nextest/ci_gammaloop/junit.xml
  302. 56.44 s > tests: 0, failures: 0, errors: 0
  303. 56.44 s > No failing testcases found.
  304. 56.44 s > =========================================
  305. 56.44 s > Extracting 4 binaries, 1 build script output directory, and 2 linked paths to /build/nextest-archive-kvpvvd
  306. 56.44 s > Extracted 18 files to /build/nextest-archive-kvpvvd in 0.48s
  307. 56.44 s > ------------
  308. 56.44 s > Nextest run ID 541ba704-2349-4f88-bdee-0829b1d092f3 with nextest profile: ci_gammaloop
  309. 56.44 s > Starting 706 tests across 4 binaries (60 tests skipped, including 59 tests via profile.ci_gammaloop.default-filter)
  310. 56.44 s > FAIL [ 3.082s] (701/706) gammalooprs::test_renormalization finite_part_ghost_2loop
  311. 56.44 s > stdout ---
  312. 56.44 s >
  313. 56.44 s > running 1 test
  314. 56.44 s > test finite_part_ghost_2loop ... FAILED
  315. 56.44 s >
  316. 56.44 s > failures:
  317. 56.44 s >
  318. 56.44 s > failures:
  319. 56.44 s > finite_part_ghost_2loop
  320. 56.44 s >
  321. 56.44 s > test result: FAILED. 0 passed; 1 failed; 0 ignored; 0 measured; 6 filtered out; finished in 3.07s
  322. 56.44 s >
  323. 56.44 s > stderr ---
  324. 56.44 s > The application panicked (crashed).
  325. 56.44 s > Message: assertion failed: (align_to_rqft(&a, &model) - expected).expand().is_zero()
  326. 56.44 s > Location: crates/gammalooprs/tests/test_renormalization.rs:583
  327. 56.44 s >
  328. 56.44 s > ━━━━━━━━━━━━━━━━━━━━━━━━━━━━━━━━━━ BACKTRACE ━━━━━━━━━━━━━━━━━━━━━━━━━━━━━━━━━━━
  329. 56.44 s > 1: <color_eyre[51793ea62743adbd]::config::PanicHook>::panic_report<unknown>
  330. 56.44 s > at <unknown source file>:<unknown line>
  331. 56.44 s > 2: <color_eyre[51793ea62743adbd]::config::PanicHook>::into_panic_hook::{closure#0}<unknown>
  332. 56.44 s > at <unknown source file>:<unknown line>
  333. 56.44 s > 3: std[bcb96dfbba0ab899]::panicking::panic_with_hook<unknown>
  334. 56.44 s > at <unknown source file>:<unknown line>
  335. 56.44 s > 4: std[bcb96dfbba0ab899]::panicking::panic_handler::{closure#0}<unknown>
  336. 56.44 s > at <unknown source file>:<unknown line>
  337. 56.44 s > 5: std[bcb96dfbba0ab899]::sys::backtrace::__rust_end_short_backtrace::<std[bcb96dfbba0ab899]::panicking::panic_handler::{closure#0}, !><unknown>
  338. 56.44 s > at <unknown source file>:<unknown line>
  339. 56.44 s > 6: __rustc[6c289b9f9c454d21]::rust_begin_unwind<unknown>
  340. 56.44 s > at <unknown source file>:<unknown line>
  341. 56.44 s > 7: core[940e698046960fd5]::panicking::panic_fmt<unknown>
  342. 56.44 s > at <unknown source file>:<unknown line>
  343. 56.44 s > 8: core[940e698046960fd5]::panicking::panic<unknown>
  344. 56.44 s > at <unknown source file>:<unknown line>
  345. 56.44 s > 9: <test_renormalization[5812939ef1a04d89]::finite_part_ghost_2loop::{closure#0} as core[940e698046960fd5]::ops::function::FnOnce<()>>::call_once<unknown>
  346. 56.44 s > at <unknown source file>:<unknown line>
  347. 56.44 s > 10: test[75d6903177b1d7e9]::__rust_begin_short_backtrace::<core[940e698046960fd5]::result::Result<(), alloc[2ea6bcb46fca0c42]::string::String>, fn() -> core[940e698046960fd5]::result::Result<(), alloc[2ea6bcb46fca0c42]::string::String>><unknown>
  348. 56.44 s > at <unknown source file>:<unknown line>
  349. 56.44 s > 11: test[75d6903177b1d7e9]::run_test::{closure#0}<unknown>
  350. 56.44 s > at <unknown source file>:<unknown line>
  351. 56.44 s > 12: std[bcb96dfbba0ab899]::sys::backtrace::__rust_begin_short_backtrace::<test[75d6903177b1d7e9]::run_test::{closure#1}, ()><unknown>
  352. 56.44 s > at <unknown source file>:<unknown line>
  353. 56.44 s > 13: <std[bcb96dfbba0ab899]::thread::lifecycle::spawn_unchecked<test[75d6903177b1d7e9]::run_test::{closure#1}, ()>::{closure#1} as core[940e698046960fd5]::ops::function::FnOnce<()>>::call_once::{shim:vtable#0}<unknown>
  354. 56.44 s > at <unknown source file>:<unknown line>
  355. 56.44 s > 14: <std[bcb96dfbba0ab899]::sys::thread::unix::Thread>::new::thread_start<unknown>
  356. 56.44 s > at <unknown source file>:<unknown line>
  357. 56.44 s > 15: start_thread<unknown>
  358. 56.44 s > at <unknown source file>:<unknown line>
  359. 56.44 s > 16: __clone3<unknown>
  360. 56.44 s > at <unknown source file>:<unknown line>
  361. 56.44 s >
  362. 56.44 s > Run with COLORBT_SHOW_HIDDEN=1 environment variable to disable frame filtering.
  363. 56.44 s > Run with RUST_BACKTRACE=full to include source snippets.
  364. 56.44 s >
  365. 56.44 s > ------------
  366. 56.44 s > Summary [ 11.576s] 706 tests run: 705 passed, 1 failed, 60 skipped
  367. 56.44 s > FAIL [ 3.082s] (701/706) gammalooprs::test_renormalization finite_part_ghost_2loop
  368. 56.44 s > stdout ---
  369. 56.44 s >
  370. 56.44 s > running 1 test
  371. 56.44 s > test finite_part_ghost_2loop ... FAILED
  372. 56.44 s >
  373. 56.44 s > failures:
  374. 56.44 s >
  375. 56.44 s > failures:
  376. 56.44 s > finite_part_ghost_2loop
  377. 56.44 s >
  378. 56.44 s > test result: FAILED. 0 passed; 1 failed; 0 ignored; 0 measured; 6 filtered out; finished in 3.07s
  379. 56.44 s >
  380. 56.44 s > stderr ---
  381. 56.44 s > The application panicked (crashed).
  382. 56.44 s > Message: assertion failed: (align_to_rqft(&a, &model) - expected).expand().is_zero()
  383. 56.44 s > Location: crates/gammalooprs/tests/test_renormalization.rs:583
  384. 56.44 s >
  385. 56.44 s > ━━━━━━━━━━━━━━━━━━━━━━━━━━━━━━━━━━ BACKTRACE ━━━━━━━━━━━━━━━━━━━━━━━━━━━━━━━━━━━
  386. 56.44 s > 1: <color_eyre[51793ea62743adbd]::config::PanicHook>::panic_report<unknown>
  387. 56.44 s > at <unknown source file>:<unknown line>
  388. 56.44 s > 2: <color_eyre[51793ea62743adbd]::config::PanicHook>::into_panic_hook::{closure#0}<unknown>
  389. 56.44 s > at <unknown source file>:<unknown line>
  390. 56.44 s > 3: std[bcb96dfbba0ab899]::panicking::panic_with_hook<unknown>
  391. 56.44 s > at <unknown source file>:<unknown line>
  392. 56.44 s > 4: std[bcb96dfbba0ab899]::panicking::panic_handler::{closure#0}<unknown>
  393. 56.44 s > at <unknown source file>:<unknown line>
  394. 56.44 s > 5: std[bcb96dfbba0ab899]::sys::backtrace::__rust_end_short_backtrace::<std[bcb96dfbba0ab899]::panicking::panic_handler::{closure#0}, !><unknown>
  395. 56.44 s > at <unknown source file>:<unknown line>
  396. 56.44 s > 6: __rustc[6c289b9f9c454d21]::rust_begin_unwind<unknown>
  397. 56.44 s > at <unknown source file>:<unknown line>
  398. 56.44 s > 7: core[940e698046960fd5]::panicking::panic_fmt<unknown>
  399. 56.44 s > at <unknown source file>:<unknown line>
  400. 56.44 s > 8: core[940e698046960fd5]::panicking::panic<unknown>
  401. 56.44 s > at <unknown source file>:<unknown line>
  402. 56.44 s > 9: <test_renormalization[5812939ef1a04d89]::finite_part_ghost_2loop::{closure#0} as core[940e698046960fd5]::ops::function::FnOnce<()>>::call_once<unknown>
  403. 56.44 s > at <unknown source file>:<unknown line>
  404. 56.44 s > 10: test[75d6903177b1d7e9]::__rust_begin_short_backtrace::<core[940e698046960fd5]::result::Result<(), alloc[2ea6bcb46fca0c42]::string::String>, fn() -> core[940e698046960fd5]::result::Result<(), alloc[2ea6bcb46fca0c42]::string::String>><unknown>
  405. 56.44 s > at <unknown source file>:<unknown line>
  406. 56.44 s > 11: test[75d6903177b1d7e9]::run_test::{closure#0}<unknown>
  407. 56.44 s > at <unknown source file>:<unknown line>
  408. 56.44 s > 12: std[bcb96dfbba0ab899]::sys::backtrace::__rust_begin_short_backtrace::<test[75d6903177b1d7e9]::run_test::{closure#1}, ()><unknown>
  409. 56.44 s > at <unknown source file>:<unknown line>
  410. 56.44 s > 13: <std[bcb96dfbba0ab899]::thread::lifecycle::spawn_unchecked<test[75d6903177b1d7e9]::run_test::{closure#1}, ()>::{closure#1} as core[940e698046960fd5]::ops::function::FnOnce<()>>::call_once::{shim:vtable#0}<unknown>
  411. 56.44 s > at <unknown source file>:<unknown line>
  412. 56.44 s > 14: <std[bcb96dfbba0ab899]::sys::thread::unix::Thread>::new::thread_start<unknown>
  413. 56.44 s > at <unknown source file>:<unknown line>
  414. 56.44 s > 15: start_thread<unknown>
  415. 56.44 s > at <unknown source file>:<unknown line>
  416. 56.44 s > 16: __clone3<unknown>
  417. 56.44 s > at <unknown source file>:<unknown line>
  418. 56.44 s >
  419. 56.44 s > Run with COLORBT_SHOW_HIDDEN=1 environment variable to disable frame filtering.
  420. 56.44 s > Run with RUST_BACKTRACE=full to include source snippets.
  421. 56.44 s >
  422. 56.44 s > error: test run failed
  423. 56.44 s >
  424. 56.44 s > ========== nextest test summary ==========
  425. 56.44 s > report: target/nextest/ci_gammaloop/junit.xml
  426. 56.44 s > tests: 706, failures: 1, errors: 0
  427. 56.44 s >
  428. 56.44 s > 1. gammalooprs::test_renormalization::finite_part_ghost_2loop
  429. 56.44 s > failure: test failure with exit code 101
  430. 56.44 s > system-out
  431. 56.44 s > running 1 test
  432. 56.44 s > test finite_part_ghost_2loop ... FAILED
  433. 56.44 s >
  434. 56.44 s > failures:
  435. 56.44 s >
  436. 56.44 s > failures:
  437. 56.44 s > finite_part_ghost_2loop
  438. 56.44 s >
  439. 56.44 s > test result: FAILED. 0 passed; 1 failed; 0 ignored; 0 measured; 6 filtered out; finished in 3.07s
  440. 56.44 s > system-err
  441. 56.44 s > The application panicked (crashed).
  442. 56.44 s > Message: assertion failed: (align_to_rqft(&a, &model) - expected).expand().is_zero()
  443. 56.44 s > Location: crates/gammalooprs/tests/test_renormalization.rs:583
  444. 56.44 s >
  445. 56.44 s > ━━━━━━━━━━━━━━━━━━━━━━━━━━━━━━━━━━ BACKTRACE ━━━━━━━━━━━━━━━━━━━━━━━━━━━━━━━━━━━
  446. 56.44 s > 1: <color_eyre[51793ea62743adbd]::config::PanicHook>::panic_report<unknown>
  447. 56.44 s > at <unknown source file>:<unknown line>
  448. 56.44 s > 2: <color_eyre[51793ea62743adbd]::config::PanicHook>::into_panic_hook::{closure#0}<unknown>
  449. 56.44 s > at <unknown source file>:<unknown line>
  450. 56.44 s > 3: std[bcb96dfbba0ab899]::panicking::panic_with_hook<unknown>
  451. 56.44 s > at <unknown source file>:<unknown line>
  452. 56.44 s > 4: std[bcb96dfbba0ab899]::panicking::panic_handler::{closure#0}<unknown>
  453. 56.44 s > at <unknown source file>:<unknown line>
  454. 56.44 s > 5: std[bcb96dfbba0ab899]::sys::backtrace::__rust_end_short_backtrace::<std[bcb96dfbba0ab899]::panicking::panic_handler::{closure#0}, !><unknown>
  455. 56.44 s > at <unknown source file>:<unknown line>
  456. 56.44 s > 6: __rustc[6c289b9f9c454d21]::rust_begin_unwind<unknown>
  457. 56.44 s > at <unknown source file>:<unknown line>
  458. 56.44 s > 7: core[940e698046960fd5]::panicking::panic_fmt<unknown>
  459. 56.44 s > at <unknown source file>:<unknown line>
  460. 56.44 s > 8: core[940e698046960fd5]::panicking::panic<unknown>
  461. 56.44 s > at <unknown source file>:<unknown line>
  462. 56.44 s > 9: <test_renormalization[5812939ef1a04d89]::finite_part_ghost_2loop::{closure#0} as core[940e698046960fd5]::ops::function::FnOnce<()>>::call_once<unknown>
  463. 56.44 s > at <unknown source file>:<unknown line>
  464. 56.44 s > 10: test[75d6903177b1d7e9]::__rust_begin_short_backtrace::<core[940e698046960fd5]::result::Result<(), alloc[2ea6bcb46fca0c42]::string::String>, fn() -> core[940e698046960fd5]::result::Result<(), alloc[2ea6bcb46fca0c42]::string::String>><unknown>
  465. 56.44 s > at <unknown source file>:<unknown line>
  466. 56.44 s > 11: test[75d6903177b1d7e9]::run_test::{closure#0}<unknown>
  467. 56.44 s > at <unknown source file>:<unknown line>
  468. 56.44 s > 12: std[bcb96dfbba0ab899]::sys::backtrace::__rust_begin_short_backtrace::<test[75d6903177b1d7e9]::run_test::{closure#1}, ()><unknown>
  469. 56.44 s > at <unknown source file>:<unknown line>
  470. 56.44 s > 13: <std[bcb96dfbba0ab899]::thread::lifecycle::spawn_unchecked<test[75d6903177b1d7e9]::run_test::{closure#1}, ()>::{closure#1} as core[940e698046960fd5]::ops::function::FnOnce<()>>::call_once::{shim:vtable#0}<unknown>
  471. 56.44 s > at <unknown source file>:<unknown line>
  472. 56.44 s > 14: <std[bcb96dfbba0ab899]::sys::thread::unix::Thread>::new::thread_start<unknown>
  473. 56.44 s > at <unknown source file>:<unknown line>
  474. 56.44 s > 15: start_thread<unknown>
  475. 56.44 s > at <unknown source file>:<unknown line>
  476. 56.44 s > 16: __clone3<unknown>
  477. 56.44 s > at <unknown source file>:<unknown line>
  478. 56.44 s >
  479. 56.44 s > Run with COLORBT_SHOW_HIDDEN=1 environment variable to disable frame filtering.
  480. 56.44 s > Run with RUST_BACKTRACE=full to include source snippets.
  481. 56.44 s > =========================================
  482. 56.44 s > Extracting 1 binary, 1 build script output directory, and 1 linked path to /build/nextest-archive-pAFac6
  483. 56.44 s > Extracted 7 files to /build/nextest-archive-pAFac6 in 0.07s
  484. 56.44 s > ------------
  485. 56.44 s > Nextest run ID abdc6ef1-d01a-4a7e-8c5e-3aff4b73c04b with nextest profile: ci_gammaloop
  486. 56.44 s > Starting 105 tests across 1 binary
  487. 56.44 s > ------------
  488. 56.44 s > Summary [ 15.938s] 105 tests run: 105 passed, 0 skipped
  489. 56.44 s >
  490. 56.44 s > ========== nextest test summary ==========
  491. 56.44 s > report: target/nextest/ci_gammaloop/junit.xml
  492. 56.44 s > tests: 105, failures: 0, errors: 0
  493. 56.44 s > No failing testcases found.
  494. 56.44 s > =========================================
  495. 56.44 s For full logs, run:
  496. 56.44 s nix log /nix/store/gfw8irsajvc73r64ijh06rb30gc2744x-gammaloop-nextest-core.drv
  497. 56.57 s Run failed.