test packages.x86_64-linux.nix-ci-check-gammaloop-nextest-core

Reproduce this run
Retry Run
  1. 0.00 s $ /nix/store/9ypz3flqsrl5xl495mm8h645gadjsxi1-coreutils-9.11/bin/timeout --kill-after=15s 7200s /nix/store/23zk8sgzamrbmj1fday15szf7f2279s8-nix-2.34.7/bin/nix --extra-experimental-features nix-command --extra-experimental-features flakes flake clone git+https://github.com/alphal00p/gammaloop --dest /tmp/nix-ci-worker/stable-pwd/repo/
  2. 0.36 s Cloning into '/tmp/nix-ci-worker/stable-pwd/repo'...
  3. 1.33 s remote: Enumerating objects: 85853, done.
  4. 1.45 s remote: Counting objects: 0% (1/8974) remote: Counting objects: 1% (90/8974) remote: Counting objects: 2% (180/8974) remote: Counting objects: 3% (270/8974) remote: Counting objects: 4% (359/8974) remote: Counting objects: 5% (449/8974) remote: Counting objects: 6% (539/8974) remote: Counting objects: 7% (629/8974) remote: Counting objects: 8% (718/8974) remote: Counting objects: 9% (808/8974) remote: Counting objects: 10% (898/8974) remote: Counting objects: 11% (988/8974) remote: Counting objects: 12% (1077/8974) remote: Counting objects: 13% (1167/8974) remote: Counting objects: 14% (1257/8974) remote: Counting objects: 15% (1347/8974) remote: Counting objects: 16% (1436/8974) remote: Counting objects: 17% (1526/8974) remote: Counting objects: 18% (1616/8974) remote: Counting objects: 19% (1706/8974) remote: Counting objects: 20% (1795/8974) remote: Counting objects: 21% (1885/8974) remote: Counting objects: 22% (1975/8974) remote: Counting objects: 23% (2065/8974) remote: Counting objects: 24% (2154/8974) remote: Counting objects: 25% (2244/8974) remote: Counting objects: 26% (2334/8974) remote: Counting objects: 27% (2423/8974) remote: Counting objects: 28% (2513/8974) remote: Counting objects: 29% (2603/8974) remote: Counting objects: 30% (2693/8974) remote: Counting objects: 31% (2782/8974) remote: Counting objects: 32% (2872/8974) remote: Counting objects: 33% (2962/8974) remote: Counting objects: 34% (3052/8974) remote: Counting objects: 35% (3141/8974) remote: Counting objects: 36% (3231/8974) remote: Counting objects: 37% (3321/8974) remote: Counting objects: 38% (3411/8974) remote: Counting objects: 39% (3500/8974) remote: Counting objects: 40% (3590/8974) remote: Counting objects: 41% (3680/8974) remote: Counting objects: 42% (3770/8974) remote: Counting objects: 43% (3859/8974) remote: Counting objects: 44% (3949/8974) remote: Counting objects: 45% (4039/8974) remote: Counting objects: 46% (4129/8974) remote: Counting objects: 47% (4218/8974) remote: Counting objects: 48% (4308/8974) remote: Counting objects: 49% (4398/8974) remote: Counting objects: 50% (4487/8974) remote: Counting objects: 51% (4577/8974) remote: Counting objects: 52% (4667/8974) remote: Counting objects: 53% (4757/8974) remote: Counting objects: 54% (4846/8974) remote: Counting objects: 55% (4936/8974) remote: Counting objects: 56% (5026/8974) remote: Counting objects: 57% (5116/8974) remote: Counting objects: 58% (5205/8974) remote: Counting objects: 59% (5295/8974) remote: Counting objects: 60% (5385/8974) remote: Counting objects: 61% (5475/8974) remote: Counting objects: 62% (5564/8974) remote: Counting objects: 63% (5654/8974) remote: Counting objects: 64% (5744/8974) remote: Counting objects: 65% (5834/8974) remote: Counting objects: 66% (5923/8974) remote: Counting objects: 67% (6013/8974) remote: Counting objects: 68% (6103/8974) remote: Counting objects: 69% (6193/8974) remote: Counting objects: 70% (6282/8974) remote: Counting objects: 71% (6372/8974) remote: Counting objects: 72% (6462/8974) remote: Counting objects: 73% (6552/8974) remote: Counting objects: 74% (6641/8974) remote: Counting objects: 75% (6731/8974) remote: Counting objects: 76% (6821/8974) remote: Counting objects: 77% (6910/8974) remote: Counting objects: 78% (7000/8974) remote: Counting objects: 79% (7090/8974) remote: Counting objects: 80% (7180/8974) remote: Counting objects: 81% (7269/8974) remote: Counting objects: 82% (7359/8974) remote: Counting objects: 83% (7449/8974) remote: Counting objects: 84% (7539/8974) remote: Counting objects: 85% (7628/8974) remote: Counting objects: 86% (7718/8974) remote: Counting objects: 87% (7808/8974) remote: Counting objects: 88% (7898/8974) remote: Counting objects: 89% (7987/8974) remote: Counting objects: 90% (8077/8974) remote: Counting objects: 91% (8167/8974) remote: Counting objects: 92% (8257/8974) remote: Counting objects: 93% (8346/8974) remote: Counting objects: 94% (8436/8974) remote: Counting objects: 95% (8526/8974) remote: Counting objects: 96% (8616/8974) remote: Counting objects: 97% (8705/8974) remote: Counting objects: 98% (8795/8974) remote: Counting objects: 99% (8885/8974) remote: Counting objects: 100% (8974/8974) remote: Counting objects: 100% (8974/8974), done.
  5. 3.40 s remote: Compressing objects: 0% (1/1977) remote: Compressing objects: 1% (20/1977) remote: Compressing objects: 2% (40/1977) remote: Compressing objects: 3% (60/1977) remote: Compressing objects: 4% (80/1977) remote: Compressing objects: 5% (99/1977) remote: Compressing objects: 6% (119/1977) remote: Compressing objects: 7% (139/1977) remote: Compressing objects: 8% (159/1977) remote: Compressing objects: 9% (178/1977) remote: Compressing objects: 10% (198/1977) remote: Compressing objects: 10% (210/1977) remote: Compressing objects: 11% (218/1977) remote: Compressing objects: 12% (238/1977) remote: Compressing objects: 13% (258/1977) remote: Compressing objects: 14% (277/1977) remote: Compressing objects: 15% (297/1977) remote: Compressing objects: 16% (317/1977) remote: Compressing objects: 17% (337/1977) remote: Compressing objects: 18% (356/1977) remote: Compressing objects: 19% (376/1977) remote: Compressing objects: 20% (396/1977) remote: Compressing objects: 21% (416/1977) remote: Compressing objects: 22% (435/1977) remote: Compressing objects: 23% (455/1977) remote: Compressing objects: 24% (475/1977) remote: Compressing objects: 25% (495/1977) remote: Compressing objects: 26% (515/1977) remote: Compressing objects: 27% (534/1977) remote: Compressing objects: 28% (554/1977) remote: Compressing objects: 29% (574/1977) remote: Compressing objects: 30% (594/1977) remote: Compressing objects: 31% (613/1977) remote: Compressing objects: 32% (633/1977) remote: Compressing objects: 33% (653/1977) remote: Compressing objects: 34% (673/1977) remote: Compressing objects: 34% (676/1977) remote: Compressing objects: 35% (692/1977) remote: Compressing objects: 36% (712/1977) remote: Compressing objects: 37% (732/1977) remote: Compressing objects: 38% (752/1977) remote: Compressing objects: 39% (772/1977) remote: Compressing objects: 40% (791/1977) remote: Compressing objects: 41% (811/1977) remote: Compressing objects: 42% (831/1977) remote: Compressing objects: 43% (851/1977) remote: Compressing objects: 44% (870/1977) remote: Compressing objects: 45% (890/1977) remote: Compressing objects: 46% (910/1977) remote: Compressing objects: 47% (930/1977) remote: Compressing objects: 48% (949/1977) remote: Compressing objects: 49% (969/1977) remote: Compressing objects: 50% (989/1977) remote: Compressing objects: 51% (1009/1977) remote: Compressing objects: 52% (1029/1977) remote: Compressing objects: 53% (1048/1977) remote: Compressing objects: 54% (1068/1977) remote: Compressing objects: 55% (1088/1977) remote: Compressing objects: 56% (1108/1977) remote: Compressing objects: 57% (1127/1977) remote: Compressing objects: 58% (1147/1977) remote: Compressing objects: 59% (1167/1977) remote: Compressing objects: 60% (1187/1977) remote: Compressing objects: 61% (1206/1977) remote: Compressing objects: 62% (1226/1977) remote: Compressing objects: 63% (1246/1977) remote: Compressing objects: 64% (1266/1977) remote: Compressing objects: 65% (1286/1977) remote: Compressing objects: 66% (1305/1977) remote: Compressing objects: 67% (1325/1977) remote: Compressing objects: 68% (1345/1977) remote: Compressing objects: 69% (1365/1977) remote: Compressing objects: 70% (1384/1977) remote: Compressing objects: 71% (1404/1977) remote: Compressing objects: 72% (1424/1977) remote: Compressing objects: 73% (1444/1977) remote: Compressing objects: 74% (1463/1977) remote: Compressing objects: 75% (1483/1977) remote: Compressing objects: 76% (1503/1977) remote: Compressing objects: 77% (1523/1977) remote: Compressing objects: 78% (1543/1977) remote: Compressing objects: 79% (1562/1977) remote: Compressing objects: 80% (1582/1977) remote: Compressing objects: 81% (1602/1977) remote: Compressing objects: 82% (1622/1977) remote: Compressing objects: 83% (1641/1977) remote: Compressing objects: 84% (1661/1977) remote: Compressing objects: 85% (1681/1977) remote: Compressing objects: 86% (1701/1977) remote: Compressing objects: 87% (1720/1977) remote: Compressing objects: 88% (1740/1977) remote: Compressing objects: 89% (1760/1977) remote: Compressing objects: 90% (1780/1977) remote: Compressing objects: 91% (1800/1977) remote: Compressing objects: 92% (1819/1977) remote: Compressing objects: 93% (1839/1977) remote: Compressing objects: 94% (1859/1977) remote: Compressing objects: 95% (1879/1977) remote: Compressing objects: 96% (1898/1977) remote: Compressing objects: 97% (1918/1977) remote: Compressing objects: 98% (1938/1977) remote: Compressing objects: 99% (1958/1977) remote: Compressing objects: 100% (1977/1977) remote: Compressing objects: 100% (1977/1977), done.
  6. 8.34 s Receiving objects: 0% (1/85853) Receiving objects: 1% (859/85853) Receiving objects: 2% (1718/85853) Receiving objects: 3% (2576/85853) Receiving objects: 4% (3435/85853) Receiving objects: 5% (4293/85853) Receiving objects: 6% (5152/85853), 9.21 MiB | 18.41 MiB/s Receiving objects: 7% (6010/85853), 9.21 MiB | 18.41 MiB/s Receiving objects: 8% (6869/85853), 9.21 MiB | 18.41 MiB/s Receiving objects: 9% (7727/85853), 9.21 MiB | 18.41 MiB/s Receiving objects: 10% (8586/85853), 9.21 MiB | 18.41 MiB/s Receiving objects: 11% (9444/85853), 9.21 MiB | 18.41 MiB/s Receiving objects: 12% (10303/85853), 9.21 MiB | 18.41 MiB/s Receiving objects: 13% (11161/85853), 9.21 MiB | 18.41 MiB/s Receiving objects: 14% (12020/85853), 9.21 MiB | 18.41 MiB/s Receiving objects: 15% (12878/85853), 9.21 MiB | 18.41 MiB/s Receiving objects: 16% (13737/85853), 9.21 MiB | 18.41 MiB/s Receiving objects: 17% (14596/85853), 9.21 MiB | 18.41 MiB/s Receiving objects: 18% (15454/85853), 9.21 MiB | 18.41 MiB/s Receiving objects: 19% (16313/85853), 9.21 MiB | 18.41 MiB/s Receiving objects: 20% (17171/85853), 9.21 MiB | 18.41 MiB/s Receiving objects: 21% (18030/85853), 9.21 MiB | 18.41 MiB/s Receiving objects: 22% (18888/85853), 9.21 MiB | 18.41 MiB/s Receiving objects: 23% (19747/85853), 9.21 MiB | 18.41 MiB/s Receiving objects: 24% (20605/85853), 9.21 MiB | 18.41 MiB/s Receiving objects: 25% (21464/85853), 9.21 MiB | 18.41 MiB/s Receiving objects: 26% (22322/85853), 9.21 MiB | 18.41 MiB/s Receiving objects: 27% (23181/85853), 9.21 MiB | 18.41 MiB/s Receiving objects: 28% (24039/85853), 9.21 MiB | 18.41 MiB/s Receiving objects: 29% (24898/85853), 9.21 MiB | 18.41 MiB/s Receiving objects: 30% (25756/85853), 9.21 MiB | 18.41 MiB/s Receiving objects: 31% (26615/85853), 9.21 MiB | 18.41 MiB/s Receiving objects: 32% (27473/85853), 9.21 MiB | 18.41 MiB/s Receiving objects: 33% (28332/85853), 9.21 MiB | 18.41 MiB/s Receiving objects: 34% (29191/85853), 9.21 MiB | 18.41 MiB/s Receiving objects: 35% (30049/85853), 9.21 MiB | 18.41 MiB/s Receiving objects: 36% (30908/85853), 9.21 MiB | 18.41 MiB/s Receiving objects: 37% (31766/85853), 9.21 MiB | 18.41 MiB/s Receiving objects: 37% (32337/85853), 29.70 MiB | 29.29 MiB/s Receiving objects: 38% (32625/85853), 29.70 MiB | 29.29 MiB/s Receiving objects: 39% (33483/85853), 29.70 MiB | 29.29 MiB/s Receiving objects: 40% (34342/85853), 29.70 MiB | 29.29 MiB/s Receiving objects: 41% (35200/85853), 29.70 MiB | 29.29 MiB/s Receiving objects: 42% (36059/85853), 29.70 MiB | 29.29 MiB/s Receiving objects: 43% (36917/85853), 29.70 MiB | 29.29 MiB/s Receiving objects: 44% (37776/85853), 29.70 MiB | 29.29 MiB/s Receiving objects: 45% (38634/85853), 29.70 MiB | 29.29 MiB/s Receiving objects: 46% (39493/85853), 29.70 MiB | 29.29 MiB/s Receiving objects: 47% (40351/85853), 45.85 MiB | 30.28 MiB/s Receiving objects: 48% (41210/85853), 45.85 MiB | 30.28 MiB/s Receiving objects: 49% (42068/85853), 45.85 MiB | 30.28 MiB/s Receiving objects: 50% (42927/85853), 45.85 MiB | 30.28 MiB/s Receiving objects: 51% (43786/85853), 45.85 MiB | 30.28 MiB/s Receiving objects: 52% (44644/85853), 45.85 MiB | 30.28 MiB/s Receiving objects: 53% (45503/85853), 45.85 MiB | 30.28 MiB/s Receiving objects: 54% (46361/85853), 45.85 MiB | 30.28 MiB/s Receiving objects: 55% (47220/85853), 45.85 MiB | 30.28 MiB/s Receiving objects: 56% (48078/85853), 45.85 MiB | 30.28 MiB/s Receiving objects: 56% (48469/85853), 45.85 MiB | 30.28 MiB/s Receiving objects: 57% (48937/85853), 61.82 MiB | 30.69 MiB/s Receiving objects: 58% (49795/85853), 61.82 MiB | 30.69 MiB/s Receiving objects: 59% (50654/85853), 61.82 MiB | 30.69 MiB/s Receiving objects: 60% (51512/85853), 61.82 MiB | 30.69 MiB/s Receiving objects: 61% (52371/85853), 61.82 MiB | 30.69 MiB/s Receiving objects: 62% (53229/85853), 61.82 MiB | 30.69 MiB/s Receiving objects: 63% (54088/85853), 77.86 MiB | 30.97 MiB/s Receiving objects: 64% (54946/85853), 77.86 MiB | 30.97 MiB/s Receiving objects: 65% (55805/85853), 77.86 MiB | 30.97 MiB/s Receiving objects: 66% (56663/85853), 77.86 MiB | 30.97 MiB/s Receiving objects: 66% (57331/85853), 93.74 MiB | 31.10 MiB/s Receiving objects: 67% (57522/85853), 93.74 MiB | 31.10 MiB/s Receiving objects: 68% (58381/85853), 93.74 MiB | 31.10 MiB/s Receiving objects: 69% (59239/85853), 93.74 MiB | 31.10 MiB/s Receiving objects: 70% (60098/85853), 93.74 MiB | 31.10 MiB/s Receiving objects: 71% (60956/85853), 110.20 MiB | 31.36 MiB/s Receiving objects: 72% (61815/85853), 110.20 MiB | 31.36 MiB/s Receiving objects: 73% (62673/85853), 110.20 MiB | 31.36 MiB/s Receiving objects: 74% (63532/85853), 110.20 MiB | 31.36 MiB/s Receiving objects: 74% (64297/85853), 127.22 MiB | 31.70 MiB/s Receiving objects: 75% (64390/85853), 127.22 MiB | 31.70 MiB/s Receiving objects: 76% (65249/85853), 127.22 MiB | 31.70 MiB/s Receiving objects: 77% (66107/85853), 127.22 MiB | 31.70 MiB/s Receiving objects: 78% (66966/85853), 127.22 MiB | 31.70 MiB/s Receiving objects: 79% (67824/85853), 127.22 MiB | 31.70 MiB/s Receiving objects: 80% (68683/85853), 127.22 MiB | 31.70 MiB/s Receiving objects: 81% (69541/85853), 127.22 MiB | 31.70 MiB/s Receiving objects: 82% (70400/85853), 127.22 MiB | 31.70 MiB/s Receiving objects: 83% (71258/85853), 127.22 MiB | 31.70 MiB/s Receiving objects: 84% (72117/85853), 127.22 MiB | 31.70 MiB/s Receiving objects: 85% (72976/85853), 127.22 MiB | 31.70 MiB/s Receiving objects: 86% (73834/85853), 127.22 MiB | 31.70 MiB/s Receiving objects: 87% (74693/85853), 143.57 MiB | 31.81 MiB/s Receiving objects: 88% (75551/85853), 143.57 MiB | 31.81 MiB/s Receiving objects: 89% (76410/85853), 143.57 MiB | 31.81 MiB/s Receiving objects: 90% (77268/85853), 143.57 MiB | 31.81 MiB/s Receiving objects: 91% (78127/85853), 143.57 MiB | 31.81 MiB/s Receiving objects: 92% (78985/85853), 143.57 MiB | 31.81 MiB/s Receiving objects: 93% (79844/85853), 143.57 MiB | 31.81 MiB/s Receiving objects: 94% (80702/85853), 143.57 MiB | 31.81 MiB/s Receiving objects: 95% (81561/85853), 143.57 MiB | 31.81 MiB/s Receiving objects: 96% (82419/85853), 143.57 MiB | 31.81 MiB/s Receiving objects: 97% (83278/85853), 143.57 MiB | 31.81 MiB/s Receiving objects: 98% (84136/85853), 143.57 MiB | 31.81 MiB/s Receiving objects: 99% (84995/85853), 143.57 MiB | 31.81 MiB/s remote: Total 85853 (delta 7809), reused 7098 (delta 6997), pack-reused 76879 (from 3)
  7. 8.34 s Receiving objects: 100% (85853/85853), 143.57 MiB | 31.81 MiB/s Receiving objects: 100% (85853/85853), 155.75 MiB | 31.66 MiB/s, done.
  8. 11.01 s Resolving deltas: 0% (0/58229) Resolving deltas: 1% (583/58229) Resolving deltas: 2% (1165/58229) Resolving deltas: 3% (1747/58229) Resolving deltas: 4% (2330/58229) Resolving deltas: 5% (2912/58229) Resolving deltas: 6% (3494/58229) Resolving deltas: 7% (4077/58229) Resolving deltas: 8% (4659/58229) Resolving deltas: 9% (5241/58229) Resolving deltas: 10% (5823/58229) Resolving deltas: 11% (6406/58229) Resolving deltas: 12% (6988/58229) Resolving deltas: 13% (7570/58229) Resolving deltas: 14% (8153/58229) Resolving deltas: 15% (8735/58229) Resolving deltas: 16% (9317/58229) Resolving deltas: 17% (9899/58229) Resolving deltas: 18% (10482/58229) Resolving deltas: 19% (11064/58229) Resolving deltas: 20% (11646/58229) Resolving deltas: 21% (12229/58229) Resolving deltas: 22% (12811/58229) Resolving deltas: 23% (13393/58229) Resolving deltas: 24% (13975/58229) Resolving deltas: 25% (14558/58229) Resolving deltas: 26% (15140/58229) Resolving deltas: 27% (15722/58229) Resolving deltas: 28% (16305/58229) Resolving deltas: 29% (16887/58229) Resolving deltas: 30% (17469/58229) Resolving deltas: 31% (18051/58229) Resolving deltas: 32% (18634/58229) Resolving deltas: 33% (19216/58229) Resolving deltas: 34% (19800/58229) Resolving deltas: 35% (20381/58229) Resolving deltas: 36% (20963/58229) Resolving deltas: 37% (21545/58229) Resolving deltas: 38% (22128/58229) Resolving deltas: 39% (22710/58229) Resolving deltas: 40% (23292/58229) Resolving deltas: 41% (23874/58229) Resolving deltas: 42% (24457/58229) Resolving deltas: 43% (25039/58229) Resolving deltas: 44% (25621/58229) Resolving deltas: 45% (26204/58229) Resolving deltas: 46% (26786/58229) Resolving deltas: 47% (27368/58229) Resolving deltas: 48% (27950/58229) Resolving deltas: 49% (28533/58229) Resolving deltas: 50% (29116/58229) Resolving deltas: 51% (29697/58229) Resolving deltas: 52% (30280/58229) Resolving deltas: 52% (30711/58229) Resolving deltas: 53% (30864/58229) Resolving deltas: 54% (31444/58229) Resolving deltas: 55% (32026/58229) Resolving deltas: 56% (32609/58229) Resolving deltas: 57% (33191/58229) Resolving deltas: 58% (33774/58229) Resolving deltas: 59% (34356/58229) Resolving deltas: 60% (34938/58229) Resolving deltas: 61% (35520/58229) Resolving deltas: 62% (36102/58229) Resolving deltas: 63% (36685/58229) Resolving deltas: 64% (37267/58229) Resolving deltas: 65% (37849/58229) Resolving deltas: 66% (38433/58229) Resolving deltas: 67% (39014/58229) Resolving deltas: 68% (39596/58229) Resolving deltas: 69% (40179/58229) Resolving deltas: 70% (40762/58229) Resolving deltas: 71% (41343/58229) Resolving deltas: 72% (41925/58229) Resolving deltas: 73% (42508/58229) Resolving deltas: 74% (43090/58229) Resolving deltas: 75% (43672/58229) Resolving deltas: 76% (44255/58229) Resolving deltas: 77% (44837/58229) Resolving deltas: 78% (45419/58229) Resolving deltas: 78% (45724/58229) Resolving deltas: 79% (46001/58229) Resolving deltas: 80% (46584/58229) Resolving deltas: 81% (47166/58229) Resolving deltas: 82% (47748/58229) Resolving deltas: 83% (48331/58229) Resolving deltas: 84% (48913/58229) Resolving deltas: 85% (49495/58229) Resolving deltas: 86% (50077/58229) Resolving deltas: 87% (50660/58229) Resolving deltas: 88% (51243/58229) Resolving deltas: 89% (51824/58229) Resolving deltas: 90% (52407/58229) Resolving deltas: 91% (52989/58229) Resolving deltas: 92% (53571/58229) Resolving deltas: 93% (54153/58229) Resolving deltas: 94% (54736/58229) Resolving deltas: 95% (55318/58229) Resolving deltas: 96% (55900/58229) Resolving deltas: 97% (56483/58229) Resolving deltas: 98% (57065/58229) Resolving deltas: 99% (57647/58229) Resolving deltas: 100% (58229/58229) Resolving deltas: 100% (58229/58229), done.
  9. 11.67 s Fetching commit 4e06fb2318cda07e694491bfaf5755da9d23fc5a for faster_uv_from_4d ...
  10. 11.67 s $ /nix/store/bcnisk3ydfgv26v2gw3zlky24g00yww2-git-2.54.0/bin/git fetch origin 4e06fb2318cda07e694491bfaf5755da9d23fc5a
  11. 12.28 s From https://github.com/alphal00p/gammaloop
  12. 12.28 s * branch 4e06fb2318cda07e694491bfaf5755da9d23fc5a -> FETCH_HEAD
  13. 12.33 s $ /nix/store/9ypz3flqsrl5xl495mm8h645gadjsxi1-coreutils-9.11/bin/timeout --kill-after=15s 7200s /nix/store/bcnisk3ydfgv26v2gw3zlky24g00yww2-git-2.54.0/bin/git -c advice.detachedHead=false checkout 4e06fb2318cda07e694491bfaf5755da9d23fc5a
  14. 12.81 s HEAD is now at 4e06fb231 allow explicit finite memory watchdog limits
  15. 12.84 s $ /nix/store/9ypz3flqsrl5xl495mm8h645gadjsxi1-coreutils-9.11/bin/timeout --kill-after=15s 7200s /nix/store/23zk8sgzamrbmj1fday15szf7f2279s8-nix-2.34.7/bin/nix --extra-experimental-features nix-command --extra-experimental-features flakes --log-format internal-json run .#packages.x86_64-linux.nix-ci-check-gammaloop-nextest-core --print-build-logs
  16. 20.98 s
  17. 29.75 s evaluating derivation 'g copying '/nix/store/4yw3 evaluating derivation 'g copying '/nix/store/4yw3 evaluating derivation 'g copying '/nix/store/4yw3 evaluating derivation 'g copying '/nix/store/4yw3 evaluating derivation 'g copying '/nix/store/4yw3 evaluating derivation 'g copying '/nix/store/4yw3 evaluating derivation 'g copying '/nix/store/4yw3 evaluating derivation 'g copying '/nix/store/4yw3 evaluating derivation 'g copying '/nix/store/4yw3 evaluating derivation 'g copying '/nix/store/4yw3 evaluating derivation 'g querying gammaloop-nexte [0/1 built, 0.0 KiB DL] [1/0/1 built, 0.0 KiB DLgammaloop-nextest-core> Extracting 4 binaries (including 1 non-test binary), 1 build script output directory, and 2 linked paths to /build/nextest-archive-XlDxgK
  18. 30.96 s gammaloop-nextest-core> Extracted 20 files to /build/nextest-archive-XlDxgK in 1.20s
  19. 30.97 s gammaloop-nextest-core> ------------
  20. 30.97 s gammaloop-nextest-core> Nextest run ID 10217cfd-6230-4e8a-a0a0-f0868c466843 with nextest profile: ci_gammaloop
  21. 30.97 s gammaloop-nextest-core> Starting 379 tests across 3 binaries
  22. 32.79 s gammaloop-nextest-core> ------------
  23. 32.79 s gammaloop-nextest-core> Summary [ 1.818s] 379 tests run: 379 passed, 0 skipped
  24. 32.97 s gammaloop-nextest-core>
  25. 32.97 s gammaloop-nextest-core> ========== nextest test summary ==========
  26. 32.97 s gammaloop-nextest-core> report: target/nextest/ci_gammaloop/junit.xml
  27. 32.97 s gammaloop-nextest-core> tests: 379, failures: 0, errors: 0
  28. 32.97 s gammaloop-nextest-core> No failing testcases found.
  29. 32.97 s gammaloop-nextest-core> =========================================
  30. 33.00 s gammaloop-nextest-core> Extracting 1 binary and 1 linked path to /build/nextest-archive-B06LiA
  31. 33.07 s gammaloop-nextest-core> Extracted 7 files to /build/nextest-archive-B06LiA in 0.07s
  32. 33.08 s gammaloop-nextest-core> ------------
  33. 33.08 s gammaloop-nextest-core> Nextest run ID 674097be-269b-4669-a18d-6af54e002db3 with nextest profile: ci_gammaloop
  34. 33.08 s gammaloop-nextest-core> Starting 19 tests across 1 binary
  35. 33.10 s gammaloop-nextest-core> ------------
  36. 33.10 s gammaloop-nextest-core> Summary [ 0.020s] 19 tests run: 19 passed, 0 skipped
  37. 33.16 s gammaloop-nextest-core>
  38. 33.16 s gammaloop-nextest-core> ========== nextest test summary ==========
  39. 33.16 s gammaloop-nextest-core> report: target/nextest/ci_gammaloop/junit.xml
  40. 33.16 s gammaloop-nextest-core> tests: 19, failures: 0, errors: 0
  41. 33.16 s gammaloop-nextest-core> No failing testcases found.
  42. 33.16 s gammaloop-nextest-core> =========================================
  43. 33.18 s gammaloop-nextest-core> Extracting 1 binary to /build/nextest-archive-19S9Kk
  44. 33.22 s gammaloop-nextest-core> Extracted 4 files to /build/nextest-archive-19S9Kk in 0.04s
  45. 33.24 s gammaloop-nextest-core> ------------
  46. 33.24 s gammaloop-nextest-core> Nextest run ID 6e593259-be55-4ce0-9d29-fd1476fcd7cc with nextest profile: ci_gammaloop
  47. 33.24 s gammaloop-nextest-core> Starting 0 tests across 1 binary
  48. 33.24 s gammaloop-nextest-core> ------------
  49. 33.24 s gammaloop-nextest-core> Summary [ 0.000s] 0 tests run: 0 passed, 0 skipped
  50. 33.28 s gammaloop-nextest-core>
  51. 33.28 s gammaloop-nextest-core> ========== nextest test summary ==========
  52. 33.28 s gammaloop-nextest-core> report: target/nextest/ci_gammaloop/junit.xml
  53. 33.28 s gammaloop-nextest-core> tests: 0, failures: 0, errors: 0
  54. 33.28 s gammaloop-nextest-core> No failing testcases found.
  55. 33.28 s gammaloop-nextest-core> =========================================
  56. 33.30 s gammaloop-nextest-core> Extracting 4 binaries, 1 build script output directory, and 2 linked paths to /build/nextest-archive-UN28bc
  57. 33.83 s gammaloop-nextest-core> Extracted 18 files to /build/nextest-archive-UN28bc in 0.53s
  58. 33.84 s gammaloop-nextest-core> ------------
  59. 33.84 s gammaloop-nextest-core> Nextest run ID 1740d595-e6b2-4f53-bce8-f1f70787280c with nextest profile: ci_gammaloop
  60. 33.84 s gammaloop-nextest-core> Starting 705 tests across 4 binaries (60 tests skipped, including 59 tests via profile.ci_gammaloop.default-filter)
  61. 41.35 s gammaloop-nextest-core> FAIL [ 3.145s] (700/705) gammalooprs::test_renormalization finite_part_ghost_2loop
  62. 41.35 s gammaloop-nextest-core> stdout ---
  63. 41.35 s gammaloop-nextest-core>
  64. 41.35 s gammaloop-nextest-core> running 1 test
  65. 41.35 s gammaloop-nextest-core> test finite_part_ghost_2loop ... FAILED
  66. 41.35 s gammaloop-nextest-core>
  67. 41.35 s gammaloop-nextest-core> failures:
  68. 41.35 s gammaloop-nextest-core>
  69. 41.35 s gammaloop-nextest-core> failures:
  70. 41.35 s gammaloop-nextest-core> finite_part_ghost_2loop
  71. 41.35 s gammaloop-nextest-core>
  72. 41.35 s gammaloop-nextest-core> test result: FAILED. 0 passed; 1 failed; 0 ignored; 0 measured; 6 filtered out; finished in 3.13s
  73. 41.35 s gammaloop-nextest-core>
  74. 41.35 s gammaloop-nextest-core> stderr ---
  75. 41.35 s gammaloop-nextest-core> The application panicked (crashed).
  76. 41.35 s gammaloop-nextest-core> Message: assertion failed: (align_to_rqft(&a, &model) - expected).expand().is_zero()
  77. 41.35 s gammaloop-nextest-core> Location: crates/gammalooprs/tests/test_renormalization.rs:583
  78. 41.35 s gammaloop-nextest-core>
  79. 41.35 s gammaloop-nextest-core> ━━━━━━━━━━━━━━━━━━━━━━━━━━━━━━━━━━ BACKTRACE ━━━━━━━━━━━━━━━━━━━━━━━━━━━━━━━━━━━
  80. 41.35 s gammaloop-nextest-core> 1: <color_eyre[51793ea62743adbd]::config::PanicHook>::panic_report<unknown>
  81. 41.35 s gammaloop-nextest-core> at <unknown source file>:<unknown line>
  82. 41.35 s gammaloop-nextest-core> 2: <color_eyre[51793ea62743adbd]::config::PanicHook>::into_panic_hook::{closure#0}<unknown>
  83. 41.35 s gammaloop-nextest-core> at <unknown source file>:<unknown line>
  84. 41.35 s gammaloop-nextest-core> 3: std[bcb96dfbba0ab899]::panicking::panic_with_hook<unknown>
  85. 41.35 s gammaloop-nextest-core> at <unknown source file>:<unknown line>
  86. 41.35 s gammaloop-nextest-core> 4: std[bcb96dfbba0ab899]::panicking::panic_handler::{closure#0}<unknown>
  87. 41.35 s gammaloop-nextest-core> at <unknown source file>:<unknown line>
  88. 41.35 s gammaloop-nextest-core> 5: std[bcb96dfbba0ab899]::sys::backtrace::__rust_end_short_backtrace::<std[bcb96dfbba0ab899]::panicking::panic_handler::{closure#0}, !><unknown>
  89. 41.35 s gammaloop-nextest-core> at <unknown source file>:<unknown line>
  90. 41.35 s gammaloop-nextest-core> 6: __rustc[6c289b9f9c454d21]::rust_begin_unwind<unknown>
  91. 41.35 s gammaloop-nextest-core> at <unknown source file>:<unknown line>
  92. 41.35 s gammaloop-nextest-core> 7: core[940e698046960fd5]::panicking::panic_fmt<unknown>
  93. 41.35 s gammaloop-nextest-core> at <unknown source file>:<unknown line>
  94. 41.35 s gammaloop-nextest-core> 8: core[940e698046960fd5]::panicking::panic<unknown>
  95. 41.35 s gammaloop-nextest-core> at <unknown source file>:<unknown line>
  96. 41.35 s gammaloop-nextest-core> 9: <test_renormalization[5812939ef1a04d89]::finite_part_ghost_2loop::{closure#0} as core[940e698046960fd5]::ops::function::FnOnce<()>>::call_once<unknown>
  97. 41.35 s gammaloop-nextest-core> at <unknown source file>:<unknown line>
  98. 41.35 s gammaloop-nextest-core> 10: test[75d6903177b1d7e9]::__rust_begin_short_backtrace::<core[940e698046960fd5]::result::Result<(), alloc[2ea6bcb46fca0c42]::string::String>, fn() -> core[940e698046960fd5]::result::Result<(), alloc[2ea6bcb46fca0c42]::string::String>><unknown>
  99. 41.35 s gammaloop-nextest-core> at <unknown source file>:<unknown line>
  100. 41.35 s gammaloop-nextest-core> 11: test[75d6903177b1d7e9]::run_test::{closure#0}<unknown>
  101. 41.35 s gammaloop-nextest-core> at <unknown source file>:<unknown line>
  102. 41.35 s gammaloop-nextest-core> 12: std[bcb96dfbba0ab899]::sys::backtrace::__rust_begin_short_backtrace::<test[75d6903177b1d7e9]::run_test::{closure#1}, ()><unknown>
  103. 41.35 s gammaloop-nextest-core> at <unknown source file>:<unknown line>
  104. 41.35 s gammaloop-nextest-core> 13: <std[bcb96dfbba0ab899]::thread::lifecycle::spawn_unchecked<test[75d6903177b1d7e9]::run_test::{closure#1}, ()>::{closure#1} as core[940e698046960fd5]::ops::function::FnOnce<()>>::call_once::{shim:vtable#0}<unknown>
  105. 41.35 s gammaloop-nextest-core> at <unknown source file>:<unknown line>
  106. 41.35 s gammaloop-nextest-core> 14: <std[bcb96dfbba0ab899]::sys::thread::unix::Thread>::new::thread_start<unknown>
  107. 41.35 s gammaloop-nextest-core> at <unknown source file>:<unknown line>
  108. 41.35 s gammaloop-nextest-core> 15: start_thread<unknown>
  109. 41.35 s gammaloop-nextest-core> at <unknown source file>:<unknown line>
  110. 41.35 s gammaloop-nextest-core> 16: __clone3<unknown>
  111. 41.35 s gammaloop-nextest-core> at <unknown source file>:<unknown line>
  112. 41.35 s gammaloop-nextest-core>
  113. 41.35 s gammaloop-nextest-core> Run with COLORBT_SHOW_HIDDEN=1 environment variable to disable frame filtering.
  114. 41.35 s gammaloop-nextest-core> Run with RUST_BACKTRACE=full to include source snippets.
  115. 41.35 s gammaloop-nextest-core>
  116. 45.79 s gammaloop-nextest-core> ------------
  117. 45.79 s gammaloop-nextest-core> Summary [ 11.945s] 705 tests run: 704 passed, 1 failed, 60 skipped
  118. 45.79 s gammaloop-nextest-core> FAIL [ 3.145s] (700/705) gammalooprs::test_renormalization finite_part_ghost_2loop
  119. 45.79 s gammaloop-nextest-core> stdout ---
  120. 45.79 s gammaloop-nextest-core>
  121. 45.79 s gammaloop-nextest-core> running 1 test
  122. 45.79 s gammaloop-nextest-core> test finite_part_ghost_2loop ... FAILED
  123. 45.79 s gammaloop-nextest-core>
  124. 45.79 s gammaloop-nextest-core> failures:
  125. 45.79 s gammaloop-nextest-core>
  126. 45.79 s gammaloop-nextest-core> failures:
  127. 45.79 s gammaloop-nextest-core> finite_part_ghost_2loop
  128. 45.79 s gammaloop-nextest-core>
  129. 45.79 s gammaloop-nextest-core> test result: FAILED. 0 passed; 1 failed; 0 ignored; 0 measured; 6 filtered out; finished in 3.13s
  130. 45.79 s gammaloop-nextest-core>
  131. 45.79 s gammaloop-nextest-core> stderr ---
  132. 45.79 s gammaloop-nextest-core> The application panicked (crashed).
  133. 45.79 s gammaloop-nextest-core> Message: assertion failed: (align_to_rqft(&a, &model) - expected).expand().is_zero()
  134. 45.79 s gammaloop-nextest-core> Location: crates/gammalooprs/tests/test_renormalization.rs:583
  135. 45.79 s gammaloop-nextest-core>
  136. 45.79 s gammaloop-nextest-core> ━━━━━━━━━━━━━━━━━━━━━━━━━━━━━━━━━━ BACKTRACE ━━━━━━━━━━━━━━━━━━━━━━━━━━━━━━━━━━━
  137. 45.79 s gammaloop-nextest-core> 1: <color_eyre[51793ea62743adbd]::config::PanicHook>::panic_report<unknown>
  138. 45.79 s gammaloop-nextest-core> at <unknown source file>:<unknown line>
  139. 45.79 s gammaloop-nextest-core> 2: <color_eyre[51793ea62743adbd]::config::PanicHook>::into_panic_hook::{closure#0}<unknown>
  140. 45.79 s gammaloop-nextest-core> at <unknown source file>:<unknown line>
  141. 45.79 s gammaloop-nextest-core> 3: std[bcb96dfbba0ab899]::panicking::panic_with_hook<unknown>
  142. 45.79 s gammaloop-nextest-core> at <unknown source file>:<unknown line>
  143. 45.79 s gammaloop-nextest-core> 4: std[bcb96dfbba0ab899]::panicking::panic_handler::{closure#0}<unknown>
  144. 45.79 s gammaloop-nextest-core> at <unknown source file>:<unknown line>
  145. 45.79 s gammaloop-nextest-core> 5: std[bcb96dfbba0ab899]::sys::backtrace::__rust_end_short_backtrace::<std[bcb96dfbba0ab899]::panicking::panic_handler::{closure#0}, !><unknown>
  146. 45.79 s gammaloop-nextest-core> at <unknown source file>:<unknown line>
  147. 45.79 s gammaloop-nextest-core> 6: __rustc[6c289b9f9c454d21]::rust_begin_unwind<unknown>
  148. 45.79 s gammaloop-nextest-core> at <unknown source file>:<unknown line>
  149. 45.79 s gammaloop-nextest-core> 7: core[940e698046960fd5]::panicking::panic_fmt<unknown>
  150. 45.79 s gammaloop-nextest-core> at <unknown source file>:<unknown line>
  151. 45.79 s gammaloop-nextest-core> 8: core[940e698046960fd5]::panicking::panic<unknown>
  152. 45.79 s gammaloop-nextest-core> at <unknown source file>:<unknown line>
  153. 45.79 s gammaloop-nextest-core> 9: <test_renormalization[5812939ef1a04d89]::finite_part_ghost_2loop::{closure#0} as core[940e698046960fd5]::ops::function::FnOnce<()>>::call_once<unknown>
  154. 45.79 s gammaloop-nextest-core> at <unknown source file>:<unknown line>
  155. 45.79 s gammaloop-nextest-core> 10: test[75d6903177b1d7e9]::__rust_begin_short_backtrace::<core[940e698046960fd5]::result::Result<(), alloc[2ea6bcb46fca0c42]::string::String>, fn() -> core[940e698046960fd5]::result::Result<(), alloc[2ea6bcb46fca0c42]::string::String>><unknown>
  156. 45.79 s gammaloop-nextest-core> at <unknown source file>:<unknown line>
  157. 45.79 s gammaloop-nextest-core> 11: test[75d6903177b1d7e9]::run_test::{closure#0}<unknown>
  158. 45.79 s gammaloop-nextest-core> at <unknown source file>:<unknown line>
  159. 45.79 s gammaloop-nextest-core> 12: std[bcb96dfbba0ab899]::sys::backtrace::__rust_begin_short_backtrace::<test[75d6903177b1d7e9]::run_test::{closure#1}, ()><unknown>
  160. 45.79 s gammaloop-nextest-core> at <unknown source file>:<unknown line>
  161. 45.79 s gammaloop-nextest-core> 13: <std[bcb96dfbba0ab899]::thread::lifecycle::spawn_unchecked<test[75d6903177b1d7e9]::run_test::{closure#1}, ()>::{closure#1} as core[940e698046960fd5]::ops::function::FnOnce<()>>::call_once::{shim:vtable#0}<unknown>
  162. 45.79 s gammaloop-nextest-core> at <unknown source file>:<unknown line>
  163. 45.79 s gammaloop-nextest-core> 14: <std[bcb96dfbba0ab899]::sys::thread::unix::Thread>::new::thread_start<unknown>
  164. 45.79 s gammaloop-nextest-core> at <unknown source file>:<unknown line>
  165. 45.79 s gammaloop-nextest-core> 15: start_thread<unknown>
  166. 45.79 s gammaloop-nextest-core> at <unknown source file>:<unknown line>
  167. 45.79 s gammaloop-nextest-core> 16: __clone3<unknown>
  168. 45.79 s gammaloop-nextest-core> at <unknown source file>:<unknown line>
  169. 45.79 s gammaloop-nextest-core>
  170. 45.79 s gammaloop-nextest-core> Run with COLORBT_SHOW_HIDDEN=1 environment variable to disable frame filtering.
  171. 45.79 s gammaloop-nextest-core> Run with RUST_BACKTRACE=full to include source snippets.
  172. 45.79 s gammaloop-nextest-core>
  173. 45.89 s gammaloop-nextest-core> error: test run failed
  174. 45.92 s gammaloop-nextest-core>
  175. 45.92 s gammaloop-nextest-core> ========== nextest test summary ==========
  176. 45.92 s gammaloop-nextest-core> report: target/nextest/ci_gammaloop/junit.xml
  177. 45.92 s gammaloop-nextest-core> tests: 705, failures: 1, errors: 0
  178. 45.92 s gammaloop-nextest-core>
  179. 45.92 s gammaloop-nextest-core> 1. gammalooprs::test_renormalization::finite_part_ghost_2loop
  180. 45.92 s gammaloop-nextest-core> failure: test failure with exit code 101
  181. 45.92 s gammaloop-nextest-core> system-out
  182. 45.92 s gammaloop-nextest-core> running 1 test
  183. 45.92 s gammaloop-nextest-core> test finite_part_ghost_2loop ... FAILED
  184. 45.92 s gammaloop-nextest-core>
  185. 45.92 s gammaloop-nextest-core> failures:
  186. 45.92 s gammaloop-nextest-core>
  187. 45.92 s gammaloop-nextest-core> failures:
  188. 45.92 s gammaloop-nextest-core> finite_part_ghost_2loop
  189. 45.92 s gammaloop-nextest-core>
  190. 45.92 s gammaloop-nextest-core> test result: FAILED. 0 passed; 1 failed; 0 ignored; 0 measured; 6 filtered out; finished in 3.13s
  191. 45.92 s gammaloop-nextest-core> system-err
  192. 45.92 s gammaloop-nextest-core> The application panicked (crashed).
  193. 45.92 s gammaloop-nextest-core> Message: assertion failed: (align_to_rqft(&a, &model) - expected).expand().is_zero()
  194. 45.92 s gammaloop-nextest-core> Location: crates/gammalooprs/tests/test_renormalization.rs:583
  195. 45.92 s gammaloop-nextest-core>
  196. 45.92 s gammaloop-nextest-core> ━━━━━━━━━━━━━━━━━━━━━━━━━━━━━━━━━━ BACKTRACE ━━━━━━━━━━━━━━━━━━━━━━━━━━━━━━━━━━━
  197. 45.92 s gammaloop-nextest-core> 1: <color_eyre[51793ea62743adbd]::config::PanicHook>::panic_report<unknown>
  198. 45.92 s gammaloop-nextest-core> at <unknown source file>:<unknown line>
  199. 45.92 s gammaloop-nextest-core> 2: <color_eyre[51793ea62743adbd]::config::PanicHook>::into_panic_hook::{closure#0}<unknown>
  200. 45.92 s gammaloop-nextest-core> at <unknown source file>:<unknown line>
  201. 45.92 s gammaloop-nextest-core> 3: std[bcb96dfbba0ab899]::panicking::panic_with_hook<unknown>
  202. 45.92 s gammaloop-nextest-core> at <unknown source file>:<unknown line>
  203. 45.92 s gammaloop-nextest-core> 4: std[bcb96dfbba0ab899]::panicking::panic_handler::{closure#0}<unknown>
  204. 45.92 s gammaloop-nextest-core> at <unknown source file>:<unknown line>
  205. 45.92 s gammaloop-nextest-core> 5: std[bcb96dfbba0ab899]::sys::backtrace::__rust_end_short_backtrace::<std[bcb96dfbba0ab899]::panicking::panic_handler::{closure#0}, !><unknown>
  206. 45.92 s gammaloop-nextest-core> at <unknown source file>:<unknown line>
  207. 45.92 s gammaloop-nextest-core> 6: __rustc[6c289b9f9c454d21]::rust_begin_unwind<unknown>
  208. 45.92 s gammaloop-nextest-core> at <unknown source file>:<unknown line>
  209. 45.92 s gammaloop-nextest-core> 7: core[940e698046960fd5]::panicking::panic_fmt<unknown>
  210. 45.92 s gammaloop-nextest-core> at <unknown source file>:<unknown line>
  211. 45.92 s gammaloop-nextest-core> 8: core[940e698046960fd5]::panicking::panic<unknown>
  212. 45.92 s gammaloop-nextest-core> at <unknown source file>:<unknown line>
  213. 45.92 s gammaloop-nextest-core> 9: <test_renormalization[5812939ef1a04d89]::finite_part_ghost_2loop::{closure#0} as core[940e698046960fd5]::ops::function::FnOnce<()>>::call_once<unknown>
  214. 45.92 s gammaloop-nextest-core> at <unknown source file>:<unknown line>
  215. 45.92 s gammaloop-nextest-core> 10: test[75d6903177b1d7e9]::__rust_begin_short_backtrace::<core[940e698046960fd5]::result::Result<(), alloc[2ea6bcb46fca0c42]::string::String>, fn() -> core[940e698046960fd5]::result::Result<(), alloc[2ea6bcb46fca0c42]::string::String>><unknown>
  216. 45.92 s gammaloop-nextest-core> at <unknown source file>:<unknown line>
  217. 45.92 s gammaloop-nextest-core> 11: test[75d6903177b1d7e9]::run_test::{closure#0}<unknown>
  218. 45.92 s gammaloop-nextest-core> at <unknown source file>:<unknown line>
  219. 45.92 s gammaloop-nextest-core> 12: std[bcb96dfbba0ab899]::sys::backtrace::__rust_begin_short_backtrace::<test[75d6903177b1d7e9]::run_test::{closure#1}, ()><unknown>
  220. 45.92 s gammaloop-nextest-core> at <unknown source file>:<unknown line>
  221. 45.92 s gammaloop-nextest-core> 13: <std[bcb96dfbba0ab899]::thread::lifecycle::spawn_unchecked<test[75d6903177b1d7e9]::run_test::{closure#1}, ()>::{closure#1} as core[940e698046960fd5]::ops::function::FnOnce<()>>::call_once::{shim:vtable#0}<unknown>
  222. 45.92 s gammaloop-nextest-core> at <unknown source file>:<unknown line>
  223. 45.92 s gammaloop-nextest-core> 14: <std[bcb96dfbba0ab899]::sys::thread::unix::Thread>::new::thread_start<unknown>
  224. 45.92 s gammaloop-nextest-core> at <unknown source file>:<unknown line>
  225. 45.92 s gammaloop-nextest-core> 15: start_thread<unknown>
  226. 45.92 s gammaloop-nextest-core> at <unknown source file>:<unknown line>
  227. 45.92 s gammaloop-nextest-core> 16: __clone3<unknown>
  228. 45.92 s gammaloop-nextest-core> at <unknown source file>:<unknown line>
  229. 45.92 s gammaloop-nextest-core>
  230. 45.92 s gammaloop-nextest-core> Run with COLORBT_SHOW_HIDDEN=1 environment variable to disable frame filtering.
  231. 45.92 s gammaloop-nextest-core> Run with RUST_BACKTRACE=full to include source snippets.
  232. 45.92 s gammaloop-nextest-core> =========================================
  233. 45.94 s gammaloop-nextest-core> Extracting 1 binary, 1 build script output directory, and 1 linked path to /build/nextest-archive-CaaIKU
  234. 46.03 s gammaloop-nextest-core> Extracted 7 files to /build/nextest-archive-CaaIKU in 0.09s
  235. 46.04 s gammaloop-nextest-core> ------------
  236. 46.04 s gammaloop-nextest-core> Nextest run ID 84f37e35-9a82-4889-8f13-cee4c626e668 with nextest profile: ci_gammaloop
  237. 46.04 s gammaloop-nextest-core> Starting 105 tests across 1 binary
  238. 65.84 s gammaloop-nextest-core> ------------
  239. 65.84 s gammaloop-nextest-core> Summary [ 19.794s] 105 tests run: 105 passed, 0 skipped
  240. 65.89 s gammaloop-nextest-core>
  241. 65.89 s gammaloop-nextest-core> ========== nextest test summary ==========
  242. 65.89 s gammaloop-nextest-core> report: target/nextest/ci_gammaloop/junit.xml
  243. 65.89 s gammaloop-nextest-core> tests: 105, failures: 0, errors: 0
  244. 65.89 s gammaloop-nextest-core> No failing testcases found.
  245. 65.89 s gammaloop-nextest-core> =========================================
  246. 65.94 s error: Cannot build '/nix/store/v0qh5n7q6ba5h5v37ywwp5q1jfzjvc33-gammaloop-nextest-core.drv'.
  247. 65.94 s Reason: builder failed with exit code 100.
  248. 65.94 s Output paths:
  249. 65.94 s /nix/store/q4cjrrnkw10yi6ir1lnvg6rhgm20mwwz-gammaloop-nextest-core
  250. 65.94 s Last 229 log lines:
  251. 65.94 s > Extracting 4 binaries (including 1 non-test binary), 1 build script output directory, and 2 linked paths to /build/nextest-archive-XlDxgK
  252. 65.94 s > Extracted 20 files to /build/nextest-archive-XlDxgK in 1.20s
  253. 65.94 s > ------------
  254. 65.94 s > Nextest run ID 10217cfd-6230-4e8a-a0a0-f0868c466843 with nextest profile: ci_gammaloop
  255. 65.94 s > Starting 379 tests across 3 binaries
  256. 65.94 s > ------------
  257. 65.94 s > Summary [ 1.818s] 379 tests run: 379 passed, 0 skipped
  258. 65.94 s >
  259. 65.94 s > ========== nextest test summary ==========
  260. 65.94 s > report: target/nextest/ci_gammaloop/junit.xml
  261. 65.94 s > tests: 379, failures: 0, errors: 0
  262. 65.94 s > No failing testcases found.
  263. 65.94 s > =========================================
  264. 65.94 s > Extracting 1 binary and 1 linked path to /build/nextest-archive-B06LiA
  265. 65.94 s > Extracted 7 files to /build/nextest-archive-B06LiA in 0.07s
  266. 65.94 s > ------------
  267. 65.94 s > Nextest run ID 674097be-269b-4669-a18d-6af54e002db3 with nextest profile: ci_gammaloop
  268. 65.94 s > Starting 19 tests across 1 binary
  269. 65.94 s > ------------
  270. 65.94 s > Summary [ 0.020s] 19 tests run: 19 passed, 0 skipped
  271. 65.94 s >
  272. 65.94 s > ========== nextest test summary ==========
  273. 65.94 s > report: target/nextest/ci_gammaloop/junit.xml
  274. 65.94 s > tests: 19, failures: 0, errors: 0
  275. 65.94 s > No failing testcases found.
  276. 65.94 s > =========================================
  277. 65.94 s > Extracting 1 binary to /build/nextest-archive-19S9Kk
  278. 65.94 s > Extracted 4 files to /build/nextest-archive-19S9Kk in 0.04s
  279. 65.94 s > ------------
  280. 65.94 s > Nextest run ID 6e593259-be55-4ce0-9d29-fd1476fcd7cc with nextest profile: ci_gammaloop
  281. 65.94 s > Starting 0 tests across 1 binary
  282. 65.94 s > ------------
  283. 65.94 s > Summary [ 0.000s] 0 tests run: 0 passed, 0 skipped
  284. 65.94 s >
  285. 65.94 s > ========== nextest test summary ==========
  286. 65.94 s > report: target/nextest/ci_gammaloop/junit.xml
  287. 65.94 s > tests: 0, failures: 0, errors: 0
  288. 65.94 s > No failing testcases found.
  289. 65.94 s > =========================================
  290. 65.94 s > Extracting 4 binaries, 1 build script output directory, and 2 linked paths to /build/nextest-archive-UN28bc
  291. 65.94 s > Extracted 18 files to /build/nextest-archive-UN28bc in 0.53s
  292. 65.94 s > ------------
  293. 65.94 s > Nextest run ID 1740d595-e6b2-4f53-bce8-f1f70787280c with nextest profile: ci_gammaloop
  294. 65.94 s > Starting 705 tests across 4 binaries (60 tests skipped, including 59 tests via profile.ci_gammaloop.default-filter)
  295. 65.94 s > FAIL [ 3.145s] (700/705) gammalooprs::test_renormalization finite_part_ghost_2loop
  296. 65.94 s > stdout ---
  297. 65.94 s >
  298. 65.94 s > running 1 test
  299. 65.94 s > test finite_part_ghost_2loop ... FAILED
  300. 65.94 s >
  301. 65.94 s > failures:
  302. 65.94 s >
  303. 65.94 s > failures:
  304. 65.94 s > finite_part_ghost_2loop
  305. 65.94 s >
  306. 65.94 s > test result: FAILED. 0 passed; 1 failed; 0 ignored; 0 measured; 6 filtered out; finished in 3.13s
  307. 65.94 s >
  308. 65.94 s > stderr ---
  309. 65.94 s > The application panicked (crashed).
  310. 65.94 s > Message: assertion failed: (align_to_rqft(&a, &model) - expected).expand().is_zero()
  311. 65.94 s > Location: crates/gammalooprs/tests/test_renormalization.rs:583
  312. 65.94 s >
  313. 65.94 s > ━━━━━━━━━━━━━━━━━━━━━━━━━━━━━━━━━━ BACKTRACE ━━━━━━━━━━━━━━━━━━━━━━━━━━━━━━━━━━━
  314. 65.94 s > 1: <color_eyre[51793ea62743adbd]::config::PanicHook>::panic_report<unknown>
  315. 65.94 s > at <unknown source file>:<unknown line>
  316. 65.94 s > 2: <color_eyre[51793ea62743adbd]::config::PanicHook>::into_panic_hook::{closure#0}<unknown>
  317. 65.94 s > at <unknown source file>:<unknown line>
  318. 65.94 s > 3: std[bcb96dfbba0ab899]::panicking::panic_with_hook<unknown>
  319. 65.94 s > at <unknown source file>:<unknown line>
  320. 65.94 s > 4: std[bcb96dfbba0ab899]::panicking::panic_handler::{closure#0}<unknown>
  321. 65.94 s > at <unknown source file>:<unknown line>
  322. 65.94 s > 5: std[bcb96dfbba0ab899]::sys::backtrace::__rust_end_short_backtrace::<std[bcb96dfbba0ab899]::panicking::panic_handler::{closure#0}, !><unknown>
  323. 65.94 s > at <unknown source file>:<unknown line>
  324. 65.94 s > 6: __rustc[6c289b9f9c454d21]::rust_begin_unwind<unknown>
  325. 65.94 s > at <unknown source file>:<unknown line>
  326. 65.94 s > 7: core[940e698046960fd5]::panicking::panic_fmt<unknown>
  327. 65.94 s > at <unknown source file>:<unknown line>
  328. 65.94 s > 8: core[940e698046960fd5]::panicking::panic<unknown>
  329. 65.94 s > at <unknown source file>:<unknown line>
  330. 65.94 s > 9: <test_renormalization[5812939ef1a04d89]::finite_part_ghost_2loop::{closure#0} as core[940e698046960fd5]::ops::function::FnOnce<()>>::call_once<unknown>
  331. 65.94 s > at <unknown source file>:<unknown line>
  332. 65.94 s > 10: test[75d6903177b1d7e9]::__rust_begin_short_backtrace::<core[940e698046960fd5]::result::Result<(), alloc[2ea6bcb46fca0c42]::string::String>, fn() -> core[940e698046960fd5]::result::Result<(), alloc[2ea6bcb46fca0c42]::string::String>><unknown>
  333. 65.94 s > at <unknown source file>:<unknown line>
  334. 65.94 s > 11: test[75d6903177b1d7e9]::run_test::{closure#0}<unknown>
  335. 65.94 s > at <unknown source file>:<unknown line>
  336. 65.94 s > 12: std[bcb96dfbba0ab899]::sys::backtrace::__rust_begin_short_backtrace::<test[75d6903177b1d7e9]::run_test::{closure#1}, ()><unknown>
  337. 65.94 s > at <unknown source file>:<unknown line>
  338. 65.94 s > 13: <std[bcb96dfbba0ab899]::thread::lifecycle::spawn_unchecked<test[75d6903177b1d7e9]::run_test::{closure#1}, ()>::{closure#1} as core[940e698046960fd5]::ops::function::FnOnce<()>>::call_once::{shim:vtable#0}<unknown>
  339. 65.94 s > at <unknown source file>:<unknown line>
  340. 65.94 s > 14: <std[bcb96dfbba0ab899]::sys::thread::unix::Thread>::new::thread_start<unknown>
  341. 65.94 s > at <unknown source file>:<unknown line>
  342. 65.94 s > 15: start_thread<unknown>
  343. 65.94 s > at <unknown source file>:<unknown line>
  344. 65.94 s > 16: __clone3<unknown>
  345. 65.94 s > at <unknown source file>:<unknown line>
  346. 65.94 s >
  347. 65.94 s > Run with COLORBT_SHOW_HIDDEN=1 environment variable to disable frame filtering.
  348. 65.94 s > Run with RUST_BACKTRACE=full to include source snippets.
  349. 65.94 s >
  350. 65.94 s > ------------
  351. 65.94 s > Summary [ 11.945s] 705 tests run: 704 passed, 1 failed, 60 skipped
  352. 65.94 s > FAIL [ 3.145s] (700/705) gammalooprs::test_renormalization finite_part_ghost_2loop
  353. 65.94 s > stdout ---
  354. 65.94 s >
  355. 65.94 s > running 1 test
  356. 65.94 s > test finite_part_ghost_2loop ... FAILED
  357. 65.94 s >
  358. 65.94 s > failures:
  359. 65.94 s >
  360. 65.94 s > failures:
  361. 65.94 s > finite_part_ghost_2loop
  362. 65.94 s >
  363. 65.94 s > test result: FAILED. 0 passed; 1 failed; 0 ignored; 0 measured; 6 filtered out; finished in 3.13s
  364. 65.94 s >
  365. 65.94 s > stderr ---
  366. 65.94 s > The application panicked (crashed).
  367. 65.94 s > Message: assertion failed: (align_to_rqft(&a, &model) - expected).expand().is_zero()
  368. 65.94 s > Location: crates/gammalooprs/tests/test_renormalization.rs:583
  369. 65.94 s >
  370. 65.94 s > ━━━━━━━━━━━━━━━━━━━━━━━━━━━━━━━━━━ BACKTRACE ━━━━━━━━━━━━━━━━━━━━━━━━━━━━━━━━━━━
  371. 65.94 s > 1: <color_eyre[51793ea62743adbd]::config::PanicHook>::panic_report<unknown>
  372. 65.94 s > at <unknown source file>:<unknown line>
  373. 65.94 s > 2: <color_eyre[51793ea62743adbd]::config::PanicHook>::into_panic_hook::{closure#0}<unknown>
  374. 65.94 s > at <unknown source file>:<unknown line>
  375. 65.94 s > 3: std[bcb96dfbba0ab899]::panicking::panic_with_hook<unknown>
  376. 65.94 s > at <unknown source file>:<unknown line>
  377. 65.94 s > 4: std[bcb96dfbba0ab899]::panicking::panic_handler::{closure#0}<unknown>
  378. 65.94 s > at <unknown source file>:<unknown line>
  379. 65.94 s > 5: std[bcb96dfbba0ab899]::sys::backtrace::__rust_end_short_backtrace::<std[bcb96dfbba0ab899]::panicking::panic_handler::{closure#0}, !><unknown>
  380. 65.94 s > at <unknown source file>:<unknown line>
  381. 65.94 s > 6: __rustc[6c289b9f9c454d21]::rust_begin_unwind<unknown>
  382. 65.94 s > at <unknown source file>:<unknown line>
  383. 65.94 s > 7: core[940e698046960fd5]::panicking::panic_fmt<unknown>
  384. 65.94 s > at <unknown source file>:<unknown line>
  385. 65.94 s > 8: core[940e698046960fd5]::panicking::panic<unknown>
  386. 65.94 s > at <unknown source file>:<unknown line>
  387. 65.94 s > 9: <test_renormalization[5812939ef1a04d89]::finite_part_ghost_2loop::{closure#0} as core[940e698046960fd5]::ops::function::FnOnce<()>>::call_once<unknown>
  388. 65.94 s > at <unknown source file>:<unknown line>
  389. 65.94 s > 10: test[75d6903177b1d7e9]::__rust_begin_short_backtrace::<core[940e698046960fd5]::result::Result<(), alloc[2ea6bcb46fca0c42]::string::String>, fn() -> core[940e698046960fd5]::result::Result<(), alloc[2ea6bcb46fca0c42]::string::String>><unknown>
  390. 65.94 s > at <unknown source file>:<unknown line>
  391. 65.94 s > 11: test[75d6903177b1d7e9]::run_test::{closure#0}<unknown>
  392. 65.94 s > at <unknown source file>:<unknown line>
  393. 65.94 s > 12: std[bcb96dfbba0ab899]::sys::backtrace::__rust_begin_short_backtrace::<test[75d6903177b1d7e9]::run_test::{closure#1}, ()><unknown>
  394. 65.94 s > at <unknown source file>:<unknown line>
  395. 65.94 s > 13: <std[bcb96dfbba0ab899]::thread::lifecycle::spawn_unchecked<test[75d6903177b1d7e9]::run_test::{closure#1}, ()>::{closure#1} as core[940e698046960fd5]::ops::function::FnOnce<()>>::call_once::{shim:vtable#0}<unknown>
  396. 65.94 s > at <unknown source file>:<unknown line>
  397. 65.94 s > 14: <std[bcb96dfbba0ab899]::sys::thread::unix::Thread>::new::thread_start<unknown>
  398. 65.94 s > at <unknown source file>:<unknown line>
  399. 65.94 s > 15: start_thread<unknown>
  400. 65.94 s > at <unknown source file>:<unknown line>
  401. 65.94 s > 16: __clone3<unknown>
  402. 65.94 s > at <unknown source file>:<unknown line>
  403. 65.94 s >
  404. 65.94 s > Run with COLORBT_SHOW_HIDDEN=1 environment variable to disable frame filtering.
  405. 65.94 s > Run with RUST_BACKTRACE=full to include source snippets.
  406. 65.94 s >
  407. 65.94 s > error: test run failed
  408. 65.94 s >
  409. 65.94 s > ========== nextest test summary ==========
  410. 65.94 s > report: target/nextest/ci_gammaloop/junit.xml
  411. 65.94 s > tests: 705, failures: 1, errors: 0
  412. 65.94 s >
  413. 65.94 s > 1. gammalooprs::test_renormalization::finite_part_ghost_2loop
  414. 65.94 s > failure: test failure with exit code 101
  415. 65.94 s > system-out
  416. 65.94 s > running 1 test
  417. 65.94 s > test finite_part_ghost_2loop ... FAILED
  418. 65.94 s >
  419. 65.94 s > failures:
  420. 65.94 s >
  421. 65.94 s > failures:
  422. 65.94 s > finite_part_ghost_2loop
  423. 65.94 s >
  424. 65.94 s > test result: FAILED. 0 passed; 1 failed; 0 ignored; 0 measured; 6 filtered out; finished in 3.13s
  425. 65.94 s > system-err
  426. 65.94 s > The application panicked (crashed).
  427. 65.94 s > Message: assertion failed: (align_to_rqft(&a, &model) - expected).expand().is_zero()
  428. 65.94 s > Location: crates/gammalooprs/tests/test_renormalization.rs:583
  429. 65.94 s >
  430. 65.94 s > ━━━━━━━━━━━━━━━━━━━━━━━━━━━━━━━━━━ BACKTRACE ━━━━━━━━━━━━━━━━━━━━━━━━━━━━━━━━━━━
  431. 65.94 s > 1: <color_eyre[51793ea62743adbd]::config::PanicHook>::panic_report<unknown>
  432. 65.94 s > at <unknown source file>:<unknown line>
  433. 65.94 s > 2: <color_eyre[51793ea62743adbd]::config::PanicHook>::into_panic_hook::{closure#0}<unknown>
  434. 65.94 s > at <unknown source file>:<unknown line>
  435. 65.94 s > 3: std[bcb96dfbba0ab899]::panicking::panic_with_hook<unknown>
  436. 65.94 s > at <unknown source file>:<unknown line>
  437. 65.94 s > 4: std[bcb96dfbba0ab899]::panicking::panic_handler::{closure#0}<unknown>
  438. 65.94 s > at <unknown source file>:<unknown line>
  439. 65.94 s > 5: std[bcb96dfbba0ab899]::sys::backtrace::__rust_end_short_backtrace::<std[bcb96dfbba0ab899]::panicking::panic_handler::{closure#0}, !><unknown>
  440. 65.94 s > at <unknown source file>:<unknown line>
  441. 65.94 s > 6: __rustc[6c289b9f9c454d21]::rust_begin_unwind<unknown>
  442. 65.94 s > at <unknown source file>:<unknown line>
  443. 65.94 s > 7: core[940e698046960fd5]::panicking::panic_fmt<unknown>
  444. 65.94 s > at <unknown source file>:<unknown line>
  445. 65.94 s > 8: core[940e698046960fd5]::panicking::panic<unknown>
  446. 65.94 s > at <unknown source file>:<unknown line>
  447. 65.94 s > 9: <test_renormalization[5812939ef1a04d89]::finite_part_ghost_2loop::{closure#0} as core[940e698046960fd5]::ops::function::FnOnce<()>>::call_once<unknown>
  448. 65.94 s > at <unknown source file>:<unknown line>
  449. 65.94 s > 10: test[75d6903177b1d7e9]::__rust_begin_short_backtrace::<core[940e698046960fd5]::result::Result<(), alloc[2ea6bcb46fca0c42]::string::String>, fn() -> core[940e698046960fd5]::result::Result<(), alloc[2ea6bcb46fca0c42]::string::String>><unknown>
  450. 65.94 s > at <unknown source file>:<unknown line>
  451. 65.94 s > 11: test[75d6903177b1d7e9]::run_test::{closure#0}<unknown>
  452. 65.94 s > at <unknown source file>:<unknown line>
  453. 65.94 s > 12: std[bcb96dfbba0ab899]::sys::backtrace::__rust_begin_short_backtrace::<test[75d6903177b1d7e9]::run_test::{closure#1}, ()><unknown>
  454. 65.94 s > at <unknown source file>:<unknown line>
  455. 65.94 s > 13: <std[bcb96dfbba0ab899]::thread::lifecycle::spawn_unchecked<test[75d6903177b1d7e9]::run_test::{closure#1}, ()>::{closure#1} as core[940e698046960fd5]::ops::function::FnOnce<()>>::call_once::{shim:vtable#0}<unknown>
  456. 65.94 s > at <unknown source file>:<unknown line>
  457. 65.94 s > 14: <std[bcb96dfbba0ab899]::sys::thread::unix::Thread>::new::thread_start<unknown>
  458. 65.94 s > at <unknown source file>:<unknown line>
  459. 65.94 s > 15: start_thread<unknown>
  460. 65.94 s > at <unknown source file>:<unknown line>
  461. 65.94 s > 16: __clone3<unknown>
  462. 65.94 s > at <unknown source file>:<unknown line>
  463. 65.94 s >
  464. 65.94 s > Run with COLORBT_SHOW_HIDDEN=1 environment variable to disable frame filtering.
  465. 65.94 s > Run with RUST_BACKTRACE=full to include source snippets.
  466. 65.94 s > =========================================
  467. 65.94 s > Extracting 1 binary, 1 build script output directory, and 1 linked path to /build/nextest-archive-CaaIKU
  468. 65.94 s > Extracted 7 files to /build/nextest-archive-CaaIKU in 0.09s
  469. 65.94 s > ------------
  470. 65.94 s > Nextest run ID 84f37e35-9a82-4889-8f13-cee4c626e668 with nextest profile: ci_gammaloop
  471. 65.94 s > Starting 105 tests across 1 binary
  472. 65.94 s > ------------
  473. 65.94 s > Summary [ 19.794s] 105 tests run: 105 passed, 0 skipped
  474. 65.94 s >
  475. 65.94 s > ========== nextest test summary ==========
  476. 65.94 s > report: target/nextest/ci_gammaloop/junit.xml
  477. 65.94 s > tests: 105, failures: 0, errors: 0
  478. 65.94 s > No failing testcases found.
  479. 65.94 s > =========================================
  480. 65.94 s For full logs, run:
  481. 65.94 s nix log /nix/store/v0qh5n7q6ba5h5v37ywwp5q1jfzjvc33-gammaloop-nextest-core.drv
  482. 66.10 s [0 built (1 failed), 0.0Run failed.