test packages.x86_64-linux.nix-ci-check-gammaloop-nextest-core

Reproduce this run
Original Run
  1. 0.72 s $ /nix/store/9ypz3flqsrl5xl495mm8h645gadjsxi1-coreutils-9.11/bin/timeout --kill-after=15s 7200s /nix/store/23zk8sgzamrbmj1fday15szf7f2279s8-nix-2.34.7/bin/nix --extra-experimental-features nix-command --extra-experimental-features flakes flake clone git+https://github.com/alphal00p/gammaloop --dest /tmp/nix-ci-worker/stable-pwd/repo/
  2. 0.81 s Cloning into '/tmp/nix-ci-worker/stable-pwd/repo'...
  3. 1.71 s remote: Enumerating objects: 85853, done.
  4. 1.81 s remote: Counting objects: 0% (1/8946) remote: Counting objects: 1% (90/8946) remote: Counting objects: 2% (179/8946) remote: Counting objects: 3% (269/8946) remote: Counting objects: 4% (358/8946) remote: Counting objects: 5% (448/8946) remote: Counting objects: 6% (537/8946) remote: Counting objects: 7% (627/8946) remote: Counting objects: 8% (716/8946) remote: Counting objects: 9% (806/8946) remote: Counting objects: 10% (895/8946) remote: Counting objects: 11% (985/8946) remote: Counting objects: 12% (1074/8946) remote: Counting objects: 13% (1163/8946) remote: Counting objects: 14% (1253/8946) remote: Counting objects: 15% (1342/8946) remote: Counting objects: 16% (1432/8946) remote: Counting objects: 17% (1521/8946) remote: Counting objects: 18% (1611/8946) remote: Counting objects: 19% (1700/8946) remote: Counting objects: 20% (1790/8946) remote: Counting objects: 21% (1879/8946) remote: Counting objects: 22% (1969/8946) remote: Counting objects: 23% (2058/8946) remote: Counting objects: 24% (2148/8946) remote: Counting objects: 25% (2237/8946) remote: Counting objects: 26% (2326/8946) remote: Counting objects: 27% (2416/8946) remote: Counting objects: 28% (2505/8946) remote: Counting objects: 29% (2595/8946) remote: Counting objects: 30% (2684/8946) remote: Counting objects: 31% (2774/8946) remote: Counting objects: 32% (2863/8946) remote: Counting objects: 33% (2953/8946) remote: Counting objects: 34% (3042/8946) remote: Counting objects: 35% (3132/8946) remote: Counting objects: 36% (3221/8946) remote: Counting objects: 37% (3311/8946) remote: Counting objects: 38% (3400/8946) remote: Counting objects: 39% (3489/8946) remote: Counting objects: 40% (3579/8946) remote: Counting objects: 41% (3668/8946) remote: Counting objects: 42% (3758/8946) remote: Counting objects: 43% (3847/8946) remote: Counting objects: 44% (3937/8946) remote: Counting objects: 45% (4026/8946) remote: Counting objects: 46% (4116/8946) remote: Counting objects: 47% (4205/8946) remote: Counting objects: 48% (4295/8946) remote: Counting objects: 49% (4384/8946) remote: Counting objects: 50% (4473/8946) remote: Counting objects: 51% (4563/8946) remote: Counting objects: 52% (4652/8946) remote: Counting objects: 53% (4742/8946) remote: Counting objects: 54% (4831/8946) remote: Counting objects: 55% (4921/8946) remote: Counting objects: 56% (5010/8946) remote: Counting objects: 57% (5100/8946) remote: Counting objects: 58% (5189/8946) remote: Counting objects: 59% (5279/8946) remote: Counting objects: 60% (5368/8946) remote: Counting objects: 61% (5458/8946) remote: Counting objects: 62% (5547/8946) remote: Counting objects: 63% (5636/8946) remote: Counting objects: 64% (5726/8946) remote: Counting objects: 65% (5815/8946) remote: Counting objects: 66% (5905/8946) remote: Counting objects: 67% (5994/8946) remote: Counting objects: 68% (6084/8946) remote: Counting objects: 69% (6173/8946) remote: Counting objects: 70% (6263/8946) remote: Counting objects: 71% (6352/8946) remote: Counting objects: 72% (6442/8946) remote: Counting objects: 73% (6531/8946) remote: Counting objects: 74% (6621/8946) remote: Counting objects: 75% (6710/8946) remote: Counting objects: 76% (6799/8946) remote: Counting objects: 77% (6889/8946) remote: Counting objects: 78% (6978/8946) remote: Counting objects: 79% (7068/8946) remote: Counting objects: 80% (7157/8946) remote: Counting objects: 81% (7247/8946) remote: Counting objects: 82% (7336/8946) remote: Counting objects: 83% (7426/8946) remote: Counting objects: 84% (7515/8946) remote: Counting objects: 85% (7605/8946) remote: Counting objects: 86% (7694/8946) remote: Counting objects: 87% (7784/8946) remote: Counting objects: 88% (7873/8946) remote: Counting objects: 89% (7962/8946) remote: Counting objects: 90% (8052/8946) remote: Counting objects: 91% (8141/8946) remote: Counting objects: 92% (8231/8946) remote: Counting objects: 93% (8320/8946) remote: Counting objects: 94% (8410/8946) remote: Counting objects: 95% (8499/8946) remote: Counting objects: 96% (8589/8946) remote: Counting objects: 97% (8678/8946) remote: Counting objects: 98% (8768/8946) remote: Counting objects: 99% (8857/8946) remote: Counting objects: 100% (8946/8946) remote: Counting objects: 100% (8946/8946), done.
  5. 3.76 s remote: Compressing objects: 0% (1/1974) remote: Compressing objects: 1% (20/1974) remote: Compressing objects: 2% (40/1974) remote: Compressing objects: 3% (60/1974) remote: Compressing objects: 4% (79/1974) remote: Compressing objects: 5% (99/1974) remote: Compressing objects: 6% (119/1974) remote: Compressing objects: 7% (139/1974) remote: Compressing objects: 8% (158/1974) remote: Compressing objects: 9% (178/1974) remote: Compressing objects: 10% (198/1974) remote: Compressing objects: 10% (211/1974) remote: Compressing objects: 11% (218/1974) remote: Compressing objects: 12% (237/1974) remote: Compressing objects: 13% (257/1974) remote: Compressing objects: 14% (277/1974) remote: Compressing objects: 15% (297/1974) remote: Compressing objects: 16% (316/1974) remote: Compressing objects: 17% (336/1974) remote: Compressing objects: 18% (356/1974) remote: Compressing objects: 19% (376/1974) remote: Compressing objects: 20% (395/1974) remote: Compressing objects: 21% (415/1974) remote: Compressing objects: 22% (435/1974) remote: Compressing objects: 23% (455/1974) remote: Compressing objects: 24% (474/1974) remote: Compressing objects: 25% (494/1974) remote: Compressing objects: 26% (514/1974) remote: Compressing objects: 27% (533/1974) remote: Compressing objects: 28% (553/1974) remote: Compressing objects: 29% (573/1974) remote: Compressing objects: 30% (593/1974) remote: Compressing objects: 31% (612/1974) remote: Compressing objects: 32% (632/1974) remote: Compressing objects: 33% (652/1974) remote: Compressing objects: 34% (672/1974) remote: Compressing objects: 35% (691/1974) remote: Compressing objects: 36% (711/1974) remote: Compressing objects: 37% (731/1974) remote: Compressing objects: 38% (751/1974) remote: Compressing objects: 39% (770/1974) remote: Compressing objects: 40% (790/1974) remote: Compressing objects: 41% (810/1974) remote: Compressing objects: 42% (830/1974) remote: Compressing objects: 43% (849/1974) remote: Compressing objects: 44% (869/1974) remote: Compressing objects: 45% (889/1974) remote: Compressing objects: 46% (909/1974) remote: Compressing objects: 47% (928/1974) remote: Compressing objects: 48% (948/1974) remote: Compressing objects: 49% (968/1974) remote: Compressing objects: 50% (987/1974) remote: Compressing objects: 51% (1007/1974) remote: Compressing objects: 51% (1011/1974) remote: Compressing objects: 52% (1027/1974) remote: Compressing objects: 53% (1047/1974) remote: Compressing objects: 54% (1066/1974) remote: Compressing objects: 55% (1086/1974) remote: Compressing objects: 56% (1106/1974) remote: Compressing objects: 57% (1126/1974) remote: Compressing objects: 58% (1145/1974) remote: Compressing objects: 59% (1165/1974) remote: Compressing objects: 60% (1185/1974) remote: Compressing objects: 61% (1205/1974) remote: Compressing objects: 62% (1224/1974) remote: Compressing objects: 63% (1244/1974) remote: Compressing objects: 64% (1264/1974) remote: Compressing objects: 65% (1284/1974) remote: Compressing objects: 66% (1303/1974) remote: Compressing objects: 67% (1323/1974) remote: Compressing objects: 68% (1343/1974) remote: Compressing objects: 69% (1363/1974) remote: Compressing objects: 70% (1382/1974) remote: Compressing objects: 71% (1402/1974) remote: Compressing objects: 72% (1422/1974) remote: Compressing objects: 73% (1442/1974) remote: Compressing objects: 74% (1461/1974) remote: Compressing objects: 75% (1481/1974) remote: Compressing objects: 76% (1501/1974) remote: Compressing objects: 77% (1520/1974) remote: Compressing objects: 78% (1540/1974) remote: Compressing objects: 79% (1560/1974) remote: Compressing objects: 80% (1580/1974) remote: Compressing objects: 81% (1599/1974) remote: Compressing objects: 82% (1619/1974) remote: Compressing objects: 83% (1639/1974) remote: Compressing objects: 84% (1659/1974) remote: Compressing objects: 85% (1678/1974) remote: Compressing objects: 86% (1698/1974) remote: Compressing objects: 87% (1718/1974) remote: Compressing objects: 88% (1738/1974) remote: Compressing objects: 89% (1757/1974) remote: Compressing objects: 90% (1777/1974) remote: Compressing objects: 91% (1797/1974) remote: Compressing objects: 92% (1817/1974) remote: Compressing objects: 93% (1836/1974) remote: Compressing objects: 94% (1856/1974) remote: Compressing objects: 95% (1876/1974) remote: Compressing objects: 96% (1896/1974) remote: Compressing objects: 97% (1915/1974) remote: Compressing objects: 98% (1935/1974) remote: Compressing objects: 99% (1955/1974) remote: Compressing objects: 100% (1974/1974) remote: Compressing objects: 100% (1974/1974), done.
  6. 8.02 s Receiving objects: 0% (1/85853) Receiving objects: 1% (859/85853) Receiving objects: 2% (1718/85853) Receiving objects: 3% (2576/85853) Receiving objects: 4% (3435/85853) Receiving objects: 5% (4293/85853) Receiving objects: 6% (5152/85853) Receiving objects: 7% (6010/85853) Receiving objects: 8% (6869/85853) Receiving objects: 9% (7727/85853), 14.34 MiB | 28.66 MiB/s Receiving objects: 10% (8586/85853), 14.34 MiB | 28.66 MiB/s Receiving objects: 11% (9444/85853), 14.34 MiB | 28.66 MiB/s Receiving objects: 12% (10303/85853), 14.34 MiB | 28.66 MiB/s Receiving objects: 13% (11161/85853), 14.34 MiB | 28.66 MiB/s Receiving objects: 14% (12020/85853), 14.34 MiB | 28.66 MiB/s Receiving objects: 15% (12878/85853), 14.34 MiB | 28.66 MiB/s Receiving objects: 16% (13737/85853), 14.34 MiB | 28.66 MiB/s Receiving objects: 17% (14596/85853), 14.34 MiB | 28.66 MiB/s Receiving objects: 18% (15454/85853), 14.34 MiB | 28.66 MiB/s Receiving objects: 19% (16313/85853), 14.34 MiB | 28.66 MiB/s Receiving objects: 20% (17171/85853), 14.34 MiB | 28.66 MiB/s Receiving objects: 21% (18030/85853), 14.34 MiB | 28.66 MiB/s Receiving objects: 22% (18888/85853), 14.34 MiB | 28.66 MiB/s Receiving objects: 23% (19747/85853), 14.34 MiB | 28.66 MiB/s Receiving objects: 24% (20605/85853), 14.34 MiB | 28.66 MiB/s Receiving objects: 25% (21464/85853), 14.34 MiB | 28.66 MiB/s Receiving objects: 26% (22322/85853), 14.34 MiB | 28.66 MiB/s Receiving objects: 27% (23181/85853), 14.34 MiB | 28.66 MiB/s Receiving objects: 28% (24039/85853), 14.34 MiB | 28.66 MiB/s Receiving objects: 29% (24898/85853), 14.34 MiB | 28.66 MiB/s Receiving objects: 30% (25756/85853), 14.34 MiB | 28.66 MiB/s Receiving objects: 31% (26615/85853), 14.34 MiB | 28.66 MiB/s Receiving objects: 32% (27473/85853), 14.34 MiB | 28.66 MiB/s Receiving objects: 33% (28332/85853), 14.34 MiB | 28.66 MiB/s Receiving objects: 34% (29191/85853), 14.34 MiB | 28.66 MiB/s Receiving objects: 35% (30049/85853), 14.34 MiB | 28.66 MiB/s Receiving objects: 36% (30908/85853), 14.34 MiB | 28.66 MiB/s Receiving objects: 37% (31766/85853), 14.34 MiB | 28.66 MiB/s Receiving objects: 38% (32625/85853), 14.34 MiB | 28.66 MiB/s Receiving objects: 39% (33483/85853), 14.34 MiB | 28.66 MiB/s Receiving objects: 40% (34342/85853), 14.34 MiB | 28.66 MiB/s Receiving objects: 40% (34674/85853), 33.69 MiB | 33.68 MiB/s Receiving objects: 41% (35200/85853), 33.69 MiB | 33.68 MiB/s Receiving objects: 42% (36059/85853), 33.69 MiB | 33.68 MiB/s Receiving objects: 43% (36917/85853), 33.69 MiB | 33.68 MiB/s Receiving objects: 44% (37776/85853), 33.69 MiB | 33.68 MiB/s Receiving objects: 45% (38634/85853), 33.69 MiB | 33.68 MiB/s Receiving objects: 46% (39493/85853), 33.69 MiB | 33.68 MiB/s Receiving objects: 47% (40351/85853), 33.69 MiB | 33.68 MiB/s Receiving objects: 48% (41210/85853), 33.69 MiB | 33.68 MiB/s Receiving objects: 49% (42068/85853), 33.69 MiB | 33.68 MiB/s Receiving objects: 50% (42927/85853), 33.69 MiB | 33.68 MiB/s Receiving objects: 51% (43786/85853), 51.61 MiB | 34.40 MiB/s Receiving objects: 52% (44644/85853), 51.61 MiB | 34.40 MiB/s Receiving objects: 53% (45503/85853), 51.61 MiB | 34.40 MiB/s Receiving objects: 54% (46361/85853), 51.61 MiB | 34.40 MiB/s Receiving objects: 55% (47220/85853), 51.61 MiB | 34.40 MiB/s Receiving objects: 56% (48078/85853), 51.61 MiB | 34.40 MiB/s Receiving objects: 57% (48937/85853), 51.61 MiB | 34.40 MiB/s Receiving objects: 58% (49795/85853), 51.61 MiB | 34.40 MiB/s Receiving objects: 58% (50245/85853), 70.51 MiB | 35.25 MiB/s Receiving objects: 59% (50654/85853), 70.51 MiB | 35.25 MiB/s Receiving objects: 60% (51512/85853), 70.51 MiB | 35.25 MiB/s Receiving objects: 61% (52371/85853), 70.51 MiB | 35.25 MiB/s Receiving objects: 62% (53229/85853), 70.51 MiB | 35.25 MiB/s Receiving objects: 63% (54088/85853), 70.51 MiB | 35.25 MiB/s Receiving objects: 64% (54946/85853), 70.51 MiB | 35.25 MiB/s Receiving objects: 65% (55805/85853), 70.51 MiB | 35.25 MiB/s Receiving objects: 66% (56663/85853), 70.51 MiB | 35.25 MiB/s Receiving objects: 67% (57522/85853), 89.87 MiB | 35.79 MiB/s Receiving objects: 68% (58381/85853), 89.87 MiB | 35.79 MiB/s Receiving objects: 69% (59239/85853), 89.87 MiB | 35.79 MiB/s Receiving objects: 69% (59400/85853), 89.87 MiB | 35.79 MiB/s Receiving objects: 70% (60098/85853), 109.43 MiB | 36.22 MiB/s Receiving objects: 71% (60956/85853), 109.43 MiB | 36.22 MiB/s Receiving objects: 72% (61815/85853), 109.43 MiB | 36.22 MiB/s Receiving objects: 73% (62673/85853), 109.43 MiB | 36.22 MiB/s Receiving objects: 74% (63532/85853), 109.43 MiB | 36.22 MiB/s Receiving objects: 75% (64390/85853), 128.50 MiB | 36.40 MiB/s Receiving objects: 76% (65249/85853), 128.50 MiB | 36.40 MiB/s Receiving objects: 77% (66107/85853), 128.50 MiB | 36.40 MiB/s Receiving objects: 78% (66966/85853), 128.50 MiB | 36.40 MiB/s Receiving objects: 79% (67824/85853), 128.50 MiB | 36.40 MiB/s Receiving objects: 80% (68683/85853), 128.50 MiB | 36.40 MiB/s Receiving objects: 81% (69541/85853), 128.50 MiB | 36.40 MiB/s Receiving objects: 82% (70400/85853), 128.50 MiB | 36.40 MiB/s Receiving objects: 83% (71258/85853), 128.50 MiB | 36.40 MiB/s Receiving objects: 84% (72117/85853), 128.50 MiB | 36.40 MiB/s Receiving objects: 85% (72976/85853), 128.50 MiB | 36.40 MiB/s Receiving objects: 86% (73834/85853), 128.50 MiB | 36.40 MiB/s Receiving objects: 86% (74223/85853), 128.50 MiB | 36.40 MiB/s Receiving objects: 87% (74693/85853), 128.50 MiB | 36.40 MiB/s Receiving objects: 88% (75551/85853), 128.50 MiB | 36.40 MiB/s Receiving objects: 89% (76410/85853), 147.86 MiB | 36.59 MiB/s Receiving objects: 90% (77268/85853), 147.86 MiB | 36.59 MiB/s Receiving objects: 91% (78127/85853), 147.86 MiB | 36.59 MiB/s Receiving objects: 92% (78985/85853), 147.86 MiB | 36.59 MiB/s Receiving objects: 93% (79844/85853), 147.86 MiB | 36.59 MiB/s Receiving objects: 94% (80702/85853), 147.86 MiB | 36.59 MiB/s Receiving objects: 95% (81561/85853), 147.86 MiB | 36.59 MiB/s Receiving objects: 96% (82419/85853), 147.86 MiB | 36.59 MiB/s Receiving objects: 97% (83278/85853), 147.86 MiB | 36.59 MiB/s Receiving objects: 98% (84136/85853), 147.86 MiB | 36.59 MiB/s Receiving objects: 99% (84995/85853), 147.86 MiB | 36.59 MiB/s remote: Total 85853 (delta 7781), reused 7073 (delta 6972), pack-reused 76907 (from 3)
  7. 8.02 s Receiving objects: 100% (85853/85853), 147.86 MiB | 36.59 MiB/s Receiving objects: 100% (85853/85853), 155.75 MiB | 36.63 MiB/s, done.
  8. 10.17 s Resolving deltas: 0% (0/58229) Resolving deltas: 1% (583/58229) Resolving deltas: 2% (1165/58229) Resolving deltas: 3% (1747/58229) Resolving deltas: 4% (2331/58229) Resolving deltas: 5% (2912/58229) Resolving deltas: 6% (3494/58229) Resolving deltas: 7% (4077/58229) Resolving deltas: 8% (4659/58229) Resolving deltas: 9% (5241/58229) Resolving deltas: 10% (5823/58229) Resolving deltas: 11% (6406/58229) Resolving deltas: 12% (6988/58229) Resolving deltas: 13% (7570/58229) Resolving deltas: 14% (8153/58229) Resolving deltas: 15% (8735/58229) Resolving deltas: 16% (9317/58229) Resolving deltas: 17% (9899/58229) Resolving deltas: 18% (10482/58229) Resolving deltas: 19% (11064/58229) Resolving deltas: 20% (11646/58229) Resolving deltas: 21% (12229/58229) Resolving deltas: 22% (12811/58229) Resolving deltas: 23% (13393/58229) Resolving deltas: 24% (13975/58229) Resolving deltas: 25% (14558/58229) Resolving deltas: 26% (15140/58229) Resolving deltas: 27% (15722/58229) Resolving deltas: 28% (16306/58229) Resolving deltas: 29% (16887/58229) Resolving deltas: 30% (17469/58229) Resolving deltas: 31% (18051/58229) Resolving deltas: 32% (18635/58229) Resolving deltas: 33% (19216/58229) Resolving deltas: 34% (19798/58229) Resolving deltas: 35% (20381/58229) Resolving deltas: 36% (20963/58229) Resolving deltas: 37% (21545/58229) Resolving deltas: 38% (22129/58229) Resolving deltas: 39% (22710/58229) Resolving deltas: 40% (23292/58229) Resolving deltas: 41% (23874/58229) Resolving deltas: 42% (24457/58229) Resolving deltas: 43% (25039/58229) Resolving deltas: 44% (25621/58229) Resolving deltas: 45% (26204/58229) Resolving deltas: 46% (26786/58229) Resolving deltas: 47% (27368/58229) Resolving deltas: 48% (27952/58229) Resolving deltas: 49% (28533/58229) Resolving deltas: 50% (29115/58229) Resolving deltas: 51% (29697/58229) Resolving deltas: 52% (30280/58229) Resolving deltas: 53% (30862/58229) Resolving deltas: 54% (31444/58229) Resolving deltas: 55% (32026/58229) Resolving deltas: 56% (32609/58229) Resolving deltas: 57% (33191/58229) Resolving deltas: 57% (33330/58229) Resolving deltas: 58% (33773/58229) Resolving deltas: 59% (34356/58229) Resolving deltas: 60% (34938/58229) Resolving deltas: 61% (35520/58229) Resolving deltas: 62% (36102/58229) Resolving deltas: 63% (36685/58229) Resolving deltas: 64% (37267/58229) Resolving deltas: 65% (37849/58229) Resolving deltas: 66% (38432/58229) Resolving deltas: 67% (39014/58229) Resolving deltas: 68% (39596/58229) Resolving deltas: 69% (40179/58229) Resolving deltas: 70% (40761/58229) Resolving deltas: 71% (41343/58229) Resolving deltas: 72% (41927/58229) Resolving deltas: 73% (42508/58229) Resolving deltas: 74% (43090/58229) Resolving deltas: 75% (43672/58229) Resolving deltas: 76% (44255/58229) Resolving deltas: 77% (44837/58229) Resolving deltas: 78% (45419/58229) Resolving deltas: 79% (46001/58229) Resolving deltas: 80% (46584/58229) Resolving deltas: 81% (47167/58229) Resolving deltas: 82% (47748/58229) Resolving deltas: 83% (48331/58229) Resolving deltas: 84% (48913/58229) Resolving deltas: 85% (49495/58229) Resolving deltas: 86% (50077/58229) Resolving deltas: 87% (50660/58229) Resolving deltas: 88% (51242/58229) Resolving deltas: 89% (51824/58229) Resolving deltas: 90% (52407/58229) Resolving deltas: 91% (52989/58229) Resolving deltas: 92% (53571/58229) Resolving deltas: 93% (54153/58229) Resolving deltas: 93% (54331/58229) Resolving deltas: 94% (54736/58229) Resolving deltas: 95% (55318/58229) Resolving deltas: 96% (55900/58229) Resolving deltas: 97% (56483/58229) Resolving deltas: 98% (57067/58229) Resolving deltas: 99% (57647/58229) Resolving deltas: 100% (58229/58229) Resolving deltas: 100% (58229/58229), done.
  9. 11.03 s Fetching commit 4e06fb2318cda07e694491bfaf5755da9d23fc5a for faster_uv_from_4d ...
  10. 11.03 s $ /nix/store/bcnisk3ydfgv26v2gw3zlky24g00yww2-git-2.54.0/bin/git fetch origin 4e06fb2318cda07e694491bfaf5755da9d23fc5a
  11. 11.58 s From https://github.com/alphal00p/gammaloop
  12. 11.58 s * branch 4e06fb2318cda07e694491bfaf5755da9d23fc5a -> FETCH_HEAD
  13. 11.62 s $ /nix/store/9ypz3flqsrl5xl495mm8h645gadjsxi1-coreutils-9.11/bin/timeout --kill-after=15s 7200s /nix/store/bcnisk3ydfgv26v2gw3zlky24g00yww2-git-2.54.0/bin/git -c advice.detachedHead=false checkout 4e06fb2318cda07e694491bfaf5755da9d23fc5a
  14. 11.99 s HEAD is now at 4e06fb231 allow explicit finite memory watchdog limits
  15. 12.00 s $ /nix/store/9ypz3flqsrl5xl495mm8h645gadjsxi1-coreutils-9.11/bin/timeout --kill-after=15s 7200s /nix/store/23zk8sgzamrbmj1fday15szf7f2279s8-nix-2.34.7/bin/nix --extra-experimental-features nix-command --extra-experimental-features flakes --log-format internal-json run .#packages.x86_64-linux.nix-ci-check-gammaloop-nextest-core --print-build-logs
  16. 18.92 s
  17. 18.98 s Downloading cached gammaloop-nextest-binaries-core-gammalooprs from https://cache.nix-ci.com
  18. 18.98 s Downloading cached gammaloop-nextest-binaries-core-gammaloop-tracing-filter from https://cache.nix-ci.com
  19. 18.99 s Downloading cached gammaloop-nextest-binaries-core-gammaloop-api from https://cache.nix-ci.com
  20. 19.24 s Downloaded cached gammaloop-nextest-binaries-core-gammaloop-tracing-filter (8.1 MiB) in 257ms
  21. 19.24 s Progress: 0 of 1 built, 1 of 5 downloaded from cache (2 downloading)
  22. 20.67 s Downloaded cached gammaloop-nextest-binaries-core-gammalooprs (88.1 MiB) in 1.6s
  23. 20.67 s Progress: 0 of 1 built, 2 of 5 downloaded from cache (1 downloading)
  24. 21.00 s Downloaded cached gammaloop-nextest-binaries-core-gammaloop-api (120.9 MiB) in 2.0s
  25. 21.00 s Progress: 0 of 1 built, 3 of 5 downloaded from cache
  26. 21.00 s Downloading cached gammaloop-nextest-binaries-core from https://cache.nix-ci.com
  27. 21.02 s Downloaded cached gammaloop-nextest-binaries-core (2032 B) in 11ms
  28. 21.02 s Progress: 0 of 1 built, 4 of 5 downloaded from cache
  29. 21.02 s Downloading cached nix-ci-check-gammaloop-nextest-core from https://cache.nix-ci.com
  30. 21.03 s Downloaded cached nix-ci-check-gammaloop-nextest-core (1016 B) in 12ms
  31. 21.03 s Progress: 0 of 1 built, 5 of 5 downloaded from cache
  32. 27.86 s evaluating derivation 'g copying '/nix/store/4yw3 evaluating derivation 'g copying '/nix/store/4yw3 evaluating derivation 'g copying '/nix/store/4yw3 evaluating derivation 'g copying '/nix/store/4yw3 evaluating derivation 'g copying '/nix/store/4yw3 evaluating derivation 'g copying '/nix/store/4yw3 evaluating derivation 'g copying '/nix/store/4yw3 evaluating derivation 'g copying '/nix/store/4yw3 evaluating derivation 'g copying '/nix/store/4yw3 evaluating derivation 'g copying '/nix/store/4yw3 evaluating derivation 'g querying gammaloop-nexte [0/1 built, 0.0 KiB DL] [1/0/1 built, 0.0 KiB DLgammaloop-nextest-core> Extracting 4 binaries (including 1 non-test binary), 1 build script output directory, and 2 linked paths to /build/nextest-archive-WzINIX
  33. 28.64 s gammaloop-nextest-core> Extracted 20 files to /build/nextest-archive-WzINIX in 0.79s
  34. 28.66 s gammaloop-nextest-core> ------------
  35. 28.66 s gammaloop-nextest-core> Nextest run ID 94bfdc91-6527-42d7-8ea1-6c62554c9734 with nextest profile: ci_gammaloop
  36. 28.66 s gammaloop-nextest-core> Starting 379 tests across 3 binaries
  37. 30.13 s gammaloop-nextest-core> ------------
  38. 30.13 s gammaloop-nextest-core> Summary [ 1.469s] 379 tests run: 379 passed, 0 skipped
  39. 30.27 s gammaloop-nextest-core>
  40. 30.27 s gammaloop-nextest-core> ========== nextest test summary ==========
  41. 30.27 s gammaloop-nextest-core> report: target/nextest/ci_gammaloop/junit.xml
  42. 30.27 s gammaloop-nextest-core> tests: 379, failures: 0, errors: 0
  43. 30.27 s gammaloop-nextest-core> No failing testcases found.
  44. 30.27 s gammaloop-nextest-core> =========================================
  45. 30.28 s gammaloop-nextest-core> Extracting 1 binary and 1 linked path to /build/nextest-archive-ruurlA
  46. 30.34 s gammaloop-nextest-core> Extracted 7 files to /build/nextest-archive-ruurlA in 0.07s
  47. 30.35 s gammaloop-nextest-core> ------------
  48. 30.35 s gammaloop-nextest-core> Nextest run ID 938f7ed4-167f-47a9-b771-8ecac78c8047 with nextest profile: ci_gammaloop
  49. 30.35 s gammaloop-nextest-core> Starting 19 tests across 1 binary
  50. 30.37 s gammaloop-nextest-core> ------------
  51. 30.37 s gammaloop-nextest-core> Summary [ 0.013s] 19 tests run: 19 passed, 0 skipped
  52. 30.41 s gammaloop-nextest-core>
  53. 30.41 s gammaloop-nextest-core> ========== nextest test summary ==========
  54. 30.41 s gammaloop-nextest-core> report: target/nextest/ci_gammaloop/junit.xml
  55. 30.41 s gammaloop-nextest-core> tests: 19, failures: 0, errors: 0
  56. 30.41 s gammaloop-nextest-core> No failing testcases found.
  57. 30.41 s gammaloop-nextest-core> =========================================
  58. 30.42 s gammaloop-nextest-core> Extracting 1 binary to /build/nextest-archive-OH5562
  59. 30.45 s gammaloop-nextest-core> Extracted 4 files to /build/nextest-archive-OH5562 in 0.03s
  60. 30.46 s gammaloop-nextest-core> ------------
  61. 30.46 s gammaloop-nextest-core> Nextest run ID 5fdeb49b-2bbc-4387-9bcc-3e8b064ec07b with nextest profile: ci_gammaloop
  62. 30.46 s gammaloop-nextest-core> Starting 0 tests across 1 binary
  63. 30.46 s gammaloop-nextest-core> ------------
  64. 30.46 s gammaloop-nextest-core> Summary [ 0.000s] 0 tests run: 0 passed, 0 skipped
  65. 30.49 s gammaloop-nextest-core>
  66. 30.49 s gammaloop-nextest-core> ========== nextest test summary ==========
  67. 30.49 s gammaloop-nextest-core> report: target/nextest/ci_gammaloop/junit.xml
  68. 30.49 s gammaloop-nextest-core> tests: 0, failures: 0, errors: 0
  69. 30.49 s gammaloop-nextest-core> No failing testcases found.
  70. 30.49 s gammaloop-nextest-core> =========================================
  71. 30.51 s gammaloop-nextest-core> Extracting 4 binaries, 1 build script output directory, and 2 linked paths to /build/nextest-archive-GgsPjq
  72. 31.00 s gammaloop-nextest-core> Extracted 18 files to /build/nextest-archive-GgsPjq in 0.49s
  73. 31.01 s gammaloop-nextest-core> ------------
  74. 31.01 s gammaloop-nextest-core> Nextest run ID 7b15bc65-ef86-46e1-a168-eb59d70538f3 with nextest profile: ci_gammaloop
  75. 31.01 s gammaloop-nextest-core> Starting 705 tests across 4 binaries (60 tests skipped, including 59 tests via profile.ci_gammaloop.default-filter)
  76. 43.36 s gammaloop-nextest-core> FAIL [ 6.058s] (699/705) gammalooprs::test_renormalization finite_part_ghost_2loop
  77. 43.36 s gammaloop-nextest-core> stdout ---
  78. 43.36 s gammaloop-nextest-core>
  79. 43.36 s gammaloop-nextest-core> running 1 test
  80. 43.36 s gammaloop-nextest-core> test finite_part_ghost_2loop ... FAILED
  81. 43.36 s gammaloop-nextest-core>
  82. 43.36 s gammaloop-nextest-core> failures:
  83. 43.36 s gammaloop-nextest-core>
  84. 43.36 s gammaloop-nextest-core> failures:
  85. 43.36 s gammaloop-nextest-core> finite_part_ghost_2loop
  86. 43.36 s gammaloop-nextest-core>
  87. 43.36 s gammaloop-nextest-core> test result: FAILED. 0 passed; 1 failed; 0 ignored; 0 measured; 6 filtered out; finished in 6.05s
  88. 43.36 s gammaloop-nextest-core>
  89. 43.36 s gammaloop-nextest-core> stderr ---
  90. 43.36 s gammaloop-nextest-core> The application panicked (crashed).
  91. 43.36 s gammaloop-nextest-core> Message: assertion failed: (align_to_rqft(&a, &model) - expected).expand().is_zero()
  92. 43.36 s gammaloop-nextest-core> Location: crates/gammalooprs/tests/test_renormalization.rs:583
  93. 43.36 s gammaloop-nextest-core>
  94. 43.36 s gammaloop-nextest-core> ━━━━━━━━━━━━━━━━━━━━━━━━━━━━━━━━━━ BACKTRACE ━━━━━━━━━━━━━━━━━━━━━━━━━━━━━━━━━━━
  95. 43.36 s gammaloop-nextest-core> 1: <color_eyre[51793ea62743adbd]::config::PanicHook>::panic_report<unknown>
  96. 43.36 s gammaloop-nextest-core> at <unknown source file>:<unknown line>
  97. 43.36 s gammaloop-nextest-core> 2: <color_eyre[51793ea62743adbd]::config::PanicHook>::into_panic_hook::{closure#0}<unknown>
  98. 43.36 s gammaloop-nextest-core> at <unknown source file>:<unknown line>
  99. 43.36 s gammaloop-nextest-core> 3: std[bcb96dfbba0ab899]::panicking::panic_with_hook<unknown>
  100. 43.36 s gammaloop-nextest-core> at <unknown source file>:<unknown line>
  101. 43.36 s gammaloop-nextest-core> 4: std[bcb96dfbba0ab899]::panicking::panic_handler::{closure#0}<unknown>
  102. 43.36 s gammaloop-nextest-core> at <unknown source file>:<unknown line>
  103. 43.36 s gammaloop-nextest-core> 5: std[bcb96dfbba0ab899]::sys::backtrace::__rust_end_short_backtrace::<std[bcb96dfbba0ab899]::panicking::panic_handler::{closure#0}, !><unknown>
  104. 43.36 s gammaloop-nextest-core> at <unknown source file>:<unknown line>
  105. 43.36 s gammaloop-nextest-core> 6: __rustc[6c289b9f9c454d21]::rust_begin_unwind<unknown>
  106. 43.36 s gammaloop-nextest-core> at <unknown source file>:<unknown line>
  107. 43.36 s gammaloop-nextest-core> 7: core[940e698046960fd5]::panicking::panic_fmt<unknown>
  108. 43.36 s gammaloop-nextest-core> at <unknown source file>:<unknown line>
  109. 43.36 s gammaloop-nextest-core> 8: core[940e698046960fd5]::panicking::panic<unknown>
  110. 43.36 s gammaloop-nextest-core> at <unknown source file>:<unknown line>
  111. 43.36 s gammaloop-nextest-core> 9: <test_renormalization[5812939ef1a04d89]::finite_part_ghost_2loop::{closure#0} as core[940e698046960fd5]::ops::function::FnOnce<()>>::call_once<unknown>
  112. 43.36 s gammaloop-nextest-core> at <unknown source file>:<unknown line>
  113. 43.36 s gammaloop-nextest-core> 10: test[75d6903177b1d7e9]::__rust_begin_short_backtrace::<core[940e698046960fd5]::result::Result<(), alloc[2ea6bcb46fca0c42]::string::String>, fn() -> core[940e698046960fd5]::result::Result<(), alloc[2ea6bcb46fca0c42]::string::String>><unknown>
  114. 43.36 s gammaloop-nextest-core> at <unknown source file>:<unknown line>
  115. 43.36 s gammaloop-nextest-core> 11: test[75d6903177b1d7e9]::run_test::{closure#0}<unknown>
  116. 43.36 s gammaloop-nextest-core> at <unknown source file>:<unknown line>
  117. 43.36 s gammaloop-nextest-core> 12: std[bcb96dfbba0ab899]::sys::backtrace::__rust_begin_short_backtrace::<test[75d6903177b1d7e9]::run_test::{closure#1}, ()><unknown>
  118. 43.36 s gammaloop-nextest-core> at <unknown source file>:<unknown line>
  119. 43.36 s gammaloop-nextest-core> 13: <std[bcb96dfbba0ab899]::thread::lifecycle::spawn_unchecked<test[75d6903177b1d7e9]::run_test::{closure#1}, ()>::{closure#1} as core[940e698046960fd5]::ops::function::FnOnce<()>>::call_once::{shim:vtable#0}<unknown>
  120. 43.36 s gammaloop-nextest-core> at <unknown source file>:<unknown line>
  121. 43.36 s gammaloop-nextest-core> 14: <std[bcb96dfbba0ab899]::sys::thread::unix::Thread>::new::thread_start<unknown>
  122. 43.36 s gammaloop-nextest-core> at <unknown source file>:<unknown line>
  123. 43.36 s gammaloop-nextest-core> 15: start_thread<unknown>
  124. 43.36 s gammaloop-nextest-core> at <unknown source file>:<unknown line>
  125. 43.36 s gammaloop-nextest-core> 16: __clone3<unknown>
  126. 43.36 s gammaloop-nextest-core> at <unknown source file>:<unknown line>
  127. 43.36 s gammaloop-nextest-core>
  128. 43.36 s gammaloop-nextest-core> Run with COLORBT_SHOW_HIDDEN=1 environment variable to disable frame filtering.
  129. 43.36 s gammaloop-nextest-core> Run with RUST_BACKTRACE=full to include source snippets.
  130. 43.36 s gammaloop-nextest-core>
  131. 51.66 s gammaloop-nextest-core> ------------
  132. 51.66 s gammaloop-nextest-core> Summary [ 20.650s] 705 tests run: 704 passed, 1 failed, 60 skipped
  133. 51.66 s gammaloop-nextest-core> FAIL [ 6.058s] (699/705) gammalooprs::test_renormalization finite_part_ghost_2loop
  134. 51.66 s gammaloop-nextest-core> stdout ---
  135. 51.66 s gammaloop-nextest-core>
  136. 51.66 s gammaloop-nextest-core> running 1 test
  137. 51.66 s gammaloop-nextest-core> test finite_part_ghost_2loop ... FAILED
  138. 51.66 s gammaloop-nextest-core>
  139. 51.66 s gammaloop-nextest-core> failures:
  140. 51.66 s gammaloop-nextest-core>
  141. 51.66 s gammaloop-nextest-core> failures:
  142. 51.66 s gammaloop-nextest-core> finite_part_ghost_2loop
  143. 51.66 s gammaloop-nextest-core>
  144. 51.66 s gammaloop-nextest-core> test result: FAILED. 0 passed; 1 failed; 0 ignored; 0 measured; 6 filtered out; finished in 6.05s
  145. 51.66 s gammaloop-nextest-core>
  146. 51.66 s gammaloop-nextest-core> stderr ---
  147. 51.66 s gammaloop-nextest-core> The application panicked (crashed).
  148. 51.66 s gammaloop-nextest-core> Message: assertion failed: (align_to_rqft(&a, &model) - expected).expand().is_zero()
  149. 51.66 s gammaloop-nextest-core> Location: crates/gammalooprs/tests/test_renormalization.rs:583
  150. 51.66 s gammaloop-nextest-core>
  151. 51.66 s gammaloop-nextest-core> ━━━━━━━━━━━━━━━━━━━━━━━━━━━━━━━━━━ BACKTRACE ━━━━━━━━━━━━━━━━━━━━━━━━━━━━━━━━━━━
  152. 51.66 s gammaloop-nextest-core> 1: <color_eyre[51793ea62743adbd]::config::PanicHook>::panic_report<unknown>
  153. 51.66 s gammaloop-nextest-core> at <unknown source file>:<unknown line>
  154. 51.66 s gammaloop-nextest-core> 2: <color_eyre[51793ea62743adbd]::config::PanicHook>::into_panic_hook::{closure#0}<unknown>
  155. 51.66 s gammaloop-nextest-core> at <unknown source file>:<unknown line>
  156. 51.66 s gammaloop-nextest-core> 3: std[bcb96dfbba0ab899]::panicking::panic_with_hook<unknown>
  157. 51.66 s gammaloop-nextest-core> at <unknown source file>:<unknown line>
  158. 51.66 s gammaloop-nextest-core> 4: std[bcb96dfbba0ab899]::panicking::panic_handler::{closure#0}<unknown>
  159. 51.66 s gammaloop-nextest-core> at <unknown source file>:<unknown line>
  160. 51.66 s gammaloop-nextest-core> 5: std[bcb96dfbba0ab899]::sys::backtrace::__rust_end_short_backtrace::<std[bcb96dfbba0ab899]::panicking::panic_handler::{closure#0}, !><unknown>
  161. 51.66 s gammaloop-nextest-core> at <unknown source file>:<unknown line>
  162. 51.66 s gammaloop-nextest-core> 6: __rustc[6c289b9f9c454d21]::rust_begin_unwind<unknown>
  163. 51.66 s gammaloop-nextest-core> at <unknown source file>:<unknown line>
  164. 51.66 s gammaloop-nextest-core> 7: core[940e698046960fd5]::panicking::panic_fmt<unknown>
  165. 51.66 s gammaloop-nextest-core> at <unknown source file>:<unknown line>
  166. 51.66 s gammaloop-nextest-core> 8: core[940e698046960fd5]::panicking::panic<unknown>
  167. 51.66 s gammaloop-nextest-core> at <unknown source file>:<unknown line>
  168. 51.67 s gammaloop-nextest-core> 9: <test_renormalization[5812939ef1a04d89]::finite_part_ghost_2loop::{closure#0} as core[940e698046960fd5]::ops::function::FnOnce<()>>::call_once<unknown>
  169. 51.67 s gammaloop-nextest-core> at <unknown source file>:<unknown line>
  170. 51.67 s gammaloop-nextest-core> 10: test[75d6903177b1d7e9]::__rust_begin_short_backtrace::<core[940e698046960fd5]::result::Result<(), alloc[2ea6bcb46fca0c42]::string::String>, fn() -> core[940e698046960fd5]::result::Result<(), alloc[2ea6bcb46fca0c42]::string::String>><unknown>
  171. 51.67 s gammaloop-nextest-core> at <unknown source file>:<unknown line>
  172. 51.67 s gammaloop-nextest-core> 11: test[75d6903177b1d7e9]::run_test::{closure#0}<unknown>
  173. 51.67 s gammaloop-nextest-core> at <unknown source file>:<unknown line>
  174. 51.67 s gammaloop-nextest-core> 12: std[bcb96dfbba0ab899]::sys::backtrace::__rust_begin_short_backtrace::<test[75d6903177b1d7e9]::run_test::{closure#1}, ()><unknown>
  175. 51.67 s gammaloop-nextest-core> at <unknown source file>:<unknown line>
  176. 51.67 s gammaloop-nextest-core> 13: <std[bcb96dfbba0ab899]::thread::lifecycle::spawn_unchecked<test[75d6903177b1d7e9]::run_test::{closure#1}, ()>::{closure#1} as core[940e698046960fd5]::ops::function::FnOnce<()>>::call_once::{shim:vtable#0}<unknown>
  177. 51.67 s gammaloop-nextest-core> at <unknown source file>:<unknown line>
  178. 51.67 s gammaloop-nextest-core> 14: <std[bcb96dfbba0ab899]::sys::thread::unix::Thread>::new::thread_start<unknown>
  179. 51.67 s gammaloop-nextest-core> at <unknown source file>:<unknown line>
  180. 51.67 s gammaloop-nextest-core> 15: start_thread<unknown>
  181. 51.67 s gammaloop-nextest-core> at <unknown source file>:<unknown line>
  182. 51.67 s gammaloop-nextest-core> 16: __clone3<unknown>
  183. 51.67 s gammaloop-nextest-core> at <unknown source file>:<unknown line>
  184. 51.67 s gammaloop-nextest-core>
  185. 51.67 s gammaloop-nextest-core> Run with COLORBT_SHOW_HIDDEN=1 environment variable to disable frame filtering.
  186. 51.67 s gammaloop-nextest-core> Run with RUST_BACKTRACE=full to include source snippets.
  187. 51.67 s gammaloop-nextest-core>
  188. 51.79 s gammaloop-nextest-core> error: test run failed
  189. 51.82 s gammaloop-nextest-core>
  190. 51.82 s gammaloop-nextest-core> ========== nextest test summary ==========
  191. 51.82 s gammaloop-nextest-core> report: target/nextest/ci_gammaloop/junit.xml
  192. 51.82 s gammaloop-nextest-core> tests: 705, failures: 1, errors: 0
  193. 51.82 s gammaloop-nextest-core>
  194. 51.82 s gammaloop-nextest-core> 1. gammalooprs::test_renormalization::finite_part_ghost_2loop
  195. 51.82 s gammaloop-nextest-core> failure: test failure with exit code 101
  196. 51.82 s gammaloop-nextest-core> system-out
  197. 51.82 s gammaloop-nextest-core> running 1 test
  198. 51.82 s gammaloop-nextest-core> test finite_part_ghost_2loop ... FAILED
  199. 51.82 s gammaloop-nextest-core>
  200. 51.82 s gammaloop-nextest-core> failures:
  201. 51.82 s gammaloop-nextest-core>
  202. 51.82 s gammaloop-nextest-core> failures:
  203. 51.82 s gammaloop-nextest-core> finite_part_ghost_2loop
  204. 51.82 s gammaloop-nextest-core>
  205. 51.82 s gammaloop-nextest-core> test result: FAILED. 0 passed; 1 failed; 0 ignored; 0 measured; 6 filtered out; finished in 6.05s
  206. 51.82 s gammaloop-nextest-core> system-err
  207. 51.82 s gammaloop-nextest-core> The application panicked (crashed).
  208. 51.82 s gammaloop-nextest-core> Message: assertion failed: (align_to_rqft(&a, &model) - expected).expand().is_zero()
  209. 51.82 s gammaloop-nextest-core> Location: crates/gammalooprs/tests/test_renormalization.rs:583
  210. 51.82 s gammaloop-nextest-core>
  211. 51.82 s gammaloop-nextest-core> ━━━━━━━━━━━━━━━━━━━━━━━━━━━━━━━━━━ BACKTRACE ━━━━━━━━━━━━━━━━━━━━━━━━━━━━━━━━━━━
  212. 51.82 s gammaloop-nextest-core> 1: <color_eyre[51793ea62743adbd]::config::PanicHook>::panic_report<unknown>
  213. 51.82 s gammaloop-nextest-core> at <unknown source file>:<unknown line>
  214. 51.82 s gammaloop-nextest-core> 2: <color_eyre[51793ea62743adbd]::config::PanicHook>::into_panic_hook::{closure#0}<unknown>
  215. 51.82 s gammaloop-nextest-core> at <unknown source file>:<unknown line>
  216. 51.82 s gammaloop-nextest-core> 3: std[bcb96dfbba0ab899]::panicking::panic_with_hook<unknown>
  217. 51.82 s gammaloop-nextest-core> at <unknown source file>:<unknown line>
  218. 51.82 s gammaloop-nextest-core> 4: std[bcb96dfbba0ab899]::panicking::panic_handler::{closure#0}<unknown>
  219. 51.82 s gammaloop-nextest-core> at <unknown source file>:<unknown line>
  220. 51.82 s gammaloop-nextest-core> 5: std[bcb96dfbba0ab899]::sys::backtrace::__rust_end_short_backtrace::<std[bcb96dfbba0ab899]::panicking::panic_handler::{closure#0}, !><unknown>
  221. 51.82 s gammaloop-nextest-core> at <unknown source file>:<unknown line>
  222. 51.82 s gammaloop-nextest-core> 6: __rustc[6c289b9f9c454d21]::rust_begin_unwind<unknown>
  223. 51.82 s gammaloop-nextest-core> at <unknown source file>:<unknown line>
  224. 51.82 s gammaloop-nextest-core> 7: core[940e698046960fd5]::panicking::panic_fmt<unknown>
  225. 51.82 s gammaloop-nextest-core> at <unknown source file>:<unknown line>
  226. 51.82 s gammaloop-nextest-core> 8: core[940e698046960fd5]::panicking::panic<unknown>
  227. 51.82 s gammaloop-nextest-core> at <unknown source file>:<unknown line>
  228. 51.82 s gammaloop-nextest-core> 9: <test_renormalization[5812939ef1a04d89]::finite_part_ghost_2loop::{closure#0} as core[940e698046960fd5]::ops::function::FnOnce<()>>::call_once<unknown>
  229. 51.82 s gammaloop-nextest-core> at <unknown source file>:<unknown line>
  230. 51.82 s gammaloop-nextest-core> 10: test[75d6903177b1d7e9]::__rust_begin_short_backtrace::<core[940e698046960fd5]::result::Result<(), alloc[2ea6bcb46fca0c42]::string::String>, fn() -> core[940e698046960fd5]::result::Result<(), alloc[2ea6bcb46fca0c42]::string::String>><unknown>
  231. 51.82 s gammaloop-nextest-core> at <unknown source file>:<unknown line>
  232. 51.82 s gammaloop-nextest-core> 11: test[75d6903177b1d7e9]::run_test::{closure#0}<unknown>
  233. 51.82 s gammaloop-nextest-core> at <unknown source file>:<unknown line>
  234. 51.82 s gammaloop-nextest-core> 12: std[bcb96dfbba0ab899]::sys::backtrace::__rust_begin_short_backtrace::<test[75d6903177b1d7e9]::run_test::{closure#1}, ()><unknown>
  235. 51.82 s gammaloop-nextest-core> at <unknown source file>:<unknown line>
  236. 51.82 s gammaloop-nextest-core> 13: <std[bcb96dfbba0ab899]::thread::lifecycle::spawn_unchecked<test[75d6903177b1d7e9]::run_test::{closure#1}, ()>::{closure#1} as core[940e698046960fd5]::ops::function::FnOnce<()>>::call_once::{shim:vtable#0}<unknown>
  237. 51.82 s gammaloop-nextest-core> at <unknown source file>:<unknown line>
  238. 51.82 s gammaloop-nextest-core> 14: <std[bcb96dfbba0ab899]::sys::thread::unix::Thread>::new::thread_start<unknown>
  239. 51.82 s gammaloop-nextest-core> at <unknown source file>:<unknown line>
  240. 51.82 s gammaloop-nextest-core> 15: start_thread<unknown>
  241. 51.82 s gammaloop-nextest-core> at <unknown source file>:<unknown line>
  242. 51.82 s gammaloop-nextest-core> 16: __clone3<unknown>
  243. 51.82 s gammaloop-nextest-core> at <unknown source file>:<unknown line>
  244. 51.82 s gammaloop-nextest-core>
  245. 51.82 s gammaloop-nextest-core> Run with COLORBT_SHOW_HIDDEN=1 environment variable to disable frame filtering.
  246. 51.82 s gammaloop-nextest-core> Run with RUST_BACKTRACE=full to include source snippets.
  247. 51.82 s gammaloop-nextest-core> =========================================
  248. 51.84 s gammaloop-nextest-core> Extracting 1 binary, 1 build script output directory, and 1 linked path to /build/nextest-archive-s18GfA
  249. 51.93 s gammaloop-nextest-core> Extracted 7 files to /build/nextest-archive-s18GfA in 0.09s
  250. 51.96 s gammaloop-nextest-core> ------------
  251. 51.96 s gammaloop-nextest-core> Nextest run ID be3592c5-0a5b-428d-85bc-08772bc3a3d9 with nextest profile: ci_gammaloop
  252. 51.96 s gammaloop-nextest-core> Starting 105 tests across 1 binary
  253. 72.30 s gammaloop-nextest-core> ------------
  254. 72.30 s gammaloop-nextest-core> Summary [ 20.343s] 105 tests run: 105 passed, 0 skipped
  255. 72.37 s gammaloop-nextest-core>
  256. 72.37 s gammaloop-nextest-core> ========== nextest test summary ==========
  257. 72.37 s gammaloop-nextest-core> report: target/nextest/ci_gammaloop/junit.xml
  258. 72.37 s gammaloop-nextest-core> tests: 105, failures: 0, errors: 0
  259. 72.37 s gammaloop-nextest-core> No failing testcases found.
  260. 72.37 s gammaloop-nextest-core> =========================================
  261. 72.46 s error: Cannot build '/nix/store/v0qh5n7q6ba5h5v37ywwp5q1jfzjvc33-gammaloop-nextest-core.drv'.
  262. 72.46 s Reason: builder failed with exit code 100.
  263. 72.46 s Output paths:
  264. 72.46 s /nix/store/q4cjrrnkw10yi6ir1lnvg6rhgm20mwwz-gammaloop-nextest-core
  265. 72.46 s Last 229 log lines:
  266. 72.46 s > Extracting 4 binaries (including 1 non-test binary), 1 build script output directory, and 2 linked paths to /build/nextest-archive-WzINIX
  267. 72.46 s > Extracted 20 files to /build/nextest-archive-WzINIX in 0.79s
  268. 72.46 s > ------------
  269. 72.46 s > Nextest run ID 94bfdc91-6527-42d7-8ea1-6c62554c9734 with nextest profile: ci_gammaloop
  270. 72.46 s > Starting 379 tests across 3 binaries
  271. 72.46 s > ------------
  272. 72.46 s > Summary [ 1.469s] 379 tests run: 379 passed, 0 skipped
  273. 72.46 s >
  274. 72.46 s > ========== nextest test summary ==========
  275. 72.46 s > report: target/nextest/ci_gammaloop/junit.xml
  276. 72.46 s > tests: 379, failures: 0, errors: 0
  277. 72.46 s > No failing testcases found.
  278. 72.46 s > =========================================
  279. 72.46 s > Extracting 1 binary and 1 linked path to /build/nextest-archive-ruurlA
  280. 72.46 s > Extracted 7 files to /build/nextest-archive-ruurlA in 0.07s
  281. 72.46 s > ------------
  282. 72.46 s > Nextest run ID 938f7ed4-167f-47a9-b771-8ecac78c8047 with nextest profile: ci_gammaloop
  283. 72.46 s > Starting 19 tests across 1 binary
  284. 72.46 s > ------------
  285. 72.46 s > Summary [ 0.013s] 19 tests run: 19 passed, 0 skipped
  286. 72.46 s >
  287. 72.46 s > ========== nextest test summary ==========
  288. 72.46 s > report: target/nextest/ci_gammaloop/junit.xml
  289. 72.46 s > tests: 19, failures: 0, errors: 0
  290. 72.46 s > No failing testcases found.
  291. 72.46 s > =========================================
  292. 72.46 s > Extracting 1 binary to /build/nextest-archive-OH5562
  293. 72.46 s > Extracted 4 files to /build/nextest-archive-OH5562 in 0.03s
  294. 72.46 s > ------------
  295. 72.46 s > Nextest run ID 5fdeb49b-2bbc-4387-9bcc-3e8b064ec07b with nextest profile: ci_gammaloop
  296. 72.46 s > Starting 0 tests across 1 binary
  297. 72.46 s > ------------
  298. 72.46 s > Summary [ 0.000s] 0 tests run: 0 passed, 0 skipped
  299. 72.46 s >
  300. 72.46 s > ========== nextest test summary ==========
  301. 72.46 s > report: target/nextest/ci_gammaloop/junit.xml
  302. 72.46 s > tests: 0, failures: 0, errors: 0
  303. 72.46 s > No failing testcases found.
  304. 72.46 s > =========================================
  305. 72.46 s > Extracting 4 binaries, 1 build script output directory, and 2 linked paths to /build/nextest-archive-GgsPjq
  306. 72.46 s > Extracted 18 files to /build/nextest-archive-GgsPjq in 0.49s
  307. 72.46 s > ------------
  308. 72.46 s > Nextest run ID 7b15bc65-ef86-46e1-a168-eb59d70538f3 with nextest profile: ci_gammaloop
  309. 72.46 s > Starting 705 tests across 4 binaries (60 tests skipped, including 59 tests via profile.ci_gammaloop.default-filter)
  310. 72.46 s > FAIL [ 6.058s] (699/705) gammalooprs::test_renormalization finite_part_ghost_2loop
  311. 72.46 s > stdout ---
  312. 72.46 s >
  313. 72.46 s > running 1 test
  314. 72.46 s > test finite_part_ghost_2loop ... FAILED
  315. 72.46 s >
  316. 72.46 s > failures:
  317. 72.46 s >
  318. 72.46 s > failures:
  319. 72.46 s > finite_part_ghost_2loop
  320. 72.46 s >
  321. 72.46 s > test result: FAILED. 0 passed; 1 failed; 0 ignored; 0 measured; 6 filtered out; finished in 6.05s
  322. 72.46 s >
  323. 72.46 s > stderr ---
  324. 72.46 s > The application panicked (crashed).
  325. 72.46 s > Message: assertion failed: (align_to_rqft(&a, &model) - expected).expand().is_zero()
  326. 72.46 s > Location: crates/gammalooprs/tests/test_renormalization.rs:583
  327. 72.46 s >
  328. 72.46 s > ━━━━━━━━━━━━━━━━━━━━━━━━━━━━━━━━━━ BACKTRACE ━━━━━━━━━━━━━━━━━━━━━━━━━━━━━━━━━━━
  329. 72.46 s > 1: <color_eyre[51793ea62743adbd]::config::PanicHook>::panic_report<unknown>
  330. 72.46 s > at <unknown source file>:<unknown line>
  331. 72.46 s > 2: <color_eyre[51793ea62743adbd]::config::PanicHook>::into_panic_hook::{closure#0}<unknown>
  332. 72.46 s > at <unknown source file>:<unknown line>
  333. 72.46 s > 3: std[bcb96dfbba0ab899]::panicking::panic_with_hook<unknown>
  334. 72.46 s > at <unknown source file>:<unknown line>
  335. 72.46 s > 4: std[bcb96dfbba0ab899]::panicking::panic_handler::{closure#0}<unknown>
  336. 72.46 s > at <unknown source file>:<unknown line>
  337. 72.46 s > 5: std[bcb96dfbba0ab899]::sys::backtrace::__rust_end_short_backtrace::<std[bcb96dfbba0ab899]::panicking::panic_handler::{closure#0}, !><unknown>
  338. 72.46 s > at <unknown source file>:<unknown line>
  339. 72.46 s > 6: __rustc[6c289b9f9c454d21]::rust_begin_unwind<unknown>
  340. 72.46 s > at <unknown source file>:<unknown line>
  341. 72.46 s > 7: core[940e698046960fd5]::panicking::panic_fmt<unknown>
  342. 72.46 s > at <unknown source file>:<unknown line>
  343. 72.46 s > 8: core[940e698046960fd5]::panicking::panic<unknown>
  344. 72.46 s > at <unknown source file>:<unknown line>
  345. 72.46 s > 9: <test_renormalization[5812939ef1a04d89]::finite_part_ghost_2loop::{closure#0} as core[940e698046960fd5]::ops::function::FnOnce<()>>::call_once<unknown>
  346. 72.46 s > at <unknown source file>:<unknown line>
  347. 72.46 s > 10: test[75d6903177b1d7e9]::__rust_begin_short_backtrace::<core[940e698046960fd5]::result::Result<(), alloc[2ea6bcb46fca0c42]::string::String>, fn() -> core[940e698046960fd5]::result::Result<(), alloc[2ea6bcb46fca0c42]::string::String>><unknown>
  348. 72.46 s > at <unknown source file>:<unknown line>
  349. 72.46 s > 11: test[75d6903177b1d7e9]::run_test::{closure#0}<unknown>
  350. 72.46 s > at <unknown source file>:<unknown line>
  351. 72.46 s > 12: std[bcb96dfbba0ab899]::sys::backtrace::__rust_begin_short_backtrace::<test[75d6903177b1d7e9]::run_test::{closure#1}, ()><unknown>
  352. 72.46 s > at <unknown source file>:<unknown line>
  353. 72.46 s > 13: <std[bcb96dfbba0ab899]::thread::lifecycle::spawn_unchecked<test[75d6903177b1d7e9]::run_test::{closure#1}, ()>::{closure#1} as core[940e698046960fd5]::ops::function::FnOnce<()>>::call_once::{shim:vtable#0}<unknown>
  354. 72.46 s > at <unknown source file>:<unknown line>
  355. 72.46 s > 14: <std[bcb96dfbba0ab899]::sys::thread::unix::Thread>::new::thread_start<unknown>
  356. 72.46 s > at <unknown source file>:<unknown line>
  357. 72.46 s > 15: start_thread<unknown>
  358. 72.46 s > at <unknown source file>:<unknown line>
  359. 72.46 s > 16: __clone3<unknown>
  360. 72.46 s > at <unknown source file>:<unknown line>
  361. 72.46 s >
  362. 72.46 s > Run with COLORBT_SHOW_HIDDEN=1 environment variable to disable frame filtering.
  363. 72.46 s > Run with RUST_BACKTRACE=full to include source snippets.
  364. 72.46 s >
  365. 72.46 s > ------------
  366. 72.47 s > Summary [ 20.650s] 705 tests run: 704 passed, 1 failed, 60 skipped
  367. 72.47 s > FAIL [ 6.058s] (699/705) gammalooprs::test_renormalization finite_part_ghost_2loop
  368. 72.47 s > stdout ---
  369. 72.47 s >
  370. 72.47 s > running 1 test
  371. 72.47 s > test finite_part_ghost_2loop ... FAILED
  372. 72.47 s >
  373. 72.47 s > failures:
  374. 72.47 s >
  375. 72.47 s > failures:
  376. 72.47 s > finite_part_ghost_2loop
  377. 72.47 s >
  378. 72.47 s > test result: FAILED. 0 passed; 1 failed; 0 ignored; 0 measured; 6 filtered out; finished in 6.05s
  379. 72.47 s >
  380. 72.47 s > stderr ---
  381. 72.47 s > The application panicked (crashed).
  382. 72.47 s > Message: assertion failed: (align_to_rqft(&a, &model) - expected).expand().is_zero()
  383. 72.47 s > Location: crates/gammalooprs/tests/test_renormalization.rs:583
  384. 72.47 s >
  385. 72.47 s > ━━━━━━━━━━━━━━━━━━━━━━━━━━━━━━━━━━ BACKTRACE ━━━━━━━━━━━━━━━━━━━━━━━━━━━━━━━━━━━
  386. 72.47 s > 1: <color_eyre[51793ea62743adbd]::config::PanicHook>::panic_report<unknown>
  387. 72.47 s > at <unknown source file>:<unknown line>
  388. 72.47 s > 2: <color_eyre[51793ea62743adbd]::config::PanicHook>::into_panic_hook::{closure#0}<unknown>
  389. 72.47 s > at <unknown source file>:<unknown line>
  390. 72.47 s > 3: std[bcb96dfbba0ab899]::panicking::panic_with_hook<unknown>
  391. 72.47 s > at <unknown source file>:<unknown line>
  392. 72.47 s > 4: std[bcb96dfbba0ab899]::panicking::panic_handler::{closure#0}<unknown>
  393. 72.47 s > at <unknown source file>:<unknown line>
  394. 72.47 s > 5: std[bcb96dfbba0ab899]::sys::backtrace::__rust_end_short_backtrace::<std[bcb96dfbba0ab899]::panicking::panic_handler::{closure#0}, !><unknown>
  395. 72.47 s > at <unknown source file>:<unknown line>
  396. 72.47 s > 6: __rustc[6c289b9f9c454d21]::rust_begin_unwind<unknown>
  397. 72.47 s > at <unknown source file>:<unknown line>
  398. 72.47 s > 7: core[940e698046960fd5]::panicking::panic_fmt<unknown>
  399. 72.47 s > at <unknown source file>:<unknown line>
  400. 72.47 s > 8: core[940e698046960fd5]::panicking::panic<unknown>
  401. 72.47 s > at <unknown source file>:<unknown line>
  402. 72.47 s > 9: <test_renormalization[5812939ef1a04d89]::finite_part_ghost_2loop::{closure#0} as core[940e698046960fd5]::ops::function::FnOnce<()>>::call_once<unknown>
  403. 72.47 s > at <unknown source file>:<unknown line>
  404. 72.47 s > 10: test[75d6903177b1d7e9]::__rust_begin_short_backtrace::<core[940e698046960fd5]::result::Result<(), alloc[2ea6bcb46fca0c42]::string::String>, fn() -> core[940e698046960fd5]::result::Result<(), alloc[2ea6bcb46fca0c42]::string::String>><unknown>
  405. 72.47 s > at <unknown source file>:<unknown line>
  406. 72.47 s > 11: test[75d6903177b1d7e9]::run_test::{closure#0}<unknown>
  407. 72.47 s > at <unknown source file>:<unknown line>
  408. 72.47 s > 12: std[bcb96dfbba0ab899]::sys::backtrace::__rust_begin_short_backtrace::<test[75d6903177b1d7e9]::run_test::{closure#1}, ()><unknown>
  409. 72.47 s > at <unknown source file>:<unknown line>
  410. 72.47 s > 13: <std[bcb96dfbba0ab899]::thread::lifecycle::spawn_unchecked<test[75d6903177b1d7e9]::run_test::{closure#1}, ()>::{closure#1} as core[940e698046960fd5]::ops::function::FnOnce<()>>::call_once::{shim:vtable#0}<unknown>
  411. 72.47 s > at <unknown source file>:<unknown line>
  412. 72.47 s > 14: <std[bcb96dfbba0ab899]::sys::thread::unix::Thread>::new::thread_start<unknown>
  413. 72.47 s > at <unknown source file>:<unknown line>
  414. 72.47 s > 15: start_thread<unknown>
  415. 72.47 s > at <unknown source file>:<unknown line>
  416. 72.47 s > 16: __clone3<unknown>
  417. 72.47 s > at <unknown source file>:<unknown line>
  418. 72.47 s >
  419. 72.47 s > Run with COLORBT_SHOW_HIDDEN=1 environment variable to disable frame filtering.
  420. 72.47 s > Run with RUST_BACKTRACE=full to include source snippets.
  421. 72.47 s >
  422. 72.47 s > error: test run failed
  423. 72.47 s >
  424. 72.47 s > ========== nextest test summary ==========
  425. 72.47 s > report: target/nextest/ci_gammaloop/junit.xml
  426. 72.47 s > tests: 705, failures: 1, errors: 0
  427. 72.47 s >
  428. 72.47 s > 1. gammalooprs::test_renormalization::finite_part_ghost_2loop
  429. 72.47 s > failure: test failure with exit code 101
  430. 72.47 s > system-out
  431. 72.47 s > running 1 test
  432. 72.47 s > test finite_part_ghost_2loop ... FAILED
  433. 72.47 s >
  434. 72.47 s > failures:
  435. 72.47 s >
  436. 72.47 s > failures:
  437. 72.47 s > finite_part_ghost_2loop
  438. 72.47 s >
  439. 72.47 s > test result: FAILED. 0 passed; 1 failed; 0 ignored; 0 measured; 6 filtered out; finished in 6.05s
  440. 72.47 s > system-err
  441. 72.47 s > The application panicked (crashed).
  442. 72.47 s > Message: assertion failed: (align_to_rqft(&a, &model) - expected).expand().is_zero()
  443. 72.47 s > Location: crates/gammalooprs/tests/test_renormalization.rs:583
  444. 72.47 s >
  445. 72.47 s > ━━━━━━━━━━━━━━━━━━━━━━━━━━━━━━━━━━ BACKTRACE ━━━━━━━━━━━━━━━━━━━━━━━━━━━━━━━━━━━
  446. 72.47 s > 1: <color_eyre[51793ea62743adbd]::config::PanicHook>::panic_report<unknown>
  447. 72.47 s > at <unknown source file>:<unknown line>
  448. 72.47 s > 2: <color_eyre[51793ea62743adbd]::config::PanicHook>::into_panic_hook::{closure#0}<unknown>
  449. 72.47 s > at <unknown source file>:<unknown line>
  450. 72.47 s > 3: std[bcb96dfbba0ab899]::panicking::panic_with_hook<unknown>
  451. 72.47 s > at <unknown source file>:<unknown line>
  452. 72.47 s > 4: std[bcb96dfbba0ab899]::panicking::panic_handler::{closure#0}<unknown>
  453. 72.47 s > at <unknown source file>:<unknown line>
  454. 72.47 s > 5: std[bcb96dfbba0ab899]::sys::backtrace::__rust_end_short_backtrace::<std[bcb96dfbba0ab899]::panicking::panic_handler::{closure#0}, !><unknown>
  455. 72.47 s > at <unknown source file>:<unknown line>
  456. 72.47 s > 6: __rustc[6c289b9f9c454d21]::rust_begin_unwind<unknown>
  457. 72.47 s > at <unknown source file>:<unknown line>
  458. 72.47 s > 7: core[940e698046960fd5]::panicking::panic_fmt<unknown>
  459. 72.47 s > at <unknown source file>:<unknown line>
  460. 72.47 s > 8: core[940e698046960fd5]::panicking::panic<unknown>
  461. 72.47 s > at <unknown source file>:<unknown line>
  462. 72.47 s > 9: <test_renormalization[5812939ef1a04d89]::finite_part_ghost_2loop::{closure#0} as core[940e698046960fd5]::ops::function::FnOnce<()>>::call_once<unknown>
  463. 72.47 s > at <unknown source file>:<unknown line>
  464. 72.47 s > 10: test[75d6903177b1d7e9]::__rust_begin_short_backtrace::<core[940e698046960fd5]::result::Result<(), alloc[2ea6bcb46fca0c42]::string::String>, fn() -> core[940e698046960fd5]::result::Result<(), alloc[2ea6bcb46fca0c42]::string::String>><unknown>
  465. 72.47 s > at <unknown source file>:<unknown line>
  466. 72.47 s > 11: test[75d6903177b1d7e9]::run_test::{closure#0}<unknown>
  467. 72.47 s > at <unknown source file>:<unknown line>
  468. 72.47 s > 12: std[bcb96dfbba0ab899]::sys::backtrace::__rust_begin_short_backtrace::<test[75d6903177b1d7e9]::run_test::{closure#1}, ()><unknown>
  469. 72.47 s > at <unknown source file>:<unknown line>
  470. 72.47 s > 13: <std[bcb96dfbba0ab899]::thread::lifecycle::spawn_unchecked<test[75d6903177b1d7e9]::run_test::{closure#1}, ()>::{closure#1} as core[940e698046960fd5]::ops::function::FnOnce<()>>::call_once::{shim:vtable#0}<unknown>
  471. 72.47 s > at <unknown source file>:<unknown line>
  472. 72.47 s > 14: <std[bcb96dfbba0ab899]::sys::thread::unix::Thread>::new::thread_start<unknown>
  473. 72.47 s > at <unknown source file>:<unknown line>
  474. 72.47 s > 15: start_thread<unknown>
  475. 72.47 s > at <unknown source file>:<unknown line>
  476. 72.47 s > 16: __clone3<unknown>
  477. 72.47 s > at <unknown source file>:<unknown line>
  478. 72.47 s >
  479. 72.47 s > Run with COLORBT_SHOW_HIDDEN=1 environment variable to disable frame filtering.
  480. 72.47 s > Run with RUST_BACKTRACE=full to include source snippets.
  481. 72.47 s > =========================================
  482. 72.47 s > Extracting 1 binary, 1 build script output directory, and 1 linked path to /build/nextest-archive-s18GfA
  483. 72.47 s > Extracted 7 files to /build/nextest-archive-s18GfA in 0.09s
  484. 72.47 s > ------------
  485. 72.47 s > Nextest run ID be3592c5-0a5b-428d-85bc-08772bc3a3d9 with nextest profile: ci_gammaloop
  486. 72.47 s > Starting 105 tests across 1 binary
  487. 72.47 s > ------------
  488. 72.47 s > Summary [ 20.343s] 105 tests run: 105 passed, 0 skipped
  489. 72.47 s >
  490. 72.47 s > ========== nextest test summary ==========
  491. 72.47 s > report: target/nextest/ci_gammaloop/junit.xml
  492. 72.47 s > tests: 105, failures: 0, errors: 0
  493. 72.47 s > No failing testcases found.
  494. 72.47 s > =========================================
  495. 72.47 s For full logs, run:
  496. 72.47 s nix log /nix/store/v0qh5n7q6ba5h5v37ywwp5q1jfzjvc33-gammaloop-nextest-core.drv
  497. 72.67 s [0 built (1 failed), 0.0Run failed.