0.72 s
$ /nix/store/9ypz3flqsrl5xl495mm8h645gadjsxi1-coreutils-9.11/bin/timeout --kill-after=15s 7200s /nix/store/23zk8sgzamrbmj1fday15szf7f2279s8-nix-2.34.7/bin/nix --extra-experimental-features nix-command --extra-experimental-features flakes flake clone git+https://github.com/alphal00p/gammaloop --dest /tmp/nix-ci-worker/stable-pwd/repo/
0.81 s
Cloning into '/tmp/nix-ci-worker/stable-pwd/repo'...
1.71 s
remote: Enumerating objects: 85853, done.
1.81 s
remote: Counting objects: 0% (1/8946)
remote: Counting objects: 1% (90/8946)
remote: Counting objects: 2% (179/8946)
remote: Counting objects: 3% (269/8946)
remote: Counting objects: 4% (358/8946)
remote: Counting objects: 5% (448/8946)
remote: Counting objects: 6% (537/8946)
remote: Counting objects: 7% (627/8946)
remote: Counting objects: 8% (716/8946)
remote: Counting objects: 9% (806/8946)
remote: Counting objects: 10% (895/8946)
remote: Counting objects: 11% (985/8946)
remote: Counting objects: 12% (1074/8946)
remote: Counting objects: 13% (1163/8946)
remote: Counting objects: 14% (1253/8946)
remote: Counting objects: 15% (1342/8946)
remote: Counting objects: 16% (1432/8946)
remote: Counting objects: 17% (1521/8946)
remote: Counting objects: 18% (1611/8946)
remote: Counting objects: 19% (1700/8946)
remote: Counting objects: 20% (1790/8946)
remote: Counting objects: 21% (1879/8946)
remote: Counting objects: 22% (1969/8946)
remote: Counting objects: 23% (2058/8946)
remote: Counting objects: 24% (2148/8946)
remote: Counting objects: 25% (2237/8946)
remote: Counting objects: 26% (2326/8946)
remote: Counting objects: 27% (2416/8946)
remote: Counting objects: 28% (2505/8946)
remote: Counting objects: 29% (2595/8946)
remote: Counting objects: 30% (2684/8946)
remote: Counting objects: 31% (2774/8946)
remote: Counting objects: 32% (2863/8946)
remote: Counting objects: 33% (2953/8946)
remote: Counting objects: 34% (3042/8946)
remote: Counting objects: 35% (3132/8946)
remote: Counting objects: 36% (3221/8946)
remote: Counting objects: 37% (3311/8946)
remote: Counting objects: 38% (3400/8946)
remote: Counting objects: 39% (3489/8946)
remote: Counting objects: 40% (3579/8946)
remote: Counting objects: 41% (3668/8946)
remote: Counting objects: 42% (3758/8946)
remote: Counting objects: 43% (3847/8946)
remote: Counting objects: 44% (3937/8946)
remote: Counting objects: 45% (4026/8946)
remote: Counting objects: 46% (4116/8946)
remote: Counting objects: 47% (4205/8946)
remote: Counting objects: 48% (4295/8946)
remote: Counting objects: 49% (4384/8946)
remote: Counting objects: 50% (4473/8946)
remote: Counting objects: 51% (4563/8946)
remote: Counting objects: 52% (4652/8946)
remote: Counting objects: 53% (4742/8946)
remote: Counting objects: 54% (4831/8946)
remote: Counting objects: 55% (4921/8946)
remote: Counting objects: 56% (5010/8946)
remote: Counting objects: 57% (5100/8946)
remote: Counting objects: 58% (5189/8946)
remote: Counting objects: 59% (5279/8946)
remote: Counting objects: 60% (5368/8946)
remote: Counting objects: 61% (5458/8946)
remote: Counting objects: 62% (5547/8946)
remote: Counting objects: 63% (5636/8946)
remote: Counting objects: 64% (5726/8946)
remote: Counting objects: 65% (5815/8946)
remote: Counting objects: 66% (5905/8946)
remote: Counting objects: 67% (5994/8946)
remote: Counting objects: 68% (6084/8946)
remote: Counting objects: 69% (6173/8946)
remote: Counting objects: 70% (6263/8946)
remote: Counting objects: 71% (6352/8946)
remote: Counting objects: 72% (6442/8946)
remote: Counting objects: 73% (6531/8946)
remote: Counting objects: 74% (6621/8946)
remote: Counting objects: 75% (6710/8946)
remote: Counting objects: 76% (6799/8946)
remote: Counting objects: 77% (6889/8946)
remote: Counting objects: 78% (6978/8946)
remote: Counting objects: 79% (7068/8946)
remote: Counting objects: 80% (7157/8946)
remote: Counting objects: 81% (7247/8946)
remote: Counting objects: 82% (7336/8946)
remote: Counting objects: 83% (7426/8946)
remote: Counting objects: 84% (7515/8946)
remote: Counting objects: 85% (7605/8946)
remote: Counting objects: 86% (7694/8946)
remote: Counting objects: 87% (7784/8946)
remote: Counting objects: 88% (7873/8946)
remote: Counting objects: 89% (7962/8946)
remote: Counting objects: 90% (8052/8946)
remote: Counting objects: 91% (8141/8946)
remote: Counting objects: 92% (8231/8946)
remote: Counting objects: 93% (8320/8946)
remote: Counting objects: 94% (8410/8946)
remote: Counting objects: 95% (8499/8946)
remote: Counting objects: 96% (8589/8946)
remote: Counting objects: 97% (8678/8946)
remote: Counting objects: 98% (8768/8946)
remote: Counting objects: 99% (8857/8946)
remote: Counting objects: 100% (8946/8946)
remote: Counting objects: 100% (8946/8946), done.
3.76 s
remote: Compressing objects: 0% (1/1974)
remote: Compressing objects: 1% (20/1974)
remote: Compressing objects: 2% (40/1974)
remote: Compressing objects: 3% (60/1974)
remote: Compressing objects: 4% (79/1974)
remote: Compressing objects: 5% (99/1974)
remote: Compressing objects: 6% (119/1974)
remote: Compressing objects: 7% (139/1974)
remote: Compressing objects: 8% (158/1974)
remote: Compressing objects: 9% (178/1974)
remote: Compressing objects: 10% (198/1974)
remote: Compressing objects: 10% (211/1974)
remote: Compressing objects: 11% (218/1974)
remote: Compressing objects: 12% (237/1974)
remote: Compressing objects: 13% (257/1974)
remote: Compressing objects: 14% (277/1974)
remote: Compressing objects: 15% (297/1974)
remote: Compressing objects: 16% (316/1974)
remote: Compressing objects: 17% (336/1974)
remote: Compressing objects: 18% (356/1974)
remote: Compressing objects: 19% (376/1974)
remote: Compressing objects: 20% (395/1974)
remote: Compressing objects: 21% (415/1974)
remote: Compressing objects: 22% (435/1974)
remote: Compressing objects: 23% (455/1974)
remote: Compressing objects: 24% (474/1974)
remote: Compressing objects: 25% (494/1974)
remote: Compressing objects: 26% (514/1974)
remote: Compressing objects: 27% (533/1974)
remote: Compressing objects: 28% (553/1974)
remote: Compressing objects: 29% (573/1974)
remote: Compressing objects: 30% (593/1974)
remote: Compressing objects: 31% (612/1974)
remote: Compressing objects: 32% (632/1974)
remote: Compressing objects: 33% (652/1974)
remote: Compressing objects: 34% (672/1974)
remote: Compressing objects: 35% (691/1974)
remote: Compressing objects: 36% (711/1974)
remote: Compressing objects: 37% (731/1974)
remote: Compressing objects: 38% (751/1974)
remote: Compressing objects: 39% (770/1974)
remote: Compressing objects: 40% (790/1974)
remote: Compressing objects: 41% (810/1974)
remote: Compressing objects: 42% (830/1974)
remote: Compressing objects: 43% (849/1974)
remote: Compressing objects: 44% (869/1974)
remote: Compressing objects: 45% (889/1974)
remote: Compressing objects: 46% (909/1974)
remote: Compressing objects: 47% (928/1974)
remote: Compressing objects: 48% (948/1974)
remote: Compressing objects: 49% (968/1974)
remote: Compressing objects: 50% (987/1974)
remote: Compressing objects: 51% (1007/1974)
remote: Compressing objects: 51% (1011/1974)
remote: Compressing objects: 52% (1027/1974)
remote: Compressing objects: 53% (1047/1974)
remote: Compressing objects: 54% (1066/1974)
remote: Compressing objects: 55% (1086/1974)
remote: Compressing objects: 56% (1106/1974)
remote: Compressing objects: 57% (1126/1974)
remote: Compressing objects: 58% (1145/1974)
remote: Compressing objects: 59% (1165/1974)
remote: Compressing objects: 60% (1185/1974)
remote: Compressing objects: 61% (1205/1974)
remote: Compressing objects: 62% (1224/1974)
remote: Compressing objects: 63% (1244/1974)
remote: Compressing objects: 64% (1264/1974)
remote: Compressing objects: 65% (1284/1974)
remote: Compressing objects: 66% (1303/1974)
remote: Compressing objects: 67% (1323/1974)
remote: Compressing objects: 68% (1343/1974)
remote: Compressing objects: 69% (1363/1974)
remote: Compressing objects: 70% (1382/1974)
remote: Compressing objects: 71% (1402/1974)
remote: Compressing objects: 72% (1422/1974)
remote: Compressing objects: 73% (1442/1974)
remote: Compressing objects: 74% (1461/1974)
remote: Compressing objects: 75% (1481/1974)
remote: Compressing objects: 76% (1501/1974)
remote: Compressing objects: 77% (1520/1974)
remote: Compressing objects: 78% (1540/1974)
remote: Compressing objects: 79% (1560/1974)
remote: Compressing objects: 80% (1580/1974)
remote: Compressing objects: 81% (1599/1974)
remote: Compressing objects: 82% (1619/1974)
remote: Compressing objects: 83% (1639/1974)
remote: Compressing objects: 84% (1659/1974)
remote: Compressing objects: 85% (1678/1974)
remote: Compressing objects: 86% (1698/1974)
remote: Compressing objects: 87% (1718/1974)
remote: Compressing objects: 88% (1738/1974)
remote: Compressing objects: 89% (1757/1974)
remote: Compressing objects: 90% (1777/1974)
remote: Compressing objects: 91% (1797/1974)
remote: Compressing objects: 92% (1817/1974)
remote: Compressing objects: 93% (1836/1974)
remote: Compressing objects: 94% (1856/1974)
remote: Compressing objects: 95% (1876/1974)
remote: Compressing objects: 96% (1896/1974)
remote: Compressing objects: 97% (1915/1974)
remote: Compressing objects: 98% (1935/1974)
remote: Compressing objects: 99% (1955/1974)
remote: Compressing objects: 100% (1974/1974)
remote: Compressing objects: 100% (1974/1974), done.
8.02 s
Receiving objects: 0% (1/85853)
Receiving objects: 1% (859/85853)
Receiving objects: 2% (1718/85853)
Receiving objects: 3% (2576/85853)
Receiving objects: 4% (3435/85853)
Receiving objects: 5% (4293/85853)
Receiving objects: 6% (5152/85853)
Receiving objects: 7% (6010/85853)
Receiving objects: 8% (6869/85853)
Receiving objects: 9% (7727/85853), 14.34 MiB | 28.66 MiB/s
Receiving objects: 10% (8586/85853), 14.34 MiB | 28.66 MiB/s
Receiving objects: 11% (9444/85853), 14.34 MiB | 28.66 MiB/s
Receiving objects: 12% (10303/85853), 14.34 MiB | 28.66 MiB/s
Receiving objects: 13% (11161/85853), 14.34 MiB | 28.66 MiB/s
Receiving objects: 14% (12020/85853), 14.34 MiB | 28.66 MiB/s
Receiving objects: 15% (12878/85853), 14.34 MiB | 28.66 MiB/s
Receiving objects: 16% (13737/85853), 14.34 MiB | 28.66 MiB/s
Receiving objects: 17% (14596/85853), 14.34 MiB | 28.66 MiB/s
Receiving objects: 18% (15454/85853), 14.34 MiB | 28.66 MiB/s
Receiving objects: 19% (16313/85853), 14.34 MiB | 28.66 MiB/s
Receiving objects: 20% (17171/85853), 14.34 MiB | 28.66 MiB/s
Receiving objects: 21% (18030/85853), 14.34 MiB | 28.66 MiB/s
Receiving objects: 22% (18888/85853), 14.34 MiB | 28.66 MiB/s
Receiving objects: 23% (19747/85853), 14.34 MiB | 28.66 MiB/s
Receiving objects: 24% (20605/85853), 14.34 MiB | 28.66 MiB/s
Receiving objects: 25% (21464/85853), 14.34 MiB | 28.66 MiB/s
Receiving objects: 26% (22322/85853), 14.34 MiB | 28.66 MiB/s
Receiving objects: 27% (23181/85853), 14.34 MiB | 28.66 MiB/s
Receiving objects: 28% (24039/85853), 14.34 MiB | 28.66 MiB/s
Receiving objects: 29% (24898/85853), 14.34 MiB | 28.66 MiB/s
Receiving objects: 30% (25756/85853), 14.34 MiB | 28.66 MiB/s
Receiving objects: 31% (26615/85853), 14.34 MiB | 28.66 MiB/s
Receiving objects: 32% (27473/85853), 14.34 MiB | 28.66 MiB/s
Receiving objects: 33% (28332/85853), 14.34 MiB | 28.66 MiB/s
Receiving objects: 34% (29191/85853), 14.34 MiB | 28.66 MiB/s
Receiving objects: 35% (30049/85853), 14.34 MiB | 28.66 MiB/s
Receiving objects: 36% (30908/85853), 14.34 MiB | 28.66 MiB/s
Receiving objects: 37% (31766/85853), 14.34 MiB | 28.66 MiB/s
Receiving objects: 38% (32625/85853), 14.34 MiB | 28.66 MiB/s
Receiving objects: 39% (33483/85853), 14.34 MiB | 28.66 MiB/s
Receiving objects: 40% (34342/85853), 14.34 MiB | 28.66 MiB/s
Receiving objects: 40% (34674/85853), 33.69 MiB | 33.68 MiB/s
Receiving objects: 41% (35200/85853), 33.69 MiB | 33.68 MiB/s
Receiving objects: 42% (36059/85853), 33.69 MiB | 33.68 MiB/s
Receiving objects: 43% (36917/85853), 33.69 MiB | 33.68 MiB/s
Receiving objects: 44% (37776/85853), 33.69 MiB | 33.68 MiB/s
Receiving objects: 45% (38634/85853), 33.69 MiB | 33.68 MiB/s
Receiving objects: 46% (39493/85853), 33.69 MiB | 33.68 MiB/s
Receiving objects: 47% (40351/85853), 33.69 MiB | 33.68 MiB/s
Receiving objects: 48% (41210/85853), 33.69 MiB | 33.68 MiB/s
Receiving objects: 49% (42068/85853), 33.69 MiB | 33.68 MiB/s
Receiving objects: 50% (42927/85853), 33.69 MiB | 33.68 MiB/s
Receiving objects: 51% (43786/85853), 51.61 MiB | 34.40 MiB/s
Receiving objects: 52% (44644/85853), 51.61 MiB | 34.40 MiB/s
Receiving objects: 53% (45503/85853), 51.61 MiB | 34.40 MiB/s
Receiving objects: 54% (46361/85853), 51.61 MiB | 34.40 MiB/s
Receiving objects: 55% (47220/85853), 51.61 MiB | 34.40 MiB/s
Receiving objects: 56% (48078/85853), 51.61 MiB | 34.40 MiB/s
Receiving objects: 57% (48937/85853), 51.61 MiB | 34.40 MiB/s
Receiving objects: 58% (49795/85853), 51.61 MiB | 34.40 MiB/s
Receiving objects: 58% (50245/85853), 70.51 MiB | 35.25 MiB/s
Receiving objects: 59% (50654/85853), 70.51 MiB | 35.25 MiB/s
Receiving objects: 60% (51512/85853), 70.51 MiB | 35.25 MiB/s
Receiving objects: 61% (52371/85853), 70.51 MiB | 35.25 MiB/s
Receiving objects: 62% (53229/85853), 70.51 MiB | 35.25 MiB/s
Receiving objects: 63% (54088/85853), 70.51 MiB | 35.25 MiB/s
Receiving objects: 64% (54946/85853), 70.51 MiB | 35.25 MiB/s
Receiving objects: 65% (55805/85853), 70.51 MiB | 35.25 MiB/s
Receiving objects: 66% (56663/85853), 70.51 MiB | 35.25 MiB/s
Receiving objects: 67% (57522/85853), 89.87 MiB | 35.79 MiB/s
Receiving objects: 68% (58381/85853), 89.87 MiB | 35.79 MiB/s
Receiving objects: 69% (59239/85853), 89.87 MiB | 35.79 MiB/s
Receiving objects: 69% (59400/85853), 89.87 MiB | 35.79 MiB/s
Receiving objects: 70% (60098/85853), 109.43 MiB | 36.22 MiB/s
Receiving objects: 71% (60956/85853), 109.43 MiB | 36.22 MiB/s
Receiving objects: 72% (61815/85853), 109.43 MiB | 36.22 MiB/s
Receiving objects: 73% (62673/85853), 109.43 MiB | 36.22 MiB/s
Receiving objects: 74% (63532/85853), 109.43 MiB | 36.22 MiB/s
Receiving objects: 75% (64390/85853), 128.50 MiB | 36.40 MiB/s
Receiving objects: 76% (65249/85853), 128.50 MiB | 36.40 MiB/s
Receiving objects: 77% (66107/85853), 128.50 MiB | 36.40 MiB/s
Receiving objects: 78% (66966/85853), 128.50 MiB | 36.40 MiB/s
Receiving objects: 79% (67824/85853), 128.50 MiB | 36.40 MiB/s
Receiving objects: 80% (68683/85853), 128.50 MiB | 36.40 MiB/s
Receiving objects: 81% (69541/85853), 128.50 MiB | 36.40 MiB/s
Receiving objects: 82% (70400/85853), 128.50 MiB | 36.40 MiB/s
Receiving objects: 83% (71258/85853), 128.50 MiB | 36.40 MiB/s
Receiving objects: 84% (72117/85853), 128.50 MiB | 36.40 MiB/s
Receiving objects: 85% (72976/85853), 128.50 MiB | 36.40 MiB/s
Receiving objects: 86% (73834/85853), 128.50 MiB | 36.40 MiB/s
Receiving objects: 86% (74223/85853), 128.50 MiB | 36.40 MiB/s
Receiving objects: 87% (74693/85853), 128.50 MiB | 36.40 MiB/s
Receiving objects: 88% (75551/85853), 128.50 MiB | 36.40 MiB/s
Receiving objects: 89% (76410/85853), 147.86 MiB | 36.59 MiB/s
Receiving objects: 90% (77268/85853), 147.86 MiB | 36.59 MiB/s
Receiving objects: 91% (78127/85853), 147.86 MiB | 36.59 MiB/s
Receiving objects: 92% (78985/85853), 147.86 MiB | 36.59 MiB/s
Receiving objects: 93% (79844/85853), 147.86 MiB | 36.59 MiB/s
Receiving objects: 94% (80702/85853), 147.86 MiB | 36.59 MiB/s
Receiving objects: 95% (81561/85853), 147.86 MiB | 36.59 MiB/s
Receiving objects: 96% (82419/85853), 147.86 MiB | 36.59 MiB/s
Receiving objects: 97% (83278/85853), 147.86 MiB | 36.59 MiB/s
Receiving objects: 98% (84136/85853), 147.86 MiB | 36.59 MiB/s
Receiving objects: 99% (84995/85853), 147.86 MiB | 36.59 MiB/s
remote: Total 85853 (delta 7781), reused 7073 (delta 6972), pack-reused 76907 (from 3)
8.02 s
Receiving objects: 100% (85853/85853), 147.86 MiB | 36.59 MiB/s
Receiving objects: 100% (85853/85853), 155.75 MiB | 36.63 MiB/s, done.
10.17 s
Resolving deltas: 0% (0/58229)
Resolving deltas: 1% (583/58229)
Resolving deltas: 2% (1165/58229)
Resolving deltas: 3% (1747/58229)
Resolving deltas: 4% (2331/58229)
Resolving deltas: 5% (2912/58229)
Resolving deltas: 6% (3494/58229)
Resolving deltas: 7% (4077/58229)
Resolving deltas: 8% (4659/58229)
Resolving deltas: 9% (5241/58229)
Resolving deltas: 10% (5823/58229)
Resolving deltas: 11% (6406/58229)
Resolving deltas: 12% (6988/58229)
Resolving deltas: 13% (7570/58229)
Resolving deltas: 14% (8153/58229)
Resolving deltas: 15% (8735/58229)
Resolving deltas: 16% (9317/58229)
Resolving deltas: 17% (9899/58229)
Resolving deltas: 18% (10482/58229)
Resolving deltas: 19% (11064/58229)
Resolving deltas: 20% (11646/58229)
Resolving deltas: 21% (12229/58229)
Resolving deltas: 22% (12811/58229)
Resolving deltas: 23% (13393/58229)
Resolving deltas: 24% (13975/58229)
Resolving deltas: 25% (14558/58229)
Resolving deltas: 26% (15140/58229)
Resolving deltas: 27% (15722/58229)
Resolving deltas: 28% (16306/58229)
Resolving deltas: 29% (16887/58229)
Resolving deltas: 30% (17469/58229)
Resolving deltas: 31% (18051/58229)
Resolving deltas: 32% (18635/58229)
Resolving deltas: 33% (19216/58229)
Resolving deltas: 34% (19798/58229)
Resolving deltas: 35% (20381/58229)
Resolving deltas: 36% (20963/58229)
Resolving deltas: 37% (21545/58229)
Resolving deltas: 38% (22129/58229)
Resolving deltas: 39% (22710/58229)
Resolving deltas: 40% (23292/58229)
Resolving deltas: 41% (23874/58229)
Resolving deltas: 42% (24457/58229)
Resolving deltas: 43% (25039/58229)
Resolving deltas: 44% (25621/58229)
Resolving deltas: 45% (26204/58229)
Resolving deltas: 46% (26786/58229)
Resolving deltas: 47% (27368/58229)
Resolving deltas: 48% (27952/58229)
Resolving deltas: 49% (28533/58229)
Resolving deltas: 50% (29115/58229)
Resolving deltas: 51% (29697/58229)
Resolving deltas: 52% (30280/58229)
Resolving deltas: 53% (30862/58229)
Resolving deltas: 54% (31444/58229)
Resolving deltas: 55% (32026/58229)
Resolving deltas: 56% (32609/58229)
Resolving deltas: 57% (33191/58229)
Resolving deltas: 57% (33330/58229)
Resolving deltas: 58% (33773/58229)
Resolving deltas: 59% (34356/58229)
Resolving deltas: 60% (34938/58229)
Resolving deltas: 61% (35520/58229)
Resolving deltas: 62% (36102/58229)
Resolving deltas: 63% (36685/58229)
Resolving deltas: 64% (37267/58229)
Resolving deltas: 65% (37849/58229)
Resolving deltas: 66% (38432/58229)
Resolving deltas: 67% (39014/58229)
Resolving deltas: 68% (39596/58229)
Resolving deltas: 69% (40179/58229)
Resolving deltas: 70% (40761/58229)
Resolving deltas: 71% (41343/58229)
Resolving deltas: 72% (41927/58229)
Resolving deltas: 73% (42508/58229)
Resolving deltas: 74% (43090/58229)
Resolving deltas: 75% (43672/58229)
Resolving deltas: 76% (44255/58229)
Resolving deltas: 77% (44837/58229)
Resolving deltas: 78% (45419/58229)
Resolving deltas: 79% (46001/58229)
Resolving deltas: 80% (46584/58229)
Resolving deltas: 81% (47167/58229)
Resolving deltas: 82% (47748/58229)
Resolving deltas: 83% (48331/58229)
Resolving deltas: 84% (48913/58229)
Resolving deltas: 85% (49495/58229)
Resolving deltas: 86% (50077/58229)
Resolving deltas: 87% (50660/58229)
Resolving deltas: 88% (51242/58229)
Resolving deltas: 89% (51824/58229)
Resolving deltas: 90% (52407/58229)
Resolving deltas: 91% (52989/58229)
Resolving deltas: 92% (53571/58229)
Resolving deltas: 93% (54153/58229)
Resolving deltas: 93% (54331/58229)
Resolving deltas: 94% (54736/58229)
Resolving deltas: 95% (55318/58229)
Resolving deltas: 96% (55900/58229)
Resolving deltas: 97% (56483/58229)
Resolving deltas: 98% (57067/58229)
Resolving deltas: 99% (57647/58229)
Resolving deltas: 100% (58229/58229)
Resolving deltas: 100% (58229/58229), done.
11.03 s
Fetching commit 4e06fb2318cda07e694491bfaf5755da9d23fc5a for faster_uv_from_4d ...
11.03 s
$ /nix/store/bcnisk3ydfgv26v2gw3zlky24g00yww2-git-2.54.0/bin/git fetch origin 4e06fb2318cda07e694491bfaf5755da9d23fc5a
11.58 s
From https://github.com/alphal00p/gammaloop
11.58 s
* branch 4e06fb2318cda07e694491bfaf5755da9d23fc5a -> FETCH_HEAD
11.62 s
$ /nix/store/9ypz3flqsrl5xl495mm8h645gadjsxi1-coreutils-9.11/bin/timeout --kill-after=15s 7200s /nix/store/bcnisk3ydfgv26v2gw3zlky24g00yww2-git-2.54.0/bin/git -c advice.detachedHead=false checkout 4e06fb2318cda07e694491bfaf5755da9d23fc5a
11.99 s
HEAD is now at 4e06fb231 allow explicit finite memory watchdog limits
12.00 s
$ /nix/store/9ypz3flqsrl5xl495mm8h645gadjsxi1-coreutils-9.11/bin/timeout --kill-after=15s 7200s /nix/store/23zk8sgzamrbmj1fday15szf7f2279s8-nix-2.34.7/bin/nix --extra-experimental-features nix-command --extra-experimental-features flakes --log-format internal-json run .#packages.x86_64-linux.nix-ci-check-gammaloop-nextest-core --print-build-logs
18.92 s
18.98 s
Downloading cached gammaloop-nextest-binaries-core-gammalooprs from https://cache.nix-ci.com
18.98 s
Downloading cached gammaloop-nextest-binaries-core-gammaloop-tracing-filter from https://cache.nix-ci.com
18.99 s
Downloading cached gammaloop-nextest-binaries-core-gammaloop-api from https://cache.nix-ci.com
19.24 s
Downloaded cached gammaloop-nextest-binaries-core-gammaloop-tracing-filter (8.1 MiB) in 257ms
19.24 s
Progress: 0 of 1 built, 1 of 5 downloaded from cache (2 downloading)
20.67 s
Downloaded cached gammaloop-nextest-binaries-core-gammalooprs (88.1 MiB) in 1.6s
20.67 s
Progress: 0 of 1 built, 2 of 5 downloaded from cache (1 downloading)
21.00 s
Downloaded cached gammaloop-nextest-binaries-core-gammaloop-api (120.9 MiB) in 2.0s
21.00 s
Progress: 0 of 1 built, 3 of 5 downloaded from cache
21.00 s
Downloading cached gammaloop-nextest-binaries-core from https://cache.nix-ci.com
21.02 s
Downloaded cached gammaloop-nextest-binaries-core (2032 B) in 11ms
21.02 s
Progress: 0 of 1 built, 4 of 5 downloaded from cache
21.02 s
Downloading cached nix-ci-check-gammaloop-nextest-core from https://cache.nix-ci.com
21.03 s
Downloaded cached nix-ci-check-gammaloop-nextest-core (1016 B) in 12ms
21.03 s
Progress: 0 of 1 built, 5 of 5 downloaded from cache
27.86 s
evaluating derivation 'g
copying '/nix/store/4yw3
evaluating derivation 'g
copying '/nix/store/4yw3
evaluating derivation 'g
copying '/nix/store/4yw3
evaluating derivation 'g
copying '/nix/store/4yw3
evaluating derivation 'g
copying '/nix/store/4yw3
evaluating derivation 'g
copying '/nix/store/4yw3
evaluating derivation 'g
copying '/nix/store/4yw3
evaluating derivation 'g
copying '/nix/store/4yw3
evaluating derivation 'g
copying '/nix/store/4yw3
evaluating derivation 'g
copying '/nix/store/4yw3
evaluating derivation 'g
querying gammaloop-nexte
[0 /1 built, 0.0 KiB DL]
[1 /0 /1 built, 0.0 KiB DLgammaloop-nextest-core> Extracting 4 binaries (including 1 non-test binary), 1 build script output directory, and 2 linked paths to /build/nextest-archive-WzINIX
28.64 s
gammaloop-nextest-core> Extracted 20 files to /build/nextest-archive-WzINIX in 0.79s
28.66 s
gammaloop-nextest-core> ------------
28.66 s
gammaloop-nextest-core> Nextest run ID 94bfdc91-6527-42d7-8ea1-6c62554c9734 with nextest profile: ci_gammaloop
28.66 s
gammaloop-nextest-core> Starting 379 tests across 3 binaries
30.13 s
gammaloop-nextest-core> ------------
30.13 s
gammaloop-nextest-core> Summary [ 1.469s] 379 tests run: 379 passed , 0 skipped
30.27 s
gammaloop-nextest-core>
30.27 s
gammaloop-nextest-core> ========== nextest test summary ==========
30.27 s
gammaloop-nextest-core> report: target/nextest/ci_gammaloop/junit.xml
30.27 s
gammaloop-nextest-core> tests: 379, failures: 0, errors: 0
30.27 s
gammaloop-nextest-core> No failing testcases found.
30.27 s
gammaloop-nextest-core> =========================================
30.28 s
gammaloop-nextest-core> Extracting 1 binary and 1 linked path to /build/nextest-archive-ruurlA
30.34 s
gammaloop-nextest-core> Extracted 7 files to /build/nextest-archive-ruurlA in 0.07s
30.35 s
gammaloop-nextest-core> ------------
30.35 s
gammaloop-nextest-core> Nextest run ID 938f7ed4-167f-47a9-b771-8ecac78c8047 with nextest profile: ci_gammaloop
30.35 s
gammaloop-nextest-core> Starting 19 tests across 1 binary
30.37 s
gammaloop-nextest-core> ------------
30.37 s
gammaloop-nextest-core> Summary [ 0.013s] 19 tests run: 19 passed , 0 skipped
30.41 s
gammaloop-nextest-core>
30.41 s
gammaloop-nextest-core> ========== nextest test summary ==========
30.41 s
gammaloop-nextest-core> report: target/nextest/ci_gammaloop/junit.xml
30.41 s
gammaloop-nextest-core> tests: 19, failures: 0, errors: 0
30.41 s
gammaloop-nextest-core> No failing testcases found.
30.41 s
gammaloop-nextest-core> =========================================
30.42 s
gammaloop-nextest-core> Extracting 1 binary to /build/nextest-archive-OH5562
30.45 s
gammaloop-nextest-core> Extracted 4 files to /build/nextest-archive-OH5562 in 0.03s
30.46 s
gammaloop-nextest-core> ------------
30.46 s
gammaloop-nextest-core> Nextest run ID 5fdeb49b-2bbc-4387-9bcc-3e8b064ec07b with nextest profile: ci_gammaloop
30.46 s
gammaloop-nextest-core> Starting 0 tests across 1 binary
30.46 s
gammaloop-nextest-core> ------------
30.46 s
gammaloop-nextest-core> Summary [ 0.000s] 0 tests run: 0 passed , 0 skipped
30.49 s
gammaloop-nextest-core>
30.49 s
gammaloop-nextest-core> ========== nextest test summary ==========
30.49 s
gammaloop-nextest-core> report: target/nextest/ci_gammaloop/junit.xml
30.49 s
gammaloop-nextest-core> tests: 0, failures: 0, errors: 0
30.49 s
gammaloop-nextest-core> No failing testcases found.
30.49 s
gammaloop-nextest-core> =========================================
30.51 s
gammaloop-nextest-core> Extracting 4 binaries, 1 build script output directory, and 2 linked paths to /build/nextest-archive-GgsPjq
31.00 s
gammaloop-nextest-core> Extracted 18 files to /build/nextest-archive-GgsPjq in 0.49s
31.01 s
gammaloop-nextest-core> ------------
31.01 s
gammaloop-nextest-core> Nextest run ID 7b15bc65-ef86-46e1-a168-eb59d70538f3 with nextest profile: ci_gammaloop
31.01 s
gammaloop-nextest-core> Starting 705 tests across 4 binaries (60 tests skipped , including 59 tests via profile.ci_gammaloop.default-filter )
43.36 s
gammaloop-nextest-core> FAIL [ 6.058s] (699/705) gammalooprs::test_renormalization finite_part_ghost_2loop
43.36 s
gammaloop-nextest-core> stdout ---
43.36 s
gammaloop-nextest-core>
43.36 s
gammaloop-nextest-core> running 1 test
43.36 s
gammaloop-nextest-core> test finite_part_ghost_2loop ... FAILED
43.36 s
gammaloop-nextest-core>
43.36 s
gammaloop-nextest-core> failures:
43.36 s
gammaloop-nextest-core>
43.36 s
gammaloop-nextest-core> failures:
43.36 s
gammaloop-nextest-core> finite_part_ghost_2loop
43.36 s
gammaloop-nextest-core>
43.36 s
gammaloop-nextest-core> test result: FAILED. 0 passed; 1 failed; 0 ignored; 0 measured; 6 filtered out; finished in 6.05s
43.36 s
gammaloop-nextest-core>
43.36 s
gammaloop-nextest-core> stderr ---
43.36 s
gammaloop-nextest-core> The application panicked (crashed).
43.36 s
gammaloop-nextest-core> Message: assertion failed: (align_to_rqft(&a, &model) - expected).expand().is_zero()
43.36 s
gammaloop-nextest-core> Location: crates/gammalooprs/tests/test_renormalization.rs :583
43.36 s
gammaloop-nextest-core>
43.36 s
gammaloop-nextest-core> ━━━━━━━━━━━━━━━━━━━━━━━━━━━━━━━━━━ BACKTRACE ━━━━━━━━━━━━━━━━━━━━━━━━━━━━━━━━━━━
43.36 s
gammaloop-nextest-core> 1: <color_eyre[51793ea62743adbd]::config::PanicHook>::panic_report <unknown>
43.36 s
gammaloop-nextest-core> at <unknown source file> :<unknown line>
43.36 s
gammaloop-nextest-core> 2: <color_eyre[51793ea62743adbd]::config::PanicHook>::into_panic_hook::{closure#0} <unknown>
43.36 s
gammaloop-nextest-core> at <unknown source file> :<unknown line>
43.36 s
gammaloop-nextest-core> 3: std[bcb96dfbba0ab899]::panicking::panic_with_hook <unknown>
43.36 s
gammaloop-nextest-core> at <unknown source file> :<unknown line>
43.36 s
gammaloop-nextest-core> 4: std[bcb96dfbba0ab899]::panicking::panic_handler::{closure#0} <unknown>
43.36 s
gammaloop-nextest-core> at <unknown source file> :<unknown line>
43.36 s
gammaloop-nextest-core> 5: std[bcb96dfbba0ab899]::sys::backtrace::__rust_end_short_backtrace::<std[bcb96dfbba0ab899]::panicking::panic_handler::{closure#0}, !> <unknown>
43.36 s
gammaloop-nextest-core> at <unknown source file> :<unknown line>
43.36 s
gammaloop-nextest-core> 6: __rustc[6c289b9f9c454d21]::rust_begin_unwind <unknown>
43.36 s
gammaloop-nextest-core> at <unknown source file> :<unknown line>
43.36 s
gammaloop-nextest-core> 7: core[940e698046960fd5]::panicking::panic_fmt <unknown>
43.36 s
gammaloop-nextest-core> at <unknown source file> :<unknown line>
43.36 s
gammaloop-nextest-core> 8: core[940e698046960fd5]::panicking::panic <unknown>
43.36 s
gammaloop-nextest-core> at <unknown source file> :<unknown line>
43.36 s
gammaloop-nextest-core> 9: <test_renormalization[5812939ef1a04d89]::finite_part_ghost_2loop::{closure#0} as core[940e698046960fd5]::ops::function::FnOnce<()>>::call_once <unknown>
43.36 s
gammaloop-nextest-core> at <unknown source file> :<unknown line>
43.36 s
gammaloop-nextest-core> 10: test[75d6903177b1d7e9]::__rust_begin_short_backtrace::<core[940e698046960fd5]::result::Result<(), alloc[2ea6bcb46fca0c42]::string::String>, fn() -> core[940e698046960fd5]::result::Result<(), alloc[2ea6bcb46fca0c42]::string::String>> <unknown>
43.36 s
gammaloop-nextest-core> at <unknown source file> :<unknown line>
43.36 s
gammaloop-nextest-core> 11: test[75d6903177b1d7e9]::run_test::{closure#0} <unknown>
43.36 s
gammaloop-nextest-core> at <unknown source file> :<unknown line>
43.36 s
gammaloop-nextest-core> 12: std[bcb96dfbba0ab899]::sys::backtrace::__rust_begin_short_backtrace::<test[75d6903177b1d7e9]::run_test::{closure#1}, ()> <unknown>
43.36 s
gammaloop-nextest-core> at <unknown source file> :<unknown line>
43.36 s
gammaloop-nextest-core> 13: <std[bcb96dfbba0ab899]::thread::lifecycle::spawn_unchecked<test[75d6903177b1d7e9]::run_test::{closure#1}, ()>::{closure#1} as core[940e698046960fd5]::ops::function::FnOnce<()>>::call_once::{shim:vtable#0} <unknown>
43.36 s
gammaloop-nextest-core> at <unknown source file> :<unknown line>
43.36 s
gammaloop-nextest-core> 14: <std[bcb96dfbba0ab899]::sys::thread::unix::Thread>::new::thread_start <unknown>
43.36 s
gammaloop-nextest-core> at <unknown source file> :<unknown line>
43.36 s
gammaloop-nextest-core> 15: start_thread <unknown>
43.36 s
gammaloop-nextest-core> at <unknown source file> :<unknown line>
43.36 s
gammaloop-nextest-core> 16: __clone3 <unknown>
43.36 s
gammaloop-nextest-core> at <unknown source file> :<unknown line>
43.36 s
gammaloop-nextest-core>
43.36 s
gammaloop-nextest-core> Run with COLORBT_SHOW_HIDDEN=1 environment variable to disable frame filtering.
43.36 s
gammaloop-nextest-core> Run with RUST_BACKTRACE=full to include source snippets.
43.36 s
gammaloop-nextest-core>
51.66 s
gammaloop-nextest-core> ------------
51.66 s
gammaloop-nextest-core> Summary [ 20.650s] 705 tests run: 704 passed , 1 failed , 60 skipped
51.66 s
gammaloop-nextest-core> FAIL [ 6.058s] (699/705) gammalooprs::test_renormalization finite_part_ghost_2loop
51.66 s
gammaloop-nextest-core> stdout ---
51.66 s
gammaloop-nextest-core>
51.66 s
gammaloop-nextest-core> running 1 test
51.66 s
gammaloop-nextest-core> test finite_part_ghost_2loop ... FAILED
51.66 s
gammaloop-nextest-core>
51.66 s
gammaloop-nextest-core> failures:
51.66 s
gammaloop-nextest-core>
51.66 s
gammaloop-nextest-core> failures:
51.66 s
gammaloop-nextest-core> finite_part_ghost_2loop
51.66 s
gammaloop-nextest-core>
51.66 s
gammaloop-nextest-core> test result: FAILED. 0 passed; 1 failed; 0 ignored; 0 measured; 6 filtered out; finished in 6.05s
51.66 s
gammaloop-nextest-core>
51.66 s
gammaloop-nextest-core> stderr ---
51.66 s
gammaloop-nextest-core> The application panicked (crashed).
51.66 s
gammaloop-nextest-core> Message: assertion failed: (align_to_rqft(&a, &model) - expected).expand().is_zero()
51.66 s
gammaloop-nextest-core> Location: crates/gammalooprs/tests/test_renormalization.rs :583
51.66 s
gammaloop-nextest-core>
51.66 s
gammaloop-nextest-core> ━━━━━━━━━━━━━━━━━━━━━━━━━━━━━━━━━━ BACKTRACE ━━━━━━━━━━━━━━━━━━━━━━━━━━━━━━━━━━━
51.66 s
gammaloop-nextest-core> 1: <color_eyre[51793ea62743adbd]::config::PanicHook>::panic_report <unknown>
51.66 s
gammaloop-nextest-core> at <unknown source file> :<unknown line>
51.66 s
gammaloop-nextest-core> 2: <color_eyre[51793ea62743adbd]::config::PanicHook>::into_panic_hook::{closure#0} <unknown>
51.66 s
gammaloop-nextest-core> at <unknown source file> :<unknown line>
51.66 s
gammaloop-nextest-core> 3: std[bcb96dfbba0ab899]::panicking::panic_with_hook <unknown>
51.66 s
gammaloop-nextest-core> at <unknown source file> :<unknown line>
51.66 s
gammaloop-nextest-core> 4: std[bcb96dfbba0ab899]::panicking::panic_handler::{closure#0} <unknown>
51.66 s
gammaloop-nextest-core> at <unknown source file> :<unknown line>
51.66 s
gammaloop-nextest-core> 5: std[bcb96dfbba0ab899]::sys::backtrace::__rust_end_short_backtrace::<std[bcb96dfbba0ab899]::panicking::panic_handler::{closure#0}, !> <unknown>
51.66 s
gammaloop-nextest-core> at <unknown source file> :<unknown line>
51.66 s
gammaloop-nextest-core> 6: __rustc[6c289b9f9c454d21]::rust_begin_unwind <unknown>
51.66 s
gammaloop-nextest-core> at <unknown source file> :<unknown line>
51.66 s
gammaloop-nextest-core> 7: core[940e698046960fd5]::panicking::panic_fmt <unknown>
51.66 s
gammaloop-nextest-core> at <unknown source file> :<unknown line>
51.66 s
gammaloop-nextest-core> 8: core[940e698046960fd5]::panicking::panic <unknown>
51.66 s
gammaloop-nextest-core> at <unknown source file> :<unknown line>
51.67 s
gammaloop-nextest-core> 9: <test_renormalization[5812939ef1a04d89]::finite_part_ghost_2loop::{closure#0} as core[940e698046960fd5]::ops::function::FnOnce<()>>::call_once <unknown>
51.67 s
gammaloop-nextest-core> at <unknown source file> :<unknown line>
51.67 s
gammaloop-nextest-core> 10: test[75d6903177b1d7e9]::__rust_begin_short_backtrace::<core[940e698046960fd5]::result::Result<(), alloc[2ea6bcb46fca0c42]::string::String>, fn() -> core[940e698046960fd5]::result::Result<(), alloc[2ea6bcb46fca0c42]::string::String>> <unknown>
51.67 s
gammaloop-nextest-core> at <unknown source file> :<unknown line>
51.67 s
gammaloop-nextest-core> 11: test[75d6903177b1d7e9]::run_test::{closure#0} <unknown>
51.67 s
gammaloop-nextest-core> at <unknown source file> :<unknown line>
51.67 s
gammaloop-nextest-core> 12: std[bcb96dfbba0ab899]::sys::backtrace::__rust_begin_short_backtrace::<test[75d6903177b1d7e9]::run_test::{closure#1}, ()> <unknown>
51.67 s
gammaloop-nextest-core> at <unknown source file> :<unknown line>
51.67 s
gammaloop-nextest-core> 13: <std[bcb96dfbba0ab899]::thread::lifecycle::spawn_unchecked<test[75d6903177b1d7e9]::run_test::{closure#1}, ()>::{closure#1} as core[940e698046960fd5]::ops::function::FnOnce<()>>::call_once::{shim:vtable#0} <unknown>
51.67 s
gammaloop-nextest-core> at <unknown source file> :<unknown line>
51.67 s
gammaloop-nextest-core> 14: <std[bcb96dfbba0ab899]::sys::thread::unix::Thread>::new::thread_start <unknown>
51.67 s
gammaloop-nextest-core> at <unknown source file> :<unknown line>
51.67 s
gammaloop-nextest-core> 15: start_thread <unknown>
51.67 s
gammaloop-nextest-core> at <unknown source file> :<unknown line>
51.67 s
gammaloop-nextest-core> 16: __clone3 <unknown>
51.67 s
gammaloop-nextest-core> at <unknown source file> :<unknown line>
51.67 s
gammaloop-nextest-core>
51.67 s
gammaloop-nextest-core> Run with COLORBT_SHOW_HIDDEN=1 environment variable to disable frame filtering.
51.67 s
gammaloop-nextest-core> Run with RUST_BACKTRACE=full to include source snippets.
51.67 s
gammaloop-nextest-core>
51.79 s
gammaloop-nextest-core> error : test run failed
51.82 s
gammaloop-nextest-core>
51.82 s
gammaloop-nextest-core> ========== nextest test summary ==========
51.82 s
gammaloop-nextest-core> report: target/nextest/ci_gammaloop/junit.xml
51.82 s
gammaloop-nextest-core> tests: 705, failures: 1, errors: 0
51.82 s
gammaloop-nextest-core>
51.82 s
gammaloop-nextest-core> 1. gammalooprs::test_renormalization::finite_part_ghost_2loop
51.82 s
gammaloop-nextest-core> failure: test failure with exit code 101
51.82 s
gammaloop-nextest-core> system-out
51.82 s
gammaloop-nextest-core> running 1 test
51.82 s
gammaloop-nextest-core> test finite_part_ghost_2loop ... FAILED
51.82 s
gammaloop-nextest-core>
51.82 s
gammaloop-nextest-core> failures:
51.82 s
gammaloop-nextest-core>
51.82 s
gammaloop-nextest-core> failures:
51.82 s
gammaloop-nextest-core> finite_part_ghost_2loop
51.82 s
gammaloop-nextest-core>
51.82 s
gammaloop-nextest-core> test result: FAILED. 0 passed; 1 failed; 0 ignored; 0 measured; 6 filtered out; finished in 6.05s
51.82 s
gammaloop-nextest-core> system-err
51.82 s
gammaloop-nextest-core> The application panicked (crashed).
51.82 s
gammaloop-nextest-core> Message: assertion failed: (align_to_rqft(&a, &model) - expected).expand().is_zero()
51.82 s
gammaloop-nextest-core> Location: crates/gammalooprs/tests/test_renormalization.rs:583
51.82 s
gammaloop-nextest-core>
51.82 s
gammaloop-nextest-core> ━━━━━━━━━━━━━━━━━━━━━━━━━━━━━━━━━━ BACKTRACE ━━━━━━━━━━━━━━━━━━━━━━━━━━━━━━━━━━━
51.82 s
gammaloop-nextest-core> 1: <color_eyre[51793ea62743adbd]::config::PanicHook>::panic_report<unknown>
51.82 s
gammaloop-nextest-core> at <unknown source file>:<unknown line>
51.82 s
gammaloop-nextest-core> 2: <color_eyre[51793ea62743adbd]::config::PanicHook>::into_panic_hook::{closure#0}<unknown>
51.82 s
gammaloop-nextest-core> at <unknown source file>:<unknown line>
51.82 s
gammaloop-nextest-core> 3: std[bcb96dfbba0ab899]::panicking::panic_with_hook<unknown>
51.82 s
gammaloop-nextest-core> at <unknown source file>:<unknown line>
51.82 s
gammaloop-nextest-core> 4: std[bcb96dfbba0ab899]::panicking::panic_handler::{closure#0}<unknown>
51.82 s
gammaloop-nextest-core> at <unknown source file>:<unknown line>
51.82 s
gammaloop-nextest-core> 5: std[bcb96dfbba0ab899]::sys::backtrace::__rust_end_short_backtrace::<std[bcb96dfbba0ab899]::panicking::panic_handler::{closure#0}, !><unknown>
51.82 s
gammaloop-nextest-core> at <unknown source file>:<unknown line>
51.82 s
gammaloop-nextest-core> 6: __rustc[6c289b9f9c454d21]::rust_begin_unwind<unknown>
51.82 s
gammaloop-nextest-core> at <unknown source file>:<unknown line>
51.82 s
gammaloop-nextest-core> 7: core[940e698046960fd5]::panicking::panic_fmt<unknown>
51.82 s
gammaloop-nextest-core> at <unknown source file>:<unknown line>
51.82 s
gammaloop-nextest-core> 8: core[940e698046960fd5]::panicking::panic<unknown>
51.82 s
gammaloop-nextest-core> at <unknown source file>:<unknown line>
51.82 s
gammaloop-nextest-core> 9: <test_renormalization[5812939ef1a04d89]::finite_part_ghost_2loop::{closure#0} as core[940e698046960fd5]::ops::function::FnOnce<()>>::call_once<unknown>
51.82 s
gammaloop-nextest-core> at <unknown source file>:<unknown line>
51.82 s
gammaloop-nextest-core> 10: test[75d6903177b1d7e9]::__rust_begin_short_backtrace::<core[940e698046960fd5]::result::Result<(), alloc[2ea6bcb46fca0c42]::string::String>, fn() -> core[940e698046960fd5]::result::Result<(), alloc[2ea6bcb46fca0c42]::string::String>><unknown>
51.82 s
gammaloop-nextest-core> at <unknown source file>:<unknown line>
51.82 s
gammaloop-nextest-core> 11: test[75d6903177b1d7e9]::run_test::{closure#0}<unknown>
51.82 s
gammaloop-nextest-core> at <unknown source file>:<unknown line>
51.82 s
gammaloop-nextest-core> 12: std[bcb96dfbba0ab899]::sys::backtrace::__rust_begin_short_backtrace::<test[75d6903177b1d7e9]::run_test::{closure#1}, ()><unknown>
51.82 s
gammaloop-nextest-core> at <unknown source file>:<unknown line>
51.82 s
gammaloop-nextest-core> 13: <std[bcb96dfbba0ab899]::thread::lifecycle::spawn_unchecked<test[75d6903177b1d7e9]::run_test::{closure#1}, ()>::{closure#1} as core[940e698046960fd5]::ops::function::FnOnce<()>>::call_once::{shim:vtable#0}<unknown>
51.82 s
gammaloop-nextest-core> at <unknown source file>:<unknown line>
51.82 s
gammaloop-nextest-core> 14: <std[bcb96dfbba0ab899]::sys::thread::unix::Thread>::new::thread_start<unknown>
51.82 s
gammaloop-nextest-core> at <unknown source file>:<unknown line>
51.82 s
gammaloop-nextest-core> 15: start_thread<unknown>
51.82 s
gammaloop-nextest-core> at <unknown source file>:<unknown line>
51.82 s
gammaloop-nextest-core> 16: __clone3<unknown>
51.82 s
gammaloop-nextest-core> at <unknown source file>:<unknown line>
51.82 s
gammaloop-nextest-core>
51.82 s
gammaloop-nextest-core> Run with COLORBT_SHOW_HIDDEN=1 environment variable to disable frame filtering.
51.82 s
gammaloop-nextest-core> Run with RUST_BACKTRACE=full to include source snippets.
51.82 s
gammaloop-nextest-core> =========================================
51.84 s
gammaloop-nextest-core> Extracting 1 binary, 1 build script output directory, and 1 linked path to /build/nextest-archive-s18GfA
51.93 s
gammaloop-nextest-core> Extracted 7 files to /build/nextest-archive-s18GfA in 0.09s
51.96 s
gammaloop-nextest-core> ------------
51.96 s
gammaloop-nextest-core> Nextest run ID be3592c5-0a5b-428d-85bc-08772bc3a3d9 with nextest profile: ci_gammaloop
51.96 s
gammaloop-nextest-core> Starting 105 tests across 1 binary
72.30 s
gammaloop-nextest-core> ------------
72.30 s
gammaloop-nextest-core> Summary [ 20.343s] 105 tests run: 105 passed , 0 skipped
72.37 s
gammaloop-nextest-core>
72.37 s
gammaloop-nextest-core> ========== nextest test summary ==========
72.37 s
gammaloop-nextest-core> report: target/nextest/ci_gammaloop/junit.xml
72.37 s
gammaloop-nextest-core> tests: 105, failures: 0, errors: 0
72.37 s
gammaloop-nextest-core> No failing testcases found.
72.37 s
gammaloop-nextest-core> =========================================
72.46 s
error: Cannot build '/nix/store/v0qh5n7q6ba5h5v37ywwp5q1jfzjvc33-gammaloop-nextest-core.drv '.
72.46 s
Reason: builder failed with exit code 100 .
72.46 s
Output paths:
72.46 s
/nix/store/q4cjrrnkw10yi6ir1lnvg6rhgm20mwwz-gammaloop-nextest-core
72.46 s
Last 229 log lines:
72.46 s
> Extracting 4 binaries (including 1 non-test binary), 1 build script output directory, and 2 linked paths to /build/nextest-archive-WzINIX
72.46 s
> Extracted 20 files to /build/nextest-archive-WzINIX in 0.79s
72.46 s
> ------------
72.46 s
> Nextest run ID 94bfdc91-6527-42d7-8ea1-6c62554c9734 with nextest profile: ci_gammaloop
72.46 s
> Starting 379 tests across 3 binaries
72.46 s
> ------------
72.46 s
> Summary [ 1.469s] 379 tests run: 379 passed , 0 skipped
72.46 s
>
72.46 s
> ========== nextest test summary ==========
72.46 s
> report: target/nextest/ci_gammaloop/junit.xml
72.46 s
> tests: 379, failures: 0, errors: 0
72.46 s
> No failing testcases found.
72.46 s
> =========================================
72.46 s
> Extracting 1 binary and 1 linked path to /build/nextest-archive-ruurlA
72.46 s
> Extracted 7 files to /build/nextest-archive-ruurlA in 0.07s
72.46 s
> ------------
72.46 s
> Nextest run ID 938f7ed4-167f-47a9-b771-8ecac78c8047 with nextest profile: ci_gammaloop
72.46 s
> Starting 19 tests across 1 binary
72.46 s
> ------------
72.46 s
> Summary [ 0.013s] 19 tests run: 19 passed , 0 skipped
72.46 s
>
72.46 s
> ========== nextest test summary ==========
72.46 s
> report: target/nextest/ci_gammaloop/junit.xml
72.46 s
> tests: 19, failures: 0, errors: 0
72.46 s
> No failing testcases found.
72.46 s
> =========================================
72.46 s
> Extracting 1 binary to /build/nextest-archive-OH5562
72.46 s
> Extracted 4 files to /build/nextest-archive-OH5562 in 0.03s
72.46 s
> ------------
72.46 s
> Nextest run ID 5fdeb49b-2bbc-4387-9bcc-3e8b064ec07b with nextest profile: ci_gammaloop
72.46 s
> Starting 0 tests across 1 binary
72.46 s
> ------------
72.46 s
> Summary [ 0.000s] 0 tests run: 0 passed , 0 skipped
72.46 s
>
72.46 s
> ========== nextest test summary ==========
72.46 s
> report: target/nextest/ci_gammaloop/junit.xml
72.46 s
> tests: 0, failures: 0, errors: 0
72.46 s
> No failing testcases found.
72.46 s
> =========================================
72.46 s
> Extracting 4 binaries, 1 build script output directory, and 2 linked paths to /build/nextest-archive-GgsPjq
72.46 s
> Extracted 18 files to /build/nextest-archive-GgsPjq in 0.49s
72.46 s
> ------------
72.46 s
> Nextest run ID 7b15bc65-ef86-46e1-a168-eb59d70538f3 with nextest profile: ci_gammaloop
72.46 s
> Starting 705 tests across 4 binaries (60 tests skipped , including 59 tests via profile.ci_gammaloop.default-filter )
72.46 s
> FAIL [ 6.058s] (699/705) gammalooprs::test_renormalization finite_part_ghost_2loop
72.46 s
> stdout ---
72.46 s
>
72.46 s
> running 1 test
72.46 s
> test finite_part_ghost_2loop ... FAILED
72.46 s
>
72.46 s
> failures:
72.46 s
>
72.46 s
> failures:
72.46 s
> finite_part_ghost_2loop
72.46 s
>
72.46 s
> test result: FAILED. 0 passed; 1 failed; 0 ignored; 0 measured; 6 filtered out; finished in 6.05s
72.46 s
>
72.46 s
> stderr ---
72.46 s
> The application panicked (crashed).
72.46 s
> Message: assertion failed: (align_to_rqft(&a, &model) - expected).expand().is_zero()
72.46 s
> Location: crates/gammalooprs/tests/test_renormalization.rs :583
72.46 s
>
72.46 s
> ━━━━━━━━━━━━━━━━━━━━━━━━━━━━━━━━━━ BACKTRACE ━━━━━━━━━━━━━━━━━━━━━━━━━━━━━━━━━━━
72.46 s
> 1: <color_eyre[51793ea62743adbd]::config::PanicHook>::panic_report <unknown>
72.46 s
> at <unknown source file> :<unknown line>
72.46 s
> 2: <color_eyre[51793ea62743adbd]::config::PanicHook>::into_panic_hook::{closure#0} <unknown>
72.46 s
> at <unknown source file> :<unknown line>
72.46 s
> 3: std[bcb96dfbba0ab899]::panicking::panic_with_hook <unknown>
72.46 s
> at <unknown source file> :<unknown line>
72.46 s
> 4: std[bcb96dfbba0ab899]::panicking::panic_handler::{closure#0} <unknown>
72.46 s
> at <unknown source file> :<unknown line>
72.46 s
> 5: std[bcb96dfbba0ab899]::sys::backtrace::__rust_end_short_backtrace::<std[bcb96dfbba0ab899]::panicking::panic_handler::{closure#0}, !> <unknown>
72.46 s
> at <unknown source file> :<unknown line>
72.46 s
> 6: __rustc[6c289b9f9c454d21]::rust_begin_unwind <unknown>
72.46 s
> at <unknown source file> :<unknown line>
72.46 s
> 7: core[940e698046960fd5]::panicking::panic_fmt <unknown>
72.46 s
> at <unknown source file> :<unknown line>
72.46 s
> 8: core[940e698046960fd5]::panicking::panic <unknown>
72.46 s
> at <unknown source file> :<unknown line>
72.46 s
> 9: <test_renormalization[5812939ef1a04d89]::finite_part_ghost_2loop::{closure#0} as core[940e698046960fd5]::ops::function::FnOnce<()>>::call_once <unknown>
72.46 s
> at <unknown source file> :<unknown line>
72.46 s
> 10: test[75d6903177b1d7e9]::__rust_begin_short_backtrace::<core[940e698046960fd5]::result::Result<(), alloc[2ea6bcb46fca0c42]::string::String>, fn() -> core[940e698046960fd5]::result::Result<(), alloc[2ea6bcb46fca0c42]::string::String>> <unknown>
72.46 s
> at <unknown source file> :<unknown line>
72.46 s
> 11: test[75d6903177b1d7e9]::run_test::{closure#0} <unknown>
72.46 s
> at <unknown source file> :<unknown line>
72.46 s
> 12: std[bcb96dfbba0ab899]::sys::backtrace::__rust_begin_short_backtrace::<test[75d6903177b1d7e9]::run_test::{closure#1}, ()> <unknown>
72.46 s
> at <unknown source file> :<unknown line>
72.46 s
> 13: <std[bcb96dfbba0ab899]::thread::lifecycle::spawn_unchecked<test[75d6903177b1d7e9]::run_test::{closure#1}, ()>::{closure#1} as core[940e698046960fd5]::ops::function::FnOnce<()>>::call_once::{shim:vtable#0} <unknown>
72.46 s
> at <unknown source file> :<unknown line>
72.46 s
> 14: <std[bcb96dfbba0ab899]::sys::thread::unix::Thread>::new::thread_start <unknown>
72.46 s
> at <unknown source file> :<unknown line>
72.46 s
> 15: start_thread <unknown>
72.46 s
> at <unknown source file> :<unknown line>
72.46 s
> 16: __clone3 <unknown>
72.46 s
> at <unknown source file> :<unknown line>
72.46 s
>
72.46 s
> Run with COLORBT_SHOW_HIDDEN=1 environment variable to disable frame filtering.
72.46 s
> Run with RUST_BACKTRACE=full to include source snippets.
72.46 s
>
72.46 s
> ------------
72.47 s
> Summary [ 20.650s] 705 tests run: 704 passed , 1 failed , 60 skipped
72.47 s
> FAIL [ 6.058s] (699/705) gammalooprs::test_renormalization finite_part_ghost_2loop
72.47 s
> stdout ---
72.47 s
>
72.47 s
> running 1 test
72.47 s
> test finite_part_ghost_2loop ... FAILED
72.47 s
>
72.47 s
> failures:
72.47 s
>
72.47 s
> failures:
72.47 s
> finite_part_ghost_2loop
72.47 s
>
72.47 s
> test result: FAILED. 0 passed; 1 failed; 0 ignored; 0 measured; 6 filtered out; finished in 6.05s
72.47 s
>
72.47 s
> stderr ---
72.47 s
> The application panicked (crashed).
72.47 s
> Message: assertion failed: (align_to_rqft(&a, &model) - expected).expand().is_zero()
72.47 s
> Location: crates/gammalooprs/tests/test_renormalization.rs :583
72.47 s
>
72.47 s
> ━━━━━━━━━━━━━━━━━━━━━━━━━━━━━━━━━━ BACKTRACE ━━━━━━━━━━━━━━━━━━━━━━━━━━━━━━━━━━━
72.47 s
> 1: <color_eyre[51793ea62743adbd]::config::PanicHook>::panic_report <unknown>
72.47 s
> at <unknown source file> :<unknown line>
72.47 s
> 2: <color_eyre[51793ea62743adbd]::config::PanicHook>::into_panic_hook::{closure#0} <unknown>
72.47 s
> at <unknown source file> :<unknown line>
72.47 s
> 3: std[bcb96dfbba0ab899]::panicking::panic_with_hook <unknown>
72.47 s
> at <unknown source file> :<unknown line>
72.47 s
> 4: std[bcb96dfbba0ab899]::panicking::panic_handler::{closure#0} <unknown>
72.47 s
> at <unknown source file> :<unknown line>
72.47 s
> 5: std[bcb96dfbba0ab899]::sys::backtrace::__rust_end_short_backtrace::<std[bcb96dfbba0ab899]::panicking::panic_handler::{closure#0}, !> <unknown>
72.47 s
> at <unknown source file> :<unknown line>
72.47 s
> 6: __rustc[6c289b9f9c454d21]::rust_begin_unwind <unknown>
72.47 s
> at <unknown source file> :<unknown line>
72.47 s
> 7: core[940e698046960fd5]::panicking::panic_fmt <unknown>
72.47 s
> at <unknown source file> :<unknown line>
72.47 s
> 8: core[940e698046960fd5]::panicking::panic <unknown>
72.47 s
> at <unknown source file> :<unknown line>
72.47 s
> 9: <test_renormalization[5812939ef1a04d89]::finite_part_ghost_2loop::{closure#0} as core[940e698046960fd5]::ops::function::FnOnce<()>>::call_once <unknown>
72.47 s
> at <unknown source file> :<unknown line>
72.47 s
> 10: test[75d6903177b1d7e9]::__rust_begin_short_backtrace::<core[940e698046960fd5]::result::Result<(), alloc[2ea6bcb46fca0c42]::string::String>, fn() -> core[940e698046960fd5]::result::Result<(), alloc[2ea6bcb46fca0c42]::string::String>> <unknown>
72.47 s
> at <unknown source file> :<unknown line>
72.47 s
> 11: test[75d6903177b1d7e9]::run_test::{closure#0} <unknown>
72.47 s
> at <unknown source file> :<unknown line>
72.47 s
> 12: std[bcb96dfbba0ab899]::sys::backtrace::__rust_begin_short_backtrace::<test[75d6903177b1d7e9]::run_test::{closure#1}, ()> <unknown>
72.47 s
> at <unknown source file> :<unknown line>
72.47 s
> 13: <std[bcb96dfbba0ab899]::thread::lifecycle::spawn_unchecked<test[75d6903177b1d7e9]::run_test::{closure#1}, ()>::{closure#1} as core[940e698046960fd5]::ops::function::FnOnce<()>>::call_once::{shim:vtable#0} <unknown>
72.47 s
> at <unknown source file> :<unknown line>
72.47 s
> 14: <std[bcb96dfbba0ab899]::sys::thread::unix::Thread>::new::thread_start <unknown>
72.47 s
> at <unknown source file> :<unknown line>
72.47 s
> 15: start_thread <unknown>
72.47 s
> at <unknown source file> :<unknown line>
72.47 s
> 16: __clone3 <unknown>
72.47 s
> at <unknown source file> :<unknown line>
72.47 s
>
72.47 s
> Run with COLORBT_SHOW_HIDDEN=1 environment variable to disable frame filtering.
72.47 s
> Run with RUST_BACKTRACE=full to include source snippets.
72.47 s
>
72.47 s
> error : test run failed
72.47 s
>
72.47 s
> ========== nextest test summary ==========
72.47 s
> report: target/nextest/ci_gammaloop/junit.xml
72.47 s
> tests: 705, failures: 1, errors: 0
72.47 s
>
72.47 s
> 1. gammalooprs::test_renormalization::finite_part_ghost_2loop
72.47 s
> failure: test failure with exit code 101
72.47 s
> system-out
72.47 s
> running 1 test
72.47 s
> test finite_part_ghost_2loop ... FAILED
72.47 s
>
72.47 s
> failures:
72.47 s
>
72.47 s
> failures:
72.47 s
> finite_part_ghost_2loop
72.47 s
>
72.47 s
> test result: FAILED. 0 passed; 1 failed; 0 ignored; 0 measured; 6 filtered out; finished in 6.05s
72.47 s
> system-err
72.47 s
> The application panicked (crashed).
72.47 s
> Message: assertion failed: (align_to_rqft(&a, &model) - expected).expand().is_zero()
72.47 s
> Location: crates/gammalooprs/tests/test_renormalization.rs:583
72.47 s
>
72.47 s
> ━━━━━━━━━━━━━━━━━━━━━━━━━━━━━━━━━━ BACKTRACE ━━━━━━━━━━━━━━━━━━━━━━━━━━━━━━━━━━━
72.47 s
> 1: <color_eyre[51793ea62743adbd]::config::PanicHook>::panic_report<unknown>
72.47 s
> at <unknown source file>:<unknown line>
72.47 s
> 2: <color_eyre[51793ea62743adbd]::config::PanicHook>::into_panic_hook::{closure#0}<unknown>
72.47 s
> at <unknown source file>:<unknown line>
72.47 s
> 3: std[bcb96dfbba0ab899]::panicking::panic_with_hook<unknown>
72.47 s
> at <unknown source file>:<unknown line>
72.47 s
> 4: std[bcb96dfbba0ab899]::panicking::panic_handler::{closure#0}<unknown>
72.47 s
> at <unknown source file>:<unknown line>
72.47 s
> 5: std[bcb96dfbba0ab899]::sys::backtrace::__rust_end_short_backtrace::<std[bcb96dfbba0ab899]::panicking::panic_handler::{closure#0}, !><unknown>
72.47 s
> at <unknown source file>:<unknown line>
72.47 s
> 6: __rustc[6c289b9f9c454d21]::rust_begin_unwind<unknown>
72.47 s
> at <unknown source file>:<unknown line>
72.47 s
> 7: core[940e698046960fd5]::panicking::panic_fmt<unknown>
72.47 s
> at <unknown source file>:<unknown line>
72.47 s
> 8: core[940e698046960fd5]::panicking::panic<unknown>
72.47 s
> at <unknown source file>:<unknown line>
72.47 s
> 9: <test_renormalization[5812939ef1a04d89]::finite_part_ghost_2loop::{closure#0} as core[940e698046960fd5]::ops::function::FnOnce<()>>::call_once<unknown>
72.47 s
> at <unknown source file>:<unknown line>
72.47 s
> 10: test[75d6903177b1d7e9]::__rust_begin_short_backtrace::<core[940e698046960fd5]::result::Result<(), alloc[2ea6bcb46fca0c42]::string::String>, fn() -> core[940e698046960fd5]::result::Result<(), alloc[2ea6bcb46fca0c42]::string::String>><unknown>
72.47 s
> at <unknown source file>:<unknown line>
72.47 s
> 11: test[75d6903177b1d7e9]::run_test::{closure#0}<unknown>
72.47 s
> at <unknown source file>:<unknown line>
72.47 s
> 12: std[bcb96dfbba0ab899]::sys::backtrace::__rust_begin_short_backtrace::<test[75d6903177b1d7e9]::run_test::{closure#1}, ()><unknown>
72.47 s
> at <unknown source file>:<unknown line>
72.47 s
> 13: <std[bcb96dfbba0ab899]::thread::lifecycle::spawn_unchecked<test[75d6903177b1d7e9]::run_test::{closure#1}, ()>::{closure#1} as core[940e698046960fd5]::ops::function::FnOnce<()>>::call_once::{shim:vtable#0}<unknown>
72.47 s
> at <unknown source file>:<unknown line>
72.47 s
> 14: <std[bcb96dfbba0ab899]::sys::thread::unix::Thread>::new::thread_start<unknown>
72.47 s
> at <unknown source file>:<unknown line>
72.47 s
> 15: start_thread<unknown>
72.47 s
> at <unknown source file>:<unknown line>
72.47 s
> 16: __clone3<unknown>
72.47 s
> at <unknown source file>:<unknown line>
72.47 s
>
72.47 s
> Run with COLORBT_SHOW_HIDDEN=1 environment variable to disable frame filtering.
72.47 s
> Run with RUST_BACKTRACE=full to include source snippets.
72.47 s
> =========================================
72.47 s
> Extracting 1 binary, 1 build script output directory, and 1 linked path to /build/nextest-archive-s18GfA
72.47 s
> Extracted 7 files to /build/nextest-archive-s18GfA in 0.09s
72.47 s
> ------------
72.47 s
> Nextest run ID be3592c5-0a5b-428d-85bc-08772bc3a3d9 with nextest profile: ci_gammaloop
72.47 s
> Starting 105 tests across 1 binary
72.47 s
> ------------
72.47 s
> Summary [ 20.343s] 105 tests run: 105 passed , 0 skipped
72.47 s
>
72.47 s
> ========== nextest test summary ==========
72.47 s
> report: target/nextest/ci_gammaloop/junit.xml
72.47 s
> tests: 105, failures: 0, errors: 0
72.47 s
> No failing testcases found.
72.47 s
> =========================================
72.47 s
For full logs, run:
72.47 s
nix log /nix/store/v0qh5n7q6ba5h5v37ywwp5q1jfzjvc33-gammaloop-nextest-core.drv
72.67 s
[0 built (1 failed ), 0.0 Run failed.