1. 0.00 s $ /nix/store/9ypz3flqsrl5xl495mm8h645gadjsxi1-coreutils-9.11/bin/timeout --kill-after=15s 7200s /nix/store/23zk8sgzamrbmj1fday15szf7f2279s8-nix-2.34.7/bin/nix --extra-experimental-features nix-command --extra-experimental-features flakes flake clone git+https://github.com/alphal00p/gammaloop --dest /tmp/nix-ci-worker/stable-pwd/repo/
  2. 0.08 s Cloning into '/tmp/nix-ci-worker/stable-pwd/repo'...
  3. 1.14 s remote: Enumerating objects: 84512, done.
  4. 1.26 s remote: Counting objects: 0% (1/8829) remote: Counting objects: 1% (89/8829) remote: Counting objects: 2% (177/8829) remote: Counting objects: 3% (265/8829) remote: Counting objects: 4% (354/8829) remote: Counting objects: 5% (442/8829) remote: Counting objects: 6% (530/8829) remote: Counting objects: 7% (619/8829) remote: Counting objects: 8% (707/8829) remote: Counting objects: 9% (795/8829) remote: Counting objects: 10% (883/8829) remote: Counting objects: 11% (972/8829) remote: Counting objects: 12% (1060/8829) remote: Counting objects: 13% (1148/8829) remote: Counting objects: 14% (1237/8829) remote: Counting objects: 15% (1325/8829) remote: Counting objects: 16% (1413/8829) remote: Counting objects: 17% (1501/8829) remote: Counting objects: 18% (1590/8829) remote: Counting objects: 19% (1678/8829) remote: Counting objects: 20% (1766/8829) remote: Counting objects: 21% (1855/8829) remote: Counting objects: 22% (1943/8829) remote: Counting objects: 23% (2031/8829) remote: Counting objects: 24% (2119/8829) remote: Counting objects: 25% (2208/8829) remote: Counting objects: 26% (2296/8829) remote: Counting objects: 27% (2384/8829) remote: Counting objects: 28% (2473/8829) remote: Counting objects: 29% (2561/8829) remote: Counting objects: 30% (2649/8829) remote: Counting objects: 31% (2737/8829) remote: Counting objects: 32% (2826/8829) remote: Counting objects: 33% (2914/8829) remote: Counting objects: 34% (3002/8829) remote: Counting objects: 35% (3091/8829) remote: Counting objects: 36% (3179/8829) remote: Counting objects: 37% (3267/8829) remote: Counting objects: 38% (3356/8829) remote: Counting objects: 39% (3444/8829) remote: Counting objects: 40% (3532/8829) remote: Counting objects: 41% (3620/8829) remote: Counting objects: 42% (3709/8829) remote: Counting objects: 43% (3797/8829) remote: Counting objects: 44% (3885/8829) remote: Counting objects: 45% (3974/8829) remote: Counting objects: 46% (4062/8829) remote: Counting objects: 47% (4150/8829) remote: Counting objects: 48% (4238/8829) remote: Counting objects: 49% (4327/8829) remote: Counting objects: 50% (4415/8829) remote: Counting objects: 51% (4503/8829) remote: Counting objects: 52% (4592/8829) remote: Counting objects: 53% (4680/8829) remote: Counting objects: 54% (4768/8829) remote: Counting objects: 55% (4856/8829) remote: Counting objects: 56% (4945/8829) remote: Counting objects: 57% (5033/8829) remote: Counting objects: 58% (5121/8829) remote: Counting objects: 59% (5210/8829) remote: Counting objects: 60% (5298/8829) remote: Counting objects: 61% (5386/8829) remote: Counting objects: 62% (5474/8829) remote: Counting objects: 63% (5563/8829) remote: Counting objects: 64% (5651/8829) remote: Counting objects: 65% (5739/8829) remote: Counting objects: 66% (5828/8829) remote: Counting objects: 67% (5916/8829) remote: Counting objects: 68% (6004/8829) remote: Counting objects: 69% (6093/8829) remote: Counting objects: 70% (6181/8829) remote: Counting objects: 71% (6269/8829) remote: Counting objects: 72% (6357/8829) remote: Counting objects: 73% (6446/8829) remote: Counting objects: 74% (6534/8829) remote: Counting objects: 75% (6622/8829) remote: Counting objects: 76% (6711/8829) remote: Counting objects: 77% (6799/8829) remote: Counting objects: 78% (6887/8829) remote: Counting objects: 79% (6975/8829) remote: Counting objects: 80% (7064/8829) remote: Counting objects: 81% (7152/8829) remote: Counting objects: 82% (7240/8829) remote: Counting objects: 83% (7329/8829) remote: Counting objects: 84% (7417/8829) remote: Counting objects: 85% (7505/8829) remote: Counting objects: 86% (7593/8829) remote: Counting objects: 87% (7682/8829) remote: Counting objects: 88% (7770/8829) remote: Counting objects: 89% (7858/8829) remote: Counting objects: 90% (7947/8829) remote: Counting objects: 91% (8035/8829) remote: Counting objects: 92% (8123/8829) remote: Counting objects: 93% (8211/8829) remote: Counting objects: 94% (8300/8829) remote: Counting objects: 95% (8388/8829) remote: Counting objects: 96% (8476/8829) remote: Counting objects: 97% (8565/8829) remote: Counting objects: 98% (8653/8829) remote: Counting objects: 99% (8741/8829) remote: Counting objects: 100% (8829/8829) remote: Counting objects: 100% (8829/8829), done.
  5. 3.08 s remote: Compressing objects: 0% (1/1879) remote: Compressing objects: 1% (19/1879) remote: Compressing objects: 2% (38/1879) remote: Compressing objects: 3% (57/1879) remote: Compressing objects: 4% (76/1879) remote: Compressing objects: 5% (94/1879) remote: Compressing objects: 6% (113/1879) remote: Compressing objects: 7% (132/1879) remote: Compressing objects: 8% (151/1879) remote: Compressing objects: 9% (170/1879) remote: Compressing objects: 10% (188/1879) remote: Compressing objects: 11% (207/1879) remote: Compressing objects: 11% (218/1879) remote: Compressing objects: 12% (226/1879) remote: Compressing objects: 13% (245/1879) remote: Compressing objects: 14% (264/1879) remote: Compressing objects: 15% (282/1879) remote: Compressing objects: 16% (301/1879) remote: Compressing objects: 17% (320/1879) remote: Compressing objects: 18% (339/1879) remote: Compressing objects: 19% (358/1879) remote: Compressing objects: 20% (376/1879) remote: Compressing objects: 21% (395/1879) remote: Compressing objects: 22% (414/1879) remote: Compressing objects: 23% (433/1879) remote: Compressing objects: 24% (451/1879) remote: Compressing objects: 25% (470/1879) remote: Compressing objects: 26% (489/1879) remote: Compressing objects: 27% (508/1879) remote: Compressing objects: 28% (527/1879) remote: Compressing objects: 29% (545/1879) remote: Compressing objects: 30% (564/1879) remote: Compressing objects: 31% (583/1879) remote: Compressing objects: 32% (602/1879) remote: Compressing objects: 33% (621/1879) remote: Compressing objects: 34% (639/1879) remote: Compressing objects: 35% (658/1879) remote: Compressing objects: 36% (677/1879) remote: Compressing objects: 37% (696/1879) remote: Compressing objects: 38% (715/1879) remote: Compressing objects: 39% (733/1879) remote: Compressing objects: 40% (752/1879) remote: Compressing objects: 41% (771/1879) remote: Compressing objects: 42% (790/1879) remote: Compressing objects: 43% (808/1879) remote: Compressing objects: 44% (827/1879) remote: Compressing objects: 45% (846/1879) remote: Compressing objects: 46% (865/1879) remote: Compressing objects: 47% (884/1879) remote: Compressing objects: 48% (902/1879) remote: Compressing objects: 49% (921/1879) remote: Compressing objects: 50% (940/1879) remote: Compressing objects: 51% (959/1879) remote: Compressing objects: 52% (978/1879) remote: Compressing objects: 53% (996/1879) remote: Compressing objects: 54% (1015/1879) remote: Compressing objects: 55% (1034/1879) remote: Compressing objects: 56% (1053/1879) remote: Compressing objects: 57% (1072/1879) remote: Compressing objects: 58% (1090/1879) remote: Compressing objects: 59% (1109/1879) remote: Compressing objects: 60% (1128/1879) remote: Compressing objects: 61% (1147/1879) remote: Compressing objects: 62% (1165/1879) remote: Compressing objects: 63% (1184/1879) remote: Compressing objects: 64% (1203/1879) remote: Compressing objects: 65% (1222/1879) remote: Compressing objects: 66% (1241/1879) remote: Compressing objects: 67% (1259/1879) remote: Compressing objects: 68% (1278/1879) remote: Compressing objects: 69% (1297/1879) remote: Compressing objects: 70% (1316/1879) remote: Compressing objects: 71% (1335/1879) remote: Compressing objects: 72% (1353/1879) remote: Compressing objects: 73% (1372/1879) remote: Compressing objects: 74% (1391/1879) remote: Compressing objects: 75% (1410/1879) remote: Compressing objects: 76% (1429/1879) remote: Compressing objects: 77% (1447/1879) remote: Compressing objects: 78% (1466/1879) remote: Compressing objects: 79% (1485/1879) remote: Compressing objects: 80% (1504/1879) remote: Compressing objects: 81% (1522/1879) remote: Compressing objects: 82% (1541/1879) remote: Compressing objects: 83% (1560/1879) remote: Compressing objects: 84% (1579/1879) remote: Compressing objects: 85% (1598/1879) remote: Compressing objects: 86% (1616/1879) remote: Compressing objects: 87% (1635/1879) remote: Compressing objects: 88% (1654/1879) remote: Compressing objects: 89% (1673/1879) remote: Compressing objects: 90% (1692/1879) remote: Compressing objects: 91% (1710/1879) remote: Compressing objects: 92% (1729/1879) remote: Compressing objects: 93% (1748/1879) remote: Compressing objects: 94% (1767/1879) remote: Compressing objects: 95% (1786/1879) remote: Compressing objects: 96% (1804/1879) remote: Compressing objects: 97% (1823/1879) remote: Compressing objects: 98% (1842/1879) remote: Compressing objects: 99% (1861/1879) remote: Compressing objects: 100% (1879/1879) remote: Compressing objects: 100% (1879/1879), done.
  6. 14.13 s Receiving objects: 0% (1/84512) Receiving objects: 1% (846/84512), 3.31 MiB | 6.52 MiB/s Receiving objects: 2% (1691/84512), 3.31 MiB | 6.52 MiB/s Receiving objects: 3% (2536/84512), 3.31 MiB | 6.52 MiB/s Receiving objects: 3% (3048/84512), 3.31 MiB | 6.52 MiB/s Receiving objects: 4% (3381/84512), 7.68 MiB | 7.62 MiB/s Receiving objects: 5% (4226/84512), 7.68 MiB | 7.62 MiB/s Receiving objects: 6% (5071/84512), 7.68 MiB | 7.62 MiB/s Receiving objects: 7% (5916/84512), 7.68 MiB | 7.62 MiB/s Receiving objects: 8% (6761/84512), 7.68 MiB | 7.62 MiB/s Receiving objects: 8% (7251/84512), 17.25 MiB | 8.59 MiB/s Receiving objects: 9% (7607/84512), 17.25 MiB | 8.59 MiB/s Receiving objects: 10% (8452/84512), 17.25 MiB | 8.59 MiB/s Receiving objects: 11% (9297/84512), 17.25 MiB | 8.59 MiB/s Receiving objects: 12% (10142/84512), 17.25 MiB | 8.59 MiB/s Receiving objects: 13% (10987/84512), 17.25 MiB | 8.59 MiB/s Receiving objects: 14% (11832/84512), 17.25 MiB | 8.59 MiB/s Receiving objects: 15% (12677/84512), 17.25 MiB | 8.59 MiB/s Receiving objects: 16% (13522/84512), 17.25 MiB | 8.59 MiB/s Receiving objects: 17% (14368/84512), 17.25 MiB | 8.59 MiB/s Receiving objects: 18% (15213/84512), 17.25 MiB | 8.59 MiB/s Receiving objects: 19% (16058/84512), 17.25 MiB | 8.59 MiB/s Receiving objects: 20% (16903/84512), 17.25 MiB | 8.59 MiB/s Receiving objects: 21% (17748/84512), 17.25 MiB | 8.59 MiB/s Receiving objects: 22% (18593/84512), 17.25 MiB | 8.59 MiB/s Receiving objects: 23% (19438/84512), 17.25 MiB | 8.59 MiB/s Receiving objects: 24% (20283/84512), 17.25 MiB | 8.59 MiB/s Receiving objects: 25% (21128/84512), 22.49 MiB | 8.96 MiB/s Receiving objects: 26% (21974/84512), 22.49 MiB | 8.96 MiB/s Receiving objects: 27% (22819/84512), 22.49 MiB | 8.96 MiB/s Receiving objects: 28% (23664/84512), 22.49 MiB | 8.96 MiB/s Receiving objects: 29% (24509/84512), 22.49 MiB | 8.96 MiB/s Receiving objects: 30% (25354/84512), 22.49 MiB | 8.96 MiB/s Receiving objects: 31% (26199/84512), 22.49 MiB | 8.96 MiB/s Receiving objects: 32% (27044/84512), 22.49 MiB | 8.96 MiB/s Receiving objects: 33% (27889/84512), 22.49 MiB | 8.96 MiB/s Receiving objects: 34% (28735/84512), 22.49 MiB | 8.96 MiB/s Receiving objects: 35% (29580/84512), 22.49 MiB | 8.96 MiB/s Receiving objects: 36% (30425/84512), 22.49 MiB | 8.96 MiB/s Receiving objects: 37% (31270/84512), 22.49 MiB | 8.96 MiB/s Receiving objects: 37% (31444/84512), 27.98 MiB | 9.30 MiB/s Receiving objects: 38% (32115/84512), 27.98 MiB | 9.30 MiB/s Receiving objects: 39% (32960/84512), 27.98 MiB | 9.30 MiB/s Receiving objects: 40% (33805/84512), 27.98 MiB | 9.30 MiB/s Receiving objects: 41% (34650/84512), 33.69 MiB | 9.60 MiB/s Receiving objects: 42% (35496/84512), 33.69 MiB | 9.60 MiB/s Receiving objects: 43% (36341/84512), 33.69 MiB | 9.60 MiB/s Receiving objects: 44% (37186/84512), 33.69 MiB | 9.60 MiB/s Receiving objects: 44% (37344/84512), 33.69 MiB | 9.60 MiB/s Receiving objects: 45% (38031/84512), 39.70 MiB | 9.90 MiB/s Receiving objects: 46% (38876/84512), 39.70 MiB | 9.90 MiB/s Receiving objects: 47% (39721/84512), 45.93 MiB | 10.18 MiB/s Receiving objects: 48% (40566/84512), 45.93 MiB | 10.18 MiB/s Receiving objects: 49% (41411/84512), 45.93 MiB | 10.18 MiB/s Receiving objects: 50% (42256/84512), 45.93 MiB | 10.18 MiB/s Receiving objects: 51% (43102/84512), 45.93 MiB | 10.18 MiB/s Receiving objects: 52% (43947/84512), 45.93 MiB | 10.18 MiB/s Receiving objects: 52% (44075/84512), 45.93 MiB | 10.18 MiB/s Receiving objects: 53% (44792/84512), 52.33 MiB | 10.88 MiB/s Receiving objects: 54% (45637/84512), 52.33 MiB | 10.88 MiB/s Receiving objects: 55% (46482/84512), 52.33 MiB | 10.88 MiB/s Receiving objects: 56% (47327/84512), 58.92 MiB | 11.38 MiB/s Receiving objects: 57% (48172/84512), 58.92 MiB | 11.38 MiB/s Receiving objects: 57% (48725/84512), 65.62 MiB | 11.83 MiB/s Receiving objects: 58% (49017/84512), 65.62 MiB | 11.83 MiB/s Receiving objects: 59% (49863/84512), 65.62 MiB | 11.83 MiB/s Receiving objects: 60% (50708/84512), 65.62 MiB | 11.83 MiB/s Receiving objects: 61% (51553/84512), 72.67 MiB | 12.30 MiB/s Receiving objects: 62% (52398/84512), 72.67 MiB | 12.30 MiB/s Receiving objects: 63% (53243/84512), 72.67 MiB | 12.30 MiB/s Receiving objects: 64% (54088/84512), 72.67 MiB | 12.30 MiB/s Receiving objects: 64% (54326/84512), 79.82 MiB | 12.72 MiB/s Receiving objects: 65% (54933/84512), 79.82 MiB | 12.72 MiB/s Receiving objects: 66% (55778/84512), 79.82 MiB | 12.72 MiB/s Receiving objects: 67% (56624/84512), 79.82 MiB | 12.72 MiB/s Receiving objects: 67% (57331/84512), 95.61 MiB | 13.74 MiB/s Receiving objects: 68% (57469/84512), 104.38 MiB | 14.35 MiB/s Receiving objects: 69% (58314/84512), 104.38 MiB | 14.35 MiB/s Receiving objects: 70% (59159/84512), 104.38 MiB | 14.35 MiB/s Receiving objects: 71% (60004/84512), 104.38 MiB | 14.35 MiB/s Receiving objects: 72% (60849/84512), 104.38 MiB | 14.35 MiB/s Receiving objects: 72% (61374/84512), 104.38 MiB | 14.35 MiB/s Receiving objects: 73% (61694/84512), 113.54 MiB | 15.00 MiB/s Receiving objects: 74% (62539/84512), 113.54 MiB | 15.00 MiB/s Receiving objects: 75% (63384/84512), 113.54 MiB | 15.00 MiB/s Receiving objects: 76% (64230/84512), 123.04 MiB | 15.69 MiB/s Receiving objects: 77% (65075/84512), 123.04 MiB | 15.69 MiB/s Receiving objects: 77% (65694/84512), 123.04 MiB | 15.69 MiB/s Receiving objects: 78% (65920/84512), 123.04 MiB | 15.69 MiB/s Receiving objects: 79% (66765/84512), 132.74 MiB | 16.39 MiB/s Receiving objects: 80% (67610/84512), 132.74 MiB | 16.39 MiB/s Receiving objects: 81% (68455/84512), 132.74 MiB | 16.39 MiB/s Receiving objects: 82% (69300/84512), 132.74 MiB | 16.39 MiB/s Receiving objects: 83% (70145/84512), 132.74 MiB | 16.39 MiB/s Receiving objects: 84% (70991/84512), 132.74 MiB | 16.39 MiB/s Receiving objects: 85% (71836/84512), 132.74 MiB | 16.39 MiB/s Receiving objects: 86% (72681/84512), 132.74 MiB | 16.39 MiB/s Receiving objects: 87% (73526/84512), 132.74 MiB | 16.39 MiB/s Receiving objects: 88% (74371/84512), 142.81 MiB | 17.13 MiB/s Receiving objects: 89% (75216/84512), 142.81 MiB | 17.13 MiB/s Receiving objects: 90% (76061/84512), 142.81 MiB | 17.13 MiB/s Receiving objects: 91% (76906/84512), 142.81 MiB | 17.13 MiB/s Receiving objects: 92% (77752/84512), 142.81 MiB | 17.13 MiB/s Receiving objects: 93% (78597/84512), 142.81 MiB | 17.13 MiB/s Receiving objects: 94% (79442/84512), 142.81 MiB | 17.13 MiB/s Receiving objects: 95% (80287/84512), 142.81 MiB | 17.13 MiB/s Receiving objects: 96% (81132/84512), 142.81 MiB | 17.13 MiB/s Receiving objects: 97% (81977/84512), 142.81 MiB | 17.13 MiB/s Receiving objects: 98% (82822/84512), 142.81 MiB | 17.13 MiB/s Receiving objects: 99% (83667/84512), 142.81 MiB | 17.13 MiB/s Receiving objects: 99% (84013/84512), 142.81 MiB | 17.13 MiB/s remote: Total 84512 (delta 7636), reused 7029 (delta 6948), pack-reused 75683 (from 2)
  7. 14.13 s Receiving objects: 100% (84512/84512), 153.24 MiB | 17.88 MiB/s Receiving objects: 100% (84512/84512), 153.91 MiB | 13.92 MiB/s, done.
  8. 15.17 s Resolving deltas: 0% (0/57177) Resolving deltas: 1% (572/57177) Resolving deltas: 2% (1144/57177) Resolving deltas: 3% (1717/57177) Resolving deltas: 4% (2288/57177) Resolving deltas: 5% (2859/57177) Resolving deltas: 6% (3432/57177) Resolving deltas: 7% (4003/57177) Resolving deltas: 8% (4575/57177) Resolving deltas: 9% (5146/57177) Resolving deltas: 10% (5718/57177) Resolving deltas: 11% (6290/57177) Resolving deltas: 12% (6862/57177) Resolving deltas: 13% (7434/57177) Resolving deltas: 14% (8005/57177) Resolving deltas: 15% (8577/57177) Resolving deltas: 16% (9149/57177) Resolving deltas: 17% (9721/57177) Resolving deltas: 18% (10292/57177) Resolving deltas: 19% (10868/57177) Resolving deltas: 20% (11436/57177) Resolving deltas: 21% (12008/57177) Resolving deltas: 22% (12579/57177) Resolving deltas: 23% (13151/57177) Resolving deltas: 24% (13723/57177) Resolving deltas: 25% (14295/57177) Resolving deltas: 26% (14867/57177) Resolving deltas: 27% (15439/57177) Resolving deltas: 28% (16010/57177) Resolving deltas: 29% (16582/57177) Resolving deltas: 30% (17155/57177) Resolving deltas: 31% (17725/57177) Resolving deltas: 32% (18297/57177) Resolving deltas: 33% (18869/57177) Resolving deltas: 34% (19442/57177) Resolving deltas: 35% (20012/57177) Resolving deltas: 36% (20584/57177) Resolving deltas: 37% (21156/57177) Resolving deltas: 38% (21728/57177) Resolving deltas: 39% (22302/57177) Resolving deltas: 40% (22871/57177) Resolving deltas: 41% (23445/57177) Resolving deltas: 42% (24015/57177) Resolving deltas: 43% (24587/57177) Resolving deltas: 44% (25158/57177) Resolving deltas: 45% (25730/57177) Resolving deltas: 46% (26307/57177) Resolving deltas: 47% (26876/57177) Resolving deltas: 48% (27445/57177) Resolving deltas: 49% (28020/57177) Resolving deltas: 50% (28589/57177) Resolving deltas: 51% (29161/57177) Resolving deltas: 52% (29733/57177) Resolving deltas: 53% (30304/57177) Resolving deltas: 54% (30876/57177) Resolving deltas: 55% (31448/57177) Resolving deltas: 56% (32020/57177) Resolving deltas: 57% (32591/57177) Resolving deltas: 58% (33163/57177) Resolving deltas: 59% (33735/57177) Resolving deltas: 60% (34310/57177) Resolving deltas: 61% (34878/57177) Resolving deltas: 62% (35450/57177) Resolving deltas: 63% (36024/57177) Resolving deltas: 64% (36595/57177) Resolving deltas: 65% (37167/57177) Resolving deltas: 66% (37737/57177) Resolving deltas: 67% (38309/57177) Resolving deltas: 68% (38881/57177) Resolving deltas: 69% (39453/57177) Resolving deltas: 70% (40024/57177) Resolving deltas: 71% (40596/57177) Resolving deltas: 72% (41168/57177) Resolving deltas: 73% (41740/57177) Resolving deltas: 74% (42311/57177) Resolving deltas: 75% (42883/57177) Resolving deltas: 76% (43455/57177) Resolving deltas: 77% (44027/57177) Resolving deltas: 78% (44599/57177) Resolving deltas: 79% (45170/57177) Resolving deltas: 80% (45742/57177) Resolving deltas: 81% (46314/57177) Resolving deltas: 82% (46886/57177) Resolving deltas: 83% (47457/57177) Resolving deltas: 84% (48029/57177) Resolving deltas: 85% (48602/57177) Resolving deltas: 86% (49174/57177) Resolving deltas: 87% (49744/57177) Resolving deltas: 88% (50316/57177) Resolving deltas: 89% (50888/57177) Resolving deltas: 90% (51460/57177) Resolving deltas: 91% (52032/57177) Resolving deltas: 92% (52603/57177) Resolving deltas: 93% (53175/57177) Resolving deltas: 94% (53747/57177) Resolving deltas: 95% (54319/57177) Resolving deltas: 96% (54890/57177) Resolving deltas: 96% (55152/57177) Resolving deltas: 97% (55464/57177) Resolving deltas: 98% (56034/57177) Resolving deltas: 99% (56606/57177) Resolving deltas: 100% (57177/57177) Resolving deltas: 100% (57177/57177), done.
  9. 15.55 s Fetching commit b8396f3a3080d196a947879eb877a2d842d871ef for faster_uv_from_4d ...
  10. 15.55 s $ /nix/store/bcnisk3ydfgv26v2gw3zlky24g00yww2-git-2.54.0/bin/git fetch origin b8396f3a3080d196a947879eb877a2d842d871ef
  11. 16.03 s From https://github.com/alphal00p/gammaloop
  12. 16.03 s * branch b8396f3a3080d196a947879eb877a2d842d871ef -> FETCH_HEAD
  13. 16.04 s $ /nix/store/9ypz3flqsrl5xl495mm8h645gadjsxi1-coreutils-9.11/bin/timeout --kill-after=15s 7200s /nix/store/bcnisk3ydfgv26v2gw3zlky24g00yww2-git-2.54.0/bin/git -c advice.detachedHead=false checkout b8396f3a3080d196a947879eb877a2d842d871ef
  14. 16.35 s HEAD is now at b8396f3a3 canonicalize uv classes and prepare bounded cff mappings
  15. 16.36 s $ /nix/store/9ypz3flqsrl5xl495mm8h645gadjsxi1-coreutils-9.11/bin/timeout --kill-after=15s 7200s /nix/store/23zk8sgzamrbmj1fday15szf7f2279s8-nix-2.34.7/bin/nix --extra-experimental-features nix-command --extra-experimental-features flakes --log-format internal-json run .#packages.x86_64-linux.nix-ci-check-gammaloop-nextest-core --print-build-logs
  16. 21.23 s
  17. 27.45 s evaluating derivation 'g copying '/nix/store/9a5p evaluating derivation 'g copying '/nix/store/9a5p evaluating derivation 'g copying '/nix/store/9a5p evaluating derivation 'g copying '/nix/store/9a5p evaluating derivation 'g copying '/nix/store/9a5p evaluating derivation 'g copying '/nix/store/9a5p evaluating derivation 'g copying '/nix/store/9a5p evaluating derivation 'g copying '/nix/store/9a5p evaluating derivation 'g copying '/nix/store/9a5p evaluating derivation 'g querying gammaloop-nexte [0/1 built, 0.0 KiB DL] [1/0/1 built, 0.0 KiB DLgammaloop-nextest-core> Extracting 4 binaries (including 1 non-test binary), 1 build script output directory, and 2 linked paths to /build/nextest-archive-xcamp3
  18. 28.24 s gammaloop-nextest-core> Extracted 20 files to /build/nextest-archive-xcamp3 in 0.79s
  19. 28.26 s gammaloop-nextest-core> ------------
  20. 28.26 s gammaloop-nextest-core> Nextest run ID b421eb54-4ee9-4f9b-8160-24abaaab242f with nextest profile: ci_gammaloop
  21. 28.26 s gammaloop-nextest-core> Starting 379 tests across 3 binaries
  22. 29.65 s gammaloop-nextest-core> ------------
  23. 29.65 s gammaloop-nextest-core> Summary [ 1.391s] 379 tests run: 379 passed, 0 skipped
  24. 29.78 s gammaloop-nextest-core>
  25. 29.78 s gammaloop-nextest-core> ========== nextest test summary ==========
  26. 29.78 s gammaloop-nextest-core> report: target/nextest/ci_gammaloop/junit.xml
  27. 29.78 s gammaloop-nextest-core> tests: 379, failures: 0, errors: 0
  28. 29.78 s gammaloop-nextest-core> No failing testcases found.
  29. 29.78 s gammaloop-nextest-core> =========================================
  30. 29.80 s gammaloop-nextest-core> Extracting 1 binary and 1 linked path to /build/nextest-archive-fxbLs0
  31. 29.87 s gammaloop-nextest-core> Extracted 7 files to /build/nextest-archive-fxbLs0 in 0.07s
  32. 29.88 s gammaloop-nextest-core> ------------
  33. 29.88 s gammaloop-nextest-core> Nextest run ID 6bf7d592-ce67-4c5f-869a-c534f3c45f72 with nextest profile: ci_gammaloop
  34. 29.88 s gammaloop-nextest-core> Starting 19 tests across 1 binary
  35. 29.89 s gammaloop-nextest-core> ------------
  36. 29.89 s gammaloop-nextest-core> Summary [ 0.013s] 19 tests run: 19 passed, 0 skipped
  37. 29.93 s gammaloop-nextest-core>
  38. 29.93 s gammaloop-nextest-core> ========== nextest test summary ==========
  39. 29.93 s gammaloop-nextest-core> report: target/nextest/ci_gammaloop/junit.xml
  40. 29.93 s gammaloop-nextest-core> tests: 19, failures: 0, errors: 0
  41. 29.93 s gammaloop-nextest-core> No failing testcases found.
  42. 29.93 s gammaloop-nextest-core> =========================================
  43. 29.95 s gammaloop-nextest-core> Extracting 1 binary to /build/nextest-archive-OuDozE
  44. 29.97 s gammaloop-nextest-core> Extracted 4 files to /build/nextest-archive-OuDozE in 0.03s
  45. 29.98 s gammaloop-nextest-core> ------------
  46. 29.98 s gammaloop-nextest-core> Nextest run ID d2523067-980f-45bd-a79f-e66787f149d2 with nextest profile: ci_gammaloop
  47. 29.98 s gammaloop-nextest-core> Starting 0 tests across 1 binary
  48. 29.98 s gammaloop-nextest-core> ------------
  49. 29.98 s gammaloop-nextest-core> Summary [ 0.000s] 0 tests run: 0 passed, 0 skipped
  50. 30.01 s gammaloop-nextest-core>
  51. 30.01 s gammaloop-nextest-core> ========== nextest test summary ==========
  52. 30.01 s gammaloop-nextest-core> report: target/nextest/ci_gammaloop/junit.xml
  53. 30.01 s gammaloop-nextest-core> tests: 0, failures: 0, errors: 0
  54. 30.01 s gammaloop-nextest-core> No failing testcases found.
  55. 30.01 s gammaloop-nextest-core> =========================================
  56. 30.03 s gammaloop-nextest-core> Extracting 4 binaries, 1 build script output directory, and 2 linked paths to /build/nextest-archive-FtZm0W
  57. 30.52 s gammaloop-nextest-core> Extracted 18 files to /build/nextest-archive-FtZm0W in 0.50s
  58. 30.54 s gammaloop-nextest-core> ------------
  59. 30.54 s gammaloop-nextest-core> Nextest run ID a0e5fcbd-74c2-4e1a-beb9-e900a1e9eda2 with nextest profile: ci_gammaloop
  60. 30.54 s gammaloop-nextest-core> Starting 692 tests across 4 binaries (60 tests skipped, including 59 tests via profile.ci_gammaloop.default-filter)
  61. 31.45 s gammaloop-nextest-core> FAIL [ 0.107s] (159/692) gammalooprs graph::three_d_source::tests::exact_taylor_vacuum_affine_circulation_preserves_energy_mapping
  62. 31.45 s gammaloop-nextest-core> stdout ---
  63. 31.45 s gammaloop-nextest-core>
  64. 31.45 s gammaloop-nextest-core> running 1 test
  65. 31.45 s gammaloop-nextest-core> test graph::three_d_source::tests::exact_taylor_vacuum_affine_circulation_preserves_energy_mapping ... FAILED
  66. 31.45 s gammaloop-nextest-core>
  67. 31.45 s gammaloop-nextest-core> failures:
  68. 31.45 s gammaloop-nextest-core>
  69. 31.45 s gammaloop-nextest-core> failures:
  70. 31.45 s gammaloop-nextest-core> graph::three_d_source::tests::exact_taylor_vacuum_affine_circulation_preserves_energy_mapping
  71. 31.45 s gammaloop-nextest-core>
  72. 31.45 s gammaloop-nextest-core> test result: FAILED. 0 passed; 1 failed; 0 ignored; 0 measured; 742 filtered out; finished in 0.10s
  73. 31.45 s gammaloop-nextest-core>
  74. 31.45 s gammaloop-nextest-core> stderr ---
  75. 31.45 s gammaloop-nextest-core> The application panicked (crashed).
  76. 31.45 s gammaloop-nextest-core> Message: assertion `left == right` failed
  77. 31.45 s gammaloop-nextest-core> left: (gammalooprs::mUVexp^2+(-gammalooprs::Q(1,spenso::cind(1))+gammalooprs::Q(4,spenso::cind(1)))^2+(-gammalooprs::Q(1,spenso::cind(2))+gammalooprs::Q(4,spenso::cind(2)))^2+(-gammalooprs::Q(1,spenso::cind(3))+gammalooprs::Q(4,spenso::cind(3)))^2)^(1/2)
  78. 31.45 s gammaloop-nextest-core> right: (gammalooprs::mUVexp^2+(gammalooprs::Q(1,spenso::cind(1))-gammalooprs::Q(4,spenso::cind(1)))^2+(gammalooprs::Q(1,spenso::cind(2))-gammalooprs::Q(4,spenso::cind(2)))^2+(gammalooprs::Q(1,spenso::cind(3))-gammalooprs::Q(4,spenso::cind(3)))^2)^(1/2)
  79. 31.45 s gammaloop-nextest-core> Location: crates/gammalooprs/src/graph/three_d_source.rs:7797
  80. 31.45 s gammaloop-nextest-core>
  81. 31.45 s gammaloop-nextest-core> ━━━━━━━━━━━━━━━━━━━━━━━━━━━━━━━━━━ BACKTRACE ━━━━━━━━━━━━━━━━━━━━━━━━━━━━━━━━━━━
  82. 31.45 s gammaloop-nextest-core> 1: <color_eyre[51793ea62743adbd]::config::PanicHook>::panic_report<unknown>
  83. 31.45 s gammaloop-nextest-core> at <unknown source file>:<unknown line>
  84. 31.45 s gammaloop-nextest-core> 2: <color_eyre[51793ea62743adbd]::config::PanicHook>::into_panic_hook::{closure#0}<unknown>
  85. 31.45 s gammaloop-nextest-core> at <unknown source file>:<unknown line>
  86. 31.45 s gammaloop-nextest-core> 3: std[bcb96dfbba0ab899]::panicking::panic_with_hook<unknown>
  87. 31.45 s gammaloop-nextest-core> at <unknown source file>:<unknown line>
  88. 31.45 s gammaloop-nextest-core> 4: std[bcb96dfbba0ab899]::panicking::panic_handler::{closure#0}<unknown>
  89. 31.45 s gammaloop-nextest-core> at <unknown source file>:<unknown line>
  90. 31.45 s gammaloop-nextest-core> 5: std[bcb96dfbba0ab899]::sys::backtrace::__rust_end_short_backtrace::<std[bcb96dfbba0ab899]::panicking::panic_handler::{closure#0}, !><unknown>
  91. 31.45 s gammaloop-nextest-core> at <unknown source file>:<unknown line>
  92. 31.45 s gammaloop-nextest-core> 6: __rustc[6c289b9f9c454d21]::rust_begin_unwind<unknown>
  93. 31.45 s gammaloop-nextest-core> at <unknown source file>:<unknown line>
  94. 31.45 s gammaloop-nextest-core> 7: core[940e698046960fd5]::panicking::panic_fmt<unknown>
  95. 31.45 s gammaloop-nextest-core> at <unknown source file>:<unknown line>
  96. 31.45 s gammaloop-nextest-core> 8: core[940e698046960fd5]::panicking::assert_failed_inner<unknown>
  97. 31.45 s gammaloop-nextest-core> at <unknown source file>:<unknown line>
  98. 31.45 s gammaloop-nextest-core> 9: core[940e698046960fd5]::panicking::assert_failed::<symbolica[499970c26fd75ddd]::atom::Atom, symbolica[499970c26fd75ddd]::atom::Atom><unknown>
  99. 31.45 s gammaloop-nextest-core> at <unknown source file>:<unknown line>
  100. 31.45 s gammaloop-nextest-core> 10: gammalooprs[24955f93fc9f4e0c]::graph::three_d_source::tests::exact_taylor_vacuum_affine_circulation_preserves_energy_mapping<unknown>
  101. 31.45 s gammaloop-nextest-core> at <unknown source file>:<unknown line>
  102. 31.45 s gammaloop-nextest-core> 11: <gammalooprs[24955f93fc9f4e0c]::graph::three_d_source::tests::exact_taylor_vacuum_affine_circulation_preserves_energy_mapping::{closure#0} as core[940e698046960fd5]::ops::function::FnOnce<()>>::call_once<unknown>
  103. 31.45 s gammaloop-nextest-core> at <unknown source file>:<unknown line>
  104. 31.45 s gammaloop-nextest-core> 12: test[75d6903177b1d7e9]::__rust_begin_short_backtrace::<core[940e698046960fd5]::result::Result<(), alloc[2ea6bcb46fca0c42]::string::String>, fn() -> core[940e698046960fd5]::result::Result<(), alloc[2ea6bcb46fca0c42]::string::String>><unknown>
  105. 31.45 s gammaloop-nextest-core> at <unknown source file>:<unknown line>
  106. 31.45 s gammaloop-nextest-core> 13: test[75d6903177b1d7e9]::run_test::{closure#0}<unknown>
  107. 31.45 s gammaloop-nextest-core> at <unknown source file>:<unknown line>
  108. 31.45 s gammaloop-nextest-core> 14: std[bcb96dfbba0ab899]::sys::backtrace::__rust_begin_short_backtrace::<test[75d6903177b1d7e9]::run_test::{closure#1}, ()><unknown>
  109. 31.45 s gammaloop-nextest-core> at <unknown source file>:<unknown line>
  110. 31.45 s gammaloop-nextest-core> 15: <std[bcb96dfbba0ab899]::thread::lifecycle::spawn_unchecked<test[75d6903177b1d7e9]::run_test::{closure#1}, ()>::{closure#1} as core[940e698046960fd5]::ops::function::FnOnce<()>>::call_once::{shim:vtable#0}<unknown>
  111. 31.45 s gammaloop-nextest-core> at <unknown source file>:<unknown line>
  112. 31.45 s gammaloop-nextest-core> 16: <std[bcb96dfbba0ab899]::sys::thread::unix::Thread>::new::thread_start<unknown>
  113. 31.45 s gammaloop-nextest-core> at <unknown source file>:<unknown line>
  114. 31.45 s gammaloop-nextest-core> 17: start_thread<unknown>
  115. 31.45 s gammaloop-nextest-core> at <unknown source file>:<unknown line>
  116. 31.45 s gammaloop-nextest-core> 18: __clone3<unknown>
  117. 31.45 s gammaloop-nextest-core> at <unknown source file>:<unknown line>
  118. 31.45 s gammaloop-nextest-core>
  119. 31.45 s gammaloop-nextest-core> Run with COLORBT_SHOW_HIDDEN=1 environment variable to disable frame filtering.
  120. 31.45 s gammaloop-nextest-core> Run with RUST_BACKTRACE=full to include source snippets.
  121. 31.45 s gammaloop-nextest-core>
  122. 31.51 s gammaloop-nextest-core> FAIL [ 0.134s] (181/692) gammalooprs graph::three_d_source::tests::pinched_affine_carrier_requires_occurrence_interpolation
  123. 31.51 s gammaloop-nextest-core> stdout ---
  124. 31.51 s gammaloop-nextest-core>
  125. 31.51 s gammaloop-nextest-core> running 1 test
  126. 31.51 s gammaloop-nextest-core> test graph::three_d_source::tests::pinched_affine_carrier_requires_occurrence_interpolation ... FAILED
  127. 31.51 s gammaloop-nextest-core>
  128. 31.51 s gammaloop-nextest-core> failures:
  129. 31.51 s gammaloop-nextest-core>
  130. 31.51 s gammaloop-nextest-core> failures:
  131. 31.51 s gammaloop-nextest-core> graph::three_d_source::tests::pinched_affine_carrier_requires_occurrence_interpolation
  132. 31.51 s gammaloop-nextest-core>
  133. 31.51 s gammaloop-nextest-core> test result: FAILED. 0 passed; 1 failed; 0 ignored; 0 measured; 742 filtered out; finished in 0.13s
  134. 31.51 s gammaloop-nextest-core>
  135. 31.51 s gammaloop-nextest-core> stderr ---
  136. 31.51 s gammaloop-nextest-core> The application panicked (crashed).
  137. 31.51 s gammaloop-nextest-core> Message: certified affine occurrence lift must reproduce the independent double contours: actual=-(-1/16*(3+E0)*(5+E0)/((1+Q(0,cind(1))^2+Q(0,cind(2))^2+Q(0,cind(3))^2)^(3/2)*(1+Q(1,cind(1))^2+Q(1,cind(2))^2+Q(1,cind(3))^2)^(3/2))-1/16*(3+E1)*(5+E1)/((1+Q(0,cind(1))^2+Q(0,cind(2))^2+Q(0,cind(3))^2)^(3/2)*(1+Q(1,cind(1))^2+Q(1,cind(2))^2+Q(1,cind(3))^2)^(3/2))-1/16*(3-E0)*(5-E0)/((1+Q(0,cind(1))^2+Q(0,cind(2))^2+Q(0,cind(3))^2)^(3/2)*(1+Q(1,cind(1))^2+Q(1,cind(2))^2+Q(1,cind(3))^2)^(3/2))-1/16*(3-E1)*(5-E1)/((1+Q(0,cind(1))^2+Q(0,cind(2))^2+Q(0,cind(3))^2)^(3/2)*(1+Q(1,cind(1))^2+Q(1,cind(2))^2+Q(1,cind(3))^2)^(3/2))+1/64*(3+E0+E1)*(5+E0+E1)/((1+Q(0,cind(1))^2+Q(0,cind(2))^2+Q(0,cind(3))^2)^(3/2)*(1+Q(1,cind(1))^2+Q(1,cind(2))^2+Q(1,cind(3))^2)^(3/2))+1/64*(3+E0-E1)*(5+E0-E1)/((1+Q(0,cind(1))^2+Q(0,cind(2))^2+Q(0,cind(3))^2)^(3/2)*(1+Q(1,cind(1))^2+Q(1,cind(2))^2+Q(1,cind(3))^2)^(3/2))+1/64*(3-E0+E1)*(5-E0+E1)/((1+Q(0,cind(1))^2+Q(0,cind(2))^2+Q(0,cind(3))^2)^(3/2)*(1+Q(1,cind(1))^2+Q(1,cind(2))^2+Q(1,cind(3))^2)^(3/2))+1/64*(3-E0-E1)*(5-E0-E1)/((1+Q(0,cind(1))^2+Q(0,cind(2))^2+Q(0,cind(3))^2)^(3/2)*(1+Q(1,cind(1))^2+Q(1,cind(2))^2+Q(1,cind(3))^2)^(3/2))+15/4/((1+Q(0,cind(1))^2+Q(0,cind(2))^2+Q(0,cind(3))^2)^(3/2)*(1+Q(1,cind(1))^2+Q(1,cind(2))^2+Q(1,cind(3))^2)^(3/2))), expected=1/16*(15-E0^2-E1^2)/(E0^3*E1^3)
  138. 31.51 s gammaloop-nextest-core> Location: crates/gammalooprs/src/graph/three_d_source.rs:7619
  139. 31.51 s gammaloop-nextest-core>
  140. 31.51 s gammaloop-nextest-core> ━━━━━━━━━━━━━━━━━━━━━━━━━━━━━━━━━━ BACKTRACE ━━━━━━━━━━━━━━━━━━━━━━━━━━━━━━━━━━━
  141. 31.51 s gammaloop-nextest-core> 1: <color_eyre[51793ea62743adbd]::config::PanicHook>::panic_report<unknown>
  142. 31.51 s gammaloop-nextest-core> at <unknown source file>:<unknown line>
  143. 31.51 s gammaloop-nextest-core> 2: <color_eyre[51793ea62743adbd]::config::PanicHook>::into_panic_hook::{closure#0}<unknown>
  144. 31.51 s gammaloop-nextest-core> at <unknown source file>:<unknown line>
  145. 31.51 s gammaloop-nextest-core> 3: std[bcb96dfbba0ab899]::panicking::panic_with_hook<unknown>
  146. 31.51 s gammaloop-nextest-core> at <unknown source file>:<unknown line>
  147. 31.51 s gammaloop-nextest-core> 4: std[bcb96dfbba0ab899]::panicking::panic_handler::{closure#0}<unknown>
  148. 31.51 s gammaloop-nextest-core> at <unknown source file>:<unknown line>
  149. 31.51 s gammaloop-nextest-core> 5: std[bcb96dfbba0ab899]::sys::backtrace::__rust_end_short_backtrace::<std[bcb96dfbba0ab899]::panicking::panic_handler::{closure#0}, !><unknown>
  150. 31.51 s gammaloop-nextest-core> at <unknown source file>:<unknown line>
  151. 31.51 s gammaloop-nextest-core> 6: __rustc[6c289b9f9c454d21]::rust_begin_unwind<unknown>
  152. 31.51 s gammaloop-nextest-core> at <unknown source file>:<unknown line>
  153. 31.51 s gammaloop-nextest-core> 7: core[940e698046960fd5]::panicking::panic_fmt<unknown>
  154. 31.51 s gammaloop-nextest-core> at <unknown source file>:<unknown line>
  155. 31.51 s gammaloop-nextest-core> 8: <gammalooprs[24955f93fc9f4e0c]::graph::three_d_source::tests::pinched_affine_carrier_requires_occurrence_interpolation::{closure#0} as core[940e698046960fd5]::ops::function::FnOnce<()>>::call_once<unknown>
  156. 31.51 s gammaloop-nextest-core> at <unknown source file>:<unknown line>
  157. 31.51 s gammaloop-nextest-core> 9: test[75d6903177b1d7e9]::__rust_begin_short_backtrace::<core[940e698046960fd5]::result::Result<(), alloc[2ea6bcb46fca0c42]::string::String>, fn() -> core[940e698046960fd5]::result::Result<(), alloc[2ea6bcb46fca0c42]::string::String>><unknown>
  158. 31.51 s gammaloop-nextest-core> at <unknown source file>:<unknown line>
  159. 31.51 s gammaloop-nextest-core> 10: test[75d6903177b1d7e9]::run_test::{closure#0}<unknown>
  160. 31.51 s gammaloop-nextest-core> at <unknown source file>:<unknown line>
  161. 31.51 s gammaloop-nextest-core> 11: std[bcb96dfbba0ab899]::sys::backtrace::__rust_begin_short_backtrace::<test[75d6903177b1d7e9]::run_test::{closure#1}, ()><unknown>
  162. 31.51 s gammaloop-nextest-core> at <unknown source file>:<unknown line>
  163. 31.51 s gammaloop-nextest-core> 12: <std[bcb96dfbba0ab899]::thread::lifecycle::spawn_unchecked<test[75d6903177b1d7e9]::run_test::{closure#1}, ()>::{closure#1} as core[940e698046960fd5]::ops::function::FnOnce<()>>::call_once::{shim:vtable#0}<unknown>
  164. 31.51 s gammaloop-nextest-core> at <unknown source file>:<unknown line>
  165. 31.51 s gammaloop-nextest-core> 13: <std[bcb96dfbba0ab899]::sys::thread::unix::Thread>::new::thread_start<unknown>
  166. 31.51 s gammaloop-nextest-core> at <unknown source file>:<unknown line>
  167. 31.51 s gammaloop-nextest-core> 14: start_thread<unknown>
  168. 31.51 s gammaloop-nextest-core> at <unknown source file>:<unknown line>
  169. 31.51 s gammaloop-nextest-core> 15: __clone3<unknown>
  170. 31.51 s gammaloop-nextest-core> at <unknown source file>:<unknown line>
  171. 31.51 s gammaloop-nextest-core>
  172. 31.51 s gammaloop-nextest-core> Run with COLORBT_SHOW_HIDDEN=1 environment variable to disable frame filtering.
  173. 31.51 s gammaloop-nextest-core> Run with RUST_BACKTRACE=full to include source snippets.
  174. 31.51 s gammaloop-nextest-core>
  175. 31.70 s gammaloop-nextest-core> FAIL [ 0.021s] (298/692) gammalooprs numerator::energy_degree::tests::canonical_class_cyclic_lifts_preserve_factorization_and_exact_bounds
  176. 31.70 s gammaloop-nextest-core> stdout ---
  177. 31.70 s gammaloop-nextest-core>
  178. 31.70 s gammaloop-nextest-core> running 1 test
  179. 31.70 s gammaloop-nextest-core> test numerator::energy_degree::tests::canonical_class_cyclic_lifts_preserve_factorization_and_exact_bounds ... FAILED
  180. 31.70 s gammaloop-nextest-core>
  181. 31.70 s gammaloop-nextest-core> failures:
  182. 31.70 s gammaloop-nextest-core>
  183. 31.70 s gammaloop-nextest-core> failures:
  184. 31.70 s gammaloop-nextest-core> numerator::energy_degree::tests::canonical_class_cyclic_lifts_preserve_factorization_and_exact_bounds
  185. 31.70 s gammaloop-nextest-core>
  186. 31.70 s gammaloop-nextest-core> test result: FAILED. 0 passed; 1 failed; 0 ignored; 0 measured; 742 filtered out; finished in 0.01s
  187. 31.70 s gammaloop-nextest-core>
  188. 31.70 s gammaloop-nextest-core> stderr ---
  189. 31.70 s gammaloop-nextest-core>
  190. 31.70 s gammaloop-nextest-core> thread 'numerator::energy_degree::tests::canonical_class_cyclic_lifts_preserve_factorization_and_exact_bounds' (2289) panicked at crates/gammalooprs/src/numerator/energy_degree.rs:2850:13:
  191. 31.70 s gammaloop-nextest-core> assertion failed: (collapsed - expression).collect_factors().is_zero()
  192. 31.70 s gammaloop-nextest-core> stack backtrace:
  193. 31.70 s gammaloop-nextest-core> 0: __rustc::rust_begin_unwind
  194. 31.70 s gammaloop-nextest-core> 1: core::panicking::panic_fmt
  195. 31.70 s gammaloop-nextest-core> 2: core::panicking::panic
  196. 31.70 s gammaloop-nextest-core> 3: gammalooprs::numerator::energy_degree::tests::canonical_class_cyclic_lifts_preserve_factorization_and_exact_bounds
  197. 31.70 s gammaloop-nextest-core> 4: <gammalooprs::numerator::energy_degree::tests::canonical_class_cyclic_lifts_preserve_factorization_and_exact_bounds::{closure#0} as core::ops::function::FnOnce<()>>::call_once
  198. 31.70 s gammaloop-nextest-core> note: Some details are omitted, run with `RUST_BACKTRACE=full` for a verbose backtrace.
  199. 31.70 s gammaloop-nextest-core>
  200. 32.67 s gammaloop-nextest-core> FAIL [ 0.107s] (592/692) gammalooprs uv::approx::local_4d::tests::canonical_uv_signed_multiloop_carriers_preserve_factorized_numerators
  201. 32.67 s gammaloop-nextest-core> stdout ---
  202. 32.67 s gammaloop-nextest-core>
  203. 32.67 s gammaloop-nextest-core> running 1 test
  204. 32.67 s gammaloop-nextest-core> test uv::approx::local_4d::tests::canonical_uv_signed_multiloop_carriers_preserve_factorized_numerators ... FAILED
  205. 32.67 s gammaloop-nextest-core>
  206. 32.67 s gammaloop-nextest-core> failures:
  207. 32.67 s gammaloop-nextest-core>
  208. 32.67 s gammaloop-nextest-core> failures:
  209. 32.67 s gammaloop-nextest-core> uv::approx::local_4d::tests::canonical_uv_signed_multiloop_carriers_preserve_factorized_numerators
  210. 32.67 s gammaloop-nextest-core>
  211. 32.67 s gammaloop-nextest-core> test result: FAILED. 0 passed; 1 failed; 0 ignored; 0 measured; 742 filtered out; finished in 0.09s
  212. 32.67 s gammaloop-nextest-core>
  213. 32.67 s gammaloop-nextest-core> stderr ---
  214. 32.67 s gammaloop-nextest-core> The application panicked (crashed).
  215. 32.67 s gammaloop-nextest-core> Message: assertion `left == right` failed
  216. 32.67 s gammaloop-nextest-core> left: 2*(signed_multiloop::a+signed_multiloop::b)^5*gammalooprs::Q(gammalooprs::uv::class(0),spenso::cind(0))
  217. 32.67 s gammaloop-nextest-core> right: -2*(signed_multiloop::a+signed_multiloop::b)^5*gammalooprs::Q(gammalooprs::uv::class(0),spenso::cind(0))
  218. 32.67 s gammaloop-nextest-core> Location: crates/gammalooprs/src/uv/approx/local_4d.rs:1983
  219. 32.67 s gammaloop-nextest-core>
  220. 32.67 s gammaloop-nextest-core> ━━━━━━━━━━━━━━━━━━━━━━━━━━━━━━━━━━ BACKTRACE ━━━━━━━━━━━━━━━━━━━━━━━━━━━━━━━━━━━
  221. 32.67 s gammaloop-nextest-core> 1: <color_eyre[51793ea62743adbd]::config::PanicHook>::panic_report<unknown>
  222. 32.67 s gammaloop-nextest-core> at <unknown source file>:<unknown line>
  223. 32.67 s gammaloop-nextest-core> 2: <color_eyre[51793ea62743adbd]::config::PanicHook>::into_panic_hook::{closure#0}<unknown>
  224. 32.67 s gammaloop-nextest-core> at <unknown source file>:<unknown line>
  225. 32.67 s gammaloop-nextest-core> 3: std[bcb96dfbba0ab899]::panicking::panic_with_hook<unknown>
  226. 32.67 s gammaloop-nextest-core> at <unknown source file>:<unknown line>
  227. 32.67 s gammaloop-nextest-core> 4: std[bcb96dfbba0ab899]::panicking::panic_handler::{closure#0}<unknown>
  228. 32.67 s gammaloop-nextest-core> at <unknown source file>:<unknown line>
  229. 32.67 s gammaloop-nextest-core> 5: std[bcb96dfbba0ab899]::sys::backtrace::__rust_end_short_backtrace::<std[bcb96dfbba0ab899]::panicking::panic_handler::{closure#0}, !><unknown>
  230. 32.67 s gammaloop-nextest-core> at <unknown source file>:<unknown line>
  231. 32.67 s gammaloop-nextest-core> 6: __rustc[6c289b9f9c454d21]::rust_begin_unwind<unknown>
  232. 32.67 s gammaloop-nextest-core> at <unknown source file>:<unknown line>
  233. 32.67 s gammaloop-nextest-core> 7: core[940e698046960fd5]::panicking::panic_fmt<unknown>
  234. 32.67 s gammaloop-nextest-core> at <unknown source file>:<unknown line>
  235. 32.67 s gammaloop-nextest-core> 8: core[940e698046960fd5]::panicking::assert_failed_inner<unknown>
  236. 32.67 s gammaloop-nextest-core> at <unknown source file>:<unknown line>
  237. 32.67 s gammaloop-nextest-core> 9: core[940e698046960fd5]::panicking::assert_failed::<symbolica[499970c26fd75ddd]::atom::Atom, symbolica[499970c26fd75ddd]::atom::Atom><unknown>
  238. 32.67 s gammaloop-nextest-core> at <unknown source file>:<unknown line>
  239. 32.67 s gammaloop-nextest-core> 10: gammalooprs[24955f93fc9f4e0c]::uv::approx::local_4d::tests::canonical_uv_signed_multiloop_carriers_preserve_factorized_numerators<unknown>
  240. 32.67 s gammaloop-nextest-core> at <unknown source file>:<unknown line>
  241. 32.67 s gammaloop-nextest-core> 11: <gammalooprs[24955f93fc9f4e0c]::uv::approx::local_4d::tests::canonical_uv_signed_multiloop_carriers_preserve_factorized_numerators::{closure#0} as core[940e698046960fd5]::ops::function::FnOnce<()>>::call_once<unknown>
  242. 32.67 s gammaloop-nextest-core> at <unknown source file>:<unknown line>
  243. 32.67 s gammaloop-nextest-core> 12: test[75d6903177b1d7e9]::__rust_begin_short_backtrace::<core[940e698046960fd5]::result::Result<(), alloc[2ea6bcb46fca0c42]::string::String>, fn() -> core[940e698046960fd5]::result::Result<(), alloc[2ea6bcb46fca0c42]::string::String>><unknown>
  244. 32.67 s gammaloop-nextest-core> at <unknown source file>:<unknown line>
  245. 32.67 s gammaloop-nextest-core> 13: test[75d6903177b1d7e9]::run_test::{closure#0}<unknown>
  246. 32.67 s gammaloop-nextest-core> at <unknown source file>:<unknown line>
  247. 32.67 s gammaloop-nextest-core> 14: std[bcb96dfbba0ab899]::sys::backtrace::__rust_begin_short_backtrace::<test[75d6903177b1d7e9]::run_test::{closure#1}, ()><unknown>
  248. 32.67 s gammaloop-nextest-core> at <unknown source file>:<unknown line>
  249. 32.67 s gammaloop-nextest-core> 15: <std[bcb96dfbba0ab899]::thread::lifecycle::spawn_unchecked<test[75d6903177b1d7e9]::run_test::{closure#1}, ()>::{closure#1} as core[940e698046960fd5]::ops::function::FnOnce<()>>::call_once::{shim:vtable#0}<unknown>
  250. 32.67 s gammaloop-nextest-core> at <unknown source file>:<unknown line>
  251. 32.67 s gammaloop-nextest-core> 16: <std[bcb96dfbba0ab899]::sys::thread::unix::Thread>::new::thread_start<unknown>
  252. 32.67 s gammaloop-nextest-core> at <unknown source file>:<unknown line>
  253. 32.67 s gammaloop-nextest-core> 17: start_thread<unknown>
  254. 32.67 s gammaloop-nextest-core> at <unknown source file>:<unknown line>
  255. 32.67 s gammaloop-nextest-core> 18: __clone3<unknown>
  256. 32.67 s gammaloop-nextest-core> at <unknown source file>:<unknown line>
  257. 32.67 s gammaloop-nextest-core>
  258. 32.67 s gammaloop-nextest-core> Run with COLORBT_SHOW_HIDDEN=1 environment variable to disable frame filtering.
  259. 32.67 s gammaloop-nextest-core> Run with RUST_BACKTRACE=full to include source snippets.
  260. 32.67 s gammaloop-nextest-core>
  261. 32.68 s gammaloop-nextest-core> FAIL [ 0.129s] (593/692) gammalooprs uv::approx::local_4d::tests::canonical_uv_classes_certify_signed_aliases_and_preserve_raw_sectors
  262. 32.68 s gammaloop-nextest-core> stdout ---
  263. 32.68 s gammaloop-nextest-core>
  264. 32.68 s gammaloop-nextest-core> running 1 test
  265. 32.68 s gammaloop-nextest-core> test uv::approx::local_4d::tests::canonical_uv_classes_certify_signed_aliases_and_preserve_raw_sectors ... FAILED
  266. 32.68 s gammaloop-nextest-core>
  267. 32.68 s gammaloop-nextest-core> failures:
  268. 32.68 s gammaloop-nextest-core>
  269. 32.68 s gammaloop-nextest-core> failures:
  270. 32.68 s gammaloop-nextest-core> uv::approx::local_4d::tests::canonical_uv_classes_certify_signed_aliases_and_preserve_raw_sectors
  271. 32.68 s gammaloop-nextest-core>
  272. 32.68 s gammaloop-nextest-core> test result: FAILED. 0 passed; 1 failed; 0 ignored; 0 measured; 742 filtered out; finished in 0.11s
  273. 32.68 s gammaloop-nextest-core>
  274. 32.68 s gammaloop-nextest-core> stderr ---
  275. 32.68 s gammaloop-nextest-core> Error:
  276. 32.68 s gammaloop-nextest-core> 0: merged canonical UV numerator does not reproduce its source bucket
  277. 32.68 s gammaloop-nextest-core>
  278. 32.68 s gammaloop-nextest-core> Location:
  279. 32.68 s gammaloop-nextest-core> crates/gammalooprs/src/uv/approx/local_4d.rs:367
  280. 32.68 s gammaloop-nextest-core>
  281. 32.68 s gammaloop-nextest-core> ━━━━━━━━━━━━━━━━━━━━━━━━━━━━━━━━━━ BACKTRACE ━━━━━━━━━━━━━━━━━━━━━━━━━━━━━━━━━━━
  282. 32.68 s gammaloop-nextest-core> 1: <color_eyre[51793ea62743adbd]::config::EyreHook>::into_eyre_hook::{closure#0}<unknown>
  283. 32.68 s gammaloop-nextest-core> at <unknown source file>:<unknown line>
  284. 32.68 s gammaloop-nextest-core> 2: eyre[cb2fd339c0c40fca]::capture_handler<unknown>
  285. 32.68 s gammaloop-nextest-core> at <unknown source file>:<unknown line>
  286. 32.68 s gammaloop-nextest-core> 3: eyre[cb2fd339c0c40fca]::private::format_err<unknown>
  287. 32.68 s gammaloop-nextest-core> at <unknown source file>:<unknown line>
  288. 32.68 s gammaloop-nextest-core> 4: <gammalooprs[24955f93fc9f4e0c]::uv::approx::local_4d::FourDSector>::canonical_projection<unknown>
  289. 32.68 s gammaloop-nextest-core> at <unknown source file>:<unknown line>
  290. 32.68 s gammaloop-nextest-core> 5: gammalooprs[24955f93fc9f4e0c]::uv::approx::local_4d::tests::canonical_uv_classes_certify_signed_aliases_and_preserve_raw_sectors<unknown>
  291. 32.68 s gammaloop-nextest-core> at <unknown source file>:<unknown line>
  292. 32.68 s gammaloop-nextest-core> 6: <gammalooprs[24955f93fc9f4e0c]::uv::approx::local_4d::tests::canonical_uv_classes_certify_signed_aliases_and_preserve_raw_sectors::{closure#0} as core[940e698046960fd5]::ops::function::FnOnce<()>>::call_once<unknown>
  293. 32.68 s gammaloop-nextest-core> at <unknown source file>:<unknown line>
  294. 32.68 s gammaloop-nextest-core> 7: test[75d6903177b1d7e9]::__rust_begin_short_backtrace::<core[940e698046960fd5]::result::Result<(), alloc[2ea6bcb46fca0c42]::string::String>, fn() -> core[940e698046960fd5]::result::Result<(), alloc[2ea6bcb46fca0c42]::string::String>><unknown>
  295. 32.68 s gammaloop-nextest-core> at <unknown source file>:<unknown line>
  296. 32.68 s gammaloop-nextest-core> 8: test[75d6903177b1d7e9]::run_test::{closure#0}<unknown>
  297. 32.68 s gammaloop-nextest-core> at <unknown source file>:<unknown line>
  298. 32.68 s gammaloop-nextest-core> 9: std[bcb96dfbba0ab899]::sys::backtrace::__rust_begin_short_backtrace::<test[75d6903177b1d7e9]::run_test::{closure#1}, ()><unknown>
  299. 32.68 s gammaloop-nextest-core> at <unknown source file>:<unknown line>
  300. 32.68 s gammaloop-nextest-core> 10: <std[bcb96dfbba0ab899]::thread::lifecycle::spawn_unchecked<test[75d6903177b1d7e9]::run_test::{closure#1}, ()>::{closure#1} as core[940e698046960fd5]::ops::function::FnOnce<()>>::call_once::{shim:vtable#0}<unknown>
  301. 32.68 s gammaloop-nextest-core> at <unknown source file>:<unknown line>
  302. 32.68 s gammaloop-nextest-core> 11: <std[bcb96dfbba0ab899]::sys::thread::unix::Thread>::new::thread_start<unknown>
  303. 32.68 s gammaloop-nextest-core> at <unknown source file>:<unknown line>
  304. 32.68 s gammaloop-nextest-core> 12: start_thread<unknown>
  305. 32.68 s gammaloop-nextest-core> at <unknown source file>:<unknown line>
  306. 32.68 s gammaloop-nextest-core> 13: __clone3<unknown>
  307. 32.68 s gammaloop-nextest-core> at <unknown source file>:<unknown line>
  308. 32.68 s gammaloop-nextest-core>
  309. 32.68 s gammaloop-nextest-core> Run with COLORBT_SHOW_HIDDEN=1 environment variable to disable frame filtering.
  310. 32.68 s gammaloop-nextest-core> Run with RUST_BACKTRACE=full to include source snippets.
  311. 32.68 s gammaloop-nextest-core>
  312. 32.86 s gammaloop-nextest-core> FAIL [ 0.100s] (606/692) gammalooprs uv::approx::tests::direct_nested_scalar_banana_replays_complete_cff_at_depth_three
  313. 32.86 s gammaloop-nextest-core> stdout ---
  314. 32.86 s gammaloop-nextest-core>
  315. 32.86 s gammaloop-nextest-core> running 1 test
  316. 32.86 s gammaloop-nextest-core> test uv::approx::tests::direct_nested_scalar_banana_replays_complete_cff_at_depth_three ... FAILED
  317. 32.86 s gammaloop-nextest-core>
  318. 32.86 s gammaloop-nextest-core> failures:
  319. 32.86 s gammaloop-nextest-core>
  320. 32.86 s gammaloop-nextest-core> failures:
  321. 32.86 s gammaloop-nextest-core> uv::approx::tests::direct_nested_scalar_banana_replays_complete_cff_at_depth_three
  322. 32.86 s gammaloop-nextest-core>
  323. 32.86 s gammaloop-nextest-core> test result: FAILED. 0 passed; 1 failed; 0 ignored; 0 measured; 742 filtered out; finished in 0.09s
  324. 32.86 s gammaloop-nextest-core>
  325. 32.86 s gammaloop-nextest-core> stderr ---
  326. 32.86 s gammaloop-nextest-core> Error:
  327. 32.86 s gammaloop-nextest-core> 0: canonical UV numerator does not reproduce its source in the component frame
  328. 32.86 s gammaloop-nextest-core>
  329. 32.86 s gammaloop-nextest-core> Location:
  330. 32.86 s gammaloop-nextest-core> crates/gammalooprs/src/uv/approx/local_4d.rs:354
  331. 32.86 s gammaloop-nextest-core>
  332. 32.86 s gammaloop-nextest-core> ━━━━━━━━━━━━━━━━━━━━━━━━━━━━━━━━━━ BACKTRACE ━━━━━━━━━━━━━━━━━━━━━━━━━━━━━━━━━━━
  333. 32.86 s gammaloop-nextest-core> 1: <color_eyre[51793ea62743adbd]::config::EyreHook>::into_eyre_hook::{closure#0}<unknown>
  334. 32.86 s gammaloop-nextest-core> at <unknown source file>:<unknown line>
  335. 32.86 s gammaloop-nextest-core> 2: eyre[cb2fd339c0c40fca]::capture_handler<unknown>
  336. 32.86 s gammaloop-nextest-core> at <unknown source file>:<unknown line>
  337. 32.86 s gammaloop-nextest-core> 3: eyre[cb2fd339c0c40fca]::private::format_err<unknown>
  338. 32.86 s gammaloop-nextest-core> at <unknown source file>:<unknown line>
  339. 32.86 s gammaloop-nextest-core> 4: <gammalooprs[24955f93fc9f4e0c]::uv::approx::local_4d::FourDSector>::canonical_projection<unknown>
  340. 32.86 s gammaloop-nextest-core> at <unknown source file>:<unknown line>
  341. 32.86 s gammaloop-nextest-core> 5: <gammalooprs[24955f93fc9f4e0c]::uv::approx::projected_4d::Projected4dApproximation>::project_local_4d<unknown>
  342. 32.86 s gammaloop-nextest-core> at <unknown source file>:<unknown line>
  343. 32.86 s gammaloop-nextest-core> 6: <gammalooprs[24955f93fc9f4e0c]::uv::approx::Approximation>::compute_3d<unknown>
  344. 32.86 s gammaloop-nextest-core> at <unknown source file>:<unknown line>
  345. 32.86 s gammaloop-nextest-core> 7: gammalooprs[24955f93fc9f4e0c]::uv::approx::tests::direct_nested_scalar_banana_replays_complete_cff_at_depth_three::{closure#0}<unknown>
  346. 32.86 s gammaloop-nextest-core> at <unknown source file>:<unknown line>
  347. 32.86 s gammaloop-nextest-core> 8: gammalooprs[24955f93fc9f4e0c]::uv::approx::tests::direct_nested_scalar_banana_replays_complete_cff_at_depth_three<unknown>
  348. 32.86 s gammaloop-nextest-core> at <unknown source file>:<unknown line>
  349. 32.86 s gammaloop-nextest-core> 9: <gammalooprs[24955f93fc9f4e0c]::uv::approx::tests::direct_nested_scalar_banana_replays_complete_cff_at_depth_three::{closure#0} as core[940e698046960fd5]::ops::function::FnOnce<()>>::call_once<unknown>
  350. 32.86 s gammaloop-nextest-core> at <unknown source file>:<unknown line>
  351. 32.86 s gammaloop-nextest-core> 10: test[75d6903177b1d7e9]::__rust_begin_short_backtrace::<core[940e698046960fd5]::result::Result<(), alloc[2ea6bcb46fca0c42]::string::String>, fn() -> core[940e698046960fd5]::result::Result<(), alloc[2ea6bcb46fca0c42]::string::String>><unknown>
  352. 32.86 s gammaloop-nextest-core> at <unknown source file>:<unknown line>
  353. 32.86 s gammaloop-nextest-core> 11: test[75d6903177b1d7e9]::run_test::{closure#0}<unknown>
  354. 32.86 s gammaloop-nextest-core> at <unknown source file>:<unknown line>
  355. 32.86 s gammaloop-nextest-core> 12: std[bcb96dfbba0ab899]::sys::backtrace::__rust_begin_short_backtrace::<test[75d6903177b1d7e9]::run_test::{closure#1}, ()><unknown>
  356. 32.86 s gammaloop-nextest-core> at <unknown source file>:<unknown line>
  357. 32.86 s gammaloop-nextest-core> 13: <std[bcb96dfbba0ab899]::thread::lifecycle::spawn_unchecked<test[75d6903177b1d7e9]::run_test::{closure#1}, ()>::{closure#1} as core[940e698046960fd5]::ops::function::FnOnce<()>>::call_once::{shim:vtable#0}<unknown>
  358. 32.86 s gammaloop-nextest-core> at <unknown source file>:<unknown line>
  359. 32.86 s gammaloop-nextest-core> 14: <std[bcb96dfbba0ab899]::sys::thread::unix::Thread>::new::thread_start<unknown>
  360. 32.86 s gammaloop-nextest-core> at <unknown source file>:<unknown line>
  361. 32.86 s gammaloop-nextest-core> 15: start_thread<unknown>
  362. 32.86 s gammaloop-nextest-core> at <unknown source file>:<unknown line>
  363. 32.86 s gammaloop-nextest-core> 16: __clone3<unknown>
  364. 32.86 s gammaloop-nextest-core> at <unknown source file>:<unknown line>
  365. 32.86 s gammaloop-nextest-core>
  366. 32.86 s gammaloop-nextest-core> Run with COLORBT_SHOW_HIDDEN=1 environment variable to disable frame filtering.
  367. 32.86 s gammaloop-nextest-core> Run with RUST_BACKTRACE=full to include source snippets.
  368. 32.86 s gammaloop-nextest-core>
  369. 43.40 s gammaloop-nextest-core> ------------
  370. 43.40 s gammaloop-nextest-core> Summary [ 12.865s] 692 tests run: 686 passed, 6 failed, 60 skipped
  371. 43.40 s gammaloop-nextest-core> FAIL [ 0.107s] (159/692) gammalooprs graph::three_d_source::tests::exact_taylor_vacuum_affine_circulation_preserves_energy_mapping
  372. 43.40 s gammaloop-nextest-core> stdout ---
  373. 43.40 s gammaloop-nextest-core>
  374. 43.40 s gammaloop-nextest-core> running 1 test
  375. 43.40 s gammaloop-nextest-core> test graph::three_d_source::tests::exact_taylor_vacuum_affine_circulation_preserves_energy_mapping ... FAILED
  376. 43.40 s gammaloop-nextest-core>
  377. 43.40 s gammaloop-nextest-core> failures:
  378. 43.40 s gammaloop-nextest-core>
  379. 43.40 s gammaloop-nextest-core> failures:
  380. 43.40 s gammaloop-nextest-core> graph::three_d_source::tests::exact_taylor_vacuum_affine_circulation_preserves_energy_mapping
  381. 43.40 s gammaloop-nextest-core>
  382. 43.40 s gammaloop-nextest-core> test result: FAILED. 0 passed; 1 failed; 0 ignored; 0 measured; 742 filtered out; finished in 0.10s
  383. 43.40 s gammaloop-nextest-core>
  384. 43.40 s gammaloop-nextest-core> stderr ---
  385. 43.40 s gammaloop-nextest-core> The application panicked (crashed).
  386. 43.40 s gammaloop-nextest-core> Message: assertion `left == right` failed
  387. 43.40 s gammaloop-nextest-core> left: (gammalooprs::mUVexp^2+(-gammalooprs::Q(1,spenso::cind(1))+gammalooprs::Q(4,spenso::cind(1)))^2+(-gammalooprs::Q(1,spenso::cind(2))+gammalooprs::Q(4,spenso::cind(2)))^2+(-gammalooprs::Q(1,spenso::cind(3))+gammalooprs::Q(4,spenso::cind(3)))^2)^(1/2)
  388. 43.40 s gammaloop-nextest-core> right: (gammalooprs::mUVexp^2+(gammalooprs::Q(1,spenso::cind(1))-gammalooprs::Q(4,spenso::cind(1)))^2+(gammalooprs::Q(1,spenso::cind(2))-gammalooprs::Q(4,spenso::cind(2)))^2+(gammalooprs::Q(1,spenso::cind(3))-gammalooprs::Q(4,spenso::cind(3)))^2)^(1/2)
  389. 43.40 s gammaloop-nextest-core> Location: crates/gammalooprs/src/graph/three_d_source.rs:7797
  390. 43.40 s gammaloop-nextest-core>
  391. 43.40 s gammaloop-nextest-core> ━━━━━━━━━━━━━━━━━━━━━━━━━━━━━━━━━━ BACKTRACE ━━━━━━━━━━━━━━━━━━━━━━━━━━━━━━━━━━━
  392. 43.40 s gammaloop-nextest-core> 1: <color_eyre[51793ea62743adbd]::config::PanicHook>::panic_report<unknown>
  393. 43.40 s gammaloop-nextest-core> at <unknown source file>:<unknown line>
  394. 43.40 s gammaloop-nextest-core> 2: <color_eyre[51793ea62743adbd]::config::PanicHook>::into_panic_hook::{closure#0}<unknown>
  395. 43.40 s gammaloop-nextest-core> at <unknown source file>:<unknown line>
  396. 43.40 s gammaloop-nextest-core> 3: std[bcb96dfbba0ab899]::panicking::panic_with_hook<unknown>
  397. 43.40 s gammaloop-nextest-core> at <unknown source file>:<unknown line>
  398. 43.40 s gammaloop-nextest-core> 4: std[bcb96dfbba0ab899]::panicking::panic_handler::{closure#0}<unknown>
  399. 43.40 s gammaloop-nextest-core> at <unknown source file>:<unknown line>
  400. 43.40 s gammaloop-nextest-core> 5: std[bcb96dfbba0ab899]::sys::backtrace::__rust_end_short_backtrace::<std[bcb96dfbba0ab899]::panicking::panic_handler::{closure#0}, !><unknown>
  401. 43.40 s gammaloop-nextest-core> at <unknown source file>:<unknown line>
  402. 43.40 s gammaloop-nextest-core> 6: __rustc[6c289b9f9c454d21]::rust_begin_unwind<unknown>
  403. 43.40 s gammaloop-nextest-core> at <unknown source file>:<unknown line>
  404. 43.40 s gammaloop-nextest-core> 7: core[940e698046960fd5]::panicking::panic_fmt<unknown>
  405. 43.40 s gammaloop-nextest-core> at <unknown source file>:<unknown line>
  406. 43.40 s gammaloop-nextest-core> 8: core[940e698046960fd5]::panicking::assert_failed_inner<unknown>
  407. 43.40 s gammaloop-nextest-core> at <unknown source file>:<unknown line>
  408. 43.40 s gammaloop-nextest-core> 9: core[940e698046960fd5]::panicking::assert_failed::<symbolica[499970c26fd75ddd]::atom::Atom, symbolica[499970c26fd75ddd]::atom::Atom><unknown>
  409. 43.40 s gammaloop-nextest-core> at <unknown source file>:<unknown line>
  410. 43.40 s gammaloop-nextest-core> 10: gammalooprs[24955f93fc9f4e0c]::graph::three_d_source::tests::exact_taylor_vacuum_affine_circulation_preserves_energy_mapping<unknown>
  411. 43.40 s gammaloop-nextest-core> at <unknown source file>:<unknown line>
  412. 43.40 s gammaloop-nextest-core> 11: <gammalooprs[24955f93fc9f4e0c]::graph::three_d_source::tests::exact_taylor_vacuum_affine_circulation_preserves_energy_mapping::{closure#0} as core[940e698046960fd5]::ops::function::FnOnce<()>>::call_once<unknown>
  413. 43.40 s gammaloop-nextest-core> at <unknown source file>:<unknown line>
  414. 43.40 s gammaloop-nextest-core> 12: test[75d6903177b1d7e9]::__rust_begin_short_backtrace::<core[940e698046960fd5]::result::Result<(), alloc[2ea6bcb46fca0c42]::string::String>, fn() -> core[940e698046960fd5]::result::Result<(), alloc[2ea6bcb46fca0c42]::string::String>><unknown>
  415. 43.40 s gammaloop-nextest-core> at <unknown source file>:<unknown line>
  416. 43.40 s gammaloop-nextest-core> 13: test[75d6903177b1d7e9]::run_test::{closure#0}<unknown>
  417. 43.40 s gammaloop-nextest-core> at <unknown source file>:<unknown line>
  418. 43.40 s gammaloop-nextest-core> 14: std[bcb96dfbba0ab899]::sys::backtrace::__rust_begin_short_backtrace::<test[75d6903177b1d7e9]::run_test::{closure#1}, ()><unknown>
  419. 43.40 s gammaloop-nextest-core> at <unknown source file>:<unknown line>
  420. 43.40 s gammaloop-nextest-core> 15: <std[bcb96dfbba0ab899]::thread::lifecycle::spawn_unchecked<test[75d6903177b1d7e9]::run_test::{closure#1}, ()>::{closure#1} as core[940e698046960fd5]::ops::function::FnOnce<()>>::call_once::{shim:vtable#0}<unknown>
  421. 43.40 s gammaloop-nextest-core> at <unknown source file>:<unknown line>
  422. 43.40 s gammaloop-nextest-core> 16: <std[bcb96dfbba0ab899]::sys::thread::unix::Thread>::new::thread_start<unknown>
  423. 43.40 s gammaloop-nextest-core> at <unknown source file>:<unknown line>
  424. 43.40 s gammaloop-nextest-core> 17: start_thread<unknown>
  425. 43.40 s gammaloop-nextest-core> at <unknown source file>:<unknown line>
  426. 43.40 s gammaloop-nextest-core> 18: __clone3<unknown>
  427. 43.40 s gammaloop-nextest-core> at <unknown source file>:<unknown line>
  428. 43.40 s gammaloop-nextest-core>
  429. 43.40 s gammaloop-nextest-core> Run with COLORBT_SHOW_HIDDEN=1 environment variable to disable frame filtering.
  430. 43.40 s gammaloop-nextest-core> Run with RUST_BACKTRACE=full to include source snippets.
  431. 43.40 s gammaloop-nextest-core>
  432. 43.40 s gammaloop-nextest-core> FAIL [ 0.134s] (181/692) gammalooprs graph::three_d_source::tests::pinched_affine_carrier_requires_occurrence_interpolation
  433. 43.40 s gammaloop-nextest-core> stdout ---
  434. 43.40 s gammaloop-nextest-core>
  435. 43.40 s gammaloop-nextest-core> running 1 test
  436. 43.40 s gammaloop-nextest-core> test graph::three_d_source::tests::pinched_affine_carrier_requires_occurrence_interpolation ... FAILED
  437. 43.40 s gammaloop-nextest-core>
  438. 43.40 s gammaloop-nextest-core> failures:
  439. 43.40 s gammaloop-nextest-core>
  440. 43.40 s gammaloop-nextest-core> failures:
  441. 43.40 s gammaloop-nextest-core> graph::three_d_source::tests::pinched_affine_carrier_requires_occurrence_interpolation
  442. 43.40 s gammaloop-nextest-core>
  443. 43.40 s gammaloop-nextest-core> test result: FAILED. 0 passed; 1 failed; 0 ignored; 0 measured; 742 filtered out; finished in 0.13s
  444. 43.40 s gammaloop-nextest-core>
  445. 43.40 s gammaloop-nextest-core> stderr ---
  446. 43.40 s gammaloop-nextest-core> The application panicked (crashed).
  447. 43.40 s gammaloop-nextest-core> Message: certified affine occurrence lift must reproduce the independent double contours: actual=-(-1/16*(3+E0)*(5+E0)/((1+Q(0,cind(1))^2+Q(0,cind(2))^2+Q(0,cind(3))^2)^(3/2)*(1+Q(1,cind(1))^2+Q(1,cind(2))^2+Q(1,cind(3))^2)^(3/2))-1/16*(3+E1)*(5+E1)/((1+Q(0,cind(1))^2+Q(0,cind(2))^2+Q(0,cind(3))^2)^(3/2)*(1+Q(1,cind(1))^2+Q(1,cind(2))^2+Q(1,cind(3))^2)^(3/2))-1/16*(3-E0)*(5-E0)/((1+Q(0,cind(1))^2+Q(0,cind(2))^2+Q(0,cind(3))^2)^(3/2)*(1+Q(1,cind(1))^2+Q(1,cind(2))^2+Q(1,cind(3))^2)^(3/2))-1/16*(3-E1)*(5-E1)/((1+Q(0,cind(1))^2+Q(0,cind(2))^2+Q(0,cind(3))^2)^(3/2)*(1+Q(1,cind(1))^2+Q(1,cind(2))^2+Q(1,cind(3))^2)^(3/2))+1/64*(3+E0+E1)*(5+E0+E1)/((1+Q(0,cind(1))^2+Q(0,cind(2))^2+Q(0,cind(3))^2)^(3/2)*(1+Q(1,cind(1))^2+Q(1,cind(2))^2+Q(1,cind(3))^2)^(3/2))+1/64*(3+E0-E1)*(5+E0-E1)/((1+Q(0,cind(1))^2+Q(0,cind(2))^2+Q(0,cind(3))^2)^(3/2)*(1+Q(1,cind(1))^2+Q(1,cind(2))^2+Q(1,cind(3))^2)^(3/2))+1/64*(3-E0+E1)*(5-E0+E1)/((1+Q(0,cind(1))^2+Q(0,cind(2))^2+Q(0,cind(3))^2)^(3/2)*(1+Q(1,cind(1))^2+Q(1,cind(2))^2+Q(1,cind(3))^2)^(3/2))+1/64*(3-E0-E1)*(5-E0-E1)/((1+Q(0,cind(1))^2+Q(0,cind(2))^2+Q(0,cind(3))^2)^(3/2)*(1+Q(1,cind(1))^2+Q(1,cind(2))^2+Q(1,cind(3))^2)^(3/2))+15/4/((1+Q(0,cind(1))^2+Q(0,cind(2))^2+Q(0,cind(3))^2)^(3/2)*(1+Q(1,cind(1))^2+Q(1,cind(2))^2+Q(1,cind(3))^2)^(3/2))), expected=1/16*(15-E0^2-E1^2)/(E0^3*E1^3)
  448. 43.40 s gammaloop-nextest-core> Location: crates/gammalooprs/src/graph/three_d_source.rs:7619
  449. 43.40 s gammaloop-nextest-core>
  450. 43.40 s gammaloop-nextest-core> ━━━━━━━━━━━━━━━━━━━━━━━━━━━━━━━━━━ BACKTRACE ━━━━━━━━━━━━━━━━━━━━━━━━━━━━━━━━━━━
  451. 43.40 s gammaloop-nextest-core> 1: <color_eyre[51793ea62743adbd]::config::PanicHook>::panic_report<unknown>
  452. 43.40 s gammaloop-nextest-core> at <unknown source file>:<unknown line>
  453. 43.40 s gammaloop-nextest-core> 2: <color_eyre[51793ea62743adbd]::config::PanicHook>::into_panic_hook::{closure#0}<unknown>
  454. 43.41 s gammaloop-nextest-core> at <unknown source file>:<unknown line>
  455. 43.41 s gammaloop-nextest-core> 3: std[bcb96dfbba0ab899]::panicking::panic_with_hook<unknown>
  456. 43.41 s gammaloop-nextest-core> at <unknown source file>:<unknown line>
  457. 43.41 s gammaloop-nextest-core> 4: std[bcb96dfbba0ab899]::panicking::panic_handler::{closure#0}<unknown>
  458. 43.41 s gammaloop-nextest-core> at <unknown source file>:<unknown line>
  459. 43.41 s gammaloop-nextest-core> 5: std[bcb96dfbba0ab899]::sys::backtrace::__rust_end_short_backtrace::<std[bcb96dfbba0ab899]::panicking::panic_handler::{closure#0}, !><unknown>
  460. 43.41 s gammaloop-nextest-core> at <unknown source file>:<unknown line>
  461. 43.41 s gammaloop-nextest-core> 6: __rustc[6c289b9f9c454d21]::rust_begin_unwind<unknown>
  462. 43.41 s gammaloop-nextest-core> at <unknown source file>:<unknown line>
  463. 43.41 s gammaloop-nextest-core> 7: core[940e698046960fd5]::panicking::panic_fmt<unknown>
  464. 43.41 s gammaloop-nextest-core> at <unknown source file>:<unknown line>
  465. 43.41 s gammaloop-nextest-core> 8: <gammalooprs[24955f93fc9f4e0c]::graph::three_d_source::tests::pinched_affine_carrier_requires_occurrence_interpolation::{closure#0} as core[940e698046960fd5]::ops::function::FnOnce<()>>::call_once<unknown>
  466. 43.41 s gammaloop-nextest-core> at <unknown source file>:<unknown line>
  467. 43.41 s gammaloop-nextest-core> 9: test[75d6903177b1d7e9]::__rust_begin_short_backtrace::<core[940e698046960fd5]::result::Result<(), alloc[2ea6bcb46fca0c42]::string::String>, fn() -> core[940e698046960fd5]::result::Result<(), alloc[2ea6bcb46fca0c42]::string::String>><unknown>
  468. 43.41 s gammaloop-nextest-core> at <unknown source file>:<unknown line>
  469. 43.41 s gammaloop-nextest-core> 10: test[75d6903177b1d7e9]::run_test::{closure#0}<unknown>
  470. 43.41 s gammaloop-nextest-core> at <unknown source file>:<unknown line>
  471. 43.41 s gammaloop-nextest-core> 11: std[bcb96dfbba0ab899]::sys::backtrace::__rust_begin_short_backtrace::<test[75d6903177b1d7e9]::run_test::{closure#1}, ()><unknown>
  472. 43.41 s gammaloop-nextest-core> at <unknown source file>:<unknown line>
  473. 43.41 s gammaloop-nextest-core> 12: <std[bcb96dfbba0ab899]::thread::lifecycle::spawn_unchecked<test[75d6903177b1d7e9]::run_test::{closure#1}, ()>::{closure#1} as core[940e698046960fd5]::ops::function::FnOnce<()>>::call_once::{shim:vtable#0}<unknown>
  474. 43.41 s gammaloop-nextest-core> at <unknown source file>:<unknown line>
  475. 43.41 s gammaloop-nextest-core> 13: <std[bcb96dfbba0ab899]::sys::thread::unix::Thread>::new::thread_start<unknown>
  476. 43.41 s gammaloop-nextest-core> at <unknown source file>:<unknown line>
  477. 43.41 s gammaloop-nextest-core> 14: start_thread<unknown>
  478. 43.41 s gammaloop-nextest-core> at <unknown source file>:<unknown line>
  479. 43.41 s gammaloop-nextest-core> 15: __clone3<unknown>
  480. 43.41 s gammaloop-nextest-core> at <unknown source file>:<unknown line>
  481. 43.41 s gammaloop-nextest-core>
  482. 43.41 s gammaloop-nextest-core> Run with COLORBT_SHOW_HIDDEN=1 environment variable to disable frame filtering.
  483. 43.41 s gammaloop-nextest-core> Run with RUST_BACKTRACE=full to include source snippets.
  484. 43.41 s gammaloop-nextest-core>
  485. 43.41 s gammaloop-nextest-core> FAIL [ 0.021s] (298/692) gammalooprs numerator::energy_degree::tests::canonical_class_cyclic_lifts_preserve_factorization_and_exact_bounds
  486. 43.41 s gammaloop-nextest-core> stdout ---
  487. 43.41 s gammaloop-nextest-core>
  488. 43.41 s gammaloop-nextest-core> running 1 test
  489. 43.41 s gammaloop-nextest-core> test numerator::energy_degree::tests::canonical_class_cyclic_lifts_preserve_factorization_and_exact_bounds ... FAILED
  490. 43.41 s gammaloop-nextest-core>
  491. 43.41 s gammaloop-nextest-core> failures:
  492. 43.41 s gammaloop-nextest-core>
  493. 43.41 s gammaloop-nextest-core> failures:
  494. 43.41 s gammaloop-nextest-core> numerator::energy_degree::tests::canonical_class_cyclic_lifts_preserve_factorization_and_exact_bounds
  495. 43.41 s gammaloop-nextest-core>
  496. 43.41 s gammaloop-nextest-core> test result: FAILED. 0 passed; 1 failed; 0 ignored; 0 measured; 742 filtered out; finished in 0.01s
  497. 43.41 s gammaloop-nextest-core>
  498. 43.41 s gammaloop-nextest-core> stderr ---
  499. 43.41 s gammaloop-nextest-core>
  500. 43.41 s gammaloop-nextest-core> thread 'numerator::energy_degree::tests::canonical_class_cyclic_lifts_preserve_factorization_and_exact_bounds' (2289) panicked at crates/gammalooprs/src/numerator/energy_degree.rs:2850:13:
  501. 43.41 s gammaloop-nextest-core> assertion failed: (collapsed - expression).collect_factors().is_zero()
  502. 43.41 s gammaloop-nextest-core> stack backtrace:
  503. 43.41 s gammaloop-nextest-core> 0: __rustc::rust_begin_unwind
  504. 43.41 s gammaloop-nextest-core> 1: core::panicking::panic_fmt
  505. 43.41 s gammaloop-nextest-core> 2: core::panicking::panic
  506. 43.41 s gammaloop-nextest-core> 3: gammalooprs::numerator::energy_degree::tests::canonical_class_cyclic_lifts_preserve_factorization_and_exact_bounds
  507. 43.41 s gammaloop-nextest-core> 4: <gammalooprs::numerator::energy_degree::tests::canonical_class_cyclic_lifts_preserve_factorization_and_exact_bounds::{closure#0} as core::ops::function::FnOnce<()>>::call_once
  508. 43.41 s gammaloop-nextest-core> note: Some details are omitted, run with `RUST_BACKTRACE=full` for a verbose backtrace.
  509. 43.41 s gammaloop-nextest-core>
  510. 43.41 s gammaloop-nextest-core> FAIL [ 0.107s] (592/692) gammalooprs uv::approx::local_4d::tests::canonical_uv_signed_multiloop_carriers_preserve_factorized_numerators
  511. 43.41 s gammaloop-nextest-core> stdout ---
  512. 43.41 s gammaloop-nextest-core>
  513. 43.41 s gammaloop-nextest-core> running 1 test
  514. 43.41 s gammaloop-nextest-core> test uv::approx::local_4d::tests::canonical_uv_signed_multiloop_carriers_preserve_factorized_numerators ... FAILED
  515. 43.41 s gammaloop-nextest-core>
  516. 43.41 s gammaloop-nextest-core> failures:
  517. 43.41 s gammaloop-nextest-core>
  518. 43.41 s gammaloop-nextest-core> failures:
  519. 43.41 s gammaloop-nextest-core> uv::approx::local_4d::tests::canonical_uv_signed_multiloop_carriers_preserve_factorized_numerators
  520. 43.41 s gammaloop-nextest-core>
  521. 43.41 s gammaloop-nextest-core> test result: FAILED. 0 passed; 1 failed; 0 ignored; 0 measured; 742 filtered out; finished in 0.09s
  522. 43.41 s gammaloop-nextest-core>
  523. 43.41 s gammaloop-nextest-core> stderr ---
  524. 43.41 s gammaloop-nextest-core> The application panicked (crashed).
  525. 43.41 s gammaloop-nextest-core> Message: assertion `left == right` failed
  526. 43.41 s gammaloop-nextest-core> left: 2*(signed_multiloop::a+signed_multiloop::b)^5*gammalooprs::Q(gammalooprs::uv::class(0),spenso::cind(0))
  527. 43.41 s gammaloop-nextest-core> right: -2*(signed_multiloop::a+signed_multiloop::b)^5*gammalooprs::Q(gammalooprs::uv::class(0),spenso::cind(0))
  528. 43.41 s gammaloop-nextest-core> Location: crates/gammalooprs/src/uv/approx/local_4d.rs:1983
  529. 43.41 s gammaloop-nextest-core>
  530. 43.41 s gammaloop-nextest-core> ━━━━━━━━━━━━━━━━━━━━━━━━━━━━━━━━━━ BACKTRACE ━━━━━━━━━━━━━━━━━━━━━━━━━━━━━━━━━━━
  531. 43.41 s gammaloop-nextest-core> 1: <color_eyre[51793ea62743adbd]::config::PanicHook>::panic_report<unknown>
  532. 43.41 s gammaloop-nextest-core> at <unknown source file>:<unknown line>
  533. 43.41 s gammaloop-nextest-core> 2: <color_eyre[51793ea62743adbd]::config::PanicHook>::into_panic_hook::{closure#0}<unknown>
  534. 43.41 s gammaloop-nextest-core> at <unknown source file>:<unknown line>
  535. 43.41 s gammaloop-nextest-core> 3: std[bcb96dfbba0ab899]::panicking::panic_with_hook<unknown>
  536. 43.41 s gammaloop-nextest-core> at <unknown source file>:<unknown line>
  537. 43.41 s gammaloop-nextest-core> 4: std[bcb96dfbba0ab899]::panicking::panic_handler::{closure#0}<unknown>
  538. 43.41 s gammaloop-nextest-core> at <unknown source file>:<unknown line>
  539. 43.41 s gammaloop-nextest-core> 5: std[bcb96dfbba0ab899]::sys::backtrace::__rust_end_short_backtrace::<std[bcb96dfbba0ab899]::panicking::panic_handler::{closure#0}, !><unknown>
  540. 43.41 s gammaloop-nextest-core> at <unknown source file>:<unknown line>
  541. 43.41 s gammaloop-nextest-core> 6: __rustc[6c289b9f9c454d21]::rust_begin_unwind<unknown>
  542. 43.41 s gammaloop-nextest-core> at <unknown source file>:<unknown line>
  543. 43.41 s gammaloop-nextest-core> 7: core[940e698046960fd5]::panicking::panic_fmt<unknown>
  544. 43.41 s gammaloop-nextest-core> at <unknown source file>:<unknown line>
  545. 43.41 s gammaloop-nextest-core> 8: core[940e698046960fd5]::panicking::assert_failed_inner<unknown>
  546. 43.41 s gammaloop-nextest-core> at <unknown source file>:<unknown line>
  547. 43.41 s gammaloop-nextest-core> 9: core[940e698046960fd5]::panicking::assert_failed::<symbolica[499970c26fd75ddd]::atom::Atom, symbolica[499970c26fd75ddd]::atom::Atom><unknown>
  548. 43.41 s gammaloop-nextest-core> at <unknown source file>:<unknown line>
  549. 43.41 s gammaloop-nextest-core> 10: gammalooprs[24955f93fc9f4e0c]::uv::approx::local_4d::tests::canonical_uv_signed_multiloop_carriers_preserve_factorized_numerators<unknown>
  550. 43.41 s gammaloop-nextest-core> at <unknown source file>:<unknown line>
  551. 43.41 s gammaloop-nextest-core> 11: <gammalooprs[24955f93fc9f4e0c]::uv::approx::local_4d::tests::canonical_uv_signed_multiloop_carriers_preserve_factorized_numerators::{closure#0} as core[940e698046960fd5]::ops::function::FnOnce<()>>::call_once<unknown>
  552. 43.41 s gammaloop-nextest-core> at <unknown source file>:<unknown line>
  553. 43.41 s gammaloop-nextest-core> 12: test[75d6903177b1d7e9]::__rust_begin_short_backtrace::<core[940e698046960fd5]::result::Result<(), alloc[2ea6bcb46fca0c42]::string::String>, fn() -> core[940e698046960fd5]::result::Result<(), alloc[2ea6bcb46fca0c42]::string::String>><unknown>
  554. 43.41 s gammaloop-nextest-core> at <unknown source file>:<unknown line>
  555. 43.41 s gammaloop-nextest-core> 13: test[75d6903177b1d7e9]::run_test::{closure#0}<unknown>
  556. 43.41 s gammaloop-nextest-core> at <unknown source file>:<unknown line>
  557. 43.41 s gammaloop-nextest-core> 14: std[bcb96dfbba0ab899]::sys::backtrace::__rust_begin_short_backtrace::<test[75d6903177b1d7e9]::run_test::{closure#1}, ()><unknown>
  558. 43.41 s gammaloop-nextest-core> at <unknown source file>:<unknown line>
  559. 43.41 s gammaloop-nextest-core> 15: <std[bcb96dfbba0ab899]::thread::lifecycle::spawn_unchecked<test[75d6903177b1d7e9]::run_test::{closure#1}, ()>::{closure#1} as core[940e698046960fd5]::ops::function::FnOnce<()>>::call_once::{shim:vtable#0}<unknown>
  560. 43.41 s gammaloop-nextest-core> at <unknown source file>:<unknown line>
  561. 43.41 s gammaloop-nextest-core> 16: <std[bcb96dfbba0ab899]::sys::thread::unix::Thread>::new::thread_start<unknown>
  562. 43.41 s gammaloop-nextest-core> at <unknown source file>:<unknown line>
  563. 43.41 s gammaloop-nextest-core> 17: start_thread<unknown>
  564. 43.41 s gammaloop-nextest-core> at <unknown source file>:<unknown line>
  565. 43.41 s gammaloop-nextest-core> 18: __clone3<unknown>
  566. 43.41 s gammaloop-nextest-core> at <unknown source file>:<unknown line>
  567. 43.41 s gammaloop-nextest-core>
  568. 43.41 s gammaloop-nextest-core> Run with COLORBT_SHOW_HIDDEN=1 environment variable to disable frame filtering.
  569. 43.41 s gammaloop-nextest-core> Run with RUST_BACKTRACE=full to include source snippets.
  570. 43.41 s gammaloop-nextest-core>
  571. 43.41 s gammaloop-nextest-core> FAIL [ 0.129s] (593/692) gammalooprs uv::approx::local_4d::tests::canonical_uv_classes_certify_signed_aliases_and_preserve_raw_sectors
  572. 43.41 s gammaloop-nextest-core> stdout ---
  573. 43.41 s gammaloop-nextest-core>
  574. 43.41 s gammaloop-nextest-core> running 1 test
  575. 43.41 s gammaloop-nextest-core> test uv::approx::local_4d::tests::canonical_uv_classes_certify_signed_aliases_and_preserve_raw_sectors ... FAILED
  576. 43.41 s gammaloop-nextest-core>
  577. 43.41 s gammaloop-nextest-core> failures:
  578. 43.41 s gammaloop-nextest-core>
  579. 43.41 s gammaloop-nextest-core> failures:
  580. 43.41 s gammaloop-nextest-core> uv::approx::local_4d::tests::canonical_uv_classes_certify_signed_aliases_and_preserve_raw_sectors
  581. 43.41 s gammaloop-nextest-core>
  582. 43.41 s gammaloop-nextest-core> test result: FAILED. 0 passed; 1 failed; 0 ignored; 0 measured; 742 filtered out; finished in 0.11s
  583. 43.41 s gammaloop-nextest-core>
  584. 43.41 s gammaloop-nextest-core> stderr ---
  585. 43.41 s gammaloop-nextest-core> Error:
  586. 43.41 s gammaloop-nextest-core> 0: merged canonical UV numerator does not reproduce its source bucket
  587. 43.41 s gammaloop-nextest-core>
  588. 43.41 s gammaloop-nextest-core> Location:
  589. 43.41 s gammaloop-nextest-core> crates/gammalooprs/src/uv/approx/local_4d.rs:367
  590. 43.41 s gammaloop-nextest-core>
  591. 43.41 s gammaloop-nextest-core> ━━━━━━━━━━━━━━━━━━━━━━━━━━━━━━━━━━ BACKTRACE ━━━━━━━━━━━━━━━━━━━━━━━━━━━━━━━━━━━
  592. 43.41 s gammaloop-nextest-core> 1: <color_eyre[51793ea62743adbd]::config::EyreHook>::into_eyre_hook::{closure#0}<unknown>
  593. 43.41 s gammaloop-nextest-core> at <unknown source file>:<unknown line>
  594. 43.41 s gammaloop-nextest-core> 2: eyre[cb2fd339c0c40fca]::capture_handler<unknown>
  595. 43.41 s gammaloop-nextest-core> at <unknown source file>:<unknown line>
  596. 43.41 s gammaloop-nextest-core> 3: eyre[cb2fd339c0c40fca]::private::format_err<unknown>
  597. 43.41 s gammaloop-nextest-core> at <unknown source file>:<unknown line>
  598. 43.41 s gammaloop-nextest-core> 4: <gammalooprs[24955f93fc9f4e0c]::uv::approx::local_4d::FourDSector>::canonical_projection<unknown>
  599. 43.41 s gammaloop-nextest-core> at <unknown source file>:<unknown line>
  600. 43.41 s gammaloop-nextest-core> 5: gammalooprs[24955f93fc9f4e0c]::uv::approx::local_4d::tests::canonical_uv_classes_certify_signed_aliases_and_preserve_raw_sectors<unknown>
  601. 43.41 s gammaloop-nextest-core> at <unknown source file>:<unknown line>
  602. 43.41 s gammaloop-nextest-core> 6: <gammalooprs[24955f93fc9f4e0c]::uv::approx::local_4d::tests::canonical_uv_classes_certify_signed_aliases_and_preserve_raw_sectors::{closure#0} as core[940e698046960fd5]::ops::function::FnOnce<()>>::call_once<unknown>
  603. 43.41 s gammaloop-nextest-core> at <unknown source file>:<unknown line>
  604. 43.41 s gammaloop-nextest-core> 7: test[75d6903177b1d7e9]::__rust_begin_short_backtrace::<core[940e698046960fd5]::result::Result<(), alloc[2ea6bcb46fca0c42]::string::String>, fn() -> core[940e698046960fd5]::result::Result<(), alloc[2ea6bcb46fca0c42]::string::String>><unknown>
  605. 43.41 s gammaloop-nextest-core> at <unknown source file>:<unknown line>
  606. 43.41 s gammaloop-nextest-core> 8: test[75d6903177b1d7e9]::run_test::{closure#0}<unknown>
  607. 43.41 s gammaloop-nextest-core> at <unknown source file>:<unknown line>
  608. 43.41 s gammaloop-nextest-core> 9: std[bcb96dfbba0ab899]::sys::backtrace::__rust_begin_short_backtrace::<test[75d6903177b1d7e9]::run_test::{closure#1}, ()><unknown>
  609. 43.41 s gammaloop-nextest-core> at <unknown source file>:<unknown line>
  610. 43.41 s gammaloop-nextest-core> 10: <std[bcb96dfbba0ab899]::thread::lifecycle::spawn_unchecked<test[75d6903177b1d7e9]::run_test::{closure#1}, ()>::{closure#1} as core[940e698046960fd5]::ops::function::FnOnce<()>>::call_once::{shim:vtable#0}<unknown>
  611. 43.41 s gammaloop-nextest-core> at <unknown source file>:<unknown line>
  612. 43.41 s gammaloop-nextest-core> 11: <std[bcb96dfbba0ab899]::sys::thread::unix::Thread>::new::thread_start<unknown>
  613. 43.41 s gammaloop-nextest-core> at <unknown source file>:<unknown line>
  614. 43.41 s gammaloop-nextest-core> 12: start_thread<unknown>
  615. 43.41 s gammaloop-nextest-core> at <unknown source file>:<unknown line>
  616. 43.41 s gammaloop-nextest-core> 13: __clone3<unknown>
  617. 43.41 s gammaloop-nextest-core> at <unknown source file>:<unknown line>
  618. 43.41 s gammaloop-nextest-core>
  619. 43.41 s gammaloop-nextest-core> Run with COLORBT_SHOW_HIDDEN=1 environment variable to disable frame filtering.
  620. 43.41 s gammaloop-nextest-core> Run with RUST_BACKTRACE=full to include source snippets.
  621. 43.41 s gammaloop-nextest-core>
  622. 43.41 s gammaloop-nextest-core> FAIL [ 0.100s] (606/692) gammalooprs uv::approx::tests::direct_nested_scalar_banana_replays_complete_cff_at_depth_three
  623. 43.41 s gammaloop-nextest-core> stdout ---
  624. 43.41 s gammaloop-nextest-core>
  625. 43.41 s gammaloop-nextest-core> running 1 test
  626. 43.41 s gammaloop-nextest-core> test uv::approx::tests::direct_nested_scalar_banana_replays_complete_cff_at_depth_three ... FAILED
  627. 43.41 s gammaloop-nextest-core>
  628. 43.41 s gammaloop-nextest-core> failures:
  629. 43.41 s gammaloop-nextest-core>
  630. 43.41 s gammaloop-nextest-core> failures:
  631. 43.41 s gammaloop-nextest-core> uv::approx::tests::direct_nested_scalar_banana_replays_complete_cff_at_depth_three
  632. 43.41 s gammaloop-nextest-core>
  633. 43.41 s gammaloop-nextest-core> test result: FAILED. 0 passed; 1 failed; 0 ignored; 0 measured; 742 filtered out; finished in 0.09s
  634. 43.41 s gammaloop-nextest-core>
  635. 43.41 s gammaloop-nextest-core> stderr ---
  636. 43.41 s gammaloop-nextest-core> Error:
  637. 43.41 s gammaloop-nextest-core> 0: canonical UV numerator does not reproduce its source in the component frame
  638. 43.41 s gammaloop-nextest-core>
  639. 43.41 s gammaloop-nextest-core> Location:
  640. 43.41 s gammaloop-nextest-core> crates/gammalooprs/src/uv/approx/local_4d.rs:354
  641. 43.41 s gammaloop-nextest-core>
  642. 43.41 s gammaloop-nextest-core> ━━━━━━━━━━━━━━━━━━━━━━━━━━━━━━━━━━ BACKTRACE ━━━━━━━━━━━━━━━━━━━━━━━━━━━━━━━━━━━
  643. 43.41 s gammaloop-nextest-core> 1: <color_eyre[51793ea62743adbd]::config::EyreHook>::into_eyre_hook::{closure#0}<unknown>
  644. 43.41 s gammaloop-nextest-core> at <unknown source file>:<unknown line>
  645. 43.41 s gammaloop-nextest-core> 2: eyre[cb2fd339c0c40fca]::capture_handler<unknown>
  646. 43.41 s gammaloop-nextest-core> at <unknown source file>:<unknown line>
  647. 43.41 s gammaloop-nextest-core> 3: eyre[cb2fd339c0c40fca]::private::format_err<unknown>
  648. 43.41 s gammaloop-nextest-core> at <unknown source file>:<unknown line>
  649. 43.41 s gammaloop-nextest-core> 4: <gammalooprs[24955f93fc9f4e0c]::uv::approx::local_4d::FourDSector>::canonical_projection<unknown>
  650. 43.41 s gammaloop-nextest-core> at <unknown source file>:<unknown line>
  651. 43.41 s gammaloop-nextest-core> 5: <gammalooprs[24955f93fc9f4e0c]::uv::approx::projected_4d::Projected4dApproximation>::project_local_4d<unknown>
  652. 43.41 s gammaloop-nextest-core> at <unknown source file>:<unknown line>
  653. 43.41 s gammaloop-nextest-core> 6: <gammalooprs[24955f93fc9f4e0c]::uv::approx::Approximation>::compute_3d<unknown>
  654. 43.41 s gammaloop-nextest-core> at <unknown source file>:<unknown line>
  655. 43.41 s gammaloop-nextest-core> 7: gammalooprs[24955f93fc9f4e0c]::uv::approx::tests::direct_nested_scalar_banana_replays_complete_cff_at_depth_three::{closure#0}<unknown>
  656. 43.41 s gammaloop-nextest-core> at <unknown source file>:<unknown line>
  657. 43.41 s gammaloop-nextest-core> 8: gammalooprs[24955f93fc9f4e0c]::uv::approx::tests::direct_nested_scalar_banana_replays_complete_cff_at_depth_three<unknown>
  658. 43.41 s gammaloop-nextest-core> at <unknown source file>:<unknown line>
  659. 43.41 s gammaloop-nextest-core> 9: <gammalooprs[24955f93fc9f4e0c]::uv::approx::tests::direct_nested_scalar_banana_replays_complete_cff_at_depth_three::{closure#0} as core[940e698046960fd5]::ops::function::FnOnce<()>>::call_once<unknown>
  660. 43.41 s gammaloop-nextest-core> at <unknown source file>:<unknown line>
  661. 43.41 s gammaloop-nextest-core> 10: test[75d6903177b1d7e9]::__rust_begin_short_backtrace::<core[940e698046960fd5]::result::Result<(), alloc[2ea6bcb46fca0c42]::string::String>, fn() -> core[940e698046960fd5]::result::Result<(), alloc[2ea6bcb46fca0c42]::string::String>><unknown>
  662. 43.41 s gammaloop-nextest-core> at <unknown source file>:<unknown line>
  663. 43.41 s gammaloop-nextest-core> 11: test[75d6903177b1d7e9]::run_test::{closure#0}<unknown>
  664. 43.41 s gammaloop-nextest-core> at <unknown source file>:<unknown line>
  665. 43.41 s gammaloop-nextest-core> 12: std[bcb96dfbba0ab899]::sys::backtrace::__rust_begin_short_backtrace::<test[75d6903177b1d7e9]::run_test::{closure#1}, ()><unknown>
  666. 43.41 s gammaloop-nextest-core> at <unknown source file>:<unknown line>
  667. 43.41 s gammaloop-nextest-core> 13: <std[bcb96dfbba0ab899]::thread::lifecycle::spawn_unchecked<test[75d6903177b1d7e9]::run_test::{closure#1}, ()>::{closure#1} as core[940e698046960fd5]::ops::function::FnOnce<()>>::call_once::{shim:vtable#0}<unknown>
  668. 43.41 s gammaloop-nextest-core> at <unknown source file>:<unknown line>
  669. 43.41 s gammaloop-nextest-core> 14: <std[bcb96dfbba0ab899]::sys::thread::unix::Thread>::new::thread_start<unknown>
  670. 43.41 s gammaloop-nextest-core> at <unknown source file>:<unknown line>
  671. 43.41 s gammaloop-nextest-core> 15: start_thread<unknown>
  672. 43.41 s gammaloop-nextest-core> at <unknown source file>:<unknown line>
  673. 43.41 s gammaloop-nextest-core> 16: __clone3<unknown>
  674. 43.41 s gammaloop-nextest-core> at <unknown source file>:<unknown line>
  675. 43.41 s gammaloop-nextest-core>
  676. 43.41 s gammaloop-nextest-core> Run with COLORBT_SHOW_HIDDEN=1 environment variable to disable frame filtering.
  677. 43.41 s gammaloop-nextest-core> Run with RUST_BACKTRACE=full to include source snippets.
  678. 43.41 s gammaloop-nextest-core>
  679. 43.53 s gammaloop-nextest-core> error: test run failed
  680. 43.57 s gammaloop-nextest-core>
  681. 43.57 s gammaloop-nextest-core> ========== nextest test summary ==========
  682. 43.57 s gammaloop-nextest-core> report: target/nextest/ci_gammaloop/junit.xml
  683. 43.57 s gammaloop-nextest-core> tests: 692, failures: 6, errors: 0
  684. 43.57 s gammaloop-nextest-core>
  685. 43.57 s gammaloop-nextest-core> 1. gammalooprs::graph::three_d_source::tests::exact_taylor_vacuum_affine_circulation_preserves_energy_mapping
  686. 43.57 s gammaloop-nextest-core> failure: test failure with exit code 101
  687. 43.57 s gammaloop-nextest-core> system-out
  688. 43.57 s gammaloop-nextest-core> running 1 test
  689. 43.57 s gammaloop-nextest-core> test graph::three_d_source::tests::exact_taylor_vacuum_affine_circulation_preserves_energy_mapping ... FAILED
  690. 43.57 s gammaloop-nextest-core>
  691. 43.57 s gammaloop-nextest-core> failures:
  692. 43.57 s gammaloop-nextest-core>
  693. 43.57 s gammaloop-nextest-core> failures:
  694. 43.57 s gammaloop-nextest-core> graph::three_d_source::tests::exact_taylor_vacuum_affine_circulation_preserves_energy_mapping
  695. 43.57 s gammaloop-nextest-core>
  696. 43.57 s gammaloop-nextest-core> test result: FAILED. 0 passed; 1 failed; 0 ignored; 0 measured; 742 filtered out; finished in 0.10s
  697. 43.57 s gammaloop-nextest-core> system-err
  698. 43.57 s gammaloop-nextest-core> The application panicked (crashed).
  699. 43.57 s gammaloop-nextest-core> Message: assertion `left == right` failed
  700. 43.57 s gammaloop-nextest-core> left: (gammalooprs::mUVexp^2+(-gammalooprs::Q(1,spenso::cind(1))+gammalooprs::Q(4,spenso::cind(1)))^2+(-gammalooprs::Q(1,spenso::cind(2))+gammalooprs::Q(4,spenso::cind(2)))^2+(-gammalooprs::Q(1,spenso::cind(3))+gammalooprs::Q(4,spenso::cind(3)))^2)^(1/2)
  701. 43.57 s gammaloop-nextest-core> right: (gammalooprs::mUVexp^2+(gammalooprs::Q(1,spenso::cind(1))-gammalooprs::Q(4,spenso::cind(1)))^2+(gammalooprs::Q(1,spenso::cind(2))-gammalooprs::Q(4,spenso::cind(2)))^2+(gammalooprs::Q(1,spenso::cind(3))-gammalooprs::Q(4,spenso::cind(3)))^2)^(1/2)
  702. 43.57 s gammaloop-nextest-core> Location: crates/gammalooprs/src/graph/three_d_source.rs:7797
  703. 43.57 s gammaloop-nextest-core>
  704. 43.57 s gammaloop-nextest-core> ━━━━━━━━━━━━━━━━━━━━━━━━━━━━━━━━━━ BACKTRACE ━━━━━━━━━━━━━━━━━━━━━━━━━━━━━━━━━━━
  705. 43.57 s gammaloop-nextest-core> 1: <color_eyre[51793ea62743adbd]::config::PanicHook>::panic_report<unknown>
  706. 43.57 s gammaloop-nextest-core> at <unknown source file>:<unknown line>
  707. 43.57 s gammaloop-nextest-core> 2: <color_eyre[51793ea62743adbd]::config::PanicHook>::into_panic_hook::{closure#0}<unknown>
  708. 43.57 s gammaloop-nextest-core> at <unknown source file>:<unknown line>
  709. 43.57 s gammaloop-nextest-core> 3: std[bcb96dfbba0ab899]::panicking::panic_with_hook<unknown>
  710. 43.57 s gammaloop-nextest-core> at <unknown source file>:<unknown line>
  711. 43.57 s gammaloop-nextest-core> 4: std[bcb96dfbba0ab899]::panicking::panic_handler::{closure#0}<unknown>
  712. 43.57 s gammaloop-nextest-core> at <unknown source file>:<unknown line>
  713. 43.57 s gammaloop-nextest-core> 5: std[bcb96dfbba0ab899]::sys::backtrace::__rust_end_short_backtrace::<std[bcb96dfbba0ab899]::panicking::panic_handler::{closure#0}, !><unknown>
  714. 43.57 s gammaloop-nextest-core> at <unknown source file>:<unknown line>
  715. 43.57 s gammaloop-nextest-core> 6: __rustc[6c289b9f9c454d21]::rust_begin_unwind<unknown>
  716. 43.57 s gammaloop-nextest-core> at <unknown source file>:<unknown line>
  717. 43.57 s gammaloop-nextest-core> 7: core[940e698046960fd5]::panicking::panic_fmt<unknown>
  718. 43.57 s gammaloop-nextest-core> at <unknown source file>:<unknown line>
  719. 43.57 s gammaloop-nextest-core> 8: core[940e698046960fd5]::panicking::assert_failed_inner<unknown>
  720. 43.57 s gammaloop-nextest-core> at <unknown source file>:<unknown line>
  721. 43.57 s gammaloop-nextest-core> 9: core[940e698046960fd5]::panicking::assert_failed::<symbolica[499970c26fd75ddd]::atom::Atom, symbolica[499970c26fd75ddd]::atom::Atom><unknown>
  722. 43.57 s gammaloop-nextest-core> at <unknown source file>:<unknown line>
  723. 43.57 s gammaloop-nextest-core> 10: gammalooprs[24955f93fc9f4e0c]::graph::three_d_source::tests::exact_taylor_vacuum_affine_circulation_preserves_energy_mapping<unknown>
  724. 43.57 s gammaloop-nextest-core> at <unknown source file>:<unknown line>
  725. 43.57 s gammaloop-nextest-core> 11: <gammalooprs[24955f93fc9f4e0c]::graph::three_d_source::tests::exact_taylor_vacuum_affine_circulation_preserves_energy_mapping::{closure#0} as core[940e698046960fd5]::ops::function::FnOnce<()>>::call_once<unknown>
  726. 43.57 s gammaloop-nextest-core> at <unknown source file>:<unknown line>
  727. 43.57 s gammaloop-nextest-core> 12: test[75d6903177b1d7e9]::__rust_begin_short_backtrace::<core[940e698046960fd5]::result::Result<(), alloc[2ea6bcb46fca0c42]::string::String>, fn() -> core[940e698046960fd5]::result::Result<(), alloc[2ea6bcb46fca0c42]::string::String>><unknown>
  728. 43.57 s gammaloop-nextest-core> at <unknown source file>:<unknown line>
  729. 43.57 s gammaloop-nextest-core> 13: test[75d6903177b1d7e9]::run_test::{closure#0}<unknown>
  730. 43.57 s gammaloop-nextest-core> at <unknown source file>:<unknown line>
  731. 43.57 s gammaloop-nextest-core> 14: std[bcb96dfbba0ab899]::sys::backtrace::__rust_begin_short_backtrace::<test[75d6903177b1d7e9]::run_test::{closure#1}, ()><unknown>
  732. 43.57 s gammaloop-nextest-core> at <unknown source file>:<unknown line>
  733. 43.57 s gammaloop-nextest-core> 15: <std[bcb96dfbba0ab899]::thread::lifecycle::spawn_unchecked<test[75d6903177b1d7e9]::run_test::{closure#1}, ()>::{closure#1} as core[940e698046960fd5]::ops::function::FnOnce<()>>::call_once::{shim:vtable#0}<unknown>
  734. 43.57 s gammaloop-nextest-core> at <unknown source file>:<unknown line>
  735. 43.57 s gammaloop-nextest-core> 16: <std[bcb96dfbba0ab899]::sys::thread::unix::Thread>::new::thread_start<unknown>
  736. 43.57 s gammaloop-nextest-core> at <unknown source file>:<unknown line>
  737. 43.57 s gammaloop-nextest-core> 17: start_thread<unknown>
  738. 43.57 s gammaloop-nextest-core> at <unknown source file>:<unknown line>
  739. 43.57 s gammaloop-nextest-core> 18: __clone3<unknown>
  740. 43.57 s gammaloop-nextest-core> at <unknown source file>:<unknown line>
  741. 43.57 s gammaloop-nextest-core>
  742. 43.57 s gammaloop-nextest-core> Run with COLORBT_SHOW_HIDDEN=1 environment variable to disable frame filtering.
  743. 43.57 s gammaloop-nextest-core> Run with RUST_BACKTRACE=full to include source snippets.
  744. 43.57 s gammaloop-nextest-core>
  745. 43.57 s gammaloop-nextest-core> 2. gammalooprs::graph::three_d_source::tests::pinched_affine_carrier_requires_occurrence_interpolation
  746. 43.57 s gammaloop-nextest-core> failure: test failure with exit code 101
  747. 43.57 s gammaloop-nextest-core> system-out
  748. 43.57 s gammaloop-nextest-core> running 1 test
  749. 43.57 s gammaloop-nextest-core> test graph::three_d_source::tests::pinched_affine_carrier_requires_occurrence_interpolation ... FAILED
  750. 43.57 s gammaloop-nextest-core>
  751. 43.57 s gammaloop-nextest-core> failures:
  752. 43.57 s gammaloop-nextest-core>
  753. 43.57 s gammaloop-nextest-core> failures:
  754. 43.57 s gammaloop-nextest-core> graph::three_d_source::tests::pinched_affine_carrier_requires_occurrence_interpolation
  755. 43.57 s gammaloop-nextest-core>
  756. 43.57 s gammaloop-nextest-core> test result: FAILED. 0 passed; 1 failed; 0 ignored; 0 measured; 742 filtered out; finished in 0.13s
  757. 43.57 s gammaloop-nextest-core> system-err
  758. 43.57 s gammaloop-nextest-core> The application panicked (crashed).
  759. 43.57 s gammaloop-nextest-core> Message: certified affine occurrence lift must reproduce the independent double contours: actual=-(-1/16*(3+E0)*(5+E0)/((1+Q(0,cind(1))^2+Q(0,cind(2))^2+Q(0,cind(3))^2)^(3/2)*(1+Q(1,cind(1))^2+Q(1,cind(2))^2+Q(1,cind(3))^2)^(3/2))-1/16*(3+E1)*(5+E1)/((1+Q(0,cind(1))^2+Q(0,cind(2))^2+Q(0,cind(3))^2)^(3/2)*(1+Q(1,cind(1))^2+Q(1,cind(2))^2+Q(1,cind(3))^2)^(3/2))-1/16*(3-E0)*(5-E0)/((1+Q(0,cind(1))^2+Q(0,cind(2))^2+Q(0,cind(3))^2)^(3/2)*(1+Q(1,cind(1))^2+Q(1,cind(2))^2+Q(1,cind(3))^2)^(3/2))-1/16*(3-E1)*(5-E1)/((1+Q(0,cind(1))^2+Q(0,cind(2))^2+Q(0,cind(3))^2)^(3/2)*(1+Q(1,cind(1))^2+Q(1,cind(2))^2+Q(1,cind(3))^2)^(3/2))+1/64*(3+E0+E1)*(5+E0+E1)/((1+Q(0,cind(1))^2+Q(0,cind(2))^2+Q(0,cind(3))^2)^(3/2)*(1+Q(1,cind(1))^2+Q(1,cind(2))^2+Q(1,cind(3))^2)^(3/2))+1/64*(3+E0-E1)*(5+E0-E1)/((1+Q(0,cind(1))^2+Q(0,cind(2))^2+Q(0,cind(3))^2)^(3/2)*(1+Q(1,cind(1))^2+Q(1,cind(2))^2+Q(1,cind(3))^2)^(3/2))+1/64*(3-E0+E1)*(5-E0+E1)/((1+Q(0,cind(1))^2+Q(0,cind(2))^2+Q(0,cind(3))^2)^(3/2)*(1+Q(1,cind(1))^2+Q(1,cind(2))^2+Q(1,cind(3))^2)^(3/2))+1/64*(3-E0-E1)*(5-E0-E1)/((1+Q(0,cind(1))^2+Q(0,cind(2))^2+Q(0,cind(3))^2)^(3/2)*(1+Q(1,cind(1))^2+Q(1,cind(2))^2+Q(1,cind(3))^2)^(3/2))+15/4/((1+Q(0,cind(1))^2+Q(0,cind(2))^2+Q(0,cind(3))^2)^(3/2)*(1+Q(1,cind(1))^2+Q(1,cind(2))^2+Q(1,cind(3))^2)^(3/2))), expected=1/16*(15-E0^2-E1^2)/(E0^3*E1^3)
  760. 43.57 s gammaloop-nextest-core> Location: crates/gammalooprs/src/graph/three_d_source.rs:7619
  761. 43.57 s gammaloop-nextest-core>
  762. 43.57 s gammaloop-nextest-core> ━━━━━━━━━━━━━━━━━━━━━━━━━━━━━━━━━━ BACKTRACE ━━━━━━━━━━━━━━━━━━━━━━━━━━━━━━━━━━━
  763. 43.57 s gammaloop-nextest-core> 1: <color_eyre[51793ea62743adbd]::config::PanicHook>::panic_report<unknown>
  764. 43.57 s gammaloop-nextest-core> at <unknown source file>:<unknown line>
  765. 43.57 s gammaloop-nextest-core> 2: <color_eyre[51793ea62743adbd]::config::PanicHook>::into_panic_hook::{closure#0}<unknown>
  766. 43.57 s gammaloop-nextest-core> at <unknown source file>:<unknown line>
  767. 43.57 s gammaloop-nextest-core> 3: std[bcb96dfbba0ab899]::panicking::panic_with_hook<unknown>
  768. 43.57 s gammaloop-nextest-core> at <unknown source file>:<unknown line>
  769. 43.57 s gammaloop-nextest-core> 4: std[bcb96dfbba0ab899]::panicking::panic_handler::{closure#0}<unknown>
  770. 43.57 s gammaloop-nextest-core> at <unknown source file>:<unknown line>
  771. 43.57 s gammaloop-nextest-core> 5: std[bcb96dfbba0ab899]::sys::backtrace::__rust_end_short_backtrace::<std[bcb96dfbba0ab899]::panicking::panic_handler::{closure#0}, !><unknown>
  772. 43.57 s gammaloop-nextest-core> at <unknown source file>:<unknown line>
  773. 43.57 s gammaloop-nextest-core> 6: __rustc[6c289b9f9c454d21]::rust_begin_unwind<unknown>
  774. 43.57 s gammaloop-nextest-core> at <unknown source file>:<unknown line>
  775. 43.57 s gammaloop-nextest-core> 7: core[940e698046960fd5]::panicking::panic_fmt<unknown>
  776. 43.57 s gammaloop-nextest-core> at <unknown source file>:<unknown line>
  777. 43.57 s gammaloop-nextest-core> 8: <gammalooprs[24955f93fc9f4e0c]::graph::three_d_source::tests::pinched_affine_carrier_requires_occurrence_interpolation::{closure#0} as core[940e698046960fd5]::ops::function::FnOnce<()>>::call_once<unknown>
  778. 43.57 s gammaloop-nextest-core> at <unknown source file>:<unknown line>
  779. 43.57 s gammaloop-nextest-core> 9: test[75d6903177b1d7e9]::__rust_begin_short_backtrace::<core[940e698046960fd5]::result::Result<(), alloc[2ea6bcb46fca0c42]::string::String>, fn() -> core[940e698046960fd5]::result::Result<(), alloc[2ea6bcb46fca0c42]::string::String>><unknown>
  780. 43.57 s gammaloop-nextest-core> at <unknown source file>:<unknown line>
  781. 43.57 s gammaloop-nextest-core> 10: test[75d6903177b1d7e9]::run_test::{closure#0}<unknown>
  782. 43.57 s gammaloop-nextest-core> at <unknown source file>:<unknown line>
  783. 43.57 s gammaloop-nextest-core> 11: std[bcb96dfbba0ab899]::sys::backtrace::__rust_begin_short_backtrace::<test[75d6903177b1d7e9]::run_test::{closure#1}, ()><unknown>
  784. 43.57 s gammaloop-nextest-core> at <unknown source file>:<unknown line>
  785. 43.57 s gammaloop-nextest-core> 12: <std[bcb96dfbba0ab899]::thread::lifecycle::spawn_unchecked<test[75d6903177b1d7e9]::run_test::{closure#1}, ()>::{closure#1} as core[940e698046960fd5]::ops::function::FnOnce<()>>::call_once::{shim:vtable#0}<unknown>
  786. 43.57 s gammaloop-nextest-core> at <unknown source file>:<unknown line>
  787. 43.57 s gammaloop-nextest-core> 13: <std[bcb96dfbba0ab899]::sys::thread::unix::Thread>::new::thread_start<unknown>
  788. 43.57 s gammaloop-nextest-core> at <unknown source file>:<unknown line>
  789. 43.57 s gammaloop-nextest-core> 14: start_thread<unknown>
  790. 43.57 s gammaloop-nextest-core> at <unknown source file>:<unknown line>
  791. 43.57 s gammaloop-nextest-core> 15: __clone3<unknown>
  792. 43.57 s gammaloop-nextest-core> at <unknown source file>:<unknown line>
  793. 43.57 s gammaloop-nextest-core>
  794. 43.57 s gammaloop-nextest-core> Run with COLORBT_SHOW_HIDDEN=1 environment variable to disable frame filtering.
  795. 43.57 s gammaloop-nextest-core> Run with RUST_BACKTRACE=full to include source snippets.
  796. 43.57 s gammaloop-nextest-core>
  797. 43.57 s gammaloop-nextest-core> 3. gammalooprs::numerator::energy_degree::tests::canonical_class_cyclic_lifts_preserve_factorization_and_exact_bounds
  798. 43.57 s gammaloop-nextest-core> failure: test failure with exit code 101
  799. 43.57 s gammaloop-nextest-core> thread 'numerator::energy_degree::tests::canonical_class_cyclic_lifts_preserve_factorization_and_exact_bounds' (2289) panicked at crates/gammalooprs/src/numerator/energy_degree.rs:2850:13:
  800. 43.57 s gammaloop-nextest-core> assertion failed: (collapsed - expression).collect_factors().is_zero()
  801. 43.57 s gammaloop-nextest-core> stack backtrace:
  802. 43.57 s gammaloop-nextest-core> 0: __rustc::rust_begin_unwind
  803. 43.57 s gammaloop-nextest-core> 1: core::panicking::panic_fmt
  804. 43.57 s gammaloop-nextest-core> 2: core::panicking::panic
  805. 43.57 s gammaloop-nextest-core> 3: gammalooprs::numerator::energy_degree::tests::canonical_class_cyclic_lifts_preserve_factorization_and_exact_bounds
  806. 43.57 s gammaloop-nextest-core> 4: <gammalooprs::numerator::energy_degree::tests::canonical_class_cyclic_lifts_preserve_factorization_and_exact_bounds::{closure#0} as core::ops::function::FnOnce<()>>::call_once
  807. 43.57 s gammaloop-nextest-core> note: Some details are omitted, run with `RUST_BACKTRACE=full` for a verbose backtrace.
  808. 43.57 s gammaloop-nextest-core> system-out
  809. 43.57 s gammaloop-nextest-core> running 1 test
  810. 43.57 s gammaloop-nextest-core> test numerator::energy_degree::tests::canonical_class_cyclic_lifts_preserve_factorization_and_exact_bounds ... FAILED
  811. 43.57 s gammaloop-nextest-core>
  812. 43.57 s gammaloop-nextest-core> failures:
  813. 43.57 s gammaloop-nextest-core>
  814. 43.57 s gammaloop-nextest-core> failures:
  815. 43.57 s gammaloop-nextest-core> numerator::energy_degree::tests::canonical_class_cyclic_lifts_preserve_factorization_and_exact_bounds
  816. 43.57 s gammaloop-nextest-core>
  817. 43.57 s gammaloop-nextest-core> test result: FAILED. 0 passed; 1 failed; 0 ignored; 0 measured; 742 filtered out; finished in 0.01s
  818. 43.57 s gammaloop-nextest-core> system-err
  819. 43.57 s gammaloop-nextest-core> thread 'numerator::energy_degree::tests::canonical_class_cyclic_lifts_preserve_factorization_and_exact_bounds' (2289) panicked at crates/gammalooprs/src/numerator/energy_degree.rs:2850:13:
  820. 43.57 s gammaloop-nextest-core> assertion failed: (collapsed - expression).collect_factors().is_zero()
  821. 43.57 s gammaloop-nextest-core> stack backtrace:
  822. 43.57 s gammaloop-nextest-core> 0: __rustc::rust_begin_unwind
  823. 43.57 s gammaloop-nextest-core> 1: core::panicking::panic_fmt
  824. 43.57 s gammaloop-nextest-core> 2: core::panicking::panic
  825. 43.57 s gammaloop-nextest-core> 3: gammalooprs::numerator::energy_degree::tests::canonical_class_cyclic_lifts_preserve_factorization_and_exact_bounds
  826. 43.57 s gammaloop-nextest-core> 4: <gammalooprs::numerator::energy_degree::tests::canonical_class_cyclic_lifts_preserve_factorization_and_exact_bounds::{closure#0} as core::ops::function::FnOnce<()>>::call_once
  827. 43.57 s gammaloop-nextest-core> note: Some details are omitted, run with `RUST_BACKTRACE=full` for a verbose backtrace.
  828. 43.57 s gammaloop-nextest-core>
  829. 43.57 s gammaloop-nextest-core> 4. gammalooprs::uv::approx::local_4d::tests::canonical_uv_signed_multiloop_carriers_preserve_factorized_numerators
  830. 43.57 s gammaloop-nextest-core> failure: test failure with exit code 101
  831. 43.57 s gammaloop-nextest-core> system-out
  832. 43.57 s gammaloop-nextest-core> running 1 test
  833. 43.57 s gammaloop-nextest-core> test uv::approx::local_4d::tests::canonical_uv_signed_multiloop_carriers_preserve_factorized_numerators ... FAILED
  834. 43.57 s gammaloop-nextest-core>
  835. 43.57 s gammaloop-nextest-core> failures:
  836. 43.57 s gammaloop-nextest-core>
  837. 43.57 s gammaloop-nextest-core> failures:
  838. 43.57 s gammaloop-nextest-core> uv::approx::local_4d::tests::canonical_uv_signed_multiloop_carriers_preserve_factorized_numerators
  839. 43.57 s gammaloop-nextest-core>
  840. 43.57 s gammaloop-nextest-core> test result: FAILED. 0 passed; 1 failed; 0 ignored; 0 measured; 742 filtered out; finished in 0.09s
  841. 43.57 s gammaloop-nextest-core> system-err
  842. 43.57 s gammaloop-nextest-core> The application panicked (crashed).
  843. 43.57 s gammaloop-nextest-core> Message: assertion `left == right` failed
  844. 43.57 s gammaloop-nextest-core> left: 2*(signed_multiloop::a+signed_multiloop::b)^5*gammalooprs::Q(gammalooprs::uv::class(0),spenso::cind(0))
  845. 43.57 s gammaloop-nextest-core> right: -2*(signed_multiloop::a+signed_multiloop::b)^5*gammalooprs::Q(gammalooprs::uv::class(0),spenso::cind(0))
  846. 43.57 s gammaloop-nextest-core> Location: crates/gammalooprs/src/uv/approx/local_4d.rs:1983
  847. 43.57 s gammaloop-nextest-core>
  848. 43.57 s gammaloop-nextest-core> ━━━━━━━━━━━━━━━━━━━━━━━━━━━━━━━━━━ BACKTRACE ━━━━━━━━━━━━━━━━━━━━━━━━━━━━━━━━━━━
  849. 43.57 s gammaloop-nextest-core> 1: <color_eyre[51793ea62743adbd]::config::PanicHook>::panic_report<unknown>
  850. 43.57 s gammaloop-nextest-core> at <unknown source file>:<unknown line>
  851. 43.57 s gammaloop-nextest-core> 2: <color_eyre[51793ea62743adbd]::config::PanicHook>::into_panic_hook::{closure#0}<unknown>
  852. 43.57 s gammaloop-nextest-core> at <unknown source file>:<unknown line>
  853. 43.57 s gammaloop-nextest-core> 3: std[bcb96dfbba0ab899]::panicking::panic_with_hook<unknown>
  854. 43.57 s gammaloop-nextest-core> at <unknown source file>:<unknown line>
  855. 43.57 s gammaloop-nextest-core> 4: std[bcb96dfbba0ab899]::panicking::panic_handler::{closure#0}<unknown>
  856. 43.57 s gammaloop-nextest-core> at <unknown source file>:<unknown line>
  857. 43.57 s gammaloop-nextest-core> 5: std[bcb96dfbba0ab899]::sys::backtrace::__rust_end_short_backtrace::<std[bcb96dfbba0ab899]::panicking::panic_handler::{closure#0}, !><unknown>
  858. 43.57 s gammaloop-nextest-core> at <unknown source file>:<unknown line>
  859. 43.57 s gammaloop-nextest-core> 6: __rustc[6c289b9f9c454d21]::rust_begin_unwind<unknown>
  860. 43.57 s gammaloop-nextest-core> at <unknown source file>:<unknown line>
  861. 43.57 s gammaloop-nextest-core> 7: core[940e698046960fd5]::panicking::panic_fmt<unknown>
  862. 43.57 s gammaloop-nextest-core> at <unknown source file>:<unknown line>
  863. 43.57 s gammaloop-nextest-core> 8: core[940e698046960fd5]::panicking::assert_failed_inner<unknown>
  864. 43.57 s gammaloop-nextest-core> at <unknown source file>:<unknown line>
  865. 43.57 s gammaloop-nextest-core> 9: core[940e698046960fd5]::panicking::assert_failed::<symbolica[499970c26fd75ddd]::atom::Atom, symbolica[499970c26fd75ddd]::atom::Atom><unknown>
  866. 43.57 s gammaloop-nextest-core> at <unknown source file>:<unknown line>
  867. 43.57 s gammaloop-nextest-core> 10: gammalooprs[24955f93fc9f4e0c]::uv::approx::local_4d::tests::canonical_uv_signed_multiloop_carriers_preserve_factorized_numerators<unknown>
  868. 43.57 s gammaloop-nextest-core> at <unknown source file>:<unknown line>
  869. 43.57 s gammaloop-nextest-core> 11: <gammalooprs[24955f93fc9f4e0c]::uv::approx::local_4d::tests::canonical_uv_signed_multiloop_carriers_preserve_factorized_numerators::{closure#0} as core[940e698046960fd5]::ops::function::FnOnce<()>>::call_once<unknown>
  870. 43.57 s gammaloop-nextest-core> at <unknown source file>:<unknown line>
  871. 43.57 s gammaloop-nextest-core> 12: test[75d6903177b1d7e9]::__rust_begin_short_backtrace::<core[940e698046960fd5]::result::Result<(), alloc[2ea6bcb46fca0c42]::string::String>, fn() -> core[940e698046960fd5]::result::Result<(), alloc[2ea6bcb46fca0c42]::string::String>><unknown>
  872. 43.57 s gammaloop-nextest-core> at <unknown source file>:<unknown line>
  873. 43.57 s gammaloop-nextest-core> 13: test[75d6903177b1d7e9]::run_test::{closure#0}<unknown>
  874. 43.57 s gammaloop-nextest-core> at <unknown source file>:<unknown line>
  875. 43.57 s gammaloop-nextest-core> 14: std[bcb96dfbba0ab899]::sys::backtrace::__rust_begin_short_backtrace::<test[75d6903177b1d7e9]::run_test::{closure#1}, ()><unknown>
  876. 43.57 s gammaloop-nextest-core> at <unknown source file>:<unknown line>
  877. 43.57 s gammaloop-nextest-core> 15: <std[bcb96dfbba0ab899]::thread::lifecycle::spawn_unchecked<test[75d6903177b1d7e9]::run_test::{closure#1}, ()>::{closure#1} as core[940e698046960fd5]::ops::function::FnOnce<()>>::call_once::{shim:vtable#0}<unknown>
  878. 43.57 s gammaloop-nextest-core> at <unknown source file>:<unknown line>
  879. 43.57 s gammaloop-nextest-core> 16: <std[bcb96dfbba0ab899]::sys::thread::unix::Thread>::new::thread_start<unknown>
  880. 43.57 s gammaloop-nextest-core> at <unknown source file>:<unknown line>
  881. 43.57 s gammaloop-nextest-core> 17: start_thread<unknown>
  882. 43.57 s gammaloop-nextest-core> at <unknown source file>:<unknown line>
  883. 43.57 s gammaloop-nextest-core> 18: __clone3<unknown>
  884. 43.57 s gammaloop-nextest-core> at <unknown source file>:<unknown line>
  885. 43.57 s gammaloop-nextest-core>
  886. 43.57 s gammaloop-nextest-core> Run with COLORBT_SHOW_HIDDEN=1 environment variable to disable frame filtering.
  887. 43.57 s gammaloop-nextest-core> Run with RUST_BACKTRACE=full to include source snippets.
  888. 43.57 s gammaloop-nextest-core>
  889. 43.57 s gammaloop-nextest-core> 5. gammalooprs::uv::approx::local_4d::tests::canonical_uv_classes_certify_signed_aliases_and_preserve_raw_sectors
  890. 43.57 s gammaloop-nextest-core> failure: test failure with exit code 101
  891. 43.57 s gammaloop-nextest-core> Error:
  892. 43.57 s gammaloop-nextest-core> 0: merged canonical UV numerator does not reproduce its source bucket
  893. 43.57 s gammaloop-nextest-core>
  894. 43.57 s gammaloop-nextest-core> Location:
  895. 43.57 s gammaloop-nextest-core> crates/gammalooprs/src/uv/approx/local_4d.rs:367
  896. 43.57 s gammaloop-nextest-core>
  897. 43.57 s gammaloop-nextest-core> ━━━━━━━━━━━━━━━━━━━━━━━━━━━━━━━━━━ BACKTRACE ━━━━━━━━━━━━━━━━━━━━━━━━━━━━━━━━━━━
  898. 43.57 s gammaloop-nextest-core> 1: <color_eyre[51793ea62743adbd]::config::EyreHook>::into_eyre_hook::{closure#0}<unknown>
  899. 43.57 s gammaloop-nextest-core> at <unknown source file>:<unknown line>
  900. 43.57 s gammaloop-nextest-core> 2: eyre[cb2fd339c0c40fca]::capture_handler<unknown>
  901. 43.57 s gammaloop-nextest-core> at <unknown source file>:<unknown line>
  902. 43.57 s gammaloop-nextest-core> 3: eyre[cb2fd339c0c40fca]::private::format_err<unknown>
  903. 43.57 s gammaloop-nextest-core> at <unknown source file>:<unknown line>
  904. 43.57 s gammaloop-nextest-core> 4: <gammalooprs[24955f93fc9f4e0c]::uv::approx::local_4d::FourDSector>::canonical_projection<unknown>
  905. 43.57 s gammaloop-nextest-core> at <unknown source file>:<unknown line>
  906. 43.57 s gammaloop-nextest-core> 5: gammalooprs[24955f93fc9f4e0c]::uv::approx::local_4d::tests::canonical_uv_classes_certify_signed_aliases_and_preserve_raw_sectors<unknown>
  907. 43.57 s gammaloop-nextest-core> at <unknown source file>:<unknown line>
  908. 43.57 s gammaloop-nextest-core> 6: <gammalooprs[24955f93fc9f4e0c]::uv::approx::local_4d::tests::canonical_uv_classes_certify_signed_aliases_and_preserve_raw_sectors::{closure#0} as core[940e698046960fd5]::ops::function::FnOnce<()>>::call_once<unknown>
  909. 43.57 s gammaloop-nextest-core> at <unknown source file>:<unknown line>
  910. 43.57 s gammaloop-nextest-core> 7: test[75d6903177b1d7e9]::__rust_begin_short_backtrace::<core[940e698046960fd5]::result::Result<(), alloc[2ea6bcb46fca0c42]::string::String>, fn() -> core[940e698046960fd5]::result::Result<(), alloc[2ea6bcb46fca0c42]::string::String>><unknown>
  911. 43.57 s gammaloop-nextest-core> at <unknown source file>:<unknown line>
  912. 43.57 s gammaloop-nextest-core> 8: test[75d6903177b1d7e9]::run_test::{closure#0}<unknown>
  913. 43.57 s gammaloop-nextest-core> at <unknown source file>:<unknown line>
  914. 43.57 s gammaloop-nextest-core> 9: std[bcb96dfbba0ab899]::sys::backtrace::__rust_begin_short_backtrace::<test[75d6903177b1d7e9]::run_test::{closure#1}, ()><unknown>
  915. 43.57 s gammaloop-nextest-core> at <unknown source file>:<unknown line>
  916. 43.57 s gammaloop-nextest-core> 10: <std[bcb96dfbba0ab899]::thread::lifecycle::spawn_unchecked<test[75d6903177b1d7e9]::run_test::{closure#1}, ()>::{closure#1} as core[940e698046960fd5]::ops::function::FnOnce<()>>::call_once::{shim:vtable#0}<unknown>
  917. 43.57 s gammaloop-nextest-core> at <unknown source file>:<unknown line>
  918. 43.57 s gammaloop-nextest-core> 11: <std[bcb96dfbba0ab899]::sys::thread::unix::Thread>::new::thread_start<unknown>
  919. 43.57 s gammaloop-nextest-core> at <unknown source file>:<unknown line>
  920. 43.57 s gammaloop-nextest-core> 12: start_thread<unknown>
  921. 43.57 s gammaloop-nextest-core> at <unknown source file>:<unknown line>
  922. 43.58 s gammaloop-nextest-core> 13: __clone3<unknown>
  923. 43.58 s gammaloop-nextest-core> at <unknown source file>:<unknown line>
  924. 43.58 s gammaloop-nextest-core>
  925. 43.58 s gammaloop-nextest-core> Run with COLORBT_SHOW_HIDDEN=1 environment variable to disable frame filtering.
  926. 43.58 s gammaloop-nextest-core> Run with RUST_BACKTRACE=full to include source snippets.
  927. 43.58 s gammaloop-nextest-core> system-out
  928. 43.58 s gammaloop-nextest-core> running 1 test
  929. 43.58 s gammaloop-nextest-core> test uv::approx::local_4d::tests::canonical_uv_classes_certify_signed_aliases_and_preserve_raw_sectors ... FAILED
  930. 43.58 s gammaloop-nextest-core>
  931. 43.58 s gammaloop-nextest-core> failures:
  932. 43.58 s gammaloop-nextest-core>
  933. 43.58 s gammaloop-nextest-core> failures:
  934. 43.58 s gammaloop-nextest-core> uv::approx::local_4d::tests::canonical_uv_classes_certify_signed_aliases_and_preserve_raw_sectors
  935. 43.58 s gammaloop-nextest-core>
  936. 43.58 s gammaloop-nextest-core> test result: FAILED. 0 passed; 1 failed; 0 ignored; 0 measured; 742 filtered out; finished in 0.11s
  937. 43.58 s gammaloop-nextest-core> system-err
  938. 43.58 s gammaloop-nextest-core> Error:
  939. 43.58 s gammaloop-nextest-core> 0: merged canonical UV numerator does not reproduce its source bucket
  940. 43.58 s gammaloop-nextest-core>
  941. 43.58 s gammaloop-nextest-core> Location:
  942. 43.58 s gammaloop-nextest-core> crates/gammalooprs/src/uv/approx/local_4d.rs:367
  943. 43.58 s gammaloop-nextest-core>
  944. 43.58 s gammaloop-nextest-core> ━━━━━━━━━━━━━━━━━━━━━━━━━━━━━━━━━━ BACKTRACE ━━━━━━━━━━━━━━━━━━━━━━━━━━━━━━━━━━━
  945. 43.58 s gammaloop-nextest-core> 1: <color_eyre[51793ea62743adbd]::config::EyreHook>::into_eyre_hook::{closure#0}<unknown>
  946. 43.58 s gammaloop-nextest-core> at <unknown source file>:<unknown line>
  947. 43.58 s gammaloop-nextest-core> 2: eyre[cb2fd339c0c40fca]::capture_handler<unknown>
  948. 43.58 s gammaloop-nextest-core> at <unknown source file>:<unknown line>
  949. 43.58 s gammaloop-nextest-core> 3: eyre[cb2fd339c0c40fca]::private::format_err<unknown>
  950. 43.58 s gammaloop-nextest-core> at <unknown source file>:<unknown line>
  951. 43.58 s gammaloop-nextest-core> 4: <gammalooprs[24955f93fc9f4e0c]::uv::approx::local_4d::FourDSector>::canonical_projection<unknown>
  952. 43.58 s gammaloop-nextest-core> at <unknown source file>:<unknown line>
  953. 43.58 s gammaloop-nextest-core> 5: gammalooprs[24955f93fc9f4e0c]::uv::approx::local_4d::tests::canonical_uv_classes_certify_signed_aliases_and_preserve_raw_sectors<unknown>
  954. 43.58 s gammaloop-nextest-core> at <unknown source file>:<unknown line>
  955. 43.58 s gammaloop-nextest-core> 6: <gammalooprs[24955f93fc9f4e0c]::uv::approx::local_4d::tests::canonical_uv_classes_certify_signed_aliases_and_preserve_raw_sectors::{closure#0} as core[940e698046960fd5]::ops::function::FnOnce<()>>::call_once<unknown>
  956. 43.58 s gammaloop-nextest-core> at <unknown source file>:<unknown line>
  957. 43.58 s gammaloop-nextest-core> 7: test[75d6903177b1d7e9]::__rust_begin_short_backtrace::<core[940e698046960fd5]::result::Result<(), alloc[2ea6bcb46fca0c42]::string::String>, fn() -> core[940e698046960fd5]::result::Result<(), alloc[2ea6bcb46fca0c42]::string::String>><unknown>
  958. 43.58 s gammaloop-nextest-core> at <unknown source file>:<unknown line>
  959. 43.58 s gammaloop-nextest-core> 8: test[75d6903177b1d7e9]::run_test::{closure#0}<unknown>
  960. 43.58 s gammaloop-nextest-core> at <unknown source file>:<unknown line>
  961. 43.58 s gammaloop-nextest-core> 9: std[bcb96dfbba0ab899]::sys::backtrace::__rust_begin_short_backtrace::<test[75d6903177b1d7e9]::run_test::{closure#1}, ()><unknown>
  962. 43.58 s gammaloop-nextest-core> at <unknown source file>:<unknown line>
  963. 43.58 s gammaloop-nextest-core> 10: <std[bcb96dfbba0ab899]::thread::lifecycle::spawn_unchecked<test[75d6903177b1d7e9]::run_test::{closure#1}, ()>::{closure#1} as core[940e698046960fd5]::ops::function::FnOnce<()>>::call_once::{shim:vtable#0}<unknown>
  964. 43.58 s gammaloop-nextest-core> at <unknown source file>:<unknown line>
  965. 43.58 s gammaloop-nextest-core> 11: <std[bcb96dfbba0ab899]::sys::thread::unix::Thread>::new::thread_start<unknown>
  966. 43.58 s gammaloop-nextest-core> at <unknown source file>:<unknown line>
  967. 43.58 s gammaloop-nextest-core> 12: start_thread<unknown>
  968. 43.58 s gammaloop-nextest-core> at <unknown source file>:<unknown line>
  969. 43.58 s gammaloop-nextest-core> 13: __clone3<unknown>
  970. 43.58 s gammaloop-nextest-core> at <unknown source file>:<unknown line>
  971. 43.58 s gammaloop-nextest-core>
  972. 43.58 s gammaloop-nextest-core> Run with COLORBT_SHOW_HIDDEN=1 environment variable to disable frame filtering.
  973. 43.58 s gammaloop-nextest-core> Run with RUST_BACKTRACE=full to include source snippets.
  974. 43.58 s gammaloop-nextest-core>
  975. 43.58 s gammaloop-nextest-core> 6. gammalooprs::uv::approx::tests::direct_nested_scalar_banana_replays_complete_cff_at_depth_three
  976. 43.58 s gammaloop-nextest-core> failure: test failure with exit code 101
  977. 43.58 s gammaloop-nextest-core> Error:
  978. 43.58 s gammaloop-nextest-core> 0: canonical UV numerator does not reproduce its source in the component frame
  979. 43.58 s gammaloop-nextest-core>
  980. 43.58 s gammaloop-nextest-core> Location:
  981. 43.58 s gammaloop-nextest-core> crates/gammalooprs/src/uv/approx/local_4d.rs:354
  982. 43.58 s gammaloop-nextest-core>
  983. 43.58 s gammaloop-nextest-core> ━━━━━━━━━━━━━━━━━━━━━━━━━━━━━━━━━━ BACKTRACE ━━━━━━━━━━━━━━━━━━━━━━━━━━━━━━━━━━━
  984. 43.58 s gammaloop-nextest-core> 1: <color_eyre[51793ea62743adbd]::config::EyreHook>::into_eyre_hook::{closure#0}<unknown>
  985. 43.58 s gammaloop-nextest-core> at <unknown source file>:<unknown line>
  986. 43.58 s gammaloop-nextest-core> 2: eyre[cb2fd339c0c40fca]::capture_handler<unknown>
  987. 43.58 s gammaloop-nextest-core> at <unknown source file>:<unknown line>
  988. 43.58 s gammaloop-nextest-core> 3: eyre[cb2fd339c0c40fca]::private::format_err<unknown>
  989. 43.58 s gammaloop-nextest-core> at <unknown source file>:<unknown line>
  990. 43.58 s gammaloop-nextest-core> 4: <gammalooprs[24955f93fc9f4e0c]::uv::approx::local_4d::FourDSector>::canonical_projection<unknown>
  991. 43.58 s gammaloop-nextest-core> at <unknown source file>:<unknown line>
  992. 43.58 s gammaloop-nextest-core> 5: <gammalooprs[24955f93fc9f4e0c]::uv::approx::projected_4d::Projected4dApproximation>::project_local_4d<unknown>
  993. 43.58 s gammaloop-nextest-core> at <unknown source file>:<unknown line>
  994. 43.58 s gammaloop-nextest-core> 6: <gammalooprs[24955f93fc9f4e0c]::uv::approx::Approximation>::compute_3d<unknown>
  995. 43.58 s gammaloop-nextest-core> at <unknown source file>:<unknown line>
  996. 43.58 s gammaloop-nextest-core> 7: gammalooprs[24955f93fc9f4e0c]::uv::approx::tests::direct_nested_scalar_banana_replays_complete_cff_at_depth_three::{closure#0}<unknown>
  997. 43.58 s gammaloop-nextest-core> at <unknown source file>:<unknown line>
  998. 43.58 s gammaloop-nextest-core> 8: gammalooprs[24955f93fc9f4e0c]::uv::approx::tests::direct_nested_scalar_banana_replays_complete_cff_at_depth_three<unknown>
  999. 43.58 s gammaloop-nextest-core> at <unknown source file>:<unknown line>
  1000. 43.58 s gammaloop-nextest-core> 9: <gammalooprs[24955f93fc9f4e0c]::uv::approx::tests::direct_nested_scalar_banana_replays_complete_cff_at_depth_three::{closure#0} as core[940e698046960fd5]::ops::function::FnOnce<()>>::call_once<unknown>
  1001. 43.58 s gammaloop-nextest-core> at <unknown source file>:<unknown line>
  1002. 43.58 s gammaloop-nextest-core> 10: test[75d6903177b1d7e9]::__rust_begin_short_backtrace::<core[940e698046960fd5]::result::Result<(), alloc[2ea6bcb46fca0c42]::string::String>, fn() -> core[940e698046960fd5]::result::Result<(), alloc[2ea6bcb46fca0c42]::string::String>><unknown>
  1003. 43.58 s gammaloop-nextest-core> at <unknown source file>:<unknown line>
  1004. 43.58 s gammaloop-nextest-core> 11: test[75d6903177b1d7e9]::run_test::{closure#0}<unknown>
  1005. 43.58 s gammaloop-nextest-core> at <unknown source file>:<unknown line>
  1006. 43.58 s gammaloop-nextest-core> 12: std[bcb96dfbba0ab899]::sys::backtrace::__rust_begin_short_backtrace::<test[75d6903177b1d7e9]::run_test::{closure#1}, ()><unknown>
  1007. 43.58 s gammaloop-nextest-core> at <unknown source file>:<unknown line>
  1008. 43.58 s gammaloop-nextest-core> 13: <std[bcb96dfbba0ab899]::thread::lifecycle::spawn_unchecked<test[75d6903177b1d7e9]::run_test::{closure#1}, ()>::{closure#1} as core[940e698046960fd5]::ops::function::FnOnce<()>>::call_once::{shim:vtable#0}<unknown>
  1009. 43.58 s gammaloop-nextest-core> at <unknown source file>:<unknown line>
  1010. 43.58 s gammaloop-nextest-core> 14: <std[bcb96dfbba0ab899]::sys::thread::unix::Thread>::new::thread_start<unknown>
  1011. 43.58 s gammaloop-nextest-core> at <unknown source file>:<unknown line>
  1012. 43.58 s gammaloop-nextest-core> 15: start_thread<unknown>
  1013. 43.58 s gammaloop-nextest-core> at <unknown source file>:<unknown line>
  1014. 43.58 s gammaloop-nextest-core> 16: __clone3<unknown>
  1015. 43.58 s gammaloop-nextest-core> at <unknown source file>:<unknown line>
  1016. 43.58 s gammaloop-nextest-core>
  1017. 43.58 s gammaloop-nextest-core> Run with COLORBT_SHOW_HIDDEN=1 environment variable to disable frame filtering.
  1018. 43.58 s gammaloop-nextest-core> Run with RUST_BACKTRACE=full to include source snippets.
  1019. 43.58 s gammaloop-nextest-core> system-out
  1020. 43.58 s gammaloop-nextest-core> running 1 test
  1021. 43.58 s gammaloop-nextest-core> test uv::approx::tests::direct_nested_scalar_banana_replays_complete_cff_at_depth_three ... FAILED
  1022. 43.58 s gammaloop-nextest-core>
  1023. 43.58 s gammaloop-nextest-core> failures:
  1024. 43.58 s gammaloop-nextest-core>
  1025. 43.58 s gammaloop-nextest-core> failures:
  1026. 43.58 s gammaloop-nextest-core> uv::approx::tests::direct_nested_scalar_banana_replays_complete_cff_at_depth_three
  1027. 43.58 s gammaloop-nextest-core>
  1028. 43.58 s gammaloop-nextest-core> test result: FAILED. 0 passed; 1 failed; 0 ignored; 0 measured; 742 filtered out; finished in 0.09s
  1029. 43.58 s gammaloop-nextest-core> system-err
  1030. 43.58 s gammaloop-nextest-core> Error:
  1031. 43.58 s gammaloop-nextest-core> 0: canonical UV numerator does not reproduce its source in the component frame
  1032. 43.58 s gammaloop-nextest-core>
  1033. 43.58 s gammaloop-nextest-core> Location:
  1034. 43.58 s gammaloop-nextest-core> crates/gammalooprs/src/uv/approx/local_4d.rs:354
  1035. 43.58 s gammaloop-nextest-core>
  1036. 43.58 s gammaloop-nextest-core> ━━━━━━━━━━━━━━━━━━━━━━━━━━━━━━━━━━ BACKTRACE ━━━━━━━━━━━━━━━━━━━━━━━━━━━━━━━━━━━
  1037. 43.58 s gammaloop-nextest-core> 1: <color_eyre[51793ea62743adbd]::config::EyreHook>::into_eyre_hook::{closure#0}<unknown>
  1038. 43.58 s gammaloop-nextest-core> at <unknown source file>:<unknown line>
  1039. 43.58 s gammaloop-nextest-core> 2: eyre[cb2fd339c0c40fca]::capture_handler<unknown>
  1040. 43.58 s gammaloop-nextest-core> at <unknown source file>:<unknown line>
  1041. 43.58 s gammaloop-nextest-core> 3: eyre[cb2fd339c0c40fca]::private::format_err<unknown>
  1042. 43.58 s gammaloop-nextest-core> at <unknown source file>:<unknown line>
  1043. 43.58 s gammaloop-nextest-core> 4: <gammalooprs[24955f93fc9f4e0c]::uv::approx::local_4d::FourDSector>::canonical_projection<unknown>
  1044. 43.58 s gammaloop-nextest-core> at <unknown source file>:<unknown line>
  1045. 43.58 s gammaloop-nextest-core> 5: <gammalooprs[24955f93fc9f4e0c]::uv::approx::projected_4d::Projected4dApproximation>::project_local_4d<unknown>
  1046. 43.58 s gammaloop-nextest-core> at <unknown source file>:<unknown line>
  1047. 43.58 s gammaloop-nextest-core> 6: <gammalooprs[24955f93fc9f4e0c]::uv::approx::Approximation>::compute_3d<unknown>
  1048. 43.58 s gammaloop-nextest-core> at <unknown source file>:<unknown line>
  1049. 43.58 s gammaloop-nextest-core> 7: gammalooprs[24955f93fc9f4e0c]::uv::approx::tests::direct_nested_scalar_banana_replays_complete_cff_at_depth_three::{closure#0}<unknown>
  1050. 43.58 s gammaloop-nextest-core> at <unknown source file>:<unknown line>
  1051. 43.58 s gammaloop-nextest-core> 8: gammalooprs[24955f93fc9f4e0c]::uv::approx::tests::direct_nested_scalar_banana_replays_complete_cff_at_depth_three<unknown>
  1052. 43.58 s gammaloop-nextest-core> at <unknown source file>:<unknown line>
  1053. 43.58 s gammaloop-nextest-core> 9: <gammalooprs[24955f93fc9f4e0c]::uv::approx::tests::direct_nested_scalar_banana_replays_complete_cff_at_depth_three::{closure#0} as core[940e698046960fd5]::ops::function::FnOnce<()>>::call_once<unknown>
  1054. 43.58 s gammaloop-nextest-core> at <unknown source file>:<unknown line>
  1055. 43.58 s gammaloop-nextest-core> 10: test[75d6903177b1d7e9]::__rust_begin_short_backtrace::<core[940e698046960fd5]::result::Result<(), alloc[2ea6bcb46fca0c42]::string::String>, fn() -> core[940e698046960fd5]::result::Result<(), alloc[2ea6bcb46fca0c42]::string::String>><unknown>
  1056. 43.58 s gammaloop-nextest-core> at <unknown source file>:<unknown line>
  1057. 43.58 s gammaloop-nextest-core> 11: test[75d6903177b1d7e9]::run_test::{closure#0}<unknown>
  1058. 43.58 s gammaloop-nextest-core> at <unknown source file>:<unknown line>
  1059. 43.58 s gammaloop-nextest-core> 12: std[bcb96dfbba0ab899]::sys::backtrace::__rust_begin_short_backtrace::<test[75d6903177b1d7e9]::run_test::{closure#1}, ()><unknown>
  1060. 43.58 s gammaloop-nextest-core> at <unknown source file>:<unknown line>
  1061. 43.58 s gammaloop-nextest-core> 13: <std[bcb96dfbba0ab899]::thread::lifecycle::spawn_unchecked<test[75d6903177b1d7e9]::run_test::{closure#1}, ()>::{closure#1} as core[940e698046960fd5]::ops::function::FnOnce<()>>::call_once::{shim:vtable#0}<unknown>
  1062. 43.58 s gammaloop-nextest-core> at <unknown source file>:<unknown line>
  1063. 43.58 s gammaloop-nextest-core> 14: <std[bcb96dfbba0ab899]::sys::thread::unix::Thread>::new::thread_start<unknown>
  1064. 43.58 s gammaloop-nextest-core> at <unknown source file>:<unknown line>
  1065. 43.58 s gammaloop-nextest-core> 15: start_thread<unknown>
  1066. 43.58 s gammaloop-nextest-core> at <unknown source file>:<unknown line>
  1067. 43.58 s gammaloop-nextest-core> 16: __clone3<unknown>
  1068. 43.58 s gammaloop-nextest-core> at <unknown source file>:<unknown line>
  1069. 43.58 s gammaloop-nextest-core>
  1070. 43.58 s gammaloop-nextest-core> Run with COLORBT_SHOW_HIDDEN=1 environment variable to disable frame filtering.
  1071. 43.58 s gammaloop-nextest-core> Run with RUST_BACKTRACE=full to include source snippets.
  1072. 43.58 s gammaloop-nextest-core> =========================================
  1073. 43.61 s gammaloop-nextest-core> Extracting 1 binary, 1 build script output directory, and 1 linked path to /build/nextest-archive-VVI262
  1074. 43.69 s gammaloop-nextest-core> Extracted 7 files to /build/nextest-archive-VVI262 in 0.09s
  1075. 43.72 s gammaloop-nextest-core> ------------
  1076. 43.72 s gammaloop-nextest-core> Nextest run ID cbda4163-781e-4d32-8559-424c822c8364 with nextest profile: ci_gammaloop
  1077. 43.72 s gammaloop-nextest-core> Starting 105 tests across 1 binary
  1078. 62.06 s gammaloop-nextest-core> ------------
  1079. 62.06 s gammaloop-nextest-core> Summary [ 18.347s] 105 tests run: 105 passed, 0 skipped
  1080. 62.11 s gammaloop-nextest-core>
  1081. 62.11 s gammaloop-nextest-core> ========== nextest test summary ==========
  1082. 62.11 s gammaloop-nextest-core> report: target/nextest/ci_gammaloop/junit.xml
  1083. 62.11 s gammaloop-nextest-core> tests: 105, failures: 0, errors: 0
  1084. 62.11 s gammaloop-nextest-core> No failing testcases found.
  1085. 62.11 s gammaloop-nextest-core> =========================================
  1086. 62.18 s error: Cannot build '/nix/store/n61r02micjg0snakcv487zfdf4anp50s-gammaloop-nextest-core.drv'.
  1087. 62.18 s Reason: builder failed with exit code 100.
  1088. 62.18 s Output paths:
  1089. 62.18 s /nix/store/xbaygav73qg6fbyhf734mhwpzkgjgnd5-gammaloop-nextest-core
  1090. 62.18 s Last 1069 log lines:
  1091. 62.18 s > Extracting 4 binaries (including 1 non-test binary), 1 build script output directory, and 2 linked paths to /build/nextest-archive-xcamp3
  1092. 62.18 s > Extracted 20 files to /build/nextest-archive-xcamp3 in 0.79s
  1093. 62.18 s > ------------
  1094. 62.18 s > Nextest run ID b421eb54-4ee9-4f9b-8160-24abaaab242f with nextest profile: ci_gammaloop
  1095. 62.18 s > Starting 379 tests across 3 binaries
  1096. 62.18 s > ------------
  1097. 62.18 s > Summary [ 1.391s] 379 tests run: 379 passed, 0 skipped
  1098. 62.18 s >
  1099. 62.18 s > ========== nextest test summary ==========
  1100. 62.18 s > report: target/nextest/ci_gammaloop/junit.xml
  1101. 62.18 s > tests: 379, failures: 0, errors: 0
  1102. 62.18 s > No failing testcases found.
  1103. 62.18 s > =========================================
  1104. 62.18 s > Extracting 1 binary and 1 linked path to /build/nextest-archive-fxbLs0
  1105. 62.18 s > Extracted 7 files to /build/nextest-archive-fxbLs0 in 0.07s
  1106. 62.18 s > ------------
  1107. 62.18 s > Nextest run ID 6bf7d592-ce67-4c5f-869a-c534f3c45f72 with nextest profile: ci_gammaloop
  1108. 62.18 s > Starting 19 tests across 1 binary
  1109. 62.18 s > ------------
  1110. 62.18 s > Summary [ 0.013s] 19 tests run: 19 passed, 0 skipped
  1111. 62.18 s >
  1112. 62.18 s > ========== nextest test summary ==========
  1113. 62.18 s > report: target/nextest/ci_gammaloop/junit.xml
  1114. 62.18 s > tests: 19, failures: 0, errors: 0
  1115. 62.18 s > No failing testcases found.
  1116. 62.18 s > =========================================
  1117. 62.18 s > Extracting 1 binary to /build/nextest-archive-OuDozE
  1118. 62.18 s > Extracted 4 files to /build/nextest-archive-OuDozE in 0.03s
  1119. 62.18 s > ------------
  1120. 62.18 s > Nextest run ID d2523067-980f-45bd-a79f-e66787f149d2 with nextest profile: ci_gammaloop
  1121. 62.18 s > Starting 0 tests across 1 binary
  1122. 62.18 s > ------------
  1123. 62.18 s > Summary [ 0.000s] 0 tests run: 0 passed, 0 skipped
  1124. 62.18 s >
  1125. 62.18 s > ========== nextest test summary ==========
  1126. 62.18 s > report: target/nextest/ci_gammaloop/junit.xml
  1127. 62.18 s > tests: 0, failures: 0, errors: 0
  1128. 62.18 s > No failing testcases found.
  1129. 62.18 s > =========================================
  1130. 62.18 s > Extracting 4 binaries, 1 build script output directory, and 2 linked paths to /build/nextest-archive-FtZm0W
  1131. 62.18 s > Extracted 18 files to /build/nextest-archive-FtZm0W in 0.50s
  1132. 62.18 s > ------------
  1133. 62.18 s > Nextest run ID a0e5fcbd-74c2-4e1a-beb9-e900a1e9eda2 with nextest profile: ci_gammaloop
  1134. 62.18 s > Starting 692 tests across 4 binaries (60 tests skipped, including 59 tests via profile.ci_gammaloop.default-filter)
  1135. 62.18 s > FAIL [ 0.107s] (159/692) gammalooprs graph::three_d_source::tests::exact_taylor_vacuum_affine_circulation_preserves_energy_mapping
  1136. 62.18 s > stdout ---
  1137. 62.18 s >
  1138. 62.18 s > running 1 test
  1139. 62.18 s > test graph::three_d_source::tests::exact_taylor_vacuum_affine_circulation_preserves_energy_mapping ... FAILED
  1140. 62.18 s >
  1141. 62.18 s > failures:
  1142. 62.18 s >
  1143. 62.18 s > failures:
  1144. 62.18 s > graph::three_d_source::tests::exact_taylor_vacuum_affine_circulation_preserves_energy_mapping
  1145. 62.18 s >
  1146. 62.18 s > test result: FAILED. 0 passed; 1 failed; 0 ignored; 0 measured; 742 filtered out; finished in 0.10s
  1147. 62.18 s >
  1148. 62.18 s > stderr ---
  1149. 62.18 s > The application panicked (crashed).
  1150. 62.18 s > Message: assertion `left == right` failed
  1151. 62.18 s > left: (gammalooprs::mUVexp^2+(-gammalooprs::Q(1,spenso::cind(1))+gammalooprs::Q(4,spenso::cind(1)))^2+(-gammalooprs::Q(1,spenso::cind(2))+gammalooprs::Q(4,spenso::cind(2)))^2+(-gammalooprs::Q(1,spenso::cind(3))+gammalooprs::Q(4,spenso::cind(3)))^2)^(1/2)
  1152. 62.18 s > right: (gammalooprs::mUVexp^2+(gammalooprs::Q(1,spenso::cind(1))-gammalooprs::Q(4,spenso::cind(1)))^2+(gammalooprs::Q(1,spenso::cind(2))-gammalooprs::Q(4,spenso::cind(2)))^2+(gammalooprs::Q(1,spenso::cind(3))-gammalooprs::Q(4,spenso::cind(3)))^2)^(1/2)
  1153. 62.18 s > Location: crates/gammalooprs/src/graph/three_d_source.rs:7797
  1154. 62.18 s >
  1155. 62.18 s > ━━━━━━━━━━━━━━━━━━━━━━━━━━━━━━━━━━ BACKTRACE ━━━━━━━━━━━━━━━━━━━━━━━━━━━━━━━━━━━
  1156. 62.18 s > 1: <color_eyre[51793ea62743adbd]::config::PanicHook>::panic_report<unknown>
  1157. 62.18 s > at <unknown source file>:<unknown line>
  1158. 62.18 s > 2: <color_eyre[51793ea62743adbd]::config::PanicHook>::into_panic_hook::{closure#0}<unknown>
  1159. 62.18 s > at <unknown source file>:<unknown line>
  1160. 62.18 s > 3: std[bcb96dfbba0ab899]::panicking::panic_with_hook<unknown>
  1161. 62.18 s > at <unknown source file>:<unknown line>
  1162. 62.18 s > 4: std[bcb96dfbba0ab899]::panicking::panic_handler::{closure#0}<unknown>
  1163. 62.18 s > at <unknown source file>:<unknown line>
  1164. 62.18 s > 5: std[bcb96dfbba0ab899]::sys::backtrace::__rust_end_short_backtrace::<std[bcb96dfbba0ab899]::panicking::panic_handler::{closure#0}, !><unknown>
  1165. 62.18 s > at <unknown source file>:<unknown line>
  1166. 62.18 s > 6: __rustc[6c289b9f9c454d21]::rust_begin_unwind<unknown>
  1167. 62.18 s > at <unknown source file>:<unknown line>
  1168. 62.18 s > 7: core[940e698046960fd5]::panicking::panic_fmt<unknown>
  1169. 62.18 s > at <unknown source file>:<unknown line>
  1170. 62.18 s > 8: core[940e698046960fd5]::panicking::assert_failed_inner<unknown>
  1171. 62.18 s > at <unknown source file>:<unknown line>
  1172. 62.18 s > 9: core[940e698046960fd5]::panicking::assert_failed::<symbolica[499970c26fd75ddd]::atom::Atom, symbolica[499970c26fd75ddd]::atom::Atom><unknown>
  1173. 62.18 s > at <unknown source file>:<unknown line>
  1174. 62.18 s > 10: gammalooprs[24955f93fc9f4e0c]::graph::three_d_source::tests::exact_taylor_vacuum_affine_circulation_preserves_energy_mapping<unknown>
  1175. 62.18 s > at <unknown source file>:<unknown line>
  1176. 62.18 s > 11: <gammalooprs[24955f93fc9f4e0c]::graph::three_d_source::tests::exact_taylor_vacuum_affine_circulation_preserves_energy_mapping::{closure#0} as core[940e698046960fd5]::ops::function::FnOnce<()>>::call_once<unknown>
  1177. 62.18 s > at <unknown source file>:<unknown line>
  1178. 62.18 s > 12: test[75d6903177b1d7e9]::__rust_begin_short_backtrace::<core[940e698046960fd5]::result::Result<(), alloc[2ea6bcb46fca0c42]::string::String>, fn() -> core[940e698046960fd5]::result::Result<(), alloc[2ea6bcb46fca0c42]::string::String>><unknown>
  1179. 62.18 s > at <unknown source file>:<unknown line>
  1180. 62.18 s > 13: test[75d6903177b1d7e9]::run_test::{closure#0}<unknown>
  1181. 62.18 s > at <unknown source file>:<unknown line>
  1182. 62.18 s > 14: std[bcb96dfbba0ab899]::sys::backtrace::__rust_begin_short_backtrace::<test[75d6903177b1d7e9]::run_test::{closure#1}, ()><unknown>
  1183. 62.18 s > at <unknown source file>:<unknown line>
  1184. 62.18 s > 15: <std[bcb96dfbba0ab899]::thread::lifecycle::spawn_unchecked<test[75d6903177b1d7e9]::run_test::{closure#1}, ()>::{closure#1} as core[940e698046960fd5]::ops::function::FnOnce<()>>::call_once::{shim:vtable#0}<unknown>
  1185. 62.18 s > at <unknown source file>:<unknown line>
  1186. 62.18 s > 16: <std[bcb96dfbba0ab899]::sys::thread::unix::Thread>::new::thread_start<unknown>
  1187. 62.18 s > at <unknown source file>:<unknown line>
  1188. 62.18 s > 17: start_thread<unknown>
  1189. 62.18 s > at <unknown source file>:<unknown line>
  1190. 62.18 s > 18: __clone3<unknown>
  1191. 62.18 s > at <unknown source file>:<unknown line>
  1192. 62.18 s >
  1193. 62.18 s > Run with COLORBT_SHOW_HIDDEN=1 environment variable to disable frame filtering.
  1194. 62.18 s > Run with RUST_BACKTRACE=full to include source snippets.
  1195. 62.18 s >
  1196. 62.18 s > FAIL [ 0.134s] (181/692) gammalooprs graph::three_d_source::tests::pinched_affine_carrier_requires_occurrence_interpolation
  1197. 62.18 s > stdout ---
  1198. 62.18 s >
  1199. 62.18 s > running 1 test
  1200. 62.18 s > test graph::three_d_source::tests::pinched_affine_carrier_requires_occurrence_interpolation ... FAILED
  1201. 62.18 s >
  1202. 62.18 s > failures:
  1203. 62.18 s >
  1204. 62.18 s > failures:
  1205. 62.18 s > graph::three_d_source::tests::pinched_affine_carrier_requires_occurrence_interpolation
  1206. 62.18 s >
  1207. 62.18 s > test result: FAILED. 0 passed; 1 failed; 0 ignored; 0 measured; 742 filtered out; finished in 0.13s
  1208. 62.18 s >
  1209. 62.18 s > stderr ---
  1210. 62.18 s > The application panicked (crashed).
  1211. 62.18 s > Message: certified affine occurrence lift must reproduce the independent double contours: actual=-(-1/16*(3+E0)*(5+E0)/((1+Q(0,cind(1))^2+Q(0,cind(2))^2+Q(0,cind(3))^2)^(3/2)*(1+Q(1,cind(1))^2+Q(1,cind(2))^2+Q(1,cind(3))^2)^(3/2))-1/16*(3+E1)*(5+E1)/((1+Q(0,cind(1))^2+Q(0,cind(2))^2+Q(0,cind(3))^2)^(3/2)*(1+Q(1,cind(1))^2+Q(1,cind(2))^2+Q(1,cind(3))^2)^(3/2))-1/16*(3-E0)*(5-E0)/((1+Q(0,cind(1))^2+Q(0,cind(2))^2+Q(0,cind(3))^2)^(3/2)*(1+Q(1,cind(1))^2+Q(1,cind(2))^2+Q(1,cind(3))^2)^(3/2))-1/16*(3-E1)*(5-E1)/((1+Q(0,cind(1))^2+Q(0,cind(2))^2+Q(0,cind(3))^2)^(3/2)*(1+Q(1,cind(1))^2+Q(1,cind(2))^2+Q(1,cind(3))^2)^(3/2))+1/64*(3+E0+E1)*(5+E0+E1)/((1+Q(0,cind(1))^2+Q(0,cind(2))^2+Q(0,cind(3))^2)^(3/2)*(1+Q(1,cind(1))^2+Q(1,cind(2))^2+Q(1,cind(3))^2)^(3/2))+1/64*(3+E0-E1)*(5+E0-E1)/((1+Q(0,cind(1))^2+Q(0,cind(2))^2+Q(0,cind(3))^2)^(3/2)*(1+Q(1,cind(1))^2+Q(1,cind(2))^2+Q(1,cind(3))^2)^(3/2))+1/64*(3-E0+E1)*(5-E0+E1)/((1+Q(0,cind(1))^2+Q(0,cind(2))^2+Q(0,cind(3))^2)^(3/2)*(1+Q(1,cind(1))^2+Q(1,cind(2))^2+Q(1,cind(3))^2)^(3/2))+1/64*(3-E0-E1)*(5-E0-E1)/((1+Q(0,cind(1))^2+Q(0,cind(2))^2+Q(0,cind(3))^2)^(3/2)*(1+Q(1,cind(1))^2+Q(1,cind(2))^2+Q(1,cind(3))^2)^(3/2))+15/4/((1+Q(0,cind(1))^2+Q(0,cind(2))^2+Q(0,cind(3))^2)^(3/2)*(1+Q(1,cind(1))^2+Q(1,cind(2))^2+Q(1,cind(3))^2)^(3/2))), expected=1/16*(15-E0^2-E1^2)/(E0^3*E1^3)
  1212. 62.18 s > Location: crates/gammalooprs/src/graph/three_d_source.rs:7619
  1213. 62.18 s >
  1214. 62.18 s > ━━━━━━━━━━━━━━━━━━━━━━━━━━━━━━━━━━ BACKTRACE ━━━━━━━━━━━━━━━━━━━━━━━━━━━━━━━━━━━
  1215. 62.18 s > 1: <color_eyre[51793ea62743adbd]::config::PanicHook>::panic_report<unknown>
  1216. 62.18 s > at <unknown source file>:<unknown line>
  1217. 62.18 s > 2: <color_eyre[51793ea62743adbd]::config::PanicHook>::into_panic_hook::{closure#0}<unknown>
  1218. 62.18 s > at <unknown source file>:<unknown line>
  1219. 62.18 s > 3: std[bcb96dfbba0ab899]::panicking::panic_with_hook<unknown>
  1220. 62.18 s > at <unknown source file>:<unknown line>
  1221. 62.18 s > 4: std[bcb96dfbba0ab899]::panicking::panic_handler::{closure#0}<unknown>
  1222. 62.18 s > at <unknown source file>:<unknown line>
  1223. 62.18 s > 5: std[bcb96dfbba0ab899]::sys::backtrace::__rust_end_short_backtrace::<std[bcb96dfbba0ab899]::panicking::panic_handler::{closure#0}, !><unknown>
  1224. 62.18 s > at <unknown source file>:<unknown line>
  1225. 62.18 s > 6: __rustc[6c289b9f9c454d21]::rust_begin_unwind<unknown>
  1226. 62.18 s > at <unknown source file>:<unknown line>
  1227. 62.18 s > 7: core[940e698046960fd5]::panicking::panic_fmt<unknown>
  1228. 62.18 s > at <unknown source file>:<unknown line>
  1229. 62.18 s > 8: <gammalooprs[24955f93fc9f4e0c]::graph::three_d_source::tests::pinched_affine_carrier_requires_occurrence_interpolation::{closure#0} as core[940e698046960fd5]::ops::function::FnOnce<()>>::call_once<unknown>
  1230. 62.18 s > at <unknown source file>:<unknown line>
  1231. 62.18 s > 9: test[75d6903177b1d7e9]::__rust_begin_short_backtrace::<core[940e698046960fd5]::result::Result<(), alloc[2ea6bcb46fca0c42]::string::String>, fn() -> core[940e698046960fd5]::result::Result<(), alloc[2ea6bcb46fca0c42]::string::String>><unknown>
  1232. 62.18 s > at <unknown source file>:<unknown line>
  1233. 62.18 s > 10: test[75d6903177b1d7e9]::run_test::{closure#0}<unknown>
  1234. 62.18 s > at <unknown source file>:<unknown line>
  1235. 62.18 s > 11: std[bcb96dfbba0ab899]::sys::backtrace::__rust_begin_short_backtrace::<test[75d6903177b1d7e9]::run_test::{closure#1}, ()><unknown>
  1236. 62.18 s > at <unknown source file>:<unknown line>
  1237. 62.18 s > 12: <std[bcb96dfbba0ab899]::thread::lifecycle::spawn_unchecked<test[75d6903177b1d7e9]::run_test::{closure#1}, ()>::{closure#1} as core[940e698046960fd5]::ops::function::FnOnce<()>>::call_once::{shim:vtable#0}<unknown>
  1238. 62.18 s > at <unknown source file>:<unknown line>
  1239. 62.18 s > 13: <std[bcb96dfbba0ab899]::sys::thread::unix::Thread>::new::thread_start<unknown>
  1240. 62.18 s > at <unknown source file>:<unknown line>
  1241. 62.18 s > 14: start_thread<unknown>
  1242. 62.18 s > at <unknown source file>:<unknown line>
  1243. 62.18 s > 15: __clone3<unknown>
  1244. 62.18 s > at <unknown source file>:<unknown line>
  1245. 62.18 s >
  1246. 62.18 s > Run with COLORBT_SHOW_HIDDEN=1 environment variable to disable frame filtering.
  1247. 62.18 s > Run with RUST_BACKTRACE=full to include source snippets.
  1248. 62.18 s >
  1249. 62.18 s > FAIL [ 0.021s] (298/692) gammalooprs numerator::energy_degree::tests::canonical_class_cyclic_lifts_preserve_factorization_and_exact_bounds
  1250. 62.18 s > stdout ---
  1251. 62.18 s >
  1252. 62.18 s > running 1 test
  1253. 62.18 s > test numerator::energy_degree::tests::canonical_class_cyclic_lifts_preserve_factorization_and_exact_bounds ... FAILED
  1254. 62.18 s >
  1255. 62.18 s > failures:
  1256. 62.18 s >
  1257. 62.18 s > failures:
  1258. 62.18 s > numerator::energy_degree::tests::canonical_class_cyclic_lifts_preserve_factorization_and_exact_bounds
  1259. 62.18 s >
  1260. 62.18 s > test result: FAILED. 0 passed; 1 failed; 0 ignored; 0 measured; 742 filtered out; finished in 0.01s
  1261. 62.18 s >
  1262. 62.18 s > stderr ---
  1263. 62.18 s >
  1264. 62.18 s > thread 'numerator::energy_degree::tests::canonical_class_cyclic_lifts_preserve_factorization_and_exact_bounds' (2289) panicked at crates/gammalooprs/src/numerator/energy_degree.rs:2850:13:
  1265. 62.18 s > assertion failed: (collapsed - expression).collect_factors().is_zero()
  1266. 62.18 s > stack backtrace:
  1267. 62.18 s > 0: __rustc::rust_begin_unwind
  1268. 62.18 s > 1: core::panicking::panic_fmt
  1269. 62.18 s > 2: core::panicking::panic
  1270. 62.18 s > 3: gammalooprs::numerator::energy_degree::tests::canonical_class_cyclic_lifts_preserve_factorization_and_exact_bounds
  1271. 62.18 s > 4: <gammalooprs::numerator::energy_degree::tests::canonical_class_cyclic_lifts_preserve_factorization_and_exact_bounds::{closure#0} as core::ops::function::FnOnce<()>>::call_once
  1272. 62.18 s > note: Some details are omitted, run with `RUST_BACKTRACE=full` for a verbose backtrace.
  1273. 62.18 s >
  1274. 62.18 s > FAIL [ 0.107s] (592/692) gammalooprs uv::approx::local_4d::tests::canonical_uv_signed_multiloop_carriers_preserve_factorized_numerators
  1275. 62.18 s > stdout ---
  1276. 62.18 s >
  1277. 62.18 s > running 1 test
  1278. 62.18 s > test uv::approx::local_4d::tests::canonical_uv_signed_multiloop_carriers_preserve_factorized_numerators ... FAILED
  1279. 62.18 s >
  1280. 62.18 s > failures:
  1281. 62.18 s >
  1282. 62.18 s > failures:
  1283. 62.18 s > uv::approx::local_4d::tests::canonical_uv_signed_multiloop_carriers_preserve_factorized_numerators
  1284. 62.18 s >
  1285. 62.18 s > test result: FAILED. 0 passed; 1 failed; 0 ignored; 0 measured; 742 filtered out; finished in 0.09s
  1286. 62.18 s >
  1287. 62.18 s > stderr ---
  1288. 62.18 s > The application panicked (crashed).
  1289. 62.18 s > Message: assertion `left == right` failed
  1290. 62.18 s > left: 2*(signed_multiloop::a+signed_multiloop::b)^5*gammalooprs::Q(gammalooprs::uv::class(0),spenso::cind(0))
  1291. 62.18 s > right: -2*(signed_multiloop::a+signed_multiloop::b)^5*gammalooprs::Q(gammalooprs::uv::class(0),spenso::cind(0))
  1292. 62.18 s > Location: crates/gammalooprs/src/uv/approx/local_4d.rs:1983
  1293. 62.18 s >
  1294. 62.18 s > ━━━━━━━━━━━━━━━━━━━━━━━━━━━━━━━━━━ BACKTRACE ━━━━━━━━━━━━━━━━━━━━━━━━━━━━━━━━━━━
  1295. 62.18 s > 1: <color_eyre[51793ea62743adbd]::config::PanicHook>::panic_report<unknown>
  1296. 62.18 s > at <unknown source file>:<unknown line>
  1297. 62.18 s > 2: <color_eyre[51793ea62743adbd]::config::PanicHook>::into_panic_hook::{closure#0}<unknown>
  1298. 62.18 s > at <unknown source file>:<unknown line>
  1299. 62.18 s > 3: std[bcb96dfbba0ab899]::panicking::panic_with_hook<unknown>
  1300. 62.18 s > at <unknown source file>:<unknown line>
  1301. 62.18 s > 4: std[bcb96dfbba0ab899]::panicking::panic_handler::{closure#0}<unknown>
  1302. 62.18 s > at <unknown source file>:<unknown line>
  1303. 62.18 s > 5: std[bcb96dfbba0ab899]::sys::backtrace::__rust_end_short_backtrace::<std[bcb96dfbba0ab899]::panicking::panic_handler::{closure#0}, !><unknown>
  1304. 62.18 s > at <unknown source file>:<unknown line>
  1305. 62.18 s > 6: __rustc[6c289b9f9c454d21]::rust_begin_unwind<unknown>
  1306. 62.18 s > at <unknown source file>:<unknown line>
  1307. 62.18 s > 7: core[940e698046960fd5]::panicking::panic_fmt<unknown>
  1308. 62.18 s > at <unknown source file>:<unknown line>
  1309. 62.18 s > 8: core[940e698046960fd5]::panicking::assert_failed_inner<unknown>
  1310. 62.18 s > at <unknown source file>:<unknown line>
  1311. 62.18 s > 9: core[940e698046960fd5]::panicking::assert_failed::<symbolica[499970c26fd75ddd]::atom::Atom, symbolica[499970c26fd75ddd]::atom::Atom><unknown>
  1312. 62.18 s > at <unknown source file>:<unknown line>
  1313. 62.18 s > 10: gammalooprs[24955f93fc9f4e0c]::uv::approx::local_4d::tests::canonical_uv_signed_multiloop_carriers_preserve_factorized_numerators<unknown>
  1314. 62.18 s > at <unknown source file>:<unknown line>
  1315. 62.18 s > 11: <gammalooprs[24955f93fc9f4e0c]::uv::approx::local_4d::tests::canonical_uv_signed_multiloop_carriers_preserve_factorized_numerators::{closure#0} as core[940e698046960fd5]::ops::function::FnOnce<()>>::call_once<unknown>
  1316. 62.18 s > at <unknown source file>:<unknown line>
  1317. 62.18 s > 12: test[75d6903177b1d7e9]::__rust_begin_short_backtrace::<core[940e698046960fd5]::result::Result<(), alloc[2ea6bcb46fca0c42]::string::String>, fn() -> core[940e698046960fd5]::result::Result<(), alloc[2ea6bcb46fca0c42]::string::String>><unknown>
  1318. 62.18 s > at <unknown source file>:<unknown line>
  1319. 62.18 s > 13: test[75d6903177b1d7e9]::run_test::{closure#0}<unknown>
  1320. 62.18 s > at <unknown source file>:<unknown line>
  1321. 62.18 s > 14: std[bcb96dfbba0ab899]::sys::backtrace::__rust_begin_short_backtrace::<test[75d6903177b1d7e9]::run_test::{closure#1}, ()><unknown>
  1322. 62.18 s > at <unknown source file>:<unknown line>
  1323. 62.18 s > 15: <std[bcb96dfbba0ab899]::thread::lifecycle::spawn_unchecked<test[75d6903177b1d7e9]::run_test::{closure#1}, ()>::{closure#1} as core[940e698046960fd5]::ops::function::FnOnce<()>>::call_once::{shim:vtable#0}<unknown>
  1324. 62.18 s > at <unknown source file>:<unknown line>
  1325. 62.18 s > 16: <std[bcb96dfbba0ab899]::sys::thread::unix::Thread>::new::thread_start<unknown>
  1326. 62.18 s > at <unknown source file>:<unknown line>
  1327. 62.18 s > 17: start_thread<unknown>
  1328. 62.18 s > at <unknown source file>:<unknown line>
  1329. 62.18 s > 18: __clone3<unknown>
  1330. 62.18 s > at <unknown source file>:<unknown line>
  1331. 62.18 s >
  1332. 62.18 s > Run with COLORBT_SHOW_HIDDEN=1 environment variable to disable frame filtering.
  1333. 62.19 s > Run with RUST_BACKTRACE=full to include source snippets.
  1334. 62.19 s >
  1335. 62.19 s > FAIL [ 0.129s] (593/692) gammalooprs uv::approx::local_4d::tests::canonical_uv_classes_certify_signed_aliases_and_preserve_raw_sectors
  1336. 62.19 s > stdout ---
  1337. 62.19 s >
  1338. 62.19 s > running 1 test
  1339. 62.19 s > test uv::approx::local_4d::tests::canonical_uv_classes_certify_signed_aliases_and_preserve_raw_sectors ... FAILED
  1340. 62.19 s >
  1341. 62.19 s > failures:
  1342. 62.19 s >
  1343. 62.19 s > failures:
  1344. 62.19 s > uv::approx::local_4d::tests::canonical_uv_classes_certify_signed_aliases_and_preserve_raw_sectors
  1345. 62.19 s >
  1346. 62.19 s > test result: FAILED. 0 passed; 1 failed; 0 ignored; 0 measured; 742 filtered out; finished in 0.11s
  1347. 62.19 s >
  1348. 62.19 s > stderr ---
  1349. 62.19 s > Error:
  1350. 62.19 s > 0: merged canonical UV numerator does not reproduce its source bucket
  1351. 62.19 s >
  1352. 62.19 s > Location:
  1353. 62.19 s > crates/gammalooprs/src/uv/approx/local_4d.rs:367
  1354. 62.19 s >
  1355. 62.19 s > ━━━━━━━━━━━━━━━━━━━━━━━━━━━━━━━━━━ BACKTRACE ━━━━━━━━━━━━━━━━━━━━━━━━━━━━━━━━━━━
  1356. 62.19 s > 1: <color_eyre[51793ea62743adbd]::config::EyreHook>::into_eyre_hook::{closure#0}<unknown>
  1357. 62.19 s > at <unknown source file>:<unknown line>
  1358. 62.19 s > 2: eyre[cb2fd339c0c40fca]::capture_handler<unknown>
  1359. 62.19 s > at <unknown source file>:<unknown line>
  1360. 62.19 s > 3: eyre[cb2fd339c0c40fca]::private::format_err<unknown>
  1361. 62.19 s > at <unknown source file>:<unknown line>
  1362. 62.19 s > 4: <gammalooprs[24955f93fc9f4e0c]::uv::approx::local_4d::FourDSector>::canonical_projection<unknown>
  1363. 62.19 s > at <unknown source file>:<unknown line>
  1364. 62.19 s > 5: gammalooprs[24955f93fc9f4e0c]::uv::approx::local_4d::tests::canonical_uv_classes_certify_signed_aliases_and_preserve_raw_sectors<unknown>
  1365. 62.19 s > at <unknown source file>:<unknown line>
  1366. 62.19 s > 6: <gammalooprs[24955f93fc9f4e0c]::uv::approx::local_4d::tests::canonical_uv_classes_certify_signed_aliases_and_preserve_raw_sectors::{closure#0} as core[940e698046960fd5]::ops::function::FnOnce<()>>::call_once<unknown>
  1367. 62.19 s > at <unknown source file>:<unknown line>
  1368. 62.19 s > 7: test[75d6903177b1d7e9]::__rust_begin_short_backtrace::<core[940e698046960fd5]::result::Result<(), alloc[2ea6bcb46fca0c42]::string::String>, fn() -> core[940e698046960fd5]::result::Result<(), alloc[2ea6bcb46fca0c42]::string::String>><unknown>
  1369. 62.19 s > at <unknown source file>:<unknown line>
  1370. 62.19 s > 8: test[75d6903177b1d7e9]::run_test::{closure#0}<unknown>
  1371. 62.19 s > at <unknown source file>:<unknown line>
  1372. 62.19 s > 9: std[bcb96dfbba0ab899]::sys::backtrace::__rust_begin_short_backtrace::<test[75d6903177b1d7e9]::run_test::{closure#1}, ()><unknown>
  1373. 62.19 s > at <unknown source file>:<unknown line>
  1374. 62.19 s > 10: <std[bcb96dfbba0ab899]::thread::lifecycle::spawn_unchecked<test[75d6903177b1d7e9]::run_test::{closure#1}, ()>::{closure#1} as core[940e698046960fd5]::ops::function::FnOnce<()>>::call_once::{shim:vtable#0}<unknown>
  1375. 62.19 s > at <unknown source file>:<unknown line>
  1376. 62.19 s > 11: <std[bcb96dfbba0ab899]::sys::thread::unix::Thread>::new::thread_start<unknown>
  1377. 62.19 s > at <unknown source file>:<unknown line>
  1378. 62.19 s > 12: start_thread<unknown>
  1379. 62.19 s > at <unknown source file>:<unknown line>
  1380. 62.19 s > 13: __clone3<unknown>
  1381. 62.19 s > at <unknown source file>:<unknown line>
  1382. 62.19 s >
  1383. 62.19 s > Run with COLORBT_SHOW_HIDDEN=1 environment variable to disable frame filtering.
  1384. 62.19 s > Run with RUST_BACKTRACE=full to include source snippets.
  1385. 62.19 s >
  1386. 62.19 s > FAIL [ 0.100s] (606/692) gammalooprs uv::approx::tests::direct_nested_scalar_banana_replays_complete_cff_at_depth_three
  1387. 62.19 s > stdout ---
  1388. 62.19 s >
  1389. 62.19 s > running 1 test
  1390. 62.19 s > test uv::approx::tests::direct_nested_scalar_banana_replays_complete_cff_at_depth_three ... FAILED
  1391. 62.19 s >
  1392. 62.19 s > failures:
  1393. 62.19 s >
  1394. 62.19 s > failures:
  1395. 62.19 s > uv::approx::tests::direct_nested_scalar_banana_replays_complete_cff_at_depth_three
  1396. 62.19 s >
  1397. 62.19 s > test result: FAILED. 0 passed; 1 failed; 0 ignored; 0 measured; 742 filtered out; finished in 0.09s
  1398. 62.19 s >
  1399. 62.19 s > stderr ---
  1400. 62.19 s > Error:
  1401. 62.19 s > 0: canonical UV numerator does not reproduce its source in the component frame
  1402. 62.19 s >
  1403. 62.19 s > Location:
  1404. 62.19 s > crates/gammalooprs/src/uv/approx/local_4d.rs:354
  1405. 62.19 s >
  1406. 62.19 s > ━━━━━━━━━━━━━━━━━━━━━━━━━━━━━━━━━━ BACKTRACE ━━━━━━━━━━━━━━━━━━━━━━━━━━━━━━━━━━━
  1407. 62.19 s > 1: <color_eyre[51793ea62743adbd]::config::EyreHook>::into_eyre_hook::{closure#0}<unknown>
  1408. 62.19 s > at <unknown source file>:<unknown line>
  1409. 62.19 s > 2: eyre[cb2fd339c0c40fca]::capture_handler<unknown>
  1410. 62.19 s > at <unknown source file>:<unknown line>
  1411. 62.19 s > 3: eyre[cb2fd339c0c40fca]::private::format_err<unknown>
  1412. 62.19 s > at <unknown source file>:<unknown line>
  1413. 62.19 s > 4: <gammalooprs[24955f93fc9f4e0c]::uv::approx::local_4d::FourDSector>::canonical_projection<unknown>
  1414. 62.19 s > at <unknown source file>:<unknown line>
  1415. 62.19 s > 5: <gammalooprs[24955f93fc9f4e0c]::uv::approx::projected_4d::Projected4dApproximation>::project_local_4d<unknown>
  1416. 62.19 s > at <unknown source file>:<unknown line>
  1417. 62.19 s > 6: <gammalooprs[24955f93fc9f4e0c]::uv::approx::Approximation>::compute_3d<unknown>
  1418. 62.19 s > at <unknown source file>:<unknown line>
  1419. 62.19 s > 7: gammalooprs[24955f93fc9f4e0c]::uv::approx::tests::direct_nested_scalar_banana_replays_complete_cff_at_depth_three::{closure#0}<unknown>
  1420. 62.19 s > at <unknown source file>:<unknown line>
  1421. 62.19 s > 8: gammalooprs[24955f93fc9f4e0c]::uv::approx::tests::direct_nested_scalar_banana_replays_complete_cff_at_depth_three<unknown>
  1422. 62.19 s > at <unknown source file>:<unknown line>
  1423. 62.19 s > 9: <gammalooprs[24955f93fc9f4e0c]::uv::approx::tests::direct_nested_scalar_banana_replays_complete_cff_at_depth_three::{closure#0} as core[940e698046960fd5]::ops::function::FnOnce<()>>::call_once<unknown>
  1424. 62.19 s > at <unknown source file>:<unknown line>
  1425. 62.19 s > 10: test[75d6903177b1d7e9]::__rust_begin_short_backtrace::<core[940e698046960fd5]::result::Result<(), alloc[2ea6bcb46fca0c42]::string::String>, fn() -> core[940e698046960fd5]::result::Result<(), alloc[2ea6bcb46fca0c42]::string::String>><unknown>
  1426. 62.19 s > at <unknown source file>:<unknown line>
  1427. 62.19 s > 11: test[75d6903177b1d7e9]::run_test::{closure#0}<unknown>
  1428. 62.19 s > at <unknown source file>:<unknown line>
  1429. 62.19 s > 12: std[bcb96dfbba0ab899]::sys::backtrace::__rust_begin_short_backtrace::<test[75d6903177b1d7e9]::run_test::{closure#1}, ()><unknown>
  1430. 62.19 s > at <unknown source file>:<unknown line>
  1431. 62.19 s > 13: <std[bcb96dfbba0ab899]::thread::lifecycle::spawn_unchecked<test[75d6903177b1d7e9]::run_test::{closure#1}, ()>::{closure#1} as core[940e698046960fd5]::ops::function::FnOnce<()>>::call_once::{shim:vtable#0}<unknown>
  1432. 62.19 s > at <unknown source file>:<unknown line>
  1433. 62.19 s > 14: <std[bcb96dfbba0ab899]::sys::thread::unix::Thread>::new::thread_start<unknown>
  1434. 62.19 s > at <unknown source file>:<unknown line>
  1435. 62.19 s > 15: start_thread<unknown>
  1436. 62.19 s > at <unknown source file>:<unknown line>
  1437. 62.19 s > 16: __clone3<unknown>
  1438. 62.19 s > at <unknown source file>:<unknown line>
  1439. 62.19 s >
  1440. 62.19 s > Run with COLORBT_SHOW_HIDDEN=1 environment variable to disable frame filtering.
  1441. 62.19 s > Run with RUST_BACKTRACE=full to include source snippets.
  1442. 62.19 s >
  1443. 62.19 s > ------------
  1444. 62.19 s > Summary [ 12.865s] 692 tests run: 686 passed, 6 failed, 60 skipped
  1445. 62.19 s > FAIL [ 0.107s] (159/692) gammalooprs graph::three_d_source::tests::exact_taylor_vacuum_affine_circulation_preserves_energy_mapping
  1446. 62.19 s > stdout ---
  1447. 62.19 s >
  1448. 62.19 s > running 1 test
  1449. 62.19 s > test graph::three_d_source::tests::exact_taylor_vacuum_affine_circulation_preserves_energy_mapping ... FAILED
  1450. 62.19 s >
  1451. 62.19 s > failures:
  1452. 62.19 s >
  1453. 62.19 s > failures:
  1454. 62.19 s > graph::three_d_source::tests::exact_taylor_vacuum_affine_circulation_preserves_energy_mapping
  1455. 62.19 s >
  1456. 62.19 s > test result: FAILED. 0 passed; 1 failed; 0 ignored; 0 measured; 742 filtered out; finished in 0.10s
  1457. 62.19 s >
  1458. 62.19 s > stderr ---
  1459. 62.19 s > The application panicked (crashed).
  1460. 62.19 s > Message: assertion `left == right` failed
  1461. 62.19 s > left: (gammalooprs::mUVexp^2+(-gammalooprs::Q(1,spenso::cind(1))+gammalooprs::Q(4,spenso::cind(1)))^2+(-gammalooprs::Q(1,spenso::cind(2))+gammalooprs::Q(4,spenso::cind(2)))^2+(-gammalooprs::Q(1,spenso::cind(3))+gammalooprs::Q(4,spenso::cind(3)))^2)^(1/2)
  1462. 62.19 s > right: (gammalooprs::mUVexp^2+(gammalooprs::Q(1,spenso::cind(1))-gammalooprs::Q(4,spenso::cind(1)))^2+(gammalooprs::Q(1,spenso::cind(2))-gammalooprs::Q(4,spenso::cind(2)))^2+(gammalooprs::Q(1,spenso::cind(3))-gammalooprs::Q(4,spenso::cind(3)))^2)^(1/2)
  1463. 62.19 s > Location: crates/gammalooprs/src/graph/three_d_source.rs:7797
  1464. 62.19 s >
  1465. 62.19 s > ━━━━━━━━━━━━━━━━━━━━━━━━━━━━━━━━━━ BACKTRACE ━━━━━━━━━━━━━━━━━━━━━━━━━━━━━━━━━━━
  1466. 62.19 s > 1: <color_eyre[51793ea62743adbd]::config::PanicHook>::panic_report<unknown>
  1467. 62.19 s > at <unknown source file>:<unknown line>
  1468. 62.19 s > 2: <color_eyre[51793ea62743adbd]::config::PanicHook>::into_panic_hook::{closure#0}<unknown>
  1469. 62.19 s > at <unknown source file>:<unknown line>
  1470. 62.19 s > 3: std[bcb96dfbba0ab899]::panicking::panic_with_hook<unknown>
  1471. 62.19 s > at <unknown source file>:<unknown line>
  1472. 62.19 s > 4: std[bcb96dfbba0ab899]::panicking::panic_handler::{closure#0}<unknown>
  1473. 62.19 s > at <unknown source file>:<unknown line>
  1474. 62.19 s > 5: std[bcb96dfbba0ab899]::sys::backtrace::__rust_end_short_backtrace::<std[bcb96dfbba0ab899]::panicking::panic_handler::{closure#0}, !><unknown>
  1475. 62.19 s > at <unknown source file>:<unknown line>
  1476. 62.19 s > 6: __rustc[6c289b9f9c454d21]::rust_begin_unwind<unknown>
  1477. 62.19 s > at <unknown source file>:<unknown line>
  1478. 62.19 s > 7: core[940e698046960fd5]::panicking::panic_fmt<unknown>
  1479. 62.19 s > at <unknown source file>:<unknown line>
  1480. 62.19 s > 8: core[940e698046960fd5]::panicking::assert_failed_inner<unknown>
  1481. 62.19 s > at <unknown source file>:<unknown line>
  1482. 62.19 s > 9: core[940e698046960fd5]::panicking::assert_failed::<symbolica[499970c26fd75ddd]::atom::Atom, symbolica[499970c26fd75ddd]::atom::Atom><unknown>
  1483. 62.19 s > at <unknown source file>:<unknown line>
  1484. 62.19 s > 10: gammalooprs[24955f93fc9f4e0c]::graph::three_d_source::tests::exact_taylor_vacuum_affine_circulation_preserves_energy_mapping<unknown>
  1485. 62.19 s > at <unknown source file>:<unknown line>
  1486. 62.19 s > 11: <gammalooprs[24955f93fc9f4e0c]::graph::three_d_source::tests::exact_taylor_vacuum_affine_circulation_preserves_energy_mapping::{closure#0} as core[940e698046960fd5]::ops::function::FnOnce<()>>::call_once<unknown>
  1487. 62.19 s > at <unknown source file>:<unknown line>
  1488. 62.19 s > 12: test[75d6903177b1d7e9]::__rust_begin_short_backtrace::<core[940e698046960fd5]::result::Result<(), alloc[2ea6bcb46fca0c42]::string::String>, fn() -> core[940e698046960fd5]::result::Result<(), alloc[2ea6bcb46fca0c42]::string::String>><unknown>
  1489. 62.19 s > at <unknown source file>:<unknown line>
  1490. 62.19 s > 13: test[75d6903177b1d7e9]::run_test::{closure#0}<unknown>
  1491. 62.19 s > at <unknown source file>:<unknown line>
  1492. 62.19 s > 14: std[bcb96dfbba0ab899]::sys::backtrace::__rust_begin_short_backtrace::<test[75d6903177b1d7e9]::run_test::{closure#1}, ()><unknown>
  1493. 62.19 s > at <unknown source file>:<unknown line>
  1494. 62.19 s > 15: <std[bcb96dfbba0ab899]::thread::lifecycle::spawn_unchecked<test[75d6903177b1d7e9]::run_test::{closure#1}, ()>::{closure#1} as core[940e698046960fd5]::ops::function::FnOnce<()>>::call_once::{shim:vtable#0}<unknown>
  1495. 62.19 s > at <unknown source file>:<unknown line>
  1496. 62.19 s > 16: <std[bcb96dfbba0ab899]::sys::thread::unix::Thread>::new::thread_start<unknown>
  1497. 62.19 s > at <unknown source file>:<unknown line>
  1498. 62.19 s > 17: start_thread<unknown>
  1499. 62.19 s > at <unknown source file>:<unknown line>
  1500. 62.19 s > 18: __clone3<unknown>
  1501. 62.19 s > at <unknown source file>:<unknown line>
  1502. 62.19 s >
  1503. 62.19 s > Run with COLORBT_SHOW_HIDDEN=1 environment variable to disable frame filtering.
  1504. 62.19 s > Run with RUST_BACKTRACE=full to include source snippets.
  1505. 62.19 s >
  1506. 62.19 s > FAIL [ 0.134s] (181/692) gammalooprs graph::three_d_source::tests::pinched_affine_carrier_requires_occurrence_interpolation
  1507. 62.19 s > stdout ---
  1508. 62.19 s >
  1509. 62.19 s > running 1 test
  1510. 62.19 s > test graph::three_d_source::tests::pinched_affine_carrier_requires_occurrence_interpolation ... FAILED
  1511. 62.19 s >
  1512. 62.19 s > failures:
  1513. 62.19 s >
  1514. 62.19 s > failures:
  1515. 62.19 s > graph::three_d_source::tests::pinched_affine_carrier_requires_occurrence_interpolation
  1516. 62.19 s >
  1517. 62.19 s > test result: FAILED. 0 passed; 1 failed; 0 ignored; 0 measured; 742 filtered out; finished in 0.13s
  1518. 62.19 s >
  1519. 62.19 s > stderr ---
  1520. 62.19 s > The application panicked (crashed).
  1521. 62.19 s > Message: certified affine occurrence lift must reproduce the independent double contours: actual=-(-1/16*(3+E0)*(5+E0)/((1+Q(0,cind(1))^2+Q(0,cind(2))^2+Q(0,cind(3))^2)^(3/2)*(1+Q(1,cind(1))^2+Q(1,cind(2))^2+Q(1,cind(3))^2)^(3/2))-1/16*(3+E1)*(5+E1)/((1+Q(0,cind(1))^2+Q(0,cind(2))^2+Q(0,cind(3))^2)^(3/2)*(1+Q(1,cind(1))^2+Q(1,cind(2))^2+Q(1,cind(3))^2)^(3/2))-1/16*(3-E0)*(5-E0)/((1+Q(0,cind(1))^2+Q(0,cind(2))^2+Q(0,cind(3))^2)^(3/2)*(1+Q(1,cind(1))^2+Q(1,cind(2))^2+Q(1,cind(3))^2)^(3/2))-1/16*(3-E1)*(5-E1)/((1+Q(0,cind(1))^2+Q(0,cind(2))^2+Q(0,cind(3))^2)^(3/2)*(1+Q(1,cind(1))^2+Q(1,cind(2))^2+Q(1,cind(3))^2)^(3/2))+1/64*(3+E0+E1)*(5+E0+E1)/((1+Q(0,cind(1))^2+Q(0,cind(2))^2+Q(0,cind(3))^2)^(3/2)*(1+Q(1,cind(1))^2+Q(1,cind(2))^2+Q(1,cind(3))^2)^(3/2))+1/64*(3+E0-E1)*(5+E0-E1)/((1+Q(0,cind(1))^2+Q(0,cind(2))^2+Q(0,cind(3))^2)^(3/2)*(1+Q(1,cind(1))^2+Q(1,cind(2))^2+Q(1,cind(3))^2)^(3/2))+1/64*(3-E0+E1)*(5-E0+E1)/((1+Q(0,cind(1))^2+Q(0,cind(2))^2+Q(0,cind(3))^2)^(3/2)*(1+Q(1,cind(1))^2+Q(1,cind(2))^2+Q(1,cind(3))^2)^(3/2))+1/64*(3-E0-E1)*(5-E0-E1)/((1+Q(0,cind(1))^2+Q(0,cind(2))^2+Q(0,cind(3))^2)^(3/2)*(1+Q(1,cind(1))^2+Q(1,cind(2))^2+Q(1,cind(3))^2)^(3/2))+15/4/((1+Q(0,cind(1))^2+Q(0,cind(2))^2+Q(0,cind(3))^2)^(3/2)*(1+Q(1,cind(1))^2+Q(1,cind(2))^2+Q(1,cind(3))^2)^(3/2))), expected=1/16*(15-E0^2-E1^2)/(E0^3*E1^3)
  1522. 62.19 s > Location: crates/gammalooprs/src/graph/three_d_source.rs:7619
  1523. 62.19 s >
  1524. 62.19 s > ━━━━━━━━━━━━━━━━━━━━━━━━━━━━━━━━━━ BACKTRACE ━━━━━━━━━━━━━━━━━━━━━━━━━━━━━━━━━━━
  1525. 62.19 s > 1: <color_eyre[51793ea62743adbd]::config::PanicHook>::panic_report<unknown>
  1526. 62.19 s > at <unknown source file>:<unknown line>
  1527. 62.19 s > 2: <color_eyre[51793ea62743adbd]::config::PanicHook>::into_panic_hook::{closure#0}<unknown>
  1528. 62.19 s > at <unknown source file>:<unknown line>
  1529. 62.19 s > 3: std[bcb96dfbba0ab899]::panicking::panic_with_hook<unknown>
  1530. 62.19 s > at <unknown source file>:<unknown line>
  1531. 62.19 s > 4: std[bcb96dfbba0ab899]::panicking::panic_handler::{closure#0}<unknown>
  1532. 62.19 s > at <unknown source file>:<unknown line>
  1533. 62.19 s > 5: std[bcb96dfbba0ab899]::sys::backtrace::__rust_end_short_backtrace::<std[bcb96dfbba0ab899]::panicking::panic_handler::{closure#0}, !><unknown>
  1534. 62.19 s > at <unknown source file>:<unknown line>
  1535. 62.19 s > 6: __rustc[6c289b9f9c454d21]::rust_begin_unwind<unknown>
  1536. 62.19 s > at <unknown source file>:<unknown line>
  1537. 62.19 s > 7: core[940e698046960fd5]::panicking::panic_fmt<unknown>
  1538. 62.19 s > at <unknown source file>:<unknown line>
  1539. 62.19 s > 8: <gammalooprs[24955f93fc9f4e0c]::graph::three_d_source::tests::pinched_affine_carrier_requires_occurrence_interpolation::{closure#0} as core[940e698046960fd5]::ops::function::FnOnce<()>>::call_once<unknown>
  1540. 62.19 s > at <unknown source file>:<unknown line>
  1541. 62.19 s > 9: test[75d6903177b1d7e9]::__rust_begin_short_backtrace::<core[940e698046960fd5]::result::Result<(), alloc[2ea6bcb46fca0c42]::string::String>, fn() -> core[940e698046960fd5]::result::Result<(), alloc[2ea6bcb46fca0c42]::string::String>><unknown>
  1542. 62.19 s > at <unknown source file>:<unknown line>
  1543. 62.19 s > 10: test[75d6903177b1d7e9]::run_test::{closure#0}<unknown>
  1544. 62.19 s > at <unknown source file>:<unknown line>
  1545. 62.19 s > 11: std[bcb96dfbba0ab899]::sys::backtrace::__rust_begin_short_backtrace::<test[75d6903177b1d7e9]::run_test::{closure#1}, ()><unknown>
  1546. 62.19 s > at <unknown source file>:<unknown line>
  1547. 62.19 s > 12: <std[bcb96dfbba0ab899]::thread::lifecycle::spawn_unchecked<test[75d6903177b1d7e9]::run_test::{closure#1}, ()>::{closure#1} as core[940e698046960fd5]::ops::function::FnOnce<()>>::call_once::{shim:vtable#0}<unknown>
  1548. 62.19 s > at <unknown source file>:<unknown line>
  1549. 62.19 s > 13: <std[bcb96dfbba0ab899]::sys::thread::unix::Thread>::new::thread_start<unknown>
  1550. 62.19 s > at <unknown source file>:<unknown line>
  1551. 62.19 s > 14: start_thread<unknown>
  1552. 62.19 s > at <unknown source file>:<unknown line>
  1553. 62.19 s > 15: __clone3<unknown>
  1554. 62.19 s > at <unknown source file>:<unknown line>
  1555. 62.19 s >
  1556. 62.19 s > Run with COLORBT_SHOW_HIDDEN=1 environment variable to disable frame filtering.
  1557. 62.19 s > Run with RUST_BACKTRACE=full to include source snippets.
  1558. 62.19 s >
  1559. 62.19 s > FAIL [ 0.021s] (298/692) gammalooprs numerator::energy_degree::tests::canonical_class_cyclic_lifts_preserve_factorization_and_exact_bounds
  1560. 62.19 s > stdout ---
  1561. 62.19 s >
  1562. 62.19 s > running 1 test
  1563. 62.19 s > test numerator::energy_degree::tests::canonical_class_cyclic_lifts_preserve_factorization_and_exact_bounds ... FAILED
  1564. 62.19 s >
  1565. 62.19 s > failures:
  1566. 62.19 s >
  1567. 62.19 s > failures:
  1568. 62.19 s > numerator::energy_degree::tests::canonical_class_cyclic_lifts_preserve_factorization_and_exact_bounds
  1569. 62.19 s >
  1570. 62.19 s > test result: FAILED. 0 passed; 1 failed; 0 ignored; 0 measured; 742 filtered out; finished in 0.01s
  1571. 62.19 s >
  1572. 62.19 s > stderr ---
  1573. 62.19 s >
  1574. 62.19 s > thread 'numerator::energy_degree::tests::canonical_class_cyclic_lifts_preserve_factorization_and_exact_bounds' (2289) panicked at crates/gammalooprs/src/numerator/energy_degree.rs:2850:13:
  1575. 62.19 s > assertion failed: (collapsed - expression).collect_factors().is_zero()
  1576. 62.19 s > stack backtrace:
  1577. 62.19 s > 0: __rustc::rust_begin_unwind
  1578. 62.19 s > 1: core::panicking::panic_fmt
  1579. 62.19 s > 2: core::panicking::panic
  1580. 62.19 s > 3: gammalooprs::numerator::energy_degree::tests::canonical_class_cyclic_lifts_preserve_factorization_and_exact_bounds
  1581. 62.19 s > 4: <gammalooprs::numerator::energy_degree::tests::canonical_class_cyclic_lifts_preserve_factorization_and_exact_bounds::{closure#0} as core::ops::function::FnOnce<()>>::call_once
  1582. 62.19 s > note: Some details are omitted, run with `RUST_BACKTRACE=full` for a verbose backtrace.
  1583. 62.19 s >
  1584. 62.19 s > FAIL [ 0.107s] (592/692) gammalooprs uv::approx::local_4d::tests::canonical_uv_signed_multiloop_carriers_preserve_factorized_numerators
  1585. 62.19 s > stdout ---
  1586. 62.19 s >
  1587. 62.19 s > running 1 test
  1588. 62.19 s > test uv::approx::local_4d::tests::canonical_uv_signed_multiloop_carriers_preserve_factorized_numerators ... FAILED
  1589. 62.19 s >
  1590. 62.19 s > failures:
  1591. 62.19 s >
  1592. 62.19 s > failures:
  1593. 62.19 s > uv::approx::local_4d::tests::canonical_uv_signed_multiloop_carriers_preserve_factorized_numerators
  1594. 62.19 s >
  1595. 62.19 s > test result: FAILED. 0 passed; 1 failed; 0 ignored; 0 measured; 742 filtered out; finished in 0.09s
  1596. 62.19 s >
  1597. 62.19 s > stderr ---
  1598. 62.19 s > The application panicked (crashed).
  1599. 62.19 s > Message: assertion `left == right` failed
  1600. 62.19 s > left: 2*(signed_multiloop::a+signed_multiloop::b)^5*gammalooprs::Q(gammalooprs::uv::class(0),spenso::cind(0))
  1601. 62.19 s > right: -2*(signed_multiloop::a+signed_multiloop::b)^5*gammalooprs::Q(gammalooprs::uv::class(0),spenso::cind(0))
  1602. 62.19 s > Location: crates/gammalooprs/src/uv/approx/local_4d.rs:1983
  1603. 62.19 s >
  1604. 62.19 s > ━━━━━━━━━━━━━━━━━━━━━━━━━━━━━━━━━━ BACKTRACE ━━━━━━━━━━━━━━━━━━━━━━━━━━━━━━━━━━━
  1605. 62.19 s > 1: <color_eyre[51793ea62743adbd]::config::PanicHook>::panic_report<unknown>
  1606. 62.19 s > at <unknown source file>:<unknown line>
  1607. 62.19 s > 2: <color_eyre[51793ea62743adbd]::config::PanicHook>::into_panic_hook::{closure#0}<unknown>
  1608. 62.19 s > at <unknown source file>:<unknown line>
  1609. 62.19 s > 3: std[bcb96dfbba0ab899]::panicking::panic_with_hook<unknown>
  1610. 62.19 s > at <unknown source file>:<unknown line>
  1611. 62.19 s > 4: std[bcb96dfbba0ab899]::panicking::panic_handler::{closure#0}<unknown>
  1612. 62.19 s > at <unknown source file>:<unknown line>
  1613. 62.19 s > 5: std[bcb96dfbba0ab899]::sys::backtrace::__rust_end_short_backtrace::<std[bcb96dfbba0ab899]::panicking::panic_handler::{closure#0}, !><unknown>
  1614. 62.19 s > at <unknown source file>:<unknown line>
  1615. 62.19 s > 6: __rustc[6c289b9f9c454d21]::rust_begin_unwind<unknown>
  1616. 62.19 s > at <unknown source file>:<unknown line>
  1617. 62.19 s > 7: core[940e698046960fd5]::panicking::panic_fmt<unknown>
  1618. 62.19 s > at <unknown source file>:<unknown line>
  1619. 62.19 s > 8: core[940e698046960fd5]::panicking::assert_failed_inner<unknown>
  1620. 62.19 s > at <unknown source file>:<unknown line>
  1621. 62.19 s > 9: core[940e698046960fd5]::panicking::assert_failed::<symbolica[499970c26fd75ddd]::atom::Atom, symbolica[499970c26fd75ddd]::atom::Atom><unknown>
  1622. 62.19 s > at <unknown source file>:<unknown line>
  1623. 62.19 s > 10: gammalooprs[24955f93fc9f4e0c]::uv::approx::local_4d::tests::canonical_uv_signed_multiloop_carriers_preserve_factorized_numerators<unknown>
  1624. 62.19 s > at <unknown source file>:<unknown line>
  1625. 62.19 s > 11: <gammalooprs[24955f93fc9f4e0c]::uv::approx::local_4d::tests::canonical_uv_signed_multiloop_carriers_preserve_factorized_numerators::{closure#0} as core[940e698046960fd5]::ops::function::FnOnce<()>>::call_once<unknown>
  1626. 62.19 s > at <unknown source file>:<unknown line>
  1627. 62.19 s > 12: test[75d6903177b1d7e9]::__rust_begin_short_backtrace::<core[940e698046960fd5]::result::Result<(), alloc[2ea6bcb46fca0c42]::string::String>, fn() -> core[940e698046960fd5]::result::Result<(), alloc[2ea6bcb46fca0c42]::string::String>><unknown>
  1628. 62.19 s > at <unknown source file>:<unknown line>
  1629. 62.19 s > 13: test[75d6903177b1d7e9]::run_test::{closure#0}<unknown>
  1630. 62.19 s > at <unknown source file>:<unknown line>
  1631. 62.19 s > 14: std[bcb96dfbba0ab899]::sys::backtrace::__rust_begin_short_backtrace::<test[75d6903177b1d7e9]::run_test::{closure#1}, ()><unknown>
  1632. 62.19 s > at <unknown source file>:<unknown line>
  1633. 62.19 s > 15: <std[bcb96dfbba0ab899]::thread::lifecycle::spawn_unchecked<test[75d6903177b1d7e9]::run_test::{closure#1}, ()>::{closure#1} as core[940e698046960fd5]::ops::function::FnOnce<()>>::call_once::{shim:vtable#0}<unknown>
  1634. 62.19 s > at <unknown source file>:<unknown line>
  1635. 62.19 s > 16: <std[bcb96dfbba0ab899]::sys::thread::unix::Thread>::new::thread_start<unknown>
  1636. 62.19 s > at <unknown source file>:<unknown line>
  1637. 62.19 s > 17: start_thread<unknown>
  1638. 62.19 s > at <unknown source file>:<unknown line>
  1639. 62.19 s > 18: __clone3<unknown>
  1640. 62.19 s > at <unknown source file>:<unknown line>
  1641. 62.19 s >
  1642. 62.19 s > Run with COLORBT_SHOW_HIDDEN=1 environment variable to disable frame filtering.
  1643. 62.19 s > Run with RUST_BACKTRACE=full to include source snippets.
  1644. 62.19 s >
  1645. 62.19 s > FAIL [ 0.129s] (593/692) gammalooprs uv::approx::local_4d::tests::canonical_uv_classes_certify_signed_aliases_and_preserve_raw_sectors
  1646. 62.19 s > stdout ---
  1647. 62.19 s >
  1648. 62.19 s > running 1 test
  1649. 62.19 s > test uv::approx::local_4d::tests::canonical_uv_classes_certify_signed_aliases_and_preserve_raw_sectors ... FAILED
  1650. 62.19 s >
  1651. 62.19 s > failures:
  1652. 62.19 s >
  1653. 62.19 s > failures:
  1654. 62.19 s > uv::approx::local_4d::tests::canonical_uv_classes_certify_signed_aliases_and_preserve_raw_sectors
  1655. 62.19 s >
  1656. 62.19 s > test result: FAILED. 0 passed; 1 failed; 0 ignored; 0 measured; 742 filtered out; finished in 0.11s
  1657. 62.19 s >
  1658. 62.19 s > stderr ---
  1659. 62.19 s > Error:
  1660. 62.19 s > 0: merged canonical UV numerator does not reproduce its source bucket
  1661. 62.19 s >
  1662. 62.19 s > Location:
  1663. 62.19 s > crates/gammalooprs/src/uv/approx/local_4d.rs:367
  1664. 62.19 s >
  1665. 62.19 s > ━━━━━━━━━━━━━━━━━━━━━━━━━━━━━━━━━━ BACKTRACE ━━━━━━━━━━━━━━━━━━━━━━━━━━━━━━━━━━━
  1666. 62.19 s > 1: <color_eyre[51793ea62743adbd]::config::EyreHook>::into_eyre_hook::{closure#0}<unknown>
  1667. 62.19 s > at <unknown source file>:<unknown line>
  1668. 62.19 s > 2: eyre[cb2fd339c0c40fca]::capture_handler<unknown>
  1669. 62.19 s > at <unknown source file>:<unknown line>
  1670. 62.19 s > 3: eyre[cb2fd339c0c40fca]::private::format_err<unknown>
  1671. 62.19 s > at <unknown source file>:<unknown line>
  1672. 62.19 s > 4: <gammalooprs[24955f93fc9f4e0c]::uv::approx::local_4d::FourDSector>::canonical_projection<unknown>
  1673. 62.19 s > at <unknown source file>:<unknown line>
  1674. 62.19 s > 5: gammalooprs[24955f93fc9f4e0c]::uv::approx::local_4d::tests::canonical_uv_classes_certify_signed_aliases_and_preserve_raw_sectors<unknown>
  1675. 62.19 s > at <unknown source file>:<unknown line>
  1676. 62.19 s > 6: <gammalooprs[24955f93fc9f4e0c]::uv::approx::local_4d::tests::canonical_uv_classes_certify_signed_aliases_and_preserve_raw_sectors::{closure#0} as core[940e698046960fd5]::ops::function::FnOnce<()>>::call_once<unknown>
  1677. 62.19 s > at <unknown source file>:<unknown line>
  1678. 62.19 s > 7: test[75d6903177b1d7e9]::__rust_begin_short_backtrace::<core[940e698046960fd5]::result::Result<(), alloc[2ea6bcb46fca0c42]::string::String>, fn() -> core[940e698046960fd5]::result::Result<(), alloc[2ea6bcb46fca0c42]::string::String>><unknown>
  1679. 62.19 s > at <unknown source file>:<unknown line>
  1680. 62.19 s > 8: test[75d6903177b1d7e9]::run_test::{closure#0}<unknown>
  1681. 62.19 s > at <unknown source file>:<unknown line>
  1682. 62.19 s > 9: std[bcb96dfbba0ab899]::sys::backtrace::__rust_begin_short_backtrace::<test[75d6903177b1d7e9]::run_test::{closure#1}, ()><unknown>
  1683. 62.19 s > at <unknown source file>:<unknown line>
  1684. 62.19 s > 10: <std[bcb96dfbba0ab899]::thread::lifecycle::spawn_unchecked<test[75d6903177b1d7e9]::run_test::{closure#1}, ()>::{closure#1} as core[940e698046960fd5]::ops::function::FnOnce<()>>::call_once::{shim:vtable#0}<unknown>
  1685. 62.19 s > at <unknown source file>:<unknown line>
  1686. 62.19 s > 11: <std[bcb96dfbba0ab899]::sys::thread::unix::Thread>::new::thread_start<unknown>
  1687. 62.19 s > at <unknown source file>:<unknown line>
  1688. 62.19 s > 12: start_thread<unknown>
  1689. 62.19 s > at <unknown source file>:<unknown line>
  1690. 62.19 s > 13: __clone3<unknown>
  1691. 62.19 s > at <unknown source file>:<unknown line>
  1692. 62.19 s >
  1693. 62.19 s > Run with COLORBT_SHOW_HIDDEN=1 environment variable to disable frame filtering.
  1694. 62.19 s > Run with RUST_BACKTRACE=full to include source snippets.
  1695. 62.19 s >
  1696. 62.19 s > FAIL [ 0.100s] (606/692) gammalooprs uv::approx::tests::direct_nested_scalar_banana_replays_complete_cff_at_depth_three
  1697. 62.19 s > stdout ---
  1698. 62.19 s >
  1699. 62.19 s > running 1 test
  1700. 62.19 s > test uv::approx::tests::direct_nested_scalar_banana_replays_complete_cff_at_depth_three ... FAILED
  1701. 62.19 s >
  1702. 62.19 s > failures:
  1703. 62.19 s >
  1704. 62.19 s > failures:
  1705. 62.19 s > uv::approx::tests::direct_nested_scalar_banana_replays_complete_cff_at_depth_three
  1706. 62.19 s >
  1707. 62.19 s > test result: FAILED. 0 passed; 1 failed; 0 ignored; 0 measured; 742 filtered out; finished in 0.09s
  1708. 62.19 s >
  1709. 62.19 s > stderr ---
  1710. 62.19 s > Error:
  1711. 62.19 s > 0: canonical UV numerator does not reproduce its source in the component frame
  1712. 62.19 s >
  1713. 62.19 s > Location:
  1714. 62.19 s > crates/gammalooprs/src/uv/approx/local_4d.rs:354
  1715. 62.19 s >
  1716. 62.19 s > ━━━━━━━━━━━━━━━━━━━━━━━━━━━━━━━━━━ BACKTRACE ━━━━━━━━━━━━━━━━━━━━━━━━━━━━━━━━━━━
  1717. 62.19 s > 1: <color_eyre[51793ea62743adbd]::config::EyreHook>::into_eyre_hook::{closure#0}<unknown>
  1718. 62.19 s > at <unknown source file>:<unknown line>
  1719. 62.19 s > 2: eyre[cb2fd339c0c40fca]::capture_handler<unknown>
  1720. 62.19 s > at <unknown source file>:<unknown line>
  1721. 62.19 s > 3: eyre[cb2fd339c0c40fca]::private::format_err<unknown>
  1722. 62.19 s > at <unknown source file>:<unknown line>
  1723. 62.19 s > 4: <gammalooprs[24955f93fc9f4e0c]::uv::approx::local_4d::FourDSector>::canonical_projection<unknown>
  1724. 62.19 s > at <unknown source file>:<unknown line>
  1725. 62.19 s > 5: <gammalooprs[24955f93fc9f4e0c]::uv::approx::projected_4d::Projected4dApproximation>::project_local_4d<unknown>
  1726. 62.19 s > at <unknown source file>:<unknown line>
  1727. 62.19 s > 6: <gammalooprs[24955f93fc9f4e0c]::uv::approx::Approximation>::compute_3d<unknown>
  1728. 62.19 s > at <unknown source file>:<unknown line>
  1729. 62.19 s > 7: gammalooprs[24955f93fc9f4e0c]::uv::approx::tests::direct_nested_scalar_banana_replays_complete_cff_at_depth_three::{closure#0}<unknown>
  1730. 62.19 s > at <unknown source file>:<unknown line>
  1731. 62.19 s > 8: gammalooprs[24955f93fc9f4e0c]::uv::approx::tests::direct_nested_scalar_banana_replays_complete_cff_at_depth_three<unknown>
  1732. 62.19 s > at <unknown source file>:<unknown line>
  1733. 62.19 s > 9: <gammalooprs[24955f93fc9f4e0c]::uv::approx::tests::direct_nested_scalar_banana_replays_complete_cff_at_depth_three::{closure#0} as core[940e698046960fd5]::ops::function::FnOnce<()>>::call_once<unknown>
  1734. 62.19 s > at <unknown source file>:<unknown line>
  1735. 62.19 s > 10: test[75d6903177b1d7e9]::__rust_begin_short_backtrace::<core[940e698046960fd5]::result::Result<(), alloc[2ea6bcb46fca0c42]::string::String>, fn() -> core[940e698046960fd5]::result::Result<(), alloc[2ea6bcb46fca0c42]::string::String>><unknown>
  1736. 62.19 s > at <unknown source file>:<unknown line>
  1737. 62.19 s > 11: test[75d6903177b1d7e9]::run_test::{closure#0}<unknown>
  1738. 62.19 s > at <unknown source file>:<unknown line>
  1739. 62.19 s > 12: std[bcb96dfbba0ab899]::sys::backtrace::__rust_begin_short_backtrace::<test[75d6903177b1d7e9]::run_test::{closure#1}, ()><unknown>
  1740. 62.19 s > at <unknown source file>:<unknown line>
  1741. 62.19 s > 13: <std[bcb96dfbba0ab899]::thread::lifecycle::spawn_unchecked<test[75d6903177b1d7e9]::run_test::{closure#1}, ()>::{closure#1} as core[940e698046960fd5]::ops::function::FnOnce<()>>::call_once::{shim:vtable#0}<unknown>
  1742. 62.19 s > at <unknown source file>:<unknown line>
  1743. 62.19 s > 14: <std[bcb96dfbba0ab899]::sys::thread::unix::Thread>::new::thread_start<unknown>
  1744. 62.19 s > at <unknown source file>:<unknown line>
  1745. 62.19 s > 15: start_thread<unknown>
  1746. 62.19 s > at <unknown source file>:<unknown line>
  1747. 62.19 s > 16: __clone3<unknown>
  1748. 62.19 s > at <unknown source file>:<unknown line>
  1749. 62.19 s >
  1750. 62.19 s > Run with COLORBT_SHOW_HIDDEN=1 environment variable to disable frame filtering.
  1751. 62.19 s > Run with RUST_BACKTRACE=full to include source snippets.
  1752. 62.19 s >
  1753. 62.19 s > error: test run failed
  1754. 62.19 s >
  1755. 62.19 s > ========== nextest test summary ==========
  1756. 62.19 s > report: target/nextest/ci_gammaloop/junit.xml
  1757. 62.19 s > tests: 692, failures: 6, errors: 0
  1758. 62.19 s >
  1759. 62.19 s > 1. gammalooprs::graph::three_d_source::tests::exact_taylor_vacuum_affine_circulation_preserves_energy_mapping
  1760. 62.19 s > failure: test failure with exit code 101
  1761. 62.19 s > system-out
  1762. 62.19 s > running 1 test
  1763. 62.19 s > test graph::three_d_source::tests::exact_taylor_vacuum_affine_circulation_preserves_energy_mapping ... FAILED
  1764. 62.19 s >
  1765. 62.19 s > failures:
  1766. 62.19 s >
  1767. 62.19 s > failures:
  1768. 62.19 s > graph::three_d_source::tests::exact_taylor_vacuum_affine_circulation_preserves_energy_mapping
  1769. 62.19 s >
  1770. 62.19 s > test result: FAILED. 0 passed; 1 failed; 0 ignored; 0 measured; 742 filtered out; finished in 0.10s
  1771. 62.19 s > system-err
  1772. 62.19 s > The application panicked (crashed).
  1773. 62.19 s > Message: assertion `left == right` failed
  1774. 62.19 s > left: (gammalooprs::mUVexp^2+(-gammalooprs::Q(1,spenso::cind(1))+gammalooprs::Q(4,spenso::cind(1)))^2+(-gammalooprs::Q(1,spenso::cind(2))+gammalooprs::Q(4,spenso::cind(2)))^2+(-gammalooprs::Q(1,spenso::cind(3))+gammalooprs::Q(4,spenso::cind(3)))^2)^(1/2)
  1775. 62.19 s > right: (gammalooprs::mUVexp^2+(gammalooprs::Q(1,spenso::cind(1))-gammalooprs::Q(4,spenso::cind(1)))^2+(gammalooprs::Q(1,spenso::cind(2))-gammalooprs::Q(4,spenso::cind(2)))^2+(gammalooprs::Q(1,spenso::cind(3))-gammalooprs::Q(4,spenso::cind(3)))^2)^(1/2)
  1776. 62.19 s > Location: crates/gammalooprs/src/graph/three_d_source.rs:7797
  1777. 62.19 s >
  1778. 62.19 s > ━━━━━━━━━━━━━━━━━━━━━━━━━━━━━━━━━━ BACKTRACE ━━━━━━━━━━━━━━━━━━━━━━━━━━━━━━━━━━━
  1779. 62.19 s > 1: <color_eyre[51793ea62743adbd]::config::PanicHook>::panic_report<unknown>
  1780. 62.19 s > at <unknown source file>:<unknown line>
  1781. 62.19 s > 2: <color_eyre[51793ea62743adbd]::config::PanicHook>::into_panic_hook::{closure#0}<unknown>
  1782. 62.19 s > at <unknown source file>:<unknown line>
  1783. 62.19 s > 3: std[bcb96dfbba0ab899]::panicking::panic_with_hook<unknown>
  1784. 62.19 s > at <unknown source file>:<unknown line>
  1785. 62.19 s > 4: std[bcb96dfbba0ab899]::panicking::panic_handler::{closure#0}<unknown>
  1786. 62.19 s > at <unknown source file>:<unknown line>
  1787. 62.19 s > 5: std[bcb96dfbba0ab899]::sys::backtrace::__rust_end_short_backtrace::<std[bcb96dfbba0ab899]::panicking::panic_handler::{closure#0}, !><unknown>
  1788. 62.19 s > at <unknown source file>:<unknown line>
  1789. 62.19 s > 6: __rustc[6c289b9f9c454d21]::rust_begin_unwind<unknown>
  1790. 62.19 s > at <unknown source file>:<unknown line>
  1791. 62.19 s > 7: core[940e698046960fd5]::panicking::panic_fmt<unknown>
  1792. 62.19 s > at <unknown source file>:<unknown line>
  1793. 62.19 s > 8: core[940e698046960fd5]::panicking::assert_failed_inner<unknown>
  1794. 62.19 s > at <unknown source file>:<unknown line>
  1795. 62.19 s > 9: core[940e698046960fd5]::panicking::assert_failed::<symbolica[499970c26fd75ddd]::atom::Atom, symbolica[499970c26fd75ddd]::atom::Atom><unknown>
  1796. 62.19 s > at <unknown source file>:<unknown line>
  1797. 62.19 s > 10: gammalooprs[24955f93fc9f4e0c]::graph::three_d_source::tests::exact_taylor_vacuum_affine_circulation_preserves_energy_mapping<unknown>
  1798. 62.19 s > at <unknown source file>:<unknown line>
  1799. 62.19 s > 11: <gammalooprs[24955f93fc9f4e0c]::graph::three_d_source::tests::exact_taylor_vacuum_affine_circulation_preserves_energy_mapping::{closure#0} as core[940e698046960fd5]::ops::function::FnOnce<()>>::call_once<unknown>
  1800. 62.19 s > at <unknown source file>:<unknown line>
  1801. 62.19 s > 12: test[75d6903177b1d7e9]::__rust_begin_short_backtrace::<core[940e698046960fd5]::result::Result<(), alloc[2ea6bcb46fca0c42]::string::String>, fn() -> core[940e698046960fd5]::result::Result<(), alloc[2ea6bcb46fca0c42]::string::String>><unknown>
  1802. 62.19 s > at <unknown source file>:<unknown line>
  1803. 62.19 s > 13: test[75d6903177b1d7e9]::run_test::{closure#0}<unknown>
  1804. 62.19 s > at <unknown source file>:<unknown line>
  1805. 62.19 s > 14: std[bcb96dfbba0ab899]::sys::backtrace::__rust_begin_short_backtrace::<test[75d6903177b1d7e9]::run_test::{closure#1}, ()><unknown>
  1806. 62.19 s > at <unknown source file>:<unknown line>
  1807. 62.19 s > 15: <std[bcb96dfbba0ab899]::thread::lifecycle::spawn_unchecked<test[75d6903177b1d7e9]::run_test::{closure#1}, ()>::{closure#1} as core[940e698046960fd5]::ops::function::FnOnce<()>>::call_once::{shim:vtable#0}<unknown>
  1808. 62.19 s > at <unknown source file>:<unknown line>
  1809. 62.19 s > 16: <std[bcb96dfbba0ab899]::sys::thread::unix::Thread>::new::thread_start<unknown>
  1810. 62.19 s > at <unknown source file>:<unknown line>
  1811. 62.19 s > 17: start_thread<unknown>
  1812. 62.19 s > at <unknown source file>:<unknown line>
  1813. 62.19 s > 18: __clone3<unknown>
  1814. 62.19 s > at <unknown source file>:<unknown line>
  1815. 62.19 s >
  1816. 62.19 s > Run with COLORBT_SHOW_HIDDEN=1 environment variable to disable frame filtering.
  1817. 62.19 s > Run with RUST_BACKTRACE=full to include source snippets.
  1818. 62.19 s >
  1819. 62.19 s > 2. gammalooprs::graph::three_d_source::tests::pinched_affine_carrier_requires_occurrence_interpolation
  1820. 62.19 s > failure: test failure with exit code 101
  1821. 62.19 s > system-out
  1822. 62.19 s > running 1 test
  1823. 62.19 s > test graph::three_d_source::tests::pinched_affine_carrier_requires_occurrence_interpolation ... FAILED
  1824. 62.19 s >
  1825. 62.19 s > failures:
  1826. 62.19 s >
  1827. 62.19 s > failures:
  1828. 62.19 s > graph::three_d_source::tests::pinched_affine_carrier_requires_occurrence_interpolation
  1829. 62.19 s >
  1830. 62.19 s > test result: FAILED. 0 passed; 1 failed; 0 ignored; 0 measured; 742 filtered out; finished in 0.13s
  1831. 62.19 s > system-err
  1832. 62.19 s > The application panicked (crashed).
  1833. 62.19 s > Message: certified affine occurrence lift must reproduce the independent double contours: actual=-(-1/16*(3+E0)*(5+E0)/((1+Q(0,cind(1))^2+Q(0,cind(2))^2+Q(0,cind(3))^2)^(3/2)*(1+Q(1,cind(1))^2+Q(1,cind(2))^2+Q(1,cind(3))^2)^(3/2))-1/16*(3+E1)*(5+E1)/((1+Q(0,cind(1))^2+Q(0,cind(2))^2+Q(0,cind(3))^2)^(3/2)*(1+Q(1,cind(1))^2+Q(1,cind(2))^2+Q(1,cind(3))^2)^(3/2))-1/16*(3-E0)*(5-E0)/((1+Q(0,cind(1))^2+Q(0,cind(2))^2+Q(0,cind(3))^2)^(3/2)*(1+Q(1,cind(1))^2+Q(1,cind(2))^2+Q(1,cind(3))^2)^(3/2))-1/16*(3-E1)*(5-E1)/((1+Q(0,cind(1))^2+Q(0,cind(2))^2+Q(0,cind(3))^2)^(3/2)*(1+Q(1,cind(1))^2+Q(1,cind(2))^2+Q(1,cind(3))^2)^(3/2))+1/64*(3+E0+E1)*(5+E0+E1)/((1+Q(0,cind(1))^2+Q(0,cind(2))^2+Q(0,cind(3))^2)^(3/2)*(1+Q(1,cind(1))^2+Q(1,cind(2))^2+Q(1,cind(3))^2)^(3/2))+1/64*(3+E0-E1)*(5+E0-E1)/((1+Q(0,cind(1))^2+Q(0,cind(2))^2+Q(0,cind(3))^2)^(3/2)*(1+Q(1,cind(1))^2+Q(1,cind(2))^2+Q(1,cind(3))^2)^(3/2))+1/64*(3-E0+E1)*(5-E0+E1)/((1+Q(0,cind(1))^2+Q(0,cind(2))^2+Q(0,cind(3))^2)^(3/2)*(1+Q(1,cind(1))^2+Q(1,cind(2))^2+Q(1,cind(3))^2)^(3/2))+1/64*(3-E0-E1)*(5-E0-E1)/((1+Q(0,cind(1))^2+Q(0,cind(2))^2+Q(0,cind(3))^2)^(3/2)*(1+Q(1,cind(1))^2+Q(1,cind(2))^2+Q(1,cind(3))^2)^(3/2))+15/4/((1+Q(0,cind(1))^2+Q(0,cind(2))^2+Q(0,cind(3))^2)^(3/2)*(1+Q(1,cind(1))^2+Q(1,cind(2))^2+Q(1,cind(3))^2)^(3/2))), expected=1/16*(15-E0^2-E1^2)/(E0^3*E1^3)
  1834. 62.19 s > Location: crates/gammalooprs/src/graph/three_d_source.rs:7619
  1835. 62.19 s >
  1836. 62.19 s > ━━━━━━━━━━━━━━━━━━━━━━━━━━━━━━━━━━ BACKTRACE ━━━━━━━━━━━━━━━━━━━━━━━━━━━━━━━━━━━
  1837. 62.19 s > 1: <color_eyre[51793ea62743adbd]::config::PanicHook>::panic_report<unknown>
  1838. 62.19 s > at <unknown source file>:<unknown line>
  1839. 62.19 s > 2: <color_eyre[51793ea62743adbd]::config::PanicHook>::into_panic_hook::{closure#0}<unknown>
  1840. 62.19 s > at <unknown source file>:<unknown line>
  1841. 62.19 s > 3: std[bcb96dfbba0ab899]::panicking::panic_with_hook<unknown>
  1842. 62.19 s > at <unknown source file>:<unknown line>
  1843. 62.19 s > 4: std[bcb96dfbba0ab899]::panicking::panic_handler::{closure#0}<unknown>
  1844. 62.19 s > at <unknown source file>:<unknown line>
  1845. 62.19 s > 5: std[bcb96dfbba0ab899]::sys::backtrace::__rust_end_short_backtrace::<std[bcb96dfbba0ab899]::panicking::panic_handler::{closure#0}, !><unknown>
  1846. 62.19 s > at <unknown source file>:<unknown line>
  1847. 62.19 s > 6: __rustc[6c289b9f9c454d21]::rust_begin_unwind<unknown>
  1848. 62.19 s > at <unknown source file>:<unknown line>
  1849. 62.19 s > 7: core[940e698046960fd5]::panicking::panic_fmt<unknown>
  1850. 62.19 s > at <unknown source file>:<unknown line>
  1851. 62.19 s > 8: <gammalooprs[24955f93fc9f4e0c]::graph::three_d_source::tests::pinched_affine_carrier_requires_occurrence_interpolation::{closure#0} as core[940e698046960fd5]::ops::function::FnOnce<()>>::call_once<unknown>
  1852. 62.19 s > at <unknown source file>:<unknown line>
  1853. 62.19 s > 9: test[75d6903177b1d7e9]::__rust_begin_short_backtrace::<core[940e698046960fd5]::result::Result<(), alloc[2ea6bcb46fca0c42]::string::String>, fn() -> core[940e698046960fd5]::result::Result<(), alloc[2ea6bcb46fca0c42]::string::String>><unknown>
  1854. 62.19 s > at <unknown source file>:<unknown line>
  1855. 62.19 s > 10: test[75d6903177b1d7e9]::run_test::{closure#0}<unknown>
  1856. 62.19 s > at <unknown source file>:<unknown line>
  1857. 62.19 s > 11: std[bcb96dfbba0ab899]::sys::backtrace::__rust_begin_short_backtrace::<test[75d6903177b1d7e9]::run_test::{closure#1}, ()><unknown>
  1858. 62.19 s > at <unknown source file>:<unknown line>
  1859. 62.19 s > 12: <std[bcb96dfbba0ab899]::thread::lifecycle::spawn_unchecked<test[75d6903177b1d7e9]::run_test::{closure#1}, ()>::{closure#1} as core[940e698046960fd5]::ops::function::FnOnce<()>>::call_once::{shim:vtable#0}<unknown>
  1860. 62.19 s > at <unknown source file>:<unknown line>
  1861. 62.19 s > 13: <std[bcb96dfbba0ab899]::sys::thread::unix::Thread>::new::thread_start<unknown>
  1862. 62.19 s > at <unknown source file>:<unknown line>
  1863. 62.19 s > 14: start_thread<unknown>
  1864. 62.19 s > at <unknown source file>:<unknown line>
  1865. 62.19 s > 15: __clone3<unknown>
  1866. 62.19 s > at <unknown source file>:<unknown line>
  1867. 62.19 s >
  1868. 62.19 s > Run with COLORBT_SHOW_HIDDEN=1 environment variable to disable frame filtering.
  1869. 62.19 s > Run with RUST_BACKTRACE=full to include source snippets.
  1870. 62.19 s >
  1871. 62.19 s > 3. gammalooprs::numerator::energy_degree::tests::canonical_class_cyclic_lifts_preserve_factorization_and_exact_bounds
  1872. 62.19 s > failure: test failure with exit code 101
  1873. 62.19 s > thread 'numerator::energy_degree::tests::canonical_class_cyclic_lifts_preserve_factorization_and_exact_bounds' (2289) panicked at crates/gammalooprs/src/numerator/energy_degree.rs:2850:13:
  1874. 62.19 s > assertion failed: (collapsed - expression).collect_factors().is_zero()
  1875. 62.19 s > stack backtrace:
  1876. 62.19 s > 0: __rustc::rust_begin_unwind
  1877. 62.19 s > 1: core::panicking::panic_fmt
  1878. 62.19 s > 2: core::panicking::panic
  1879. 62.19 s > 3: gammalooprs::numerator::energy_degree::tests::canonical_class_cyclic_lifts_preserve_factorization_and_exact_bounds
  1880. 62.19 s > 4: <gammalooprs::numerator::energy_degree::tests::canonical_class_cyclic_lifts_preserve_factorization_and_exact_bounds::{closure#0} as core::ops::function::FnOnce<()>>::call_once
  1881. 62.19 s > note: Some details are omitted, run with `RUST_BACKTRACE=full` for a verbose backtrace.
  1882. 62.19 s > system-out
  1883. 62.19 s > running 1 test
  1884. 62.19 s > test numerator::energy_degree::tests::canonical_class_cyclic_lifts_preserve_factorization_and_exact_bounds ... FAILED
  1885. 62.19 s >
  1886. 62.19 s > failures:
  1887. 62.19 s >
  1888. 62.19 s > failures:
  1889. 62.19 s > numerator::energy_degree::tests::canonical_class_cyclic_lifts_preserve_factorization_and_exact_bounds
  1890. 62.19 s >
  1891. 62.19 s > test result: FAILED. 0 passed; 1 failed; 0 ignored; 0 measured; 742 filtered out; finished in 0.01s
  1892. 62.19 s > system-err
  1893. 62.19 s > thread 'numerator::energy_degree::tests::canonical_class_cyclic_lifts_preserve_factorization_and_exact_bounds' (2289) panicked at crates/gammalooprs/src/numerator/energy_degree.rs:2850:13:
  1894. 62.19 s > assertion failed: (collapsed - expression).collect_factors().is_zero()
  1895. 62.19 s > stack backtrace:
  1896. 62.19 s > 0: __rustc::rust_begin_unwind
  1897. 62.19 s > 1: core::panicking::panic_fmt
  1898. 62.19 s > 2: core::panicking::panic
  1899. 62.19 s > 3: gammalooprs::numerator::energy_degree::tests::canonical_class_cyclic_lifts_preserve_factorization_and_exact_bounds
  1900. 62.19 s > 4: <gammalooprs::numerator::energy_degree::tests::canonical_class_cyclic_lifts_preserve_factorization_and_exact_bounds::{closure#0} as core::ops::function::FnOnce<()>>::call_once
  1901. 62.19 s > note: Some details are omitted, run with `RUST_BACKTRACE=full` for a verbose backtrace.
  1902. 62.19 s >
  1903. 62.19 s > 4. gammalooprs::uv::approx::local_4d::tests::canonical_uv_signed_multiloop_carriers_preserve_factorized_numerators
  1904. 62.19 s > failure: test failure with exit code 101
  1905. 62.19 s > system-out
  1906. 62.19 s > running 1 test
  1907. 62.19 s > test uv::approx::local_4d::tests::canonical_uv_signed_multiloop_carriers_preserve_factorized_numerators ... FAILED
  1908. 62.19 s >
  1909. 62.19 s > failures:
  1910. 62.19 s >
  1911. 62.19 s > failures:
  1912. 62.19 s > uv::approx::local_4d::tests::canonical_uv_signed_multiloop_carriers_preserve_factorized_numerators
  1913. 62.19 s >
  1914. 62.19 s > test result: FAILED. 0 passed; 1 failed; 0 ignored; 0 measured; 742 filtered out; finished in 0.09s
  1915. 62.19 s > system-err
  1916. 62.19 s > The application panicked (crashed).
  1917. 62.19 s > Message: assertion `left == right` failed
  1918. 62.19 s > left: 2*(signed_multiloop::a+signed_multiloop::b)^5*gammalooprs::Q(gammalooprs::uv::class(0),spenso::cind(0))
  1919. 62.19 s > right: -2*(signed_multiloop::a+signed_multiloop::b)^5*gammalooprs::Q(gammalooprs::uv::class(0),spenso::cind(0))
  1920. 62.19 s > Location: crates/gammalooprs/src/uv/approx/local_4d.rs:1983
  1921. 62.19 s >
  1922. 62.19 s > ━━━━━━━━━━━━━━━━━━━━━━━━━━━━━━━━━━ BACKTRACE ━━━━━━━━━━━━━━━━━━━━━━━━━━━━━━━━━━━
  1923. 62.19 s > 1: <color_eyre[51793ea62743adbd]::config::PanicHook>::panic_report<unknown>
  1924. 62.19 s > at <unknown source file>:<unknown line>
  1925. 62.19 s > 2: <color_eyre[51793ea62743adbd]::config::PanicHook>::into_panic_hook::{closure#0}<unknown>
  1926. 62.19 s > at <unknown source file>:<unknown line>
  1927. 62.19 s > 3: std[bcb96dfbba0ab899]::panicking::panic_with_hook<unknown>
  1928. 62.19 s > at <unknown source file>:<unknown line>
  1929. 62.19 s > 4: std[bcb96dfbba0ab899]::panicking::panic_handler::{closure#0}<unknown>
  1930. 62.19 s > at <unknown source file>:<unknown line>
  1931. 62.19 s > 5: std[bcb96dfbba0ab899]::sys::backtrace::__rust_end_short_backtrace::<std[bcb96dfbba0ab899]::panicking::panic_handler::{closure#0}, !><unknown>
  1932. 62.19 s > at <unknown source file>:<unknown line>
  1933. 62.19 s > 6: __rustc[6c289b9f9c454d21]::rust_begin_unwind<unknown>
  1934. 62.19 s > at <unknown source file>:<unknown line>
  1935. 62.19 s > 7: core[940e698046960fd5]::panicking::panic_fmt<unknown>
  1936. 62.19 s > at <unknown source file>:<unknown line>
  1937. 62.19 s > 8: core[940e698046960fd5]::panicking::assert_failed_inner<unknown>
  1938. 62.19 s > at <unknown source file>:<unknown line>
  1939. 62.19 s > 9: core[940e698046960fd5]::panicking::assert_failed::<symbolica[499970c26fd75ddd]::atom::Atom, symbolica[499970c26fd75ddd]::atom::Atom><unknown>
  1940. 62.19 s > at <unknown source file>:<unknown line>
  1941. 62.19 s > 10: gammalooprs[24955f93fc9f4e0c]::uv::approx::local_4d::tests::canonical_uv_signed_multiloop_carriers_preserve_factorized_numerators<unknown>
  1942. 62.19 s > at <unknown source file>:<unknown line>
  1943. 62.19 s > 11: <gammalooprs[24955f93fc9f4e0c]::uv::approx::local_4d::tests::canonical_uv_signed_multiloop_carriers_preserve_factorized_numerators::{closure#0} as core[940e698046960fd5]::ops::function::FnOnce<()>>::call_once<unknown>
  1944. 62.19 s > at <unknown source file>:<unknown line>
  1945. 62.19 s > 12: test[75d6903177b1d7e9]::__rust_begin_short_backtrace::<core[940e698046960fd5]::result::Result<(), alloc[2ea6bcb46fca0c42]::string::String>, fn() -> core[940e698046960fd5]::result::Result<(), alloc[2ea6bcb46fca0c42]::string::String>><unknown>
  1946. 62.19 s > at <unknown source file>:<unknown line>
  1947. 62.19 s > 13: test[75d6903177b1d7e9]::run_test::{closure#0}<unknown>
  1948. 62.19 s > at <unknown source file>:<unknown line>
  1949. 62.19 s > 14: std[bcb96dfbba0ab899]::sys::backtrace::__rust_begin_short_backtrace::<test[75d6903177b1d7e9]::run_test::{closure#1}, ()><unknown>
  1950. 62.19 s > at <unknown source file>:<unknown line>
  1951. 62.19 s > 15: <std[bcb96dfbba0ab899]::thread::lifecycle::spawn_unchecked<test[75d6903177b1d7e9]::run_test::{closure#1}, ()>::{closure#1} as core[940e698046960fd5]::ops::function::FnOnce<()>>::call_once::{shim:vtable#0}<unknown>
  1952. 62.19 s > at <unknown source file>:<unknown line>
  1953. 62.20 s > 16: <std[bcb96dfbba0ab899]::sys::thread::unix::Thread>::new::thread_start<unknown>
  1954. 62.20 s > at <unknown source file>:<unknown line>
  1955. 62.20 s > 17: start_thread<unknown>
  1956. 62.20 s > at <unknown source file>:<unknown line>
  1957. 62.20 s > 18: __clone3<unknown>
  1958. 62.20 s > at <unknown source file>:<unknown line>
  1959. 62.20 s >
  1960. 62.20 s > Run with COLORBT_SHOW_HIDDEN=1 environment variable to disable frame filtering.
  1961. 62.20 s > Run with RUST_BACKTRACE=full to include source snippets.
  1962. 62.20 s >
  1963. 62.20 s > 5. gammalooprs::uv::approx::local_4d::tests::canonical_uv_classes_certify_signed_aliases_and_preserve_raw_sectors
  1964. 62.20 s > failure: test failure with exit code 101
  1965. 62.20 s > Error:
  1966. 62.20 s > 0: merged canonical UV numerator does not reproduce its source bucket
  1967. 62.20 s >
  1968. 62.20 s > Location:
  1969. 62.20 s > crates/gammalooprs/src/uv/approx/local_4d.rs:367
  1970. 62.20 s >
  1971. 62.20 s > ━━━━━━━━━━━━━━━━━━━━━━━━━━━━━━━━━━ BACKTRACE ━━━━━━━━━━━━━━━━━━━━━━━━━━━━━━━━━━━
  1972. 62.20 s > 1: <color_eyre[51793ea62743adbd]::config::EyreHook>::into_eyre_hook::{closure#0}<unknown>
  1973. 62.20 s > at <unknown source file>:<unknown line>
  1974. 62.20 s > 2: eyre[cb2fd339c0c40fca]::capture_handler<unknown>
  1975. 62.20 s > at <unknown source file>:<unknown line>
  1976. 62.20 s > 3: eyre[cb2fd339c0c40fca]::private::format_err<unknown>
  1977. 62.20 s > at <unknown source file>:<unknown line>
  1978. 62.20 s > 4: <gammalooprs[24955f93fc9f4e0c]::uv::approx::local_4d::FourDSector>::canonical_projection<unknown>
  1979. 62.20 s > at <unknown source file>:<unknown line>
  1980. 62.20 s > 5: gammalooprs[24955f93fc9f4e0c]::uv::approx::local_4d::tests::canonical_uv_classes_certify_signed_aliases_and_preserve_raw_sectors<unknown>
  1981. 62.20 s > at <unknown source file>:<unknown line>
  1982. 62.20 s > 6: <gammalooprs[24955f93fc9f4e0c]::uv::approx::local_4d::tests::canonical_uv_classes_certify_signed_aliases_and_preserve_raw_sectors::{closure#0} as core[940e698046960fd5]::ops::function::FnOnce<()>>::call_once<unknown>
  1983. 62.20 s > at <unknown source file>:<unknown line>
  1984. 62.20 s > 7: test[75d6903177b1d7e9]::__rust_begin_short_backtrace::<core[940e698046960fd5]::result::Result<(), alloc[2ea6bcb46fca0c42]::string::String>, fn() -> core[940e698046960fd5]::result::Result<(), alloc[2ea6bcb46fca0c42]::string::String>><unknown>
  1985. 62.20 s > at <unknown source file>:<unknown line>
  1986. 62.20 s > 8: test[75d6903177b1d7e9]::run_test::{closure#0}<unknown>
  1987. 62.20 s > at <unknown source file>:<unknown line>
  1988. 62.20 s > 9: std[bcb96dfbba0ab899]::sys::backtrace::__rust_begin_short_backtrace::<test[75d6903177b1d7e9]::run_test::{closure#1}, ()><unknown>
  1989. 62.20 s > at <unknown source file>:<unknown line>
  1990. 62.20 s > 10: <std[bcb96dfbba0ab899]::thread::lifecycle::spawn_unchecked<test[75d6903177b1d7e9]::run_test::{closure#1}, ()>::{closure#1} as core[940e698046960fd5]::ops::function::FnOnce<()>>::call_once::{shim:vtable#0}<unknown>
  1991. 62.20 s > at <unknown source file>:<unknown line>
  1992. 62.20 s > 11: <std[bcb96dfbba0ab899]::sys::thread::unix::Thread>::new::thread_start<unknown>
  1993. 62.20 s > at <unknown source file>:<unknown line>
  1994. 62.20 s > 12: start_thread<unknown>
  1995. 62.20 s > at <unknown source file>:<unknown line>
  1996. 62.20 s > 13: __clone3<unknown>
  1997. 62.20 s > at <unknown source file>:<unknown line>
  1998. 62.20 s >
  1999. 62.20 s > Run with COLORBT_SHOW_HIDDEN=1 environment variable to disable frame filtering.
  2000. 62.20 s > Run with RUST_BACKTRACE=full to include source snippets.
  2001. 62.20 s > system-out
  2002. 62.20 s > running 1 test
  2003. 62.20 s > test uv::approx::local_4d::tests::canonical_uv_classes_certify_signed_aliases_and_preserve_raw_sectors ... FAILED
  2004. 62.20 s >
  2005. 62.20 s > failures:
  2006. 62.20 s >
  2007. 62.20 s > failures:
  2008. 62.20 s > uv::approx::local_4d::tests::canonical_uv_classes_certify_signed_aliases_and_preserve_raw_sectors
  2009. 62.20 s >
  2010. 62.20 s > test result: FAILED. 0 passed; 1 failed; 0 ignored; 0 measured; 742 filtered out; finished in 0.11s
  2011. 62.20 s > system-err
  2012. 62.20 s > Error:
  2013. 62.20 s > 0: merged canonical UV numerator does not reproduce its source bucket
  2014. 62.20 s >
  2015. 62.20 s > Location:
  2016. 62.20 s > crates/gammalooprs/src/uv/approx/local_4d.rs:367
  2017. 62.20 s >
  2018. 62.20 s > ━━━━━━━━━━━━━━━━━━━━━━━━━━━━━━━━━━ BACKTRACE ━━━━━━━━━━━━━━━━━━━━━━━━━━━━━━━━━━━
  2019. 62.20 s > 1: <color_eyre[51793ea62743adbd]::config::EyreHook>::into_eyre_hook::{closure#0}<unknown>
  2020. 62.20 s > at <unknown source file>:<unknown line>
  2021. 62.20 s > 2: eyre[cb2fd339c0c40fca]::capture_handler<unknown>
  2022. 62.20 s > at <unknown source file>:<unknown line>
  2023. 62.20 s > 3: eyre[cb2fd339c0c40fca]::private::format_err<unknown>
  2024. 62.20 s > at <unknown source file>:<unknown line>
  2025. 62.20 s > 4: <gammalooprs[24955f93fc9f4e0c]::uv::approx::local_4d::FourDSector>::canonical_projection<unknown>
  2026. 62.20 s > at <unknown source file>:<unknown line>
  2027. 62.20 s > 5: gammalooprs[24955f93fc9f4e0c]::uv::approx::local_4d::tests::canonical_uv_classes_certify_signed_aliases_and_preserve_raw_sectors<unknown>
  2028. 62.20 s > at <unknown source file>:<unknown line>
  2029. 62.20 s > 6: <gammalooprs[24955f93fc9f4e0c]::uv::approx::local_4d::tests::canonical_uv_classes_certify_signed_aliases_and_preserve_raw_sectors::{closure#0} as core[940e698046960fd5]::ops::function::FnOnce<()>>::call_once<unknown>
  2030. 62.20 s > at <unknown source file>:<unknown line>
  2031. 62.20 s > 7: test[75d6903177b1d7e9]::__rust_begin_short_backtrace::<core[940e698046960fd5]::result::Result<(), alloc[2ea6bcb46fca0c42]::string::String>, fn() -> core[940e698046960fd5]::result::Result<(), alloc[2ea6bcb46fca0c42]::string::String>><unknown>
  2032. 62.20 s > at <unknown source file>:<unknown line>
  2033. 62.20 s > 8: test[75d6903177b1d7e9]::run_test::{closure#0}<unknown>
  2034. 62.20 s > at <unknown source file>:<unknown line>
  2035. 62.20 s > 9: std[bcb96dfbba0ab899]::sys::backtrace::__rust_begin_short_backtrace::<test[75d6903177b1d7e9]::run_test::{closure#1}, ()><unknown>
  2036. 62.20 s > at <unknown source file>:<unknown line>
  2037. 62.20 s > 10: <std[bcb96dfbba0ab899]::thread::lifecycle::spawn_unchecked<test[75d6903177b1d7e9]::run_test::{closure#1}, ()>::{closure#1} as core[940e698046960fd5]::ops::function::FnOnce<()>>::call_once::{shim:vtable#0}<unknown>
  2038. 62.20 s > at <unknown source file>:<unknown line>
  2039. 62.20 s > 11: <std[bcb96dfbba0ab899]::sys::thread::unix::Thread>::new::thread_start<unknown>
  2040. 62.20 s > at <unknown source file>:<unknown line>
  2041. 62.20 s > 12: start_thread<unknown>
  2042. 62.20 s > at <unknown source file>:<unknown line>
  2043. 62.20 s > 13: __clone3<unknown>
  2044. 62.20 s > at <unknown source file>:<unknown line>
  2045. 62.20 s >
  2046. 62.20 s > Run with COLORBT_SHOW_HIDDEN=1 environment variable to disable frame filtering.
  2047. 62.20 s > Run with RUST_BACKTRACE=full to include source snippets.
  2048. 62.20 s >
  2049. 62.20 s > 6. gammalooprs::uv::approx::tests::direct_nested_scalar_banana_replays_complete_cff_at_depth_three
  2050. 62.20 s > failure: test failure with exit code 101
  2051. 62.20 s > Error:
  2052. 62.20 s > 0: canonical UV numerator does not reproduce its source in the component frame
  2053. 62.20 s >
  2054. 62.20 s > Location:
  2055. 62.20 s > crates/gammalooprs/src/uv/approx/local_4d.rs:354
  2056. 62.20 s >
  2057. 62.20 s > ━━━━━━━━━━━━━━━━━━━━━━━━━━━━━━━━━━ BACKTRACE ━━━━━━━━━━━━━━━━━━━━━━━━━━━━━━━━━━━
  2058. 62.20 s > 1: <color_eyre[51793ea62743adbd]::config::EyreHook>::into_eyre_hook::{closure#0}<unknown>
  2059. 62.20 s > at <unknown source file>:<unknown line>
  2060. 62.20 s > 2: eyre[cb2fd339c0c40fca]::capture_handler<unknown>
  2061. 62.20 s > at <unknown source file>:<unknown line>
  2062. 62.20 s > 3: eyre[cb2fd339c0c40fca]::private::format_err<unknown>
  2063. 62.20 s > at <unknown source file>:<unknown line>
  2064. 62.20 s > 4: <gammalooprs[24955f93fc9f4e0c]::uv::approx::local_4d::FourDSector>::canonical_projection<unknown>
  2065. 62.20 s > at <unknown source file>:<unknown line>
  2066. 62.20 s > 5: <gammalooprs[24955f93fc9f4e0c]::uv::approx::projected_4d::Projected4dApproximation>::project_local_4d<unknown>
  2067. 62.20 s > at <unknown source file>:<unknown line>
  2068. 62.20 s > 6: <gammalooprs[24955f93fc9f4e0c]::uv::approx::Approximation>::compute_3d<unknown>
  2069. 62.20 s > at <unknown source file>:<unknown line>
  2070. 62.20 s > 7: gammalooprs[24955f93fc9f4e0c]::uv::approx::tests::direct_nested_scalar_banana_replays_complete_cff_at_depth_three::{closure#0}<unknown>
  2071. 62.20 s > at <unknown source file>:<unknown line>
  2072. 62.20 s > 8: gammalooprs[24955f93fc9f4e0c]::uv::approx::tests::direct_nested_scalar_banana_replays_complete_cff_at_depth_three<unknown>
  2073. 62.20 s > at <unknown source file>:<unknown line>
  2074. 62.20 s > 9: <gammalooprs[24955f93fc9f4e0c]::uv::approx::tests::direct_nested_scalar_banana_replays_complete_cff_at_depth_three::{closure#0} as core[940e698046960fd5]::ops::function::FnOnce<()>>::call_once<unknown>
  2075. 62.20 s > at <unknown source file>:<unknown line>
  2076. 62.20 s > 10: test[75d6903177b1d7e9]::__rust_begin_short_backtrace::<core[940e698046960fd5]::result::Result<(), alloc[2ea6bcb46fca0c42]::string::String>, fn() -> core[940e698046960fd5]::result::Result<(), alloc[2ea6bcb46fca0c42]::string::String>><unknown>
  2077. 62.20 s > at <unknown source file>:<unknown line>
  2078. 62.20 s > 11: test[75d6903177b1d7e9]::run_test::{closure#0}<unknown>
  2079. 62.20 s > at <unknown source file>:<unknown line>
  2080. 62.20 s > 12: std[bcb96dfbba0ab899]::sys::backtrace::__rust_begin_short_backtrace::<test[75d6903177b1d7e9]::run_test::{closure#1}, ()><unknown>
  2081. 62.20 s > at <unknown source file>:<unknown line>
  2082. 62.20 s > 13: <std[bcb96dfbba0ab899]::thread::lifecycle::spawn_unchecked<test[75d6903177b1d7e9]::run_test::{closure#1}, ()>::{closure#1} as core[940e698046960fd5]::ops::function::FnOnce<()>>::call_once::{shim:vtable#0}<unknown>
  2083. 62.20 s > at <unknown source file>:<unknown line>
  2084. 62.20 s > 14: <std[bcb96dfbba0ab899]::sys::thread::unix::Thread>::new::thread_start<unknown>
  2085. 62.20 s > at <unknown source file>:<unknown line>
  2086. 62.20 s > 15: start_thread<unknown>
  2087. 62.20 s > at <unknown source file>:<unknown line>
  2088. 62.20 s > 16: __clone3<unknown>
  2089. 62.20 s > at <unknown source file>:<unknown line>
  2090. 62.20 s >
  2091. 62.20 s > Run with COLORBT_SHOW_HIDDEN=1 environment variable to disable frame filtering.
  2092. 62.20 s > Run with RUST_BACKTRACE=full to include source snippets.
  2093. 62.20 s > system-out
  2094. 62.20 s > running 1 test
  2095. 62.20 s > test uv::approx::tests::direct_nested_scalar_banana_replays_complete_cff_at_depth_three ... FAILED
  2096. 62.20 s >
  2097. 62.20 s > failures:
  2098. 62.20 s >
  2099. 62.20 s > failures:
  2100. 62.20 s > uv::approx::tests::direct_nested_scalar_banana_replays_complete_cff_at_depth_three
  2101. 62.20 s >
  2102. 62.20 s > test result: FAILED. 0 passed; 1 failed; 0 ignored; 0 measured; 742 filtered out; finished in 0.09s
  2103. 62.20 s > system-err
  2104. 62.20 s > Error:
  2105. 62.20 s > 0: canonical UV numerator does not reproduce its source in the component frame
  2106. 62.20 s >
  2107. 62.20 s > Location:
  2108. 62.20 s > crates/gammalooprs/src/uv/approx/local_4d.rs:354
  2109. 62.20 s >
  2110. 62.20 s > ━━━━━━━━━━━━━━━━━━━━━━━━━━━━━━━━━━ BACKTRACE ━━━━━━━━━━━━━━━━━━━━━━━━━━━━━━━━━━━
  2111. 62.20 s > 1: <color_eyre[51793ea62743adbd]::config::EyreHook>::into_eyre_hook::{closure#0}<unknown>
  2112. 62.20 s > at <unknown source file>:<unknown line>
  2113. 62.20 s > 2: eyre[cb2fd339c0c40fca]::capture_handler<unknown>
  2114. 62.20 s > at <unknown source file>:<unknown line>
  2115. 62.20 s > 3: eyre[cb2fd339c0c40fca]::private::format_err<unknown>
  2116. 62.20 s > at <unknown source file>:<unknown line>
  2117. 62.20 s > 4: <gammalooprs[24955f93fc9f4e0c]::uv::approx::local_4d::FourDSector>::canonical_projection<unknown>
  2118. 62.20 s > at <unknown source file>:<unknown line>
  2119. 62.20 s > 5: <gammalooprs[24955f93fc9f4e0c]::uv::approx::projected_4d::Projected4dApproximation>::project_local_4d<unknown>
  2120. 62.20 s > at <unknown source file>:<unknown line>
  2121. 62.20 s > 6: <gammalooprs[24955f93fc9f4e0c]::uv::approx::Approximation>::compute_3d<unknown>
  2122. 62.20 s > at <unknown source file>:<unknown line>
  2123. 62.20 s > 7: gammalooprs[24955f93fc9f4e0c]::uv::approx::tests::direct_nested_scalar_banana_replays_complete_cff_at_depth_three::{closure#0}<unknown>
  2124. 62.20 s > at <unknown source file>:<unknown line>
  2125. 62.20 s > 8: gammalooprs[24955f93fc9f4e0c]::uv::approx::tests::direct_nested_scalar_banana_replays_complete_cff_at_depth_three<unknown>
  2126. 62.20 s > at <unknown source file>:<unknown line>
  2127. 62.20 s > 9: <gammalooprs[24955f93fc9f4e0c]::uv::approx::tests::direct_nested_scalar_banana_replays_complete_cff_at_depth_three::{closure#0} as core[940e698046960fd5]::ops::function::FnOnce<()>>::call_once<unknown>
  2128. 62.20 s > at <unknown source file>:<unknown line>
  2129. 62.20 s > 10: test[75d6903177b1d7e9]::__rust_begin_short_backtrace::<core[940e698046960fd5]::result::Result<(), alloc[2ea6bcb46fca0c42]::string::String>, fn() -> core[940e698046960fd5]::result::Result<(), alloc[2ea6bcb46fca0c42]::string::String>><unknown>
  2130. 62.20 s > at <unknown source file>:<unknown line>
  2131. 62.20 s > 11: test[75d6903177b1d7e9]::run_test::{closure#0}<unknown>
  2132. 62.20 s > at <unknown source file>:<unknown line>
  2133. 62.20 s > 12: std[bcb96dfbba0ab899]::sys::backtrace::__rust_begin_short_backtrace::<test[75d6903177b1d7e9]::run_test::{closure#1}, ()><unknown>
  2134. 62.20 s > at <unknown source file>:<unknown line>
  2135. 62.20 s > 13: <std[bcb96dfbba0ab899]::thread::lifecycle::spawn_unchecked<test[75d6903177b1d7e9]::run_test::{closure#1}, ()>::{closure#1} as core[940e698046960fd5]::ops::function::FnOnce<()>>::call_once::{shim:vtable#0}<unknown>
  2136. 62.20 s > at <unknown source file>:<unknown line>
  2137. 62.20 s > 14: <std[bcb96dfbba0ab899]::sys::thread::unix::Thread>::new::thread_start<unknown>
  2138. 62.20 s > at <unknown source file>:<unknown line>
  2139. 62.20 s > 15: start_thread<unknown>
  2140. 62.20 s > at <unknown source file>:<unknown line>
  2141. 62.20 s > 16: __clone3<unknown>
  2142. 62.20 s > at <unknown source file>:<unknown line>
  2143. 62.20 s >
  2144. 62.20 s > Run with COLORBT_SHOW_HIDDEN=1 environment variable to disable frame filtering.
  2145. 62.20 s > Run with RUST_BACKTRACE=full to include source snippets.
  2146. 62.20 s > =========================================
  2147. 62.20 s > Extracting 1 binary, 1 build script output directory, and 1 linked path to /build/nextest-archive-VVI262
  2148. 62.20 s > Extracted 7 files to /build/nextest-archive-VVI262 in 0.09s
  2149. 62.20 s > ------------
  2150. 62.20 s > Nextest run ID cbda4163-781e-4d32-8559-424c822c8364 with nextest profile: ci_gammaloop
  2151. 62.20 s > Starting 105 tests across 1 binary
  2152. 62.20 s > ------------
  2153. 62.20 s > Summary [ 18.347s] 105 tests run: 105 passed, 0 skipped
  2154. 62.20 s >
  2155. 62.20 s > ========== nextest test summary ==========
  2156. 62.20 s > report: target/nextest/ci_gammaloop/junit.xml
  2157. 62.20 s > tests: 105, failures: 0, errors: 0
  2158. 62.20 s > No failing testcases found.
  2159. 62.20 s > =========================================
  2160. 62.20 s For full logs, run:
  2161. 62.20 s nix log /nix/store/n61r02micjg0snakcv487zfdf4anp50s-gammaloop-nextest-core.drv
  2162. 62.35 s [0 built (1 failed), 0.0Run failed.