test packages.x86_64-linux.nix-ci-check-gammaloop-nextest-core
0.00 s
$ /nix/store/9ypz3flqsrl5xl495mm8h645gadjsxi1-coreutils-9.11/bin/timeout --kill-after=15s 7200s /nix/store/23zk8sgzamrbmj1fday15szf7f2279s8-nix-2.34.7/bin/nix --extra-experimental-features nix-command --extra-experimental-features flakes flake clone git+https://github.com/alphal00p/gammaloop --dest /tmp/nix-ci-worker/stable-pwd/repo/
0.08 s
Cloning into '/tmp/nix-ci-worker/stable-pwd/repo'...
1.14 s
remote: Enumerating objects: 84512, done.
1.26 s
remote: Counting objects: 0% (1/8829)
remote: Counting objects: 1% (89/8829)
remote: Counting objects: 2% (177/8829)
remote: Counting objects: 3% (265/8829)
remote: Counting objects: 4% (354/8829)
remote: Counting objects: 5% (442/8829)
remote: Counting objects: 6% (530/8829)
remote: Counting objects: 7% (619/8829)
remote: Counting objects: 8% (707/8829)
remote: Counting objects: 9% (795/8829)
remote: Counting objects: 10% (883/8829)
remote: Counting objects: 11% (972/8829)
remote: Counting objects: 12% (1060/8829)
remote: Counting objects: 13% (1148/8829)
remote: Counting objects: 14% (1237/8829)
remote: Counting objects: 15% (1325/8829)
remote: Counting objects: 16% (1413/8829)
remote: Counting objects: 17% (1501/8829)
remote: Counting objects: 18% (1590/8829)
remote: Counting objects: 19% (1678/8829)
remote: Counting objects: 20% (1766/8829)
remote: Counting objects: 21% (1855/8829)
remote: Counting objects: 22% (1943/8829)
remote: Counting objects: 23% (2031/8829)
remote: Counting objects: 24% (2119/8829)
remote: Counting objects: 25% (2208/8829)
remote: Counting objects: 26% (2296/8829)
remote: Counting objects: 27% (2384/8829)
remote: Counting objects: 28% (2473/8829)
remote: Counting objects: 29% (2561/8829)
remote: Counting objects: 30% (2649/8829)
remote: Counting objects: 31% (2737/8829)
remote: Counting objects: 32% (2826/8829)
remote: Counting objects: 33% (2914/8829)
remote: Counting objects: 34% (3002/8829)
remote: Counting objects: 35% (3091/8829)
remote: Counting objects: 36% (3179/8829)
remote: Counting objects: 37% (3267/8829)
remote: Counting objects: 38% (3356/8829)
remote: Counting objects: 39% (3444/8829)
remote: Counting objects: 40% (3532/8829)
remote: Counting objects: 41% (3620/8829)
remote: Counting objects: 42% (3709/8829)
remote: Counting objects: 43% (3797/8829)
remote: Counting objects: 44% (3885/8829)
remote: Counting objects: 45% (3974/8829)
remote: Counting objects: 46% (4062/8829)
remote: Counting objects: 47% (4150/8829)
remote: Counting objects: 48% (4238/8829)
remote: Counting objects: 49% (4327/8829)
remote: Counting objects: 50% (4415/8829)
remote: Counting objects: 51% (4503/8829)
remote: Counting objects: 52% (4592/8829)
remote: Counting objects: 53% (4680/8829)
remote: Counting objects: 54% (4768/8829)
remote: Counting objects: 55% (4856/8829)
remote: Counting objects: 56% (4945/8829)
remote: Counting objects: 57% (5033/8829)
remote: Counting objects: 58% (5121/8829)
remote: Counting objects: 59% (5210/8829)
remote: Counting objects: 60% (5298/8829)
remote: Counting objects: 61% (5386/8829)
remote: Counting objects: 62% (5474/8829)
remote: Counting objects: 63% (5563/8829)
remote: Counting objects: 64% (5651/8829)
remote: Counting objects: 65% (5739/8829)
remote: Counting objects: 66% (5828/8829)
remote: Counting objects: 67% (5916/8829)
remote: Counting objects: 68% (6004/8829)
remote: Counting objects: 69% (6093/8829)
remote: Counting objects: 70% (6181/8829)
remote: Counting objects: 71% (6269/8829)
remote: Counting objects: 72% (6357/8829)
remote: Counting objects: 73% (6446/8829)
remote: Counting objects: 74% (6534/8829)
remote: Counting objects: 75% (6622/8829)
remote: Counting objects: 76% (6711/8829)
remote: Counting objects: 77% (6799/8829)
remote: Counting objects: 78% (6887/8829)
remote: Counting objects: 79% (6975/8829)
remote: Counting objects: 80% (7064/8829)
remote: Counting objects: 81% (7152/8829)
remote: Counting objects: 82% (7240/8829)
remote: Counting objects: 83% (7329/8829)
remote: Counting objects: 84% (7417/8829)
remote: Counting objects: 85% (7505/8829)
remote: Counting objects: 86% (7593/8829)
remote: Counting objects: 87% (7682/8829)
remote: Counting objects: 88% (7770/8829)
remote: Counting objects: 89% (7858/8829)
remote: Counting objects: 90% (7947/8829)
remote: Counting objects: 91% (8035/8829)
remote: Counting objects: 92% (8123/8829)
remote: Counting objects: 93% (8211/8829)
remote: Counting objects: 94% (8300/8829)
remote: Counting objects: 95% (8388/8829)
remote: Counting objects: 96% (8476/8829)
remote: Counting objects: 97% (8565/8829)
remote: Counting objects: 98% (8653/8829)
remote: Counting objects: 99% (8741/8829)
remote: Counting objects: 100% (8829/8829)
remote: Counting objects: 100% (8829/8829), done.
3.08 s
remote: Compressing objects: 0% (1/1879)
remote: Compressing objects: 1% (19/1879)
remote: Compressing objects: 2% (38/1879)
remote: Compressing objects: 3% (57/1879)
remote: Compressing objects: 4% (76/1879)
remote: Compressing objects: 5% (94/1879)
remote: Compressing objects: 6% (113/1879)
remote: Compressing objects: 7% (132/1879)
remote: Compressing objects: 8% (151/1879)
remote: Compressing objects: 9% (170/1879)
remote: Compressing objects: 10% (188/1879)
remote: Compressing objects: 11% (207/1879)
remote: Compressing objects: 11% (218/1879)
remote: Compressing objects: 12% (226/1879)
remote: Compressing objects: 13% (245/1879)
remote: Compressing objects: 14% (264/1879)
remote: Compressing objects: 15% (282/1879)
remote: Compressing objects: 16% (301/1879)
remote: Compressing objects: 17% (320/1879)
remote: Compressing objects: 18% (339/1879)
remote: Compressing objects: 19% (358/1879)
remote: Compressing objects: 20% (376/1879)
remote: Compressing objects: 21% (395/1879)
remote: Compressing objects: 22% (414/1879)
remote: Compressing objects: 23% (433/1879)
remote: Compressing objects: 24% (451/1879)
remote: Compressing objects: 25% (470/1879)
remote: Compressing objects: 26% (489/1879)
remote: Compressing objects: 27% (508/1879)
remote: Compressing objects: 28% (527/1879)
remote: Compressing objects: 29% (545/1879)
remote: Compressing objects: 30% (564/1879)
remote: Compressing objects: 31% (583/1879)
remote: Compressing objects: 32% (602/1879)
remote: Compressing objects: 33% (621/1879)
remote: Compressing objects: 34% (639/1879)
remote: Compressing objects: 35% (658/1879)
remote: Compressing objects: 36% (677/1879)
remote: Compressing objects: 37% (696/1879)
remote: Compressing objects: 38% (715/1879)
remote: Compressing objects: 39% (733/1879)
remote: Compressing objects: 40% (752/1879)
remote: Compressing objects: 41% (771/1879)
remote: Compressing objects: 42% (790/1879)
remote: Compressing objects: 43% (808/1879)
remote: Compressing objects: 44% (827/1879)
remote: Compressing objects: 45% (846/1879)
remote: Compressing objects: 46% (865/1879)
remote: Compressing objects: 47% (884/1879)
remote: Compressing objects: 48% (902/1879)
remote: Compressing objects: 49% (921/1879)
remote: Compressing objects: 50% (940/1879)
remote: Compressing objects: 51% (959/1879)
remote: Compressing objects: 52% (978/1879)
remote: Compressing objects: 53% (996/1879)
remote: Compressing objects: 54% (1015/1879)
remote: Compressing objects: 55% (1034/1879)
remote: Compressing objects: 56% (1053/1879)
remote: Compressing objects: 57% (1072/1879)
remote: Compressing objects: 58% (1090/1879)
remote: Compressing objects: 59% (1109/1879)
remote: Compressing objects: 60% (1128/1879)
remote: Compressing objects: 61% (1147/1879)
remote: Compressing objects: 62% (1165/1879)
remote: Compressing objects: 63% (1184/1879)
remote: Compressing objects: 64% (1203/1879)
remote: Compressing objects: 65% (1222/1879)
remote: Compressing objects: 66% (1241/1879)
remote: Compressing objects: 67% (1259/1879)
remote: Compressing objects: 68% (1278/1879)
remote: Compressing objects: 69% (1297/1879)
remote: Compressing objects: 70% (1316/1879)
remote: Compressing objects: 71% (1335/1879)
remote: Compressing objects: 72% (1353/1879)
remote: Compressing objects: 73% (1372/1879)
remote: Compressing objects: 74% (1391/1879)
remote: Compressing objects: 75% (1410/1879)
remote: Compressing objects: 76% (1429/1879)
remote: Compressing objects: 77% (1447/1879)
remote: Compressing objects: 78% (1466/1879)
remote: Compressing objects: 79% (1485/1879)
remote: Compressing objects: 80% (1504/1879)
remote: Compressing objects: 81% (1522/1879)
remote: Compressing objects: 82% (1541/1879)
remote: Compressing objects: 83% (1560/1879)
remote: Compressing objects: 84% (1579/1879)
remote: Compressing objects: 85% (1598/1879)
remote: Compressing objects: 86% (1616/1879)
remote: Compressing objects: 87% (1635/1879)
remote: Compressing objects: 88% (1654/1879)
remote: Compressing objects: 89% (1673/1879)
remote: Compressing objects: 90% (1692/1879)
remote: Compressing objects: 91% (1710/1879)
remote: Compressing objects: 92% (1729/1879)
remote: Compressing objects: 93% (1748/1879)
remote: Compressing objects: 94% (1767/1879)
remote: Compressing objects: 95% (1786/1879)
remote: Compressing objects: 96% (1804/1879)
remote: Compressing objects: 97% (1823/1879)
remote: Compressing objects: 98% (1842/1879)
remote: Compressing objects: 99% (1861/1879)
remote: Compressing objects: 100% (1879/1879)
remote: Compressing objects: 100% (1879/1879), done.
14.13 s
Receiving objects: 0% (1/84512)
Receiving objects: 1% (846/84512), 3.31 MiB | 6.52 MiB/s
Receiving objects: 2% (1691/84512), 3.31 MiB | 6.52 MiB/s
Receiving objects: 3% (2536/84512), 3.31 MiB | 6.52 MiB/s
Receiving objects: 3% (3048/84512), 3.31 MiB | 6.52 MiB/s
Receiving objects: 4% (3381/84512), 7.68 MiB | 7.62 MiB/s
Receiving objects: 5% (4226/84512), 7.68 MiB | 7.62 MiB/s
Receiving objects: 6% (5071/84512), 7.68 MiB | 7.62 MiB/s
Receiving objects: 7% (5916/84512), 7.68 MiB | 7.62 MiB/s
Receiving objects: 8% (6761/84512), 7.68 MiB | 7.62 MiB/s
Receiving objects: 8% (7251/84512), 17.25 MiB | 8.59 MiB/s
Receiving objects: 9% (7607/84512), 17.25 MiB | 8.59 MiB/s
Receiving objects: 10% (8452/84512), 17.25 MiB | 8.59 MiB/s
Receiving objects: 11% (9297/84512), 17.25 MiB | 8.59 MiB/s
Receiving objects: 12% (10142/84512), 17.25 MiB | 8.59 MiB/s
Receiving objects: 13% (10987/84512), 17.25 MiB | 8.59 MiB/s
Receiving objects: 14% (11832/84512), 17.25 MiB | 8.59 MiB/s
Receiving objects: 15% (12677/84512), 17.25 MiB | 8.59 MiB/s
Receiving objects: 16% (13522/84512), 17.25 MiB | 8.59 MiB/s
Receiving objects: 17% (14368/84512), 17.25 MiB | 8.59 MiB/s
Receiving objects: 18% (15213/84512), 17.25 MiB | 8.59 MiB/s
Receiving objects: 19% (16058/84512), 17.25 MiB | 8.59 MiB/s
Receiving objects: 20% (16903/84512), 17.25 MiB | 8.59 MiB/s
Receiving objects: 21% (17748/84512), 17.25 MiB | 8.59 MiB/s
Receiving objects: 22% (18593/84512), 17.25 MiB | 8.59 MiB/s
Receiving objects: 23% (19438/84512), 17.25 MiB | 8.59 MiB/s
Receiving objects: 24% (20283/84512), 17.25 MiB | 8.59 MiB/s
Receiving objects: 25% (21128/84512), 22.49 MiB | 8.96 MiB/s
Receiving objects: 26% (21974/84512), 22.49 MiB | 8.96 MiB/s
Receiving objects: 27% (22819/84512), 22.49 MiB | 8.96 MiB/s
Receiving objects: 28% (23664/84512), 22.49 MiB | 8.96 MiB/s
Receiving objects: 29% (24509/84512), 22.49 MiB | 8.96 MiB/s
Receiving objects: 30% (25354/84512), 22.49 MiB | 8.96 MiB/s
Receiving objects: 31% (26199/84512), 22.49 MiB | 8.96 MiB/s
Receiving objects: 32% (27044/84512), 22.49 MiB | 8.96 MiB/s
Receiving objects: 33% (27889/84512), 22.49 MiB | 8.96 MiB/s
Receiving objects: 34% (28735/84512), 22.49 MiB | 8.96 MiB/s
Receiving objects: 35% (29580/84512), 22.49 MiB | 8.96 MiB/s
Receiving objects: 36% (30425/84512), 22.49 MiB | 8.96 MiB/s
Receiving objects: 37% (31270/84512), 22.49 MiB | 8.96 MiB/s
Receiving objects: 37% (31444/84512), 27.98 MiB | 9.30 MiB/s
Receiving objects: 38% (32115/84512), 27.98 MiB | 9.30 MiB/s
Receiving objects: 39% (32960/84512), 27.98 MiB | 9.30 MiB/s
Receiving objects: 40% (33805/84512), 27.98 MiB | 9.30 MiB/s
Receiving objects: 41% (34650/84512), 33.69 MiB | 9.60 MiB/s
Receiving objects: 42% (35496/84512), 33.69 MiB | 9.60 MiB/s
Receiving objects: 43% (36341/84512), 33.69 MiB | 9.60 MiB/s
Receiving objects: 44% (37186/84512), 33.69 MiB | 9.60 MiB/s
Receiving objects: 44% (37344/84512), 33.69 MiB | 9.60 MiB/s
Receiving objects: 45% (38031/84512), 39.70 MiB | 9.90 MiB/s
Receiving objects: 46% (38876/84512), 39.70 MiB | 9.90 MiB/s
Receiving objects: 47% (39721/84512), 45.93 MiB | 10.18 MiB/s
Receiving objects: 48% (40566/84512), 45.93 MiB | 10.18 MiB/s
Receiving objects: 49% (41411/84512), 45.93 MiB | 10.18 MiB/s
Receiving objects: 50% (42256/84512), 45.93 MiB | 10.18 MiB/s
Receiving objects: 51% (43102/84512), 45.93 MiB | 10.18 MiB/s
Receiving objects: 52% (43947/84512), 45.93 MiB | 10.18 MiB/s
Receiving objects: 52% (44075/84512), 45.93 MiB | 10.18 MiB/s
Receiving objects: 53% (44792/84512), 52.33 MiB | 10.88 MiB/s
Receiving objects: 54% (45637/84512), 52.33 MiB | 10.88 MiB/s
Receiving objects: 55% (46482/84512), 52.33 MiB | 10.88 MiB/s
Receiving objects: 56% (47327/84512), 58.92 MiB | 11.38 MiB/s
Receiving objects: 57% (48172/84512), 58.92 MiB | 11.38 MiB/s
Receiving objects: 57% (48725/84512), 65.62 MiB | 11.83 MiB/s
Receiving objects: 58% (49017/84512), 65.62 MiB | 11.83 MiB/s
Receiving objects: 59% (49863/84512), 65.62 MiB | 11.83 MiB/s
Receiving objects: 60% (50708/84512), 65.62 MiB | 11.83 MiB/s
Receiving objects: 61% (51553/84512), 72.67 MiB | 12.30 MiB/s
Receiving objects: 62% (52398/84512), 72.67 MiB | 12.30 MiB/s
Receiving objects: 63% (53243/84512), 72.67 MiB | 12.30 MiB/s
Receiving objects: 64% (54088/84512), 72.67 MiB | 12.30 MiB/s
Receiving objects: 64% (54326/84512), 79.82 MiB | 12.72 MiB/s
Receiving objects: 65% (54933/84512), 79.82 MiB | 12.72 MiB/s
Receiving objects: 66% (55778/84512), 79.82 MiB | 12.72 MiB/s
Receiving objects: 67% (56624/84512), 79.82 MiB | 12.72 MiB/s
Receiving objects: 67% (57331/84512), 95.61 MiB | 13.74 MiB/s
Receiving objects: 68% (57469/84512), 104.38 MiB | 14.35 MiB/s
Receiving objects: 69% (58314/84512), 104.38 MiB | 14.35 MiB/s
Receiving objects: 70% (59159/84512), 104.38 MiB | 14.35 MiB/s
Receiving objects: 71% (60004/84512), 104.38 MiB | 14.35 MiB/s
Receiving objects: 72% (60849/84512), 104.38 MiB | 14.35 MiB/s
Receiving objects: 72% (61374/84512), 104.38 MiB | 14.35 MiB/s
Receiving objects: 73% (61694/84512), 113.54 MiB | 15.00 MiB/s
Receiving objects: 74% (62539/84512), 113.54 MiB | 15.00 MiB/s
Receiving objects: 75% (63384/84512), 113.54 MiB | 15.00 MiB/s
Receiving objects: 76% (64230/84512), 123.04 MiB | 15.69 MiB/s
Receiving objects: 77% (65075/84512), 123.04 MiB | 15.69 MiB/s
Receiving objects: 77% (65694/84512), 123.04 MiB | 15.69 MiB/s
Receiving objects: 78% (65920/84512), 123.04 MiB | 15.69 MiB/s
Receiving objects: 79% (66765/84512), 132.74 MiB | 16.39 MiB/s
Receiving objects: 80% (67610/84512), 132.74 MiB | 16.39 MiB/s
Receiving objects: 81% (68455/84512), 132.74 MiB | 16.39 MiB/s
Receiving objects: 82% (69300/84512), 132.74 MiB | 16.39 MiB/s
Receiving objects: 83% (70145/84512), 132.74 MiB | 16.39 MiB/s
Receiving objects: 84% (70991/84512), 132.74 MiB | 16.39 MiB/s
Receiving objects: 85% (71836/84512), 132.74 MiB | 16.39 MiB/s
Receiving objects: 86% (72681/84512), 132.74 MiB | 16.39 MiB/s
Receiving objects: 87% (73526/84512), 132.74 MiB | 16.39 MiB/s
Receiving objects: 88% (74371/84512), 142.81 MiB | 17.13 MiB/s
Receiving objects: 89% (75216/84512), 142.81 MiB | 17.13 MiB/s
Receiving objects: 90% (76061/84512), 142.81 MiB | 17.13 MiB/s
Receiving objects: 91% (76906/84512), 142.81 MiB | 17.13 MiB/s
Receiving objects: 92% (77752/84512), 142.81 MiB | 17.13 MiB/s
Receiving objects: 93% (78597/84512), 142.81 MiB | 17.13 MiB/s
Receiving objects: 94% (79442/84512), 142.81 MiB | 17.13 MiB/s
Receiving objects: 95% (80287/84512), 142.81 MiB | 17.13 MiB/s
Receiving objects: 96% (81132/84512), 142.81 MiB | 17.13 MiB/s
Receiving objects: 97% (81977/84512), 142.81 MiB | 17.13 MiB/s
Receiving objects: 98% (82822/84512), 142.81 MiB | 17.13 MiB/s
Receiving objects: 99% (83667/84512), 142.81 MiB | 17.13 MiB/s
Receiving objects: 99% (84013/84512), 142.81 MiB | 17.13 MiB/s
remote: Total 84512 (delta 7636), reused 7029 (delta 6948), pack-reused 75683 (from 2)
14.13 s
Receiving objects: 100% (84512/84512), 153.24 MiB | 17.88 MiB/s
Receiving objects: 100% (84512/84512), 153.91 MiB | 13.92 MiB/s, done.
15.17 s
Resolving deltas: 0% (0/57177)
Resolving deltas: 1% (572/57177)
Resolving deltas: 2% (1144/57177)
Resolving deltas: 3% (1717/57177)
Resolving deltas: 4% (2288/57177)
Resolving deltas: 5% (2859/57177)
Resolving deltas: 6% (3432/57177)
Resolving deltas: 7% (4003/57177)
Resolving deltas: 8% (4575/57177)
Resolving deltas: 9% (5146/57177)
Resolving deltas: 10% (5718/57177)
Resolving deltas: 11% (6290/57177)
Resolving deltas: 12% (6862/57177)
Resolving deltas: 13% (7434/57177)
Resolving deltas: 14% (8005/57177)
Resolving deltas: 15% (8577/57177)
Resolving deltas: 16% (9149/57177)
Resolving deltas: 17% (9721/57177)
Resolving deltas: 18% (10292/57177)
Resolving deltas: 19% (10868/57177)
Resolving deltas: 20% (11436/57177)
Resolving deltas: 21% (12008/57177)
Resolving deltas: 22% (12579/57177)
Resolving deltas: 23% (13151/57177)
Resolving deltas: 24% (13723/57177)
Resolving deltas: 25% (14295/57177)
Resolving deltas: 26% (14867/57177)
Resolving deltas: 27% (15439/57177)
Resolving deltas: 28% (16010/57177)
Resolving deltas: 29% (16582/57177)
Resolving deltas: 30% (17155/57177)
Resolving deltas: 31% (17725/57177)
Resolving deltas: 32% (18297/57177)
Resolving deltas: 33% (18869/57177)
Resolving deltas: 34% (19442/57177)
Resolving deltas: 35% (20012/57177)
Resolving deltas: 36% (20584/57177)
Resolving deltas: 37% (21156/57177)
Resolving deltas: 38% (21728/57177)
Resolving deltas: 39% (22302/57177)
Resolving deltas: 40% (22871/57177)
Resolving deltas: 41% (23445/57177)
Resolving deltas: 42% (24015/57177)
Resolving deltas: 43% (24587/57177)
Resolving deltas: 44% (25158/57177)
Resolving deltas: 45% (25730/57177)
Resolving deltas: 46% (26307/57177)
Resolving deltas: 47% (26876/57177)
Resolving deltas: 48% (27445/57177)
Resolving deltas: 49% (28020/57177)
Resolving deltas: 50% (28589/57177)
Resolving deltas: 51% (29161/57177)
Resolving deltas: 52% (29733/57177)
Resolving deltas: 53% (30304/57177)
Resolving deltas: 54% (30876/57177)
Resolving deltas: 55% (31448/57177)
Resolving deltas: 56% (32020/57177)
Resolving deltas: 57% (32591/57177)
Resolving deltas: 58% (33163/57177)
Resolving deltas: 59% (33735/57177)
Resolving deltas: 60% (34310/57177)
Resolving deltas: 61% (34878/57177)
Resolving deltas: 62% (35450/57177)
Resolving deltas: 63% (36024/57177)
Resolving deltas: 64% (36595/57177)
Resolving deltas: 65% (37167/57177)
Resolving deltas: 66% (37737/57177)
Resolving deltas: 67% (38309/57177)
Resolving deltas: 68% (38881/57177)
Resolving deltas: 69% (39453/57177)
Resolving deltas: 70% (40024/57177)
Resolving deltas: 71% (40596/57177)
Resolving deltas: 72% (41168/57177)
Resolving deltas: 73% (41740/57177)
Resolving deltas: 74% (42311/57177)
Resolving deltas: 75% (42883/57177)
Resolving deltas: 76% (43455/57177)
Resolving deltas: 77% (44027/57177)
Resolving deltas: 78% (44599/57177)
Resolving deltas: 79% (45170/57177)
Resolving deltas: 80% (45742/57177)
Resolving deltas: 81% (46314/57177)
Resolving deltas: 82% (46886/57177)
Resolving deltas: 83% (47457/57177)
Resolving deltas: 84% (48029/57177)
Resolving deltas: 85% (48602/57177)
Resolving deltas: 86% (49174/57177)
Resolving deltas: 87% (49744/57177)
Resolving deltas: 88% (50316/57177)
Resolving deltas: 89% (50888/57177)
Resolving deltas: 90% (51460/57177)
Resolving deltas: 91% (52032/57177)
Resolving deltas: 92% (52603/57177)
Resolving deltas: 93% (53175/57177)
Resolving deltas: 94% (53747/57177)
Resolving deltas: 95% (54319/57177)
Resolving deltas: 96% (54890/57177)
Resolving deltas: 96% (55152/57177)
Resolving deltas: 97% (55464/57177)
Resolving deltas: 98% (56034/57177)
Resolving deltas: 99% (56606/57177)
Resolving deltas: 100% (57177/57177)
Resolving deltas: 100% (57177/57177), done.
15.55 s
Fetching commit b8396f3a3080d196a947879eb877a2d842d871ef for faster_uv_from_4d ...
15.55 s
$ /nix/store/bcnisk3ydfgv26v2gw3zlky24g00yww2-git-2.54.0/bin/git fetch origin b8396f3a3080d196a947879eb877a2d842d871ef
16.03 s
From https://github.com/alphal00p/gammaloop
16.03 s
* branch b8396f3a3080d196a947879eb877a2d842d871ef -> FETCH_HEAD
16.04 s
$ /nix/store/9ypz3flqsrl5xl495mm8h645gadjsxi1-coreutils-9.11/bin/timeout --kill-after=15s 7200s /nix/store/bcnisk3ydfgv26v2gw3zlky24g00yww2-git-2.54.0/bin/git -c advice.detachedHead=false checkout b8396f3a3080d196a947879eb877a2d842d871ef
16.35 s
HEAD is now at b8396f3a3 canonicalize uv classes and prepare bounded cff mappings
16.36 s
$ /nix/store/9ypz3flqsrl5xl495mm8h645gadjsxi1-coreutils-9.11/bin/timeout --kill-after=15s 7200s /nix/store/23zk8sgzamrbmj1fday15szf7f2279s8-nix-2.34.7/bin/nix --extra-experimental-features nix-command --extra-experimental-features flakes --log-format internal-json run .#packages.x86_64-linux.nix-ci-check-gammaloop-nextest-core --print-build-logs
21.23 s
27.45 s
evaluating derivation 'g
copying '/nix/store/9a5p
evaluating derivation 'g
copying '/nix/store/9a5p
evaluating derivation 'g
copying '/nix/store/9a5p
evaluating derivation 'g
copying '/nix/store/9a5p
evaluating derivation 'g
copying '/nix/store/9a5p
evaluating derivation 'g
copying '/nix/store/9a5p
evaluating derivation 'g
copying '/nix/store/9a5p
evaluating derivation 'g
copying '/nix/store/9a5p
evaluating derivation 'g
copying '/nix/store/9a5p
evaluating derivation 'g
querying gammaloop-nexte
[0 /1 built, 0.0 KiB DL]
[1 /0 /1 built, 0.0 KiB DLgammaloop-nextest-core> Extracting 4 binaries (including 1 non-test binary), 1 build script output directory, and 2 linked paths to /build/nextest-archive-xcamp3
28.24 s
gammaloop-nextest-core> Extracted 20 files to /build/nextest-archive-xcamp3 in 0.79s
28.26 s
gammaloop-nextest-core> ------------
28.26 s
gammaloop-nextest-core> Nextest run ID b421eb54-4ee9-4f9b-8160-24abaaab242f with nextest profile: ci_gammaloop
28.26 s
gammaloop-nextest-core> Starting 379 tests across 3 binaries
29.65 s
gammaloop-nextest-core> ------------
29.65 s
gammaloop-nextest-core> Summary [ 1.391s] 379 tests run: 379 passed , 0 skipped
29.78 s
gammaloop-nextest-core>
29.78 s
gammaloop-nextest-core> ========== nextest test summary ==========
29.78 s
gammaloop-nextest-core> report: target/nextest/ci_gammaloop/junit.xml
29.78 s
gammaloop-nextest-core> tests: 379, failures: 0, errors: 0
29.78 s
gammaloop-nextest-core> No failing testcases found.
29.78 s
gammaloop-nextest-core> =========================================
29.80 s
gammaloop-nextest-core> Extracting 1 binary and 1 linked path to /build/nextest-archive-fxbLs0
29.87 s
gammaloop-nextest-core> Extracted 7 files to /build/nextest-archive-fxbLs0 in 0.07s
29.88 s
gammaloop-nextest-core> ------------
29.88 s
gammaloop-nextest-core> Nextest run ID 6bf7d592-ce67-4c5f-869a-c534f3c45f72 with nextest profile: ci_gammaloop
29.88 s
gammaloop-nextest-core> Starting 19 tests across 1 binary
29.89 s
gammaloop-nextest-core> ------------
29.89 s
gammaloop-nextest-core> Summary [ 0.013s] 19 tests run: 19 passed , 0 skipped
29.93 s
gammaloop-nextest-core>
29.93 s
gammaloop-nextest-core> ========== nextest test summary ==========
29.93 s
gammaloop-nextest-core> report: target/nextest/ci_gammaloop/junit.xml
29.93 s
gammaloop-nextest-core> tests: 19, failures: 0, errors: 0
29.93 s
gammaloop-nextest-core> No failing testcases found.
29.93 s
gammaloop-nextest-core> =========================================
29.95 s
gammaloop-nextest-core> Extracting 1 binary to /build/nextest-archive-OuDozE
29.97 s
gammaloop-nextest-core> Extracted 4 files to /build/nextest-archive-OuDozE in 0.03s
29.98 s
gammaloop-nextest-core> ------------
29.98 s
gammaloop-nextest-core> Nextest run ID d2523067-980f-45bd-a79f-e66787f149d2 with nextest profile: ci_gammaloop
29.98 s
gammaloop-nextest-core> Starting 0 tests across 1 binary
29.98 s
gammaloop-nextest-core> ------------
29.98 s
gammaloop-nextest-core> Summary [ 0.000s] 0 tests run: 0 passed , 0 skipped
30.01 s
gammaloop-nextest-core>
30.01 s
gammaloop-nextest-core> ========== nextest test summary ==========
30.01 s
gammaloop-nextest-core> report: target/nextest/ci_gammaloop/junit.xml
30.01 s
gammaloop-nextest-core> tests: 0, failures: 0, errors: 0
30.01 s
gammaloop-nextest-core> No failing testcases found.
30.01 s
gammaloop-nextest-core> =========================================
30.03 s
gammaloop-nextest-core> Extracting 4 binaries, 1 build script output directory, and 2 linked paths to /build/nextest-archive-FtZm0W
30.52 s
gammaloop-nextest-core> Extracted 18 files to /build/nextest-archive-FtZm0W in 0.50s
30.54 s
gammaloop-nextest-core> ------------
30.54 s
gammaloop-nextest-core> Nextest run ID a0e5fcbd-74c2-4e1a-beb9-e900a1e9eda2 with nextest profile: ci_gammaloop
30.54 s
gammaloop-nextest-core> Starting 692 tests across 4 binaries (60 tests skipped , including 59 tests via profile.ci_gammaloop.default-filter )
31.45 s
gammaloop-nextest-core> FAIL [ 0.107s] (159/692) gammalooprs graph::three_d_source::tests :: exact_taylor_vacuum_affine_circulation_preserves_energy_mapping
31.45 s
gammaloop-nextest-core> stdout ---
31.45 s
gammaloop-nextest-core>
31.45 s
gammaloop-nextest-core> running 1 test
31.45 s
gammaloop-nextest-core> test graph::three_d_source::tests::exact_taylor_vacuum_affine_circulation_preserves_energy_mapping ... FAILED
31.45 s
gammaloop-nextest-core>
31.45 s
gammaloop-nextest-core> failures:
31.45 s
gammaloop-nextest-core>
31.45 s
gammaloop-nextest-core> failures:
31.45 s
gammaloop-nextest-core> graph::three_d_source::tests::exact_taylor_vacuum_affine_circulation_preserves_energy_mapping
31.45 s
gammaloop-nextest-core>
31.45 s
gammaloop-nextest-core> test result: FAILED. 0 passed; 1 failed; 0 ignored; 0 measured; 742 filtered out; finished in 0.10s
31.45 s
gammaloop-nextest-core>
31.45 s
gammaloop-nextest-core> stderr ---
31.45 s
gammaloop-nextest-core> The application panicked (crashed).
31.45 s
gammaloop-nextest-core> Message: assertion `left == right` failed
31.45 s
gammaloop-nextest-core> left: (gammalooprs::mUVexp^2+(-gammalooprs::Q(1,spenso::cind(1))+gammalooprs::Q(4,spenso::cind(1)))^2+(-gammalooprs::Q(1,spenso::cind(2))+gammalooprs::Q(4,spenso::cind(2)))^2+(-gammalooprs::Q(1,spenso::cind(3))+gammalooprs::Q(4,spenso::cind(3)))^2)^(1/2)
31.45 s
gammaloop-nextest-core> right: (gammalooprs::mUVexp^2+(gammalooprs::Q(1,spenso::cind(1))-gammalooprs::Q(4,spenso::cind(1)))^2+(gammalooprs::Q(1,spenso::cind(2))-gammalooprs::Q(4,spenso::cind(2)))^2+(gammalooprs::Q(1,spenso::cind(3))-gammalooprs::Q(4,spenso::cind(3)))^2)^(1/2)
31.45 s
gammaloop-nextest-core> Location: crates/gammalooprs/src/graph/three_d_source.rs :7797
31.45 s
gammaloop-nextest-core>
31.45 s
gammaloop-nextest-core> ━━━━━━━━━━━━━━━━━━━━━━━━━━━━━━━━━━ BACKTRACE ━━━━━━━━━━━━━━━━━━━━━━━━━━━━━━━━━━━
31.45 s
gammaloop-nextest-core> 1: <color_eyre[51793ea62743adbd]::config::PanicHook>::panic_report <unknown>
31.45 s
gammaloop-nextest-core> at <unknown source file> :<unknown line>
31.45 s
gammaloop-nextest-core> 2: <color_eyre[51793ea62743adbd]::config::PanicHook>::into_panic_hook::{closure#0} <unknown>
31.45 s
gammaloop-nextest-core> at <unknown source file> :<unknown line>
31.45 s
gammaloop-nextest-core> 3: std[bcb96dfbba0ab899]::panicking::panic_with_hook <unknown>
31.45 s
gammaloop-nextest-core> at <unknown source file> :<unknown line>
31.45 s
gammaloop-nextest-core> 4: std[bcb96dfbba0ab899]::panicking::panic_handler::{closure#0} <unknown>
31.45 s
gammaloop-nextest-core> at <unknown source file> :<unknown line>
31.45 s
gammaloop-nextest-core> 5: std[bcb96dfbba0ab899]::sys::backtrace::__rust_end_short_backtrace::<std[bcb96dfbba0ab899]::panicking::panic_handler::{closure#0}, !> <unknown>
31.45 s
gammaloop-nextest-core> at <unknown source file> :<unknown line>
31.45 s
gammaloop-nextest-core> 6: __rustc[6c289b9f9c454d21]::rust_begin_unwind <unknown>
31.45 s
gammaloop-nextest-core> at <unknown source file> :<unknown line>
31.45 s
gammaloop-nextest-core> 7: core[940e698046960fd5]::panicking::panic_fmt <unknown>
31.45 s
gammaloop-nextest-core> at <unknown source file> :<unknown line>
31.45 s
gammaloop-nextest-core> 8: core[940e698046960fd5]::panicking::assert_failed_inner <unknown>
31.45 s
gammaloop-nextest-core> at <unknown source file> :<unknown line>
31.45 s
gammaloop-nextest-core> 9: core[940e698046960fd5]::panicking::assert_failed::<symbolica[499970c26fd75ddd]::atom::Atom, symbolica[499970c26fd75ddd]::atom::Atom> <unknown>
31.45 s
gammaloop-nextest-core> at <unknown source file> :<unknown line>
31.45 s
gammaloop-nextest-core> 10: gammalooprs[24955f93fc9f4e0c]::graph::three_d_source::tests::exact_taylor_vacuum_affine_circulation_preserves_energy_mapping <unknown>
31.45 s
gammaloop-nextest-core> at <unknown source file> :<unknown line>
31.45 s
gammaloop-nextest-core> 11: <gammalooprs[24955f93fc9f4e0c]::graph::three_d_source::tests::exact_taylor_vacuum_affine_circulation_preserves_energy_mapping::{closure#0} as core[940e698046960fd5]::ops::function::FnOnce<()>>::call_once <unknown>
31.45 s
gammaloop-nextest-core> at <unknown source file> :<unknown line>
31.45 s
gammaloop-nextest-core> 12: test[75d6903177b1d7e9]::__rust_begin_short_backtrace::<core[940e698046960fd5]::result::Result<(), alloc[2ea6bcb46fca0c42]::string::String>, fn() -> core[940e698046960fd5]::result::Result<(), alloc[2ea6bcb46fca0c42]::string::String>> <unknown>
31.45 s
gammaloop-nextest-core> at <unknown source file> :<unknown line>
31.45 s
gammaloop-nextest-core> 13: test[75d6903177b1d7e9]::run_test::{closure#0} <unknown>
31.45 s
gammaloop-nextest-core> at <unknown source file> :<unknown line>
31.45 s
gammaloop-nextest-core> 14: std[bcb96dfbba0ab899]::sys::backtrace::__rust_begin_short_backtrace::<test[75d6903177b1d7e9]::run_test::{closure#1}, ()> <unknown>
31.45 s
gammaloop-nextest-core> at <unknown source file> :<unknown line>
31.45 s
gammaloop-nextest-core> 15: <std[bcb96dfbba0ab899]::thread::lifecycle::spawn_unchecked<test[75d6903177b1d7e9]::run_test::{closure#1}, ()>::{closure#1} as core[940e698046960fd5]::ops::function::FnOnce<()>>::call_once::{shim:vtable#0} <unknown>
31.45 s
gammaloop-nextest-core> at <unknown source file> :<unknown line>
31.45 s
gammaloop-nextest-core> 16: <std[bcb96dfbba0ab899]::sys::thread::unix::Thread>::new::thread_start <unknown>
31.45 s
gammaloop-nextest-core> at <unknown source file> :<unknown line>
31.45 s
gammaloop-nextest-core> 17: start_thread <unknown>
31.45 s
gammaloop-nextest-core> at <unknown source file> :<unknown line>
31.45 s
gammaloop-nextest-core> 18: __clone3 <unknown>
31.45 s
gammaloop-nextest-core> at <unknown source file> :<unknown line>
31.45 s
gammaloop-nextest-core>
31.45 s
gammaloop-nextest-core> Run with COLORBT_SHOW_HIDDEN=1 environment variable to disable frame filtering.
31.45 s
gammaloop-nextest-core> Run with RUST_BACKTRACE=full to include source snippets.
31.45 s
gammaloop-nextest-core>
31.51 s
gammaloop-nextest-core> FAIL [ 0.134s] (181/692) gammalooprs graph::three_d_source::tests :: pinched_affine_carrier_requires_occurrence_interpolation
31.51 s
gammaloop-nextest-core> stdout ---
31.51 s
gammaloop-nextest-core>
31.51 s
gammaloop-nextest-core> running 1 test
31.51 s
gammaloop-nextest-core> test graph::three_d_source::tests::pinched_affine_carrier_requires_occurrence_interpolation ... FAILED
31.51 s
gammaloop-nextest-core>
31.51 s
gammaloop-nextest-core> failures:
31.51 s
gammaloop-nextest-core>
31.51 s
gammaloop-nextest-core> failures:
31.51 s
gammaloop-nextest-core> graph::three_d_source::tests::pinched_affine_carrier_requires_occurrence_interpolation
31.51 s
gammaloop-nextest-core>
31.51 s
gammaloop-nextest-core> test result: FAILED. 0 passed; 1 failed; 0 ignored; 0 measured; 742 filtered out; finished in 0.13s
31.51 s
gammaloop-nextest-core>
31.51 s
gammaloop-nextest-core> stderr ---
31.51 s
gammaloop-nextest-core> The application panicked (crashed).
31.51 s
gammaloop-nextest-core> Message: certified affine occurrence lift must reproduce the independent double contours: actual=-(-1/16*(3+E0)*(5+E0)/((1+Q(0,cind(1))^2+Q(0,cind(2))^2+Q(0,cind(3))^2)^(3/2)*(1+Q(1,cind(1))^2+Q(1,cind(2))^2+Q(1,cind(3))^2)^(3/2))-1/16*(3+E1)*(5+E1)/((1+Q(0,cind(1))^2+Q(0,cind(2))^2+Q(0,cind(3))^2)^(3/2)*(1+Q(1,cind(1))^2+Q(1,cind(2))^2+Q(1,cind(3))^2)^(3/2))-1/16*(3-E0)*(5-E0)/((1+Q(0,cind(1))^2+Q(0,cind(2))^2+Q(0,cind(3))^2)^(3/2)*(1+Q(1,cind(1))^2+Q(1,cind(2))^2+Q(1,cind(3))^2)^(3/2))-1/16*(3-E1)*(5-E1)/((1+Q(0,cind(1))^2+Q(0,cind(2))^2+Q(0,cind(3))^2)^(3/2)*(1+Q(1,cind(1))^2+Q(1,cind(2))^2+Q(1,cind(3))^2)^(3/2))+1/64*(3+E0+E1)*(5+E0+E1)/((1+Q(0,cind(1))^2+Q(0,cind(2))^2+Q(0,cind(3))^2)^(3/2)*(1+Q(1,cind(1))^2+Q(1,cind(2))^2+Q(1,cind(3))^2)^(3/2))+1/64*(3+E0-E1)*(5+E0-E1)/((1+Q(0,cind(1))^2+Q(0,cind(2))^2+Q(0,cind(3))^2)^(3/2)*(1+Q(1,cind(1))^2+Q(1,cind(2))^2+Q(1,cind(3))^2)^(3/2))+1/64*(3-E0+E1)*(5-E0+E1)/((1+Q(0,cind(1))^2+Q(0,cind(2))^2+Q(0,cind(3))^2)^(3/2)*(1+Q(1,cind(1))^2+Q(1,cind(2))^2+Q(1,cind(3))^2)^(3/2))+1/64*(3-E0-E1)*(5-E0-E1)/((1+Q(0,cind(1))^2+Q(0,cind(2))^2+Q(0,cind(3))^2)^(3/2)*(1+Q(1,cind(1))^2+Q(1,cind(2))^2+Q(1,cind(3))^2)^(3/2))+15/4/((1+Q(0,cind(1))^2+Q(0,cind(2))^2+Q(0,cind(3))^2)^(3/2)*(1+Q(1,cind(1))^2+Q(1,cind(2))^2+Q(1,cind(3))^2)^(3/2))), expected=1/16*(15-E0^2-E1^2)/(E0^3*E1^3)
31.51 s
gammaloop-nextest-core> Location: crates/gammalooprs/src/graph/three_d_source.rs :7619
31.51 s
gammaloop-nextest-core>
31.51 s
gammaloop-nextest-core> ━━━━━━━━━━━━━━━━━━━━━━━━━━━━━━━━━━ BACKTRACE ━━━━━━━━━━━━━━━━━━━━━━━━━━━━━━━━━━━
31.51 s
gammaloop-nextest-core> 1: <color_eyre[51793ea62743adbd]::config::PanicHook>::panic_report <unknown>
31.51 s
gammaloop-nextest-core> at <unknown source file> :<unknown line>
31.51 s
gammaloop-nextest-core> 2: <color_eyre[51793ea62743adbd]::config::PanicHook>::into_panic_hook::{closure#0} <unknown>
31.51 s
gammaloop-nextest-core> at <unknown source file> :<unknown line>
31.51 s
gammaloop-nextest-core> 3: std[bcb96dfbba0ab899]::panicking::panic_with_hook <unknown>
31.51 s
gammaloop-nextest-core> at <unknown source file> :<unknown line>
31.51 s
gammaloop-nextest-core> 4: std[bcb96dfbba0ab899]::panicking::panic_handler::{closure#0} <unknown>
31.51 s
gammaloop-nextest-core> at <unknown source file> :<unknown line>
31.51 s
gammaloop-nextest-core> 5: std[bcb96dfbba0ab899]::sys::backtrace::__rust_end_short_backtrace::<std[bcb96dfbba0ab899]::panicking::panic_handler::{closure#0}, !> <unknown>
31.51 s
gammaloop-nextest-core> at <unknown source file> :<unknown line>
31.51 s
gammaloop-nextest-core> 6: __rustc[6c289b9f9c454d21]::rust_begin_unwind <unknown>
31.51 s
gammaloop-nextest-core> at <unknown source file> :<unknown line>
31.51 s
gammaloop-nextest-core> 7: core[940e698046960fd5]::panicking::panic_fmt <unknown>
31.51 s
gammaloop-nextest-core> at <unknown source file> :<unknown line>
31.51 s
gammaloop-nextest-core> 8: <gammalooprs[24955f93fc9f4e0c]::graph::three_d_source::tests::pinched_affine_carrier_requires_occurrence_interpolation::{closure#0} as core[940e698046960fd5]::ops::function::FnOnce<()>>::call_once <unknown>
31.51 s
gammaloop-nextest-core> at <unknown source file> :<unknown line>
31.51 s
gammaloop-nextest-core> 9: test[75d6903177b1d7e9]::__rust_begin_short_backtrace::<core[940e698046960fd5]::result::Result<(), alloc[2ea6bcb46fca0c42]::string::String>, fn() -> core[940e698046960fd5]::result::Result<(), alloc[2ea6bcb46fca0c42]::string::String>> <unknown>
31.51 s
gammaloop-nextest-core> at <unknown source file> :<unknown line>
31.51 s
gammaloop-nextest-core> 10: test[75d6903177b1d7e9]::run_test::{closure#0} <unknown>
31.51 s
gammaloop-nextest-core> at <unknown source file> :<unknown line>
31.51 s
gammaloop-nextest-core> 11: std[bcb96dfbba0ab899]::sys::backtrace::__rust_begin_short_backtrace::<test[75d6903177b1d7e9]::run_test::{closure#1}, ()> <unknown>
31.51 s
gammaloop-nextest-core> at <unknown source file> :<unknown line>
31.51 s
gammaloop-nextest-core> 12: <std[bcb96dfbba0ab899]::thread::lifecycle::spawn_unchecked<test[75d6903177b1d7e9]::run_test::{closure#1}, ()>::{closure#1} as core[940e698046960fd5]::ops::function::FnOnce<()>>::call_once::{shim:vtable#0} <unknown>
31.51 s
gammaloop-nextest-core> at <unknown source file> :<unknown line>
31.51 s
gammaloop-nextest-core> 13: <std[bcb96dfbba0ab899]::sys::thread::unix::Thread>::new::thread_start <unknown>
31.51 s
gammaloop-nextest-core> at <unknown source file> :<unknown line>
31.51 s
gammaloop-nextest-core> 14: start_thread <unknown>
31.51 s
gammaloop-nextest-core> at <unknown source file> :<unknown line>
31.51 s
gammaloop-nextest-core> 15: __clone3 <unknown>
31.51 s
gammaloop-nextest-core> at <unknown source file> :<unknown line>
31.51 s
gammaloop-nextest-core>
31.51 s
gammaloop-nextest-core> Run with COLORBT_SHOW_HIDDEN=1 environment variable to disable frame filtering.
31.51 s
gammaloop-nextest-core> Run with RUST_BACKTRACE=full to include source snippets.
31.51 s
gammaloop-nextest-core>
31.70 s
gammaloop-nextest-core> FAIL [ 0.021s] (298/692) gammalooprs numerator::energy_degree::tests :: canonical_class_cyclic_lifts_preserve_factorization_and_exact_bounds
31.70 s
gammaloop-nextest-core> stdout ---
31.70 s
gammaloop-nextest-core>
31.70 s
gammaloop-nextest-core> running 1 test
31.70 s
gammaloop-nextest-core> test numerator::energy_degree::tests::canonical_class_cyclic_lifts_preserve_factorization_and_exact_bounds ... FAILED
31.70 s
gammaloop-nextest-core>
31.70 s
gammaloop-nextest-core> failures:
31.70 s
gammaloop-nextest-core>
31.70 s
gammaloop-nextest-core> failures:
31.70 s
gammaloop-nextest-core> numerator::energy_degree::tests::canonical_class_cyclic_lifts_preserve_factorization_and_exact_bounds
31.70 s
gammaloop-nextest-core>
31.70 s
gammaloop-nextest-core> test result: FAILED. 0 passed; 1 failed; 0 ignored; 0 measured; 742 filtered out; finished in 0.01s
31.70 s
gammaloop-nextest-core>
31.70 s
gammaloop-nextest-core> stderr ---
31.70 s
gammaloop-nextest-core>
31.70 s
gammaloop-nextest-core> thread 'numerator::energy_degree::tests::canonical_class_cyclic_lifts_preserve_factorization_and_exact_bounds' (2289) panicked at crates/gammalooprs/src/numerator/energy_degree.rs:2850:13:
31.70 s
gammaloop-nextest-core> assertion failed: (collapsed - expression).collect_factors().is_zero()
31.70 s
gammaloop-nextest-core> stack backtrace:
31.70 s
gammaloop-nextest-core> 0: __rustc::rust_begin_unwind
31.70 s
gammaloop-nextest-core> 1: core::panicking::panic_fmt
31.70 s
gammaloop-nextest-core> 2: core::panicking::panic
31.70 s
gammaloop-nextest-core> 3: gammalooprs::numerator::energy_degree::tests::canonical_class_cyclic_lifts_preserve_factorization_and_exact_bounds
31.70 s
gammaloop-nextest-core> 4: <gammalooprs::numerator::energy_degree::tests::canonical_class_cyclic_lifts_preserve_factorization_and_exact_bounds::{closure#0} as core::ops::function::FnOnce<()>>::call_once
31.70 s
gammaloop-nextest-core> note: Some details are omitted, run with `RUST_BACKTRACE=full` for a verbose backtrace.
31.70 s
gammaloop-nextest-core>
32.67 s
gammaloop-nextest-core> FAIL [ 0.107s] (592/692) gammalooprs uv::approx::local_4d::tests :: canonical_uv_signed_multiloop_carriers_preserve_factorized_numerators
32.67 s
gammaloop-nextest-core> stdout ---
32.67 s
gammaloop-nextest-core>
32.67 s
gammaloop-nextest-core> running 1 test
32.67 s
gammaloop-nextest-core> test uv::approx::local_4d::tests::canonical_uv_signed_multiloop_carriers_preserve_factorized_numerators ... FAILED
32.67 s
gammaloop-nextest-core>
32.67 s
gammaloop-nextest-core> failures:
32.67 s
gammaloop-nextest-core>
32.67 s
gammaloop-nextest-core> failures:
32.67 s
gammaloop-nextest-core> uv::approx::local_4d::tests::canonical_uv_signed_multiloop_carriers_preserve_factorized_numerators
32.67 s
gammaloop-nextest-core>
32.67 s
gammaloop-nextest-core> test result: FAILED. 0 passed; 1 failed; 0 ignored; 0 measured; 742 filtered out; finished in 0.09s
32.67 s
gammaloop-nextest-core>
32.67 s
gammaloop-nextest-core> stderr ---
32.67 s
gammaloop-nextest-core> The application panicked (crashed).
32.67 s
gammaloop-nextest-core> Message: assertion `left == right` failed
32.67 s
gammaloop-nextest-core> left: 2*(signed_multiloop::a+signed_multiloop::b)^5*gammalooprs::Q(gammalooprs::uv::class(0),spenso::cind(0))
32.67 s
gammaloop-nextest-core> right: -2*(signed_multiloop::a+signed_multiloop::b)^5*gammalooprs::Q(gammalooprs::uv::class(0),spenso::cind(0))
32.67 s
gammaloop-nextest-core> Location: crates/gammalooprs/src/uv/approx/local_4d.rs :1983
32.67 s
gammaloop-nextest-core>
32.67 s
gammaloop-nextest-core> ━━━━━━━━━━━━━━━━━━━━━━━━━━━━━━━━━━ BACKTRACE ━━━━━━━━━━━━━━━━━━━━━━━━━━━━━━━━━━━
32.67 s
gammaloop-nextest-core> 1: <color_eyre[51793ea62743adbd]::config::PanicHook>::panic_report <unknown>
32.67 s
gammaloop-nextest-core> at <unknown source file> :<unknown line>
32.67 s
gammaloop-nextest-core> 2: <color_eyre[51793ea62743adbd]::config::PanicHook>::into_panic_hook::{closure#0} <unknown>
32.67 s
gammaloop-nextest-core> at <unknown source file> :<unknown line>
32.67 s
gammaloop-nextest-core> 3: std[bcb96dfbba0ab899]::panicking::panic_with_hook <unknown>
32.67 s
gammaloop-nextest-core> at <unknown source file> :<unknown line>
32.67 s
gammaloop-nextest-core> 4: std[bcb96dfbba0ab899]::panicking::panic_handler::{closure#0} <unknown>
32.67 s
gammaloop-nextest-core> at <unknown source file> :<unknown line>
32.67 s
gammaloop-nextest-core> 5: std[bcb96dfbba0ab899]::sys::backtrace::__rust_end_short_backtrace::<std[bcb96dfbba0ab899]::panicking::panic_handler::{closure#0}, !> <unknown>
32.67 s
gammaloop-nextest-core> at <unknown source file> :<unknown line>
32.67 s
gammaloop-nextest-core> 6: __rustc[6c289b9f9c454d21]::rust_begin_unwind <unknown>
32.67 s
gammaloop-nextest-core> at <unknown source file> :<unknown line>
32.67 s
gammaloop-nextest-core> 7: core[940e698046960fd5]::panicking::panic_fmt <unknown>
32.67 s
gammaloop-nextest-core> at <unknown source file> :<unknown line>
32.67 s
gammaloop-nextest-core> 8: core[940e698046960fd5]::panicking::assert_failed_inner <unknown>
32.67 s
gammaloop-nextest-core> at <unknown source file> :<unknown line>
32.67 s
gammaloop-nextest-core> 9: core[940e698046960fd5]::panicking::assert_failed::<symbolica[499970c26fd75ddd]::atom::Atom, symbolica[499970c26fd75ddd]::atom::Atom> <unknown>
32.67 s
gammaloop-nextest-core> at <unknown source file> :<unknown line>
32.67 s
gammaloop-nextest-core> 10: gammalooprs[24955f93fc9f4e0c]::uv::approx::local_4d::tests::canonical_uv_signed_multiloop_carriers_preserve_factorized_numerators <unknown>
32.67 s
gammaloop-nextest-core> at <unknown source file> :<unknown line>
32.67 s
gammaloop-nextest-core> 11: <gammalooprs[24955f93fc9f4e0c]::uv::approx::local_4d::tests::canonical_uv_signed_multiloop_carriers_preserve_factorized_numerators::{closure#0} as core[940e698046960fd5]::ops::function::FnOnce<()>>::call_once <unknown>
32.67 s
gammaloop-nextest-core> at <unknown source file> :<unknown line>
32.67 s
gammaloop-nextest-core> 12: test[75d6903177b1d7e9]::__rust_begin_short_backtrace::<core[940e698046960fd5]::result::Result<(), alloc[2ea6bcb46fca0c42]::string::String>, fn() -> core[940e698046960fd5]::result::Result<(), alloc[2ea6bcb46fca0c42]::string::String>> <unknown>
32.67 s
gammaloop-nextest-core> at <unknown source file> :<unknown line>
32.67 s
gammaloop-nextest-core> 13: test[75d6903177b1d7e9]::run_test::{closure#0} <unknown>
32.67 s
gammaloop-nextest-core> at <unknown source file> :<unknown line>
32.67 s
gammaloop-nextest-core> 14: std[bcb96dfbba0ab899]::sys::backtrace::__rust_begin_short_backtrace::<test[75d6903177b1d7e9]::run_test::{closure#1}, ()> <unknown>
32.67 s
gammaloop-nextest-core> at <unknown source file> :<unknown line>
32.67 s
gammaloop-nextest-core> 15: <std[bcb96dfbba0ab899]::thread::lifecycle::spawn_unchecked<test[75d6903177b1d7e9]::run_test::{closure#1}, ()>::{closure#1} as core[940e698046960fd5]::ops::function::FnOnce<()>>::call_once::{shim:vtable#0} <unknown>
32.67 s
gammaloop-nextest-core> at <unknown source file> :<unknown line>
32.67 s
gammaloop-nextest-core> 16: <std[bcb96dfbba0ab899]::sys::thread::unix::Thread>::new::thread_start <unknown>
32.67 s
gammaloop-nextest-core> at <unknown source file> :<unknown line>
32.67 s
gammaloop-nextest-core> 17: start_thread <unknown>
32.67 s
gammaloop-nextest-core> at <unknown source file> :<unknown line>
32.67 s
gammaloop-nextest-core> 18: __clone3 <unknown>
32.67 s
gammaloop-nextest-core> at <unknown source file> :<unknown line>
32.67 s
gammaloop-nextest-core>
32.67 s
gammaloop-nextest-core> Run with COLORBT_SHOW_HIDDEN=1 environment variable to disable frame filtering.
32.67 s
gammaloop-nextest-core> Run with RUST_BACKTRACE=full to include source snippets.
32.67 s
gammaloop-nextest-core>
32.68 s
gammaloop-nextest-core> FAIL [ 0.129s] (593/692) gammalooprs uv::approx::local_4d::tests :: canonical_uv_classes_certify_signed_aliases_and_preserve_raw_sectors
32.68 s
gammaloop-nextest-core> stdout ---
32.68 s
gammaloop-nextest-core>
32.68 s
gammaloop-nextest-core> running 1 test
32.68 s
gammaloop-nextest-core> test uv::approx::local_4d::tests::canonical_uv_classes_certify_signed_aliases_and_preserve_raw_sectors ... FAILED
32.68 s
gammaloop-nextest-core>
32.68 s
gammaloop-nextest-core> failures:
32.68 s
gammaloop-nextest-core>
32.68 s
gammaloop-nextest-core> failures:
32.68 s
gammaloop-nextest-core> uv::approx::local_4d::tests::canonical_uv_classes_certify_signed_aliases_and_preserve_raw_sectors
32.68 s
gammaloop-nextest-core>
32.68 s
gammaloop-nextest-core> test result: FAILED. 0 passed; 1 failed; 0 ignored; 0 measured; 742 filtered out; finished in 0.11s
32.68 s
gammaloop-nextest-core>
32.68 s
gammaloop-nextest-core> stderr ---
32.68 s
gammaloop-nextest-core> Error:
32.68 s
gammaloop-nextest-core> 0: merged canonical UV numerator does not reproduce its source bucket
32.68 s
gammaloop-nextest-core>
32.68 s
gammaloop-nextest-core> Location:
32.68 s
gammaloop-nextest-core> crates/gammalooprs/src/uv/approx/local_4d.rs :367
32.68 s
gammaloop-nextest-core>
32.68 s
gammaloop-nextest-core> ━━━━━━━━━━━━━━━━━━━━━━━━━━━━━━━━━━ BACKTRACE ━━━━━━━━━━━━━━━━━━━━━━━━━━━━━━━━━━━
32.68 s
gammaloop-nextest-core> 1: <color_eyre[51793ea62743adbd]::config::EyreHook>::into_eyre_hook::{closure#0} <unknown>
32.68 s
gammaloop-nextest-core> at <unknown source file> :<unknown line>
32.68 s
gammaloop-nextest-core> 2: eyre[cb2fd339c0c40fca]::capture_handler <unknown>
32.68 s
gammaloop-nextest-core> at <unknown source file> :<unknown line>
32.68 s
gammaloop-nextest-core> 3: eyre[cb2fd339c0c40fca]::private::format_err <unknown>
32.68 s
gammaloop-nextest-core> at <unknown source file> :<unknown line>
32.68 s
gammaloop-nextest-core> 4: <gammalooprs[24955f93fc9f4e0c]::uv::approx::local_4d::FourDSector>::canonical_projection <unknown>
32.68 s
gammaloop-nextest-core> at <unknown source file> :<unknown line>
32.68 s
gammaloop-nextest-core> 5: gammalooprs[24955f93fc9f4e0c]::uv::approx::local_4d::tests::canonical_uv_classes_certify_signed_aliases_and_preserve_raw_sectors <unknown>
32.68 s
gammaloop-nextest-core> at <unknown source file> :<unknown line>
32.68 s
gammaloop-nextest-core> 6: <gammalooprs[24955f93fc9f4e0c]::uv::approx::local_4d::tests::canonical_uv_classes_certify_signed_aliases_and_preserve_raw_sectors::{closure#0} as core[940e698046960fd5]::ops::function::FnOnce<()>>::call_once <unknown>
32.68 s
gammaloop-nextest-core> at <unknown source file> :<unknown line>
32.68 s
gammaloop-nextest-core> 7: test[75d6903177b1d7e9]::__rust_begin_short_backtrace::<core[940e698046960fd5]::result::Result<(), alloc[2ea6bcb46fca0c42]::string::String>, fn() -> core[940e698046960fd5]::result::Result<(), alloc[2ea6bcb46fca0c42]::string::String>> <unknown>
32.68 s
gammaloop-nextest-core> at <unknown source file> :<unknown line>
32.68 s
gammaloop-nextest-core> 8: test[75d6903177b1d7e9]::run_test::{closure#0} <unknown>
32.68 s
gammaloop-nextest-core> at <unknown source file> :<unknown line>
32.68 s
gammaloop-nextest-core> 9: std[bcb96dfbba0ab899]::sys::backtrace::__rust_begin_short_backtrace::<test[75d6903177b1d7e9]::run_test::{closure#1}, ()> <unknown>
32.68 s
gammaloop-nextest-core> at <unknown source file> :<unknown line>
32.68 s
gammaloop-nextest-core> 10: <std[bcb96dfbba0ab899]::thread::lifecycle::spawn_unchecked<test[75d6903177b1d7e9]::run_test::{closure#1}, ()>::{closure#1} as core[940e698046960fd5]::ops::function::FnOnce<()>>::call_once::{shim:vtable#0} <unknown>
32.68 s
gammaloop-nextest-core> at <unknown source file> :<unknown line>
32.68 s
gammaloop-nextest-core> 11: <std[bcb96dfbba0ab899]::sys::thread::unix::Thread>::new::thread_start <unknown>
32.68 s
gammaloop-nextest-core> at <unknown source file> :<unknown line>
32.68 s
gammaloop-nextest-core> 12: start_thread <unknown>
32.68 s
gammaloop-nextest-core> at <unknown source file> :<unknown line>
32.68 s
gammaloop-nextest-core> 13: __clone3 <unknown>
32.68 s
gammaloop-nextest-core> at <unknown source file> :<unknown line>
32.68 s
gammaloop-nextest-core>
32.68 s
gammaloop-nextest-core> Run with COLORBT_SHOW_HIDDEN=1 environment variable to disable frame filtering.
32.68 s
gammaloop-nextest-core> Run with RUST_BACKTRACE=full to include source snippets.
32.68 s
gammaloop-nextest-core>
32.86 s
gammaloop-nextest-core> FAIL [ 0.100s] (606/692) gammalooprs uv::approx::tests :: direct_nested_scalar_banana_replays_complete_cff_at_depth_three
32.86 s
gammaloop-nextest-core> stdout ---
32.86 s
gammaloop-nextest-core>
32.86 s
gammaloop-nextest-core> running 1 test
32.86 s
gammaloop-nextest-core> test uv::approx::tests::direct_nested_scalar_banana_replays_complete_cff_at_depth_three ... FAILED
32.86 s
gammaloop-nextest-core>
32.86 s
gammaloop-nextest-core> failures:
32.86 s
gammaloop-nextest-core>
32.86 s
gammaloop-nextest-core> failures:
32.86 s
gammaloop-nextest-core> uv::approx::tests::direct_nested_scalar_banana_replays_complete_cff_at_depth_three
32.86 s
gammaloop-nextest-core>
32.86 s
gammaloop-nextest-core> test result: FAILED. 0 passed; 1 failed; 0 ignored; 0 measured; 742 filtered out; finished in 0.09s
32.86 s
gammaloop-nextest-core>
32.86 s
gammaloop-nextest-core> stderr ---
32.86 s
gammaloop-nextest-core> Error:
32.86 s
gammaloop-nextest-core> 0: canonical UV numerator does not reproduce its source in the component frame
32.86 s
gammaloop-nextest-core>
32.86 s
gammaloop-nextest-core> Location:
32.86 s
gammaloop-nextest-core> crates/gammalooprs/src/uv/approx/local_4d.rs :354
32.86 s
gammaloop-nextest-core>
32.86 s
gammaloop-nextest-core> ━━━━━━━━━━━━━━━━━━━━━━━━━━━━━━━━━━ BACKTRACE ━━━━━━━━━━━━━━━━━━━━━━━━━━━━━━━━━━━
32.86 s
gammaloop-nextest-core> 1: <color_eyre[51793ea62743adbd]::config::EyreHook>::into_eyre_hook::{closure#0} <unknown>
32.86 s
gammaloop-nextest-core> at <unknown source file> :<unknown line>
32.86 s
gammaloop-nextest-core> 2: eyre[cb2fd339c0c40fca]::capture_handler <unknown>
32.86 s
gammaloop-nextest-core> at <unknown source file> :<unknown line>
32.86 s
gammaloop-nextest-core> 3: eyre[cb2fd339c0c40fca]::private::format_err <unknown>
32.86 s
gammaloop-nextest-core> at <unknown source file> :<unknown line>
32.86 s
gammaloop-nextest-core> 4: <gammalooprs[24955f93fc9f4e0c]::uv::approx::local_4d::FourDSector>::canonical_projection <unknown>
32.86 s
gammaloop-nextest-core> at <unknown source file> :<unknown line>
32.86 s
gammaloop-nextest-core> 5: <gammalooprs[24955f93fc9f4e0c]::uv::approx::projected_4d::Projected4dApproximation>::project_local_4d <unknown>
32.86 s
gammaloop-nextest-core> at <unknown source file> :<unknown line>
32.86 s
gammaloop-nextest-core> 6: <gammalooprs[24955f93fc9f4e0c]::uv::approx::Approximation>::compute_3d <unknown>
32.86 s
gammaloop-nextest-core> at <unknown source file> :<unknown line>
32.86 s
gammaloop-nextest-core> 7: gammalooprs[24955f93fc9f4e0c]::uv::approx::tests::direct_nested_scalar_banana_replays_complete_cff_at_depth_three::{closure#0} <unknown>
32.86 s
gammaloop-nextest-core> at <unknown source file> :<unknown line>
32.86 s
gammaloop-nextest-core> 8: gammalooprs[24955f93fc9f4e0c]::uv::approx::tests::direct_nested_scalar_banana_replays_complete_cff_at_depth_three <unknown>
32.86 s
gammaloop-nextest-core> at <unknown source file> :<unknown line>
32.86 s
gammaloop-nextest-core> 9: <gammalooprs[24955f93fc9f4e0c]::uv::approx::tests::direct_nested_scalar_banana_replays_complete_cff_at_depth_three::{closure#0} as core[940e698046960fd5]::ops::function::FnOnce<()>>::call_once <unknown>
32.86 s
gammaloop-nextest-core> at <unknown source file> :<unknown line>
32.86 s
gammaloop-nextest-core> 10: test[75d6903177b1d7e9]::__rust_begin_short_backtrace::<core[940e698046960fd5]::result::Result<(), alloc[2ea6bcb46fca0c42]::string::String>, fn() -> core[940e698046960fd5]::result::Result<(), alloc[2ea6bcb46fca0c42]::string::String>> <unknown>
32.86 s
gammaloop-nextest-core> at <unknown source file> :<unknown line>
32.86 s
gammaloop-nextest-core> 11: test[75d6903177b1d7e9]::run_test::{closure#0} <unknown>
32.86 s
gammaloop-nextest-core> at <unknown source file> :<unknown line>
32.86 s
gammaloop-nextest-core> 12: std[bcb96dfbba0ab899]::sys::backtrace::__rust_begin_short_backtrace::<test[75d6903177b1d7e9]::run_test::{closure#1}, ()> <unknown>
32.86 s
gammaloop-nextest-core> at <unknown source file> :<unknown line>
32.86 s
gammaloop-nextest-core> 13: <std[bcb96dfbba0ab899]::thread::lifecycle::spawn_unchecked<test[75d6903177b1d7e9]::run_test::{closure#1}, ()>::{closure#1} as core[940e698046960fd5]::ops::function::FnOnce<()>>::call_once::{shim:vtable#0} <unknown>
32.86 s
gammaloop-nextest-core> at <unknown source file> :<unknown line>
32.86 s
gammaloop-nextest-core> 14: <std[bcb96dfbba0ab899]::sys::thread::unix::Thread>::new::thread_start <unknown>
32.86 s
gammaloop-nextest-core> at <unknown source file> :<unknown line>
32.86 s
gammaloop-nextest-core> 15: start_thread <unknown>
32.86 s
gammaloop-nextest-core> at <unknown source file> :<unknown line>
32.86 s
gammaloop-nextest-core> 16: __clone3 <unknown>
32.86 s
gammaloop-nextest-core> at <unknown source file> :<unknown line>
32.86 s
gammaloop-nextest-core>
32.86 s
gammaloop-nextest-core> Run with COLORBT_SHOW_HIDDEN=1 environment variable to disable frame filtering.
32.86 s
gammaloop-nextest-core> Run with RUST_BACKTRACE=full to include source snippets.
32.86 s
gammaloop-nextest-core>
43.40 s
gammaloop-nextest-core> ------------
43.40 s
gammaloop-nextest-core> Summary [ 12.865s] 692 tests run: 686 passed , 6 failed , 60 skipped
43.40 s
gammaloop-nextest-core> FAIL [ 0.107s] (159/692) gammalooprs graph::three_d_source::tests :: exact_taylor_vacuum_affine_circulation_preserves_energy_mapping
43.40 s
gammaloop-nextest-core> stdout ---
43.40 s
gammaloop-nextest-core>
43.40 s
gammaloop-nextest-core> running 1 test
43.40 s
gammaloop-nextest-core> test graph::three_d_source::tests::exact_taylor_vacuum_affine_circulation_preserves_energy_mapping ... FAILED
43.40 s
gammaloop-nextest-core>
43.40 s
gammaloop-nextest-core> failures:
43.40 s
gammaloop-nextest-core>
43.40 s
gammaloop-nextest-core> failures:
43.40 s
gammaloop-nextest-core> graph::three_d_source::tests::exact_taylor_vacuum_affine_circulation_preserves_energy_mapping
43.40 s
gammaloop-nextest-core>
43.40 s
gammaloop-nextest-core> test result: FAILED. 0 passed; 1 failed; 0 ignored; 0 measured; 742 filtered out; finished in 0.10s
43.40 s
gammaloop-nextest-core>
43.40 s
gammaloop-nextest-core> stderr ---
43.40 s
gammaloop-nextest-core> The application panicked (crashed).
43.40 s
gammaloop-nextest-core> Message: assertion `left == right` failed
43.40 s
gammaloop-nextest-core> left: (gammalooprs::mUVexp^2+(-gammalooprs::Q(1,spenso::cind(1))+gammalooprs::Q(4,spenso::cind(1)))^2+(-gammalooprs::Q(1,spenso::cind(2))+gammalooprs::Q(4,spenso::cind(2)))^2+(-gammalooprs::Q(1,spenso::cind(3))+gammalooprs::Q(4,spenso::cind(3)))^2)^(1/2)
43.40 s
gammaloop-nextest-core> right: (gammalooprs::mUVexp^2+(gammalooprs::Q(1,spenso::cind(1))-gammalooprs::Q(4,spenso::cind(1)))^2+(gammalooprs::Q(1,spenso::cind(2))-gammalooprs::Q(4,spenso::cind(2)))^2+(gammalooprs::Q(1,spenso::cind(3))-gammalooprs::Q(4,spenso::cind(3)))^2)^(1/2)
43.40 s
gammaloop-nextest-core> Location: crates/gammalooprs/src/graph/three_d_source.rs :7797
43.40 s
gammaloop-nextest-core>
43.40 s
gammaloop-nextest-core> ━━━━━━━━━━━━━━━━━━━━━━━━━━━━━━━━━━ BACKTRACE ━━━━━━━━━━━━━━━━━━━━━━━━━━━━━━━━━━━
43.40 s
gammaloop-nextest-core> 1: <color_eyre[51793ea62743adbd]::config::PanicHook>::panic_report <unknown>
43.40 s
gammaloop-nextest-core> at <unknown source file> :<unknown line>
43.40 s
gammaloop-nextest-core> 2: <color_eyre[51793ea62743adbd]::config::PanicHook>::into_panic_hook::{closure#0} <unknown>
43.40 s
gammaloop-nextest-core> at <unknown source file> :<unknown line>
43.40 s
gammaloop-nextest-core> 3: std[bcb96dfbba0ab899]::panicking::panic_with_hook <unknown>
43.40 s
gammaloop-nextest-core> at <unknown source file> :<unknown line>
43.40 s
gammaloop-nextest-core> 4: std[bcb96dfbba0ab899]::panicking::panic_handler::{closure#0} <unknown>
43.40 s
gammaloop-nextest-core> at <unknown source file> :<unknown line>
43.40 s
gammaloop-nextest-core> 5: std[bcb96dfbba0ab899]::sys::backtrace::__rust_end_short_backtrace::<std[bcb96dfbba0ab899]::panicking::panic_handler::{closure#0}, !> <unknown>
43.40 s
gammaloop-nextest-core> at <unknown source file> :<unknown line>
43.40 s
gammaloop-nextest-core> 6: __rustc[6c289b9f9c454d21]::rust_begin_unwind <unknown>
43.40 s
gammaloop-nextest-core> at <unknown source file> :<unknown line>
43.40 s
gammaloop-nextest-core> 7: core[940e698046960fd5]::panicking::panic_fmt <unknown>
43.40 s
gammaloop-nextest-core> at <unknown source file> :<unknown line>
43.40 s
gammaloop-nextest-core> 8: core[940e698046960fd5]::panicking::assert_failed_inner <unknown>
43.40 s
gammaloop-nextest-core> at <unknown source file> :<unknown line>
43.40 s
gammaloop-nextest-core> 9: core[940e698046960fd5]::panicking::assert_failed::<symbolica[499970c26fd75ddd]::atom::Atom, symbolica[499970c26fd75ddd]::atom::Atom> <unknown>
43.40 s
gammaloop-nextest-core> at <unknown source file> :<unknown line>
43.40 s
gammaloop-nextest-core> 10: gammalooprs[24955f93fc9f4e0c]::graph::three_d_source::tests::exact_taylor_vacuum_affine_circulation_preserves_energy_mapping <unknown>
43.40 s
gammaloop-nextest-core> at <unknown source file> :<unknown line>
43.40 s
gammaloop-nextest-core> 11: <gammalooprs[24955f93fc9f4e0c]::graph::three_d_source::tests::exact_taylor_vacuum_affine_circulation_preserves_energy_mapping::{closure#0} as core[940e698046960fd5]::ops::function::FnOnce<()>>::call_once <unknown>
43.40 s
gammaloop-nextest-core> at <unknown source file> :<unknown line>
43.40 s
gammaloop-nextest-core> 12: test[75d6903177b1d7e9]::__rust_begin_short_backtrace::<core[940e698046960fd5]::result::Result<(), alloc[2ea6bcb46fca0c42]::string::String>, fn() -> core[940e698046960fd5]::result::Result<(), alloc[2ea6bcb46fca0c42]::string::String>> <unknown>
43.40 s
gammaloop-nextest-core> at <unknown source file> :<unknown line>
43.40 s
gammaloop-nextest-core> 13: test[75d6903177b1d7e9]::run_test::{closure#0} <unknown>
43.40 s
gammaloop-nextest-core> at <unknown source file> :<unknown line>
43.40 s
gammaloop-nextest-core> 14: std[bcb96dfbba0ab899]::sys::backtrace::__rust_begin_short_backtrace::<test[75d6903177b1d7e9]::run_test::{closure#1}, ()> <unknown>
43.40 s
gammaloop-nextest-core> at <unknown source file> :<unknown line>
43.40 s
gammaloop-nextest-core> 15: <std[bcb96dfbba0ab899]::thread::lifecycle::spawn_unchecked<test[75d6903177b1d7e9]::run_test::{closure#1}, ()>::{closure#1} as core[940e698046960fd5]::ops::function::FnOnce<()>>::call_once::{shim:vtable#0} <unknown>
43.40 s
gammaloop-nextest-core> at <unknown source file> :<unknown line>
43.40 s
gammaloop-nextest-core> 16: <std[bcb96dfbba0ab899]::sys::thread::unix::Thread>::new::thread_start <unknown>
43.40 s
gammaloop-nextest-core> at <unknown source file> :<unknown line>
43.40 s
gammaloop-nextest-core> 17: start_thread <unknown>
43.40 s
gammaloop-nextest-core> at <unknown source file> :<unknown line>
43.40 s
gammaloop-nextest-core> 18: __clone3 <unknown>
43.40 s
gammaloop-nextest-core> at <unknown source file> :<unknown line>
43.40 s
gammaloop-nextest-core>
43.40 s
gammaloop-nextest-core> Run with COLORBT_SHOW_HIDDEN=1 environment variable to disable frame filtering.
43.40 s
gammaloop-nextest-core> Run with RUST_BACKTRACE=full to include source snippets.
43.40 s
gammaloop-nextest-core>
43.40 s
gammaloop-nextest-core> FAIL [ 0.134s] (181/692) gammalooprs graph::three_d_source::tests :: pinched_affine_carrier_requires_occurrence_interpolation
43.40 s
gammaloop-nextest-core> stdout ---
43.40 s
gammaloop-nextest-core>
43.40 s
gammaloop-nextest-core> running 1 test
43.40 s
gammaloop-nextest-core> test graph::three_d_source::tests::pinched_affine_carrier_requires_occurrence_interpolation ... FAILED
43.40 s
gammaloop-nextest-core>
43.40 s
gammaloop-nextest-core> failures:
43.40 s
gammaloop-nextest-core>
43.40 s
gammaloop-nextest-core> failures:
43.40 s
gammaloop-nextest-core> graph::three_d_source::tests::pinched_affine_carrier_requires_occurrence_interpolation
43.40 s
gammaloop-nextest-core>
43.40 s
gammaloop-nextest-core> test result: FAILED. 0 passed; 1 failed; 0 ignored; 0 measured; 742 filtered out; finished in 0.13s
43.40 s
gammaloop-nextest-core>
43.40 s
gammaloop-nextest-core> stderr ---
43.40 s
gammaloop-nextest-core> The application panicked (crashed).
43.40 s
gammaloop-nextest-core> Message: certified affine occurrence lift must reproduce the independent double contours: actual=-(-1/16*(3+E0)*(5+E0)/((1+Q(0,cind(1))^2+Q(0,cind(2))^2+Q(0,cind(3))^2)^(3/2)*(1+Q(1,cind(1))^2+Q(1,cind(2))^2+Q(1,cind(3))^2)^(3/2))-1/16*(3+E1)*(5+E1)/((1+Q(0,cind(1))^2+Q(0,cind(2))^2+Q(0,cind(3))^2)^(3/2)*(1+Q(1,cind(1))^2+Q(1,cind(2))^2+Q(1,cind(3))^2)^(3/2))-1/16*(3-E0)*(5-E0)/((1+Q(0,cind(1))^2+Q(0,cind(2))^2+Q(0,cind(3))^2)^(3/2)*(1+Q(1,cind(1))^2+Q(1,cind(2))^2+Q(1,cind(3))^2)^(3/2))-1/16*(3-E1)*(5-E1)/((1+Q(0,cind(1))^2+Q(0,cind(2))^2+Q(0,cind(3))^2)^(3/2)*(1+Q(1,cind(1))^2+Q(1,cind(2))^2+Q(1,cind(3))^2)^(3/2))+1/64*(3+E0+E1)*(5+E0+E1)/((1+Q(0,cind(1))^2+Q(0,cind(2))^2+Q(0,cind(3))^2)^(3/2)*(1+Q(1,cind(1))^2+Q(1,cind(2))^2+Q(1,cind(3))^2)^(3/2))+1/64*(3+E0-E1)*(5+E0-E1)/((1+Q(0,cind(1))^2+Q(0,cind(2))^2+Q(0,cind(3))^2)^(3/2)*(1+Q(1,cind(1))^2+Q(1,cind(2))^2+Q(1,cind(3))^2)^(3/2))+1/64*(3-E0+E1)*(5-E0+E1)/((1+Q(0,cind(1))^2+Q(0,cind(2))^2+Q(0,cind(3))^2)^(3/2)*(1+Q(1,cind(1))^2+Q(1,cind(2))^2+Q(1,cind(3))^2)^(3/2))+1/64*(3-E0-E1)*(5-E0-E1)/((1+Q(0,cind(1))^2+Q(0,cind(2))^2+Q(0,cind(3))^2)^(3/2)*(1+Q(1,cind(1))^2+Q(1,cind(2))^2+Q(1,cind(3))^2)^(3/2))+15/4/((1+Q(0,cind(1))^2+Q(0,cind(2))^2+Q(0,cind(3))^2)^(3/2)*(1+Q(1,cind(1))^2+Q(1,cind(2))^2+Q(1,cind(3))^2)^(3/2))), expected=1/16*(15-E0^2-E1^2)/(E0^3*E1^3)
43.40 s
gammaloop-nextest-core> Location: crates/gammalooprs/src/graph/three_d_source.rs :7619
43.40 s
gammaloop-nextest-core>
43.40 s
gammaloop-nextest-core> ━━━━━━━━━━━━━━━━━━━━━━━━━━━━━━━━━━ BACKTRACE ━━━━━━━━━━━━━━━━━━━━━━━━━━━━━━━━━━━
43.40 s
gammaloop-nextest-core> 1: <color_eyre[51793ea62743adbd]::config::PanicHook>::panic_report <unknown>
43.40 s
gammaloop-nextest-core> at <unknown source file> :<unknown line>
43.40 s
gammaloop-nextest-core> 2: <color_eyre[51793ea62743adbd]::config::PanicHook>::into_panic_hook::{closure#0} <unknown>
43.41 s
gammaloop-nextest-core> at <unknown source file> :<unknown line>
43.41 s
gammaloop-nextest-core> 3: std[bcb96dfbba0ab899]::panicking::panic_with_hook <unknown>
43.41 s
gammaloop-nextest-core> at <unknown source file> :<unknown line>
43.41 s
gammaloop-nextest-core> 4: std[bcb96dfbba0ab899]::panicking::panic_handler::{closure#0} <unknown>
43.41 s
gammaloop-nextest-core> at <unknown source file> :<unknown line>
43.41 s
gammaloop-nextest-core> 5: std[bcb96dfbba0ab899]::sys::backtrace::__rust_end_short_backtrace::<std[bcb96dfbba0ab899]::panicking::panic_handler::{closure#0}, !> <unknown>
43.41 s
gammaloop-nextest-core> at <unknown source file> :<unknown line>
43.41 s
gammaloop-nextest-core> 6: __rustc[6c289b9f9c454d21]::rust_begin_unwind <unknown>
43.41 s
gammaloop-nextest-core> at <unknown source file> :<unknown line>
43.41 s
gammaloop-nextest-core> 7: core[940e698046960fd5]::panicking::panic_fmt <unknown>
43.41 s
gammaloop-nextest-core> at <unknown source file> :<unknown line>
43.41 s
gammaloop-nextest-core> 8: <gammalooprs[24955f93fc9f4e0c]::graph::three_d_source::tests::pinched_affine_carrier_requires_occurrence_interpolation::{closure#0} as core[940e698046960fd5]::ops::function::FnOnce<()>>::call_once <unknown>
43.41 s
gammaloop-nextest-core> at <unknown source file> :<unknown line>
43.41 s
gammaloop-nextest-core> 9: test[75d6903177b1d7e9]::__rust_begin_short_backtrace::<core[940e698046960fd5]::result::Result<(), alloc[2ea6bcb46fca0c42]::string::String>, fn() -> core[940e698046960fd5]::result::Result<(), alloc[2ea6bcb46fca0c42]::string::String>> <unknown>
43.41 s
gammaloop-nextest-core> at <unknown source file> :<unknown line>
43.41 s
gammaloop-nextest-core> 10: test[75d6903177b1d7e9]::run_test::{closure#0} <unknown>
43.41 s
gammaloop-nextest-core> at <unknown source file> :<unknown line>
43.41 s
gammaloop-nextest-core> 11: std[bcb96dfbba0ab899]::sys::backtrace::__rust_begin_short_backtrace::<test[75d6903177b1d7e9]::run_test::{closure#1}, ()> <unknown>
43.41 s
gammaloop-nextest-core> at <unknown source file> :<unknown line>
43.41 s
gammaloop-nextest-core> 12: <std[bcb96dfbba0ab899]::thread::lifecycle::spawn_unchecked<test[75d6903177b1d7e9]::run_test::{closure#1}, ()>::{closure#1} as core[940e698046960fd5]::ops::function::FnOnce<()>>::call_once::{shim:vtable#0} <unknown>
43.41 s
gammaloop-nextest-core> at <unknown source file> :<unknown line>
43.41 s
gammaloop-nextest-core> 13: <std[bcb96dfbba0ab899]::sys::thread::unix::Thread>::new::thread_start <unknown>
43.41 s
gammaloop-nextest-core> at <unknown source file> :<unknown line>
43.41 s
gammaloop-nextest-core> 14: start_thread <unknown>
43.41 s
gammaloop-nextest-core> at <unknown source file> :<unknown line>
43.41 s
gammaloop-nextest-core> 15: __clone3 <unknown>
43.41 s
gammaloop-nextest-core> at <unknown source file> :<unknown line>
43.41 s
gammaloop-nextest-core>
43.41 s
gammaloop-nextest-core> Run with COLORBT_SHOW_HIDDEN=1 environment variable to disable frame filtering.
43.41 s
gammaloop-nextest-core> Run with RUST_BACKTRACE=full to include source snippets.
43.41 s
gammaloop-nextest-core>
43.41 s
gammaloop-nextest-core> FAIL [ 0.021s] (298/692) gammalooprs numerator::energy_degree::tests :: canonical_class_cyclic_lifts_preserve_factorization_and_exact_bounds
43.41 s
gammaloop-nextest-core> stdout ---
43.41 s
gammaloop-nextest-core>
43.41 s
gammaloop-nextest-core> running 1 test
43.41 s
gammaloop-nextest-core> test numerator::energy_degree::tests::canonical_class_cyclic_lifts_preserve_factorization_and_exact_bounds ... FAILED
43.41 s
gammaloop-nextest-core>
43.41 s
gammaloop-nextest-core> failures:
43.41 s
gammaloop-nextest-core>
43.41 s
gammaloop-nextest-core> failures:
43.41 s
gammaloop-nextest-core> numerator::energy_degree::tests::canonical_class_cyclic_lifts_preserve_factorization_and_exact_bounds
43.41 s
gammaloop-nextest-core>
43.41 s
gammaloop-nextest-core> test result: FAILED. 0 passed; 1 failed; 0 ignored; 0 measured; 742 filtered out; finished in 0.01s
43.41 s
gammaloop-nextest-core>
43.41 s
gammaloop-nextest-core> stderr ---
43.41 s
gammaloop-nextest-core>
43.41 s
gammaloop-nextest-core> thread 'numerator::energy_degree::tests::canonical_class_cyclic_lifts_preserve_factorization_and_exact_bounds' (2289) panicked at crates/gammalooprs/src/numerator/energy_degree.rs:2850:13:
43.41 s
gammaloop-nextest-core> assertion failed: (collapsed - expression).collect_factors().is_zero()
43.41 s
gammaloop-nextest-core> stack backtrace:
43.41 s
gammaloop-nextest-core> 0: __rustc::rust_begin_unwind
43.41 s
gammaloop-nextest-core> 1: core::panicking::panic_fmt
43.41 s
gammaloop-nextest-core> 2: core::panicking::panic
43.41 s
gammaloop-nextest-core> 3: gammalooprs::numerator::energy_degree::tests::canonical_class_cyclic_lifts_preserve_factorization_and_exact_bounds
43.41 s
gammaloop-nextest-core> 4: <gammalooprs::numerator::energy_degree::tests::canonical_class_cyclic_lifts_preserve_factorization_and_exact_bounds::{closure#0} as core::ops::function::FnOnce<()>>::call_once
43.41 s
gammaloop-nextest-core> note: Some details are omitted, run with `RUST_BACKTRACE=full` for a verbose backtrace.
43.41 s
gammaloop-nextest-core>
43.41 s
gammaloop-nextest-core> FAIL [ 0.107s] (592/692) gammalooprs uv::approx::local_4d::tests :: canonical_uv_signed_multiloop_carriers_preserve_factorized_numerators
43.41 s
gammaloop-nextest-core> stdout ---
43.41 s
gammaloop-nextest-core>
43.41 s
gammaloop-nextest-core> running 1 test
43.41 s
gammaloop-nextest-core> test uv::approx::local_4d::tests::canonical_uv_signed_multiloop_carriers_preserve_factorized_numerators ... FAILED
43.41 s
gammaloop-nextest-core>
43.41 s
gammaloop-nextest-core> failures:
43.41 s
gammaloop-nextest-core>
43.41 s
gammaloop-nextest-core> failures:
43.41 s
gammaloop-nextest-core> uv::approx::local_4d::tests::canonical_uv_signed_multiloop_carriers_preserve_factorized_numerators
43.41 s
gammaloop-nextest-core>
43.41 s
gammaloop-nextest-core> test result: FAILED. 0 passed; 1 failed; 0 ignored; 0 measured; 742 filtered out; finished in 0.09s
43.41 s
gammaloop-nextest-core>
43.41 s
gammaloop-nextest-core> stderr ---
43.41 s
gammaloop-nextest-core> The application panicked (crashed).
43.41 s
gammaloop-nextest-core> Message: assertion `left == right` failed
43.41 s
gammaloop-nextest-core> left: 2*(signed_multiloop::a+signed_multiloop::b)^5*gammalooprs::Q(gammalooprs::uv::class(0),spenso::cind(0))
43.41 s
gammaloop-nextest-core> right: -2*(signed_multiloop::a+signed_multiloop::b)^5*gammalooprs::Q(gammalooprs::uv::class(0),spenso::cind(0))
43.41 s
gammaloop-nextest-core> Location: crates/gammalooprs/src/uv/approx/local_4d.rs :1983
43.41 s
gammaloop-nextest-core>
43.41 s
gammaloop-nextest-core> ━━━━━━━━━━━━━━━━━━━━━━━━━━━━━━━━━━ BACKTRACE ━━━━━━━━━━━━━━━━━━━━━━━━━━━━━━━━━━━
43.41 s
gammaloop-nextest-core> 1: <color_eyre[51793ea62743adbd]::config::PanicHook>::panic_report <unknown>
43.41 s
gammaloop-nextest-core> at <unknown source file> :<unknown line>
43.41 s
gammaloop-nextest-core> 2: <color_eyre[51793ea62743adbd]::config::PanicHook>::into_panic_hook::{closure#0} <unknown>
43.41 s
gammaloop-nextest-core> at <unknown source file> :<unknown line>
43.41 s
gammaloop-nextest-core> 3: std[bcb96dfbba0ab899]::panicking::panic_with_hook <unknown>
43.41 s
gammaloop-nextest-core> at <unknown source file> :<unknown line>
43.41 s
gammaloop-nextest-core> 4: std[bcb96dfbba0ab899]::panicking::panic_handler::{closure#0} <unknown>
43.41 s
gammaloop-nextest-core> at <unknown source file> :<unknown line>
43.41 s
gammaloop-nextest-core> 5: std[bcb96dfbba0ab899]::sys::backtrace::__rust_end_short_backtrace::<std[bcb96dfbba0ab899]::panicking::panic_handler::{closure#0}, !> <unknown>
43.41 s
gammaloop-nextest-core> at <unknown source file> :<unknown line>
43.41 s
gammaloop-nextest-core> 6: __rustc[6c289b9f9c454d21]::rust_begin_unwind <unknown>
43.41 s
gammaloop-nextest-core> at <unknown source file> :<unknown line>
43.41 s
gammaloop-nextest-core> 7: core[940e698046960fd5]::panicking::panic_fmt <unknown>
43.41 s
gammaloop-nextest-core> at <unknown source file> :<unknown line>
43.41 s
gammaloop-nextest-core> 8: core[940e698046960fd5]::panicking::assert_failed_inner <unknown>
43.41 s
gammaloop-nextest-core> at <unknown source file> :<unknown line>
43.41 s
gammaloop-nextest-core> 9: core[940e698046960fd5]::panicking::assert_failed::<symbolica[499970c26fd75ddd]::atom::Atom, symbolica[499970c26fd75ddd]::atom::Atom> <unknown>
43.41 s
gammaloop-nextest-core> at <unknown source file> :<unknown line>
43.41 s
gammaloop-nextest-core> 10: gammalooprs[24955f93fc9f4e0c]::uv::approx::local_4d::tests::canonical_uv_signed_multiloop_carriers_preserve_factorized_numerators <unknown>
43.41 s
gammaloop-nextest-core> at <unknown source file> :<unknown line>
43.41 s
gammaloop-nextest-core> 11: <gammalooprs[24955f93fc9f4e0c]::uv::approx::local_4d::tests::canonical_uv_signed_multiloop_carriers_preserve_factorized_numerators::{closure#0} as core[940e698046960fd5]::ops::function::FnOnce<()>>::call_once <unknown>
43.41 s
gammaloop-nextest-core> at <unknown source file> :<unknown line>
43.41 s
gammaloop-nextest-core> 12: test[75d6903177b1d7e9]::__rust_begin_short_backtrace::<core[940e698046960fd5]::result::Result<(), alloc[2ea6bcb46fca0c42]::string::String>, fn() -> core[940e698046960fd5]::result::Result<(), alloc[2ea6bcb46fca0c42]::string::String>> <unknown>
43.41 s
gammaloop-nextest-core> at <unknown source file> :<unknown line>
43.41 s
gammaloop-nextest-core> 13: test[75d6903177b1d7e9]::run_test::{closure#0} <unknown>
43.41 s
gammaloop-nextest-core> at <unknown source file> :<unknown line>
43.41 s
gammaloop-nextest-core> 14: std[bcb96dfbba0ab899]::sys::backtrace::__rust_begin_short_backtrace::<test[75d6903177b1d7e9]::run_test::{closure#1}, ()> <unknown>
43.41 s
gammaloop-nextest-core> at <unknown source file> :<unknown line>
43.41 s
gammaloop-nextest-core> 15: <std[bcb96dfbba0ab899]::thread::lifecycle::spawn_unchecked<test[75d6903177b1d7e9]::run_test::{closure#1}, ()>::{closure#1} as core[940e698046960fd5]::ops::function::FnOnce<()>>::call_once::{shim:vtable#0} <unknown>
43.41 s
gammaloop-nextest-core> at <unknown source file> :<unknown line>
43.41 s
gammaloop-nextest-core> 16: <std[bcb96dfbba0ab899]::sys::thread::unix::Thread>::new::thread_start <unknown>
43.41 s
gammaloop-nextest-core> at <unknown source file> :<unknown line>
43.41 s
gammaloop-nextest-core> 17: start_thread <unknown>
43.41 s
gammaloop-nextest-core> at <unknown source file> :<unknown line>
43.41 s
gammaloop-nextest-core> 18: __clone3 <unknown>
43.41 s
gammaloop-nextest-core> at <unknown source file> :<unknown line>
43.41 s
gammaloop-nextest-core>
43.41 s
gammaloop-nextest-core> Run with COLORBT_SHOW_HIDDEN=1 environment variable to disable frame filtering.
43.41 s
gammaloop-nextest-core> Run with RUST_BACKTRACE=full to include source snippets.
43.41 s
gammaloop-nextest-core>
43.41 s
gammaloop-nextest-core> FAIL [ 0.129s] (593/692) gammalooprs uv::approx::local_4d::tests :: canonical_uv_classes_certify_signed_aliases_and_preserve_raw_sectors
43.41 s
gammaloop-nextest-core> stdout ---
43.41 s
gammaloop-nextest-core>
43.41 s
gammaloop-nextest-core> running 1 test
43.41 s
gammaloop-nextest-core> test uv::approx::local_4d::tests::canonical_uv_classes_certify_signed_aliases_and_preserve_raw_sectors ... FAILED
43.41 s
gammaloop-nextest-core>
43.41 s
gammaloop-nextest-core> failures:
43.41 s
gammaloop-nextest-core>
43.41 s
gammaloop-nextest-core> failures:
43.41 s
gammaloop-nextest-core> uv::approx::local_4d::tests::canonical_uv_classes_certify_signed_aliases_and_preserve_raw_sectors
43.41 s
gammaloop-nextest-core>
43.41 s
gammaloop-nextest-core> test result: FAILED. 0 passed; 1 failed; 0 ignored; 0 measured; 742 filtered out; finished in 0.11s
43.41 s
gammaloop-nextest-core>
43.41 s
gammaloop-nextest-core> stderr ---
43.41 s
gammaloop-nextest-core> Error:
43.41 s
gammaloop-nextest-core> 0: merged canonical UV numerator does not reproduce its source bucket
43.41 s
gammaloop-nextest-core>
43.41 s
gammaloop-nextest-core> Location:
43.41 s
gammaloop-nextest-core> crates/gammalooprs/src/uv/approx/local_4d.rs :367
43.41 s
gammaloop-nextest-core>
43.41 s
gammaloop-nextest-core> ━━━━━━━━━━━━━━━━━━━━━━━━━━━━━━━━━━ BACKTRACE ━━━━━━━━━━━━━━━━━━━━━━━━━━━━━━━━━━━
43.41 s
gammaloop-nextest-core> 1: <color_eyre[51793ea62743adbd]::config::EyreHook>::into_eyre_hook::{closure#0} <unknown>
43.41 s
gammaloop-nextest-core> at <unknown source file> :<unknown line>
43.41 s
gammaloop-nextest-core> 2: eyre[cb2fd339c0c40fca]::capture_handler <unknown>
43.41 s
gammaloop-nextest-core> at <unknown source file> :<unknown line>
43.41 s
gammaloop-nextest-core> 3: eyre[cb2fd339c0c40fca]::private::format_err <unknown>
43.41 s
gammaloop-nextest-core> at <unknown source file> :<unknown line>
43.41 s
gammaloop-nextest-core> 4: <gammalooprs[24955f93fc9f4e0c]::uv::approx::local_4d::FourDSector>::canonical_projection <unknown>
43.41 s
gammaloop-nextest-core> at <unknown source file> :<unknown line>
43.41 s
gammaloop-nextest-core> 5: gammalooprs[24955f93fc9f4e0c]::uv::approx::local_4d::tests::canonical_uv_classes_certify_signed_aliases_and_preserve_raw_sectors <unknown>
43.41 s
gammaloop-nextest-core> at <unknown source file> :<unknown line>
43.41 s
gammaloop-nextest-core> 6: <gammalooprs[24955f93fc9f4e0c]::uv::approx::local_4d::tests::canonical_uv_classes_certify_signed_aliases_and_preserve_raw_sectors::{closure#0} as core[940e698046960fd5]::ops::function::FnOnce<()>>::call_once <unknown>
43.41 s
gammaloop-nextest-core> at <unknown source file> :<unknown line>
43.41 s
gammaloop-nextest-core> 7: test[75d6903177b1d7e9]::__rust_begin_short_backtrace::<core[940e698046960fd5]::result::Result<(), alloc[2ea6bcb46fca0c42]::string::String>, fn() -> core[940e698046960fd5]::result::Result<(), alloc[2ea6bcb46fca0c42]::string::String>> <unknown>
43.41 s
gammaloop-nextest-core> at <unknown source file> :<unknown line>
43.41 s
gammaloop-nextest-core> 8: test[75d6903177b1d7e9]::run_test::{closure#0} <unknown>
43.41 s
gammaloop-nextest-core> at <unknown source file> :<unknown line>
43.41 s
gammaloop-nextest-core> 9: std[bcb96dfbba0ab899]::sys::backtrace::__rust_begin_short_backtrace::<test[75d6903177b1d7e9]::run_test::{closure#1}, ()> <unknown>
43.41 s
gammaloop-nextest-core> at <unknown source file> :<unknown line>
43.41 s
gammaloop-nextest-core> 10: <std[bcb96dfbba0ab899]::thread::lifecycle::spawn_unchecked<test[75d6903177b1d7e9]::run_test::{closure#1}, ()>::{closure#1} as core[940e698046960fd5]::ops::function::FnOnce<()>>::call_once::{shim:vtable#0} <unknown>
43.41 s
gammaloop-nextest-core> at <unknown source file> :<unknown line>
43.41 s
gammaloop-nextest-core> 11: <std[bcb96dfbba0ab899]::sys::thread::unix::Thread>::new::thread_start <unknown>
43.41 s
gammaloop-nextest-core> at <unknown source file> :<unknown line>
43.41 s
gammaloop-nextest-core> 12: start_thread <unknown>
43.41 s
gammaloop-nextest-core> at <unknown source file> :<unknown line>
43.41 s
gammaloop-nextest-core> 13: __clone3 <unknown>
43.41 s
gammaloop-nextest-core> at <unknown source file> :<unknown line>
43.41 s
gammaloop-nextest-core>
43.41 s
gammaloop-nextest-core> Run with COLORBT_SHOW_HIDDEN=1 environment variable to disable frame filtering.
43.41 s
gammaloop-nextest-core> Run with RUST_BACKTRACE=full to include source snippets.
43.41 s
gammaloop-nextest-core>
43.41 s
gammaloop-nextest-core> FAIL [ 0.100s] (606/692) gammalooprs uv::approx::tests :: direct_nested_scalar_banana_replays_complete_cff_at_depth_three
43.41 s
gammaloop-nextest-core> stdout ---
43.41 s
gammaloop-nextest-core>
43.41 s
gammaloop-nextest-core> running 1 test
43.41 s
gammaloop-nextest-core> test uv::approx::tests::direct_nested_scalar_banana_replays_complete_cff_at_depth_three ... FAILED
43.41 s
gammaloop-nextest-core>
43.41 s
gammaloop-nextest-core> failures:
43.41 s
gammaloop-nextest-core>
43.41 s
gammaloop-nextest-core> failures:
43.41 s
gammaloop-nextest-core> uv::approx::tests::direct_nested_scalar_banana_replays_complete_cff_at_depth_three
43.41 s
gammaloop-nextest-core>
43.41 s
gammaloop-nextest-core> test result: FAILED. 0 passed; 1 failed; 0 ignored; 0 measured; 742 filtered out; finished in 0.09s
43.41 s
gammaloop-nextest-core>
43.41 s
gammaloop-nextest-core> stderr ---
43.41 s
gammaloop-nextest-core> Error:
43.41 s
gammaloop-nextest-core> 0: canonical UV numerator does not reproduce its source in the component frame
43.41 s
gammaloop-nextest-core>
43.41 s
gammaloop-nextest-core> Location:
43.41 s
gammaloop-nextest-core> crates/gammalooprs/src/uv/approx/local_4d.rs :354
43.41 s
gammaloop-nextest-core>
43.41 s
gammaloop-nextest-core> ━━━━━━━━━━━━━━━━━━━━━━━━━━━━━━━━━━ BACKTRACE ━━━━━━━━━━━━━━━━━━━━━━━━━━━━━━━━━━━
43.41 s
gammaloop-nextest-core> 1: <color_eyre[51793ea62743adbd]::config::EyreHook>::into_eyre_hook::{closure#0} <unknown>
43.41 s
gammaloop-nextest-core> at <unknown source file> :<unknown line>
43.41 s
gammaloop-nextest-core> 2: eyre[cb2fd339c0c40fca]::capture_handler <unknown>
43.41 s
gammaloop-nextest-core> at <unknown source file> :<unknown line>
43.41 s
gammaloop-nextest-core> 3: eyre[cb2fd339c0c40fca]::private::format_err <unknown>
43.41 s
gammaloop-nextest-core> at <unknown source file> :<unknown line>
43.41 s
gammaloop-nextest-core> 4: <gammalooprs[24955f93fc9f4e0c]::uv::approx::local_4d::FourDSector>::canonical_projection <unknown>
43.41 s
gammaloop-nextest-core> at <unknown source file> :<unknown line>
43.41 s
gammaloop-nextest-core> 5: <gammalooprs[24955f93fc9f4e0c]::uv::approx::projected_4d::Projected4dApproximation>::project_local_4d <unknown>
43.41 s
gammaloop-nextest-core> at <unknown source file> :<unknown line>
43.41 s
gammaloop-nextest-core> 6: <gammalooprs[24955f93fc9f4e0c]::uv::approx::Approximation>::compute_3d <unknown>
43.41 s
gammaloop-nextest-core> at <unknown source file> :<unknown line>
43.41 s
gammaloop-nextest-core> 7: gammalooprs[24955f93fc9f4e0c]::uv::approx::tests::direct_nested_scalar_banana_replays_complete_cff_at_depth_three::{closure#0} <unknown>
43.41 s
gammaloop-nextest-core> at <unknown source file> :<unknown line>
43.41 s
gammaloop-nextest-core> 8: gammalooprs[24955f93fc9f4e0c]::uv::approx::tests::direct_nested_scalar_banana_replays_complete_cff_at_depth_three <unknown>
43.41 s
gammaloop-nextest-core> at <unknown source file> :<unknown line>
43.41 s
gammaloop-nextest-core> 9: <gammalooprs[24955f93fc9f4e0c]::uv::approx::tests::direct_nested_scalar_banana_replays_complete_cff_at_depth_three::{closure#0} as core[940e698046960fd5]::ops::function::FnOnce<()>>::call_once <unknown>
43.41 s
gammaloop-nextest-core> at <unknown source file> :<unknown line>
43.41 s
gammaloop-nextest-core> 10: test[75d6903177b1d7e9]::__rust_begin_short_backtrace::<core[940e698046960fd5]::result::Result<(), alloc[2ea6bcb46fca0c42]::string::String>, fn() -> core[940e698046960fd5]::result::Result<(), alloc[2ea6bcb46fca0c42]::string::String>> <unknown>
43.41 s
gammaloop-nextest-core> at <unknown source file> :<unknown line>
43.41 s
gammaloop-nextest-core> 11: test[75d6903177b1d7e9]::run_test::{closure#0} <unknown>
43.41 s
gammaloop-nextest-core> at <unknown source file> :<unknown line>
43.41 s
gammaloop-nextest-core> 12: std[bcb96dfbba0ab899]::sys::backtrace::__rust_begin_short_backtrace::<test[75d6903177b1d7e9]::run_test::{closure#1}, ()> <unknown>
43.41 s
gammaloop-nextest-core> at <unknown source file> :<unknown line>
43.41 s
gammaloop-nextest-core> 13: <std[bcb96dfbba0ab899]::thread::lifecycle::spawn_unchecked<test[75d6903177b1d7e9]::run_test::{closure#1}, ()>::{closure#1} as core[940e698046960fd5]::ops::function::FnOnce<()>>::call_once::{shim:vtable#0} <unknown>
43.41 s
gammaloop-nextest-core> at <unknown source file> :<unknown line>
43.41 s
gammaloop-nextest-core> 14: <std[bcb96dfbba0ab899]::sys::thread::unix::Thread>::new::thread_start <unknown>
43.41 s
gammaloop-nextest-core> at <unknown source file> :<unknown line>
43.41 s
gammaloop-nextest-core> 15: start_thread <unknown>
43.41 s
gammaloop-nextest-core> at <unknown source file> :<unknown line>
43.41 s
gammaloop-nextest-core> 16: __clone3 <unknown>
43.41 s
gammaloop-nextest-core> at <unknown source file> :<unknown line>
43.41 s
gammaloop-nextest-core>
43.41 s
gammaloop-nextest-core> Run with COLORBT_SHOW_HIDDEN=1 environment variable to disable frame filtering.
43.41 s
gammaloop-nextest-core> Run with RUST_BACKTRACE=full to include source snippets.
43.41 s
gammaloop-nextest-core>
43.53 s
gammaloop-nextest-core> error : test run failed
43.57 s
gammaloop-nextest-core>
43.57 s
gammaloop-nextest-core> ========== nextest test summary ==========
43.57 s
gammaloop-nextest-core> report: target/nextest/ci_gammaloop/junit.xml
43.57 s
gammaloop-nextest-core> tests: 692, failures: 6, errors: 0
43.57 s
gammaloop-nextest-core>
43.57 s
gammaloop-nextest-core> 1. gammalooprs::graph::three_d_source::tests::exact_taylor_vacuum_affine_circulation_preserves_energy_mapping
43.57 s
gammaloop-nextest-core> failure: test failure with exit code 101
43.57 s
gammaloop-nextest-core> system-out
43.57 s
gammaloop-nextest-core> running 1 test
43.57 s
gammaloop-nextest-core> test graph::three_d_source::tests::exact_taylor_vacuum_affine_circulation_preserves_energy_mapping ... FAILED
43.57 s
gammaloop-nextest-core>
43.57 s
gammaloop-nextest-core> failures:
43.57 s
gammaloop-nextest-core>
43.57 s
gammaloop-nextest-core> failures:
43.57 s
gammaloop-nextest-core> graph::three_d_source::tests::exact_taylor_vacuum_affine_circulation_preserves_energy_mapping
43.57 s
gammaloop-nextest-core>
43.57 s
gammaloop-nextest-core> test result: FAILED. 0 passed; 1 failed; 0 ignored; 0 measured; 742 filtered out; finished in 0.10s
43.57 s
gammaloop-nextest-core> system-err
43.57 s
gammaloop-nextest-core> The application panicked (crashed).
43.57 s
gammaloop-nextest-core> Message: assertion `left == right` failed
43.57 s
gammaloop-nextest-core> left: (gammalooprs::mUVexp^2+(-gammalooprs::Q(1,spenso::cind(1))+gammalooprs::Q(4,spenso::cind(1)))^2+(-gammalooprs::Q(1,spenso::cind(2))+gammalooprs::Q(4,spenso::cind(2)))^2+(-gammalooprs::Q(1,spenso::cind(3))+gammalooprs::Q(4,spenso::cind(3)))^2)^(1/2)
43.57 s
gammaloop-nextest-core> right: (gammalooprs::mUVexp^2+(gammalooprs::Q(1,spenso::cind(1))-gammalooprs::Q(4,spenso::cind(1)))^2+(gammalooprs::Q(1,spenso::cind(2))-gammalooprs::Q(4,spenso::cind(2)))^2+(gammalooprs::Q(1,spenso::cind(3))-gammalooprs::Q(4,spenso::cind(3)))^2)^(1/2)
43.57 s
gammaloop-nextest-core> Location: crates/gammalooprs/src/graph/three_d_source.rs:7797
43.57 s
gammaloop-nextest-core>
43.57 s
gammaloop-nextest-core> ━━━━━━━━━━━━━━━━━━━━━━━━━━━━━━━━━━ BACKTRACE ━━━━━━━━━━━━━━━━━━━━━━━━━━━━━━━━━━━
43.57 s
gammaloop-nextest-core> 1: <color_eyre[51793ea62743adbd]::config::PanicHook>::panic_report<unknown>
43.57 s
gammaloop-nextest-core> at <unknown source file>:<unknown line>
43.57 s
gammaloop-nextest-core> 2: <color_eyre[51793ea62743adbd]::config::PanicHook>::into_panic_hook::{closure#0}<unknown>
43.57 s
gammaloop-nextest-core> at <unknown source file>:<unknown line>
43.57 s
gammaloop-nextest-core> 3: std[bcb96dfbba0ab899]::panicking::panic_with_hook<unknown>
43.57 s
gammaloop-nextest-core> at <unknown source file>:<unknown line>
43.57 s
gammaloop-nextest-core> 4: std[bcb96dfbba0ab899]::panicking::panic_handler::{closure#0}<unknown>
43.57 s
gammaloop-nextest-core> at <unknown source file>:<unknown line>
43.57 s
gammaloop-nextest-core> 5: std[bcb96dfbba0ab899]::sys::backtrace::__rust_end_short_backtrace::<std[bcb96dfbba0ab899]::panicking::panic_handler::{closure#0}, !><unknown>
43.57 s
gammaloop-nextest-core> at <unknown source file>:<unknown line>
43.57 s
gammaloop-nextest-core> 6: __rustc[6c289b9f9c454d21]::rust_begin_unwind<unknown>
43.57 s
gammaloop-nextest-core> at <unknown source file>:<unknown line>
43.57 s
gammaloop-nextest-core> 7: core[940e698046960fd5]::panicking::panic_fmt<unknown>
43.57 s
gammaloop-nextest-core> at <unknown source file>:<unknown line>
43.57 s
gammaloop-nextest-core> 8: core[940e698046960fd5]::panicking::assert_failed_inner<unknown>
43.57 s
gammaloop-nextest-core> at <unknown source file>:<unknown line>
43.57 s
gammaloop-nextest-core> 9: core[940e698046960fd5]::panicking::assert_failed::<symbolica[499970c26fd75ddd]::atom::Atom, symbolica[499970c26fd75ddd]::atom::Atom><unknown>
43.57 s
gammaloop-nextest-core> at <unknown source file>:<unknown line>
43.57 s
gammaloop-nextest-core> 10: gammalooprs[24955f93fc9f4e0c]::graph::three_d_source::tests::exact_taylor_vacuum_affine_circulation_preserves_energy_mapping<unknown>
43.57 s
gammaloop-nextest-core> at <unknown source file>:<unknown line>
43.57 s
gammaloop-nextest-core> 11: <gammalooprs[24955f93fc9f4e0c]::graph::three_d_source::tests::exact_taylor_vacuum_affine_circulation_preserves_energy_mapping::{closure#0} as core[940e698046960fd5]::ops::function::FnOnce<()>>::call_once<unknown>
43.57 s
gammaloop-nextest-core> at <unknown source file>:<unknown line>
43.57 s
gammaloop-nextest-core> 12: test[75d6903177b1d7e9]::__rust_begin_short_backtrace::<core[940e698046960fd5]::result::Result<(), alloc[2ea6bcb46fca0c42]::string::String>, fn() -> core[940e698046960fd5]::result::Result<(), alloc[2ea6bcb46fca0c42]::string::String>><unknown>
43.57 s
gammaloop-nextest-core> at <unknown source file>:<unknown line>
43.57 s
gammaloop-nextest-core> 13: test[75d6903177b1d7e9]::run_test::{closure#0}<unknown>
43.57 s
gammaloop-nextest-core> at <unknown source file>:<unknown line>
43.57 s
gammaloop-nextest-core> 14: std[bcb96dfbba0ab899]::sys::backtrace::__rust_begin_short_backtrace::<test[75d6903177b1d7e9]::run_test::{closure#1}, ()><unknown>
43.57 s
gammaloop-nextest-core> at <unknown source file>:<unknown line>
43.57 s
gammaloop-nextest-core> 15: <std[bcb96dfbba0ab899]::thread::lifecycle::spawn_unchecked<test[75d6903177b1d7e9]::run_test::{closure#1}, ()>::{closure#1} as core[940e698046960fd5]::ops::function::FnOnce<()>>::call_once::{shim:vtable#0}<unknown>
43.57 s
gammaloop-nextest-core> at <unknown source file>:<unknown line>
43.57 s
gammaloop-nextest-core> 16: <std[bcb96dfbba0ab899]::sys::thread::unix::Thread>::new::thread_start<unknown>
43.57 s
gammaloop-nextest-core> at <unknown source file>:<unknown line>
43.57 s
gammaloop-nextest-core> 17: start_thread<unknown>
43.57 s
gammaloop-nextest-core> at <unknown source file>:<unknown line>
43.57 s
gammaloop-nextest-core> 18: __clone3<unknown>
43.57 s
gammaloop-nextest-core> at <unknown source file>:<unknown line>
43.57 s
gammaloop-nextest-core>
43.57 s
gammaloop-nextest-core> Run with COLORBT_SHOW_HIDDEN=1 environment variable to disable frame filtering.
43.57 s
gammaloop-nextest-core> Run with RUST_BACKTRACE=full to include source snippets.
43.57 s
gammaloop-nextest-core>
43.57 s
gammaloop-nextest-core> 2. gammalooprs::graph::three_d_source::tests::pinched_affine_carrier_requires_occurrence_interpolation
43.57 s
gammaloop-nextest-core> failure: test failure with exit code 101
43.57 s
gammaloop-nextest-core> system-out
43.57 s
gammaloop-nextest-core> running 1 test
43.57 s
gammaloop-nextest-core> test graph::three_d_source::tests::pinched_affine_carrier_requires_occurrence_interpolation ... FAILED
43.57 s
gammaloop-nextest-core>
43.57 s
gammaloop-nextest-core> failures:
43.57 s
gammaloop-nextest-core>
43.57 s
gammaloop-nextest-core> failures:
43.57 s
gammaloop-nextest-core> graph::three_d_source::tests::pinched_affine_carrier_requires_occurrence_interpolation
43.57 s
gammaloop-nextest-core>
43.57 s
gammaloop-nextest-core> test result: FAILED. 0 passed; 1 failed; 0 ignored; 0 measured; 742 filtered out; finished in 0.13s
43.57 s
gammaloop-nextest-core> system-err
43.57 s
gammaloop-nextest-core> The application panicked (crashed).
43.57 s
gammaloop-nextest-core> Message: certified affine occurrence lift must reproduce the independent double contours: actual=-(-1/16*(3+E0)*(5+E0)/((1+Q(0,cind(1))^2+Q(0,cind(2))^2+Q(0,cind(3))^2)^(3/2)*(1+Q(1,cind(1))^2+Q(1,cind(2))^2+Q(1,cind(3))^2)^(3/2))-1/16*(3+E1)*(5+E1)/((1+Q(0,cind(1))^2+Q(0,cind(2))^2+Q(0,cind(3))^2)^(3/2)*(1+Q(1,cind(1))^2+Q(1,cind(2))^2+Q(1,cind(3))^2)^(3/2))-1/16*(3-E0)*(5-E0)/((1+Q(0,cind(1))^2+Q(0,cind(2))^2+Q(0,cind(3))^2)^(3/2)*(1+Q(1,cind(1))^2+Q(1,cind(2))^2+Q(1,cind(3))^2)^(3/2))-1/16*(3-E1)*(5-E1)/((1+Q(0,cind(1))^2+Q(0,cind(2))^2+Q(0,cind(3))^2)^(3/2)*(1+Q(1,cind(1))^2+Q(1,cind(2))^2+Q(1,cind(3))^2)^(3/2))+1/64*(3+E0+E1)*(5+E0+E1)/((1+Q(0,cind(1))^2+Q(0,cind(2))^2+Q(0,cind(3))^2)^(3/2)*(1+Q(1,cind(1))^2+Q(1,cind(2))^2+Q(1,cind(3))^2)^(3/2))+1/64*(3+E0-E1)*(5+E0-E1)/((1+Q(0,cind(1))^2+Q(0,cind(2))^2+Q(0,cind(3))^2)^(3/2)*(1+Q(1,cind(1))^2+Q(1,cind(2))^2+Q(1,cind(3))^2)^(3/2))+1/64*(3-E0+E1)*(5-E0+E1)/((1+Q(0,cind(1))^2+Q(0,cind(2))^2+Q(0,cind(3))^2)^(3/2)*(1+Q(1,cind(1))^2+Q(1,cind(2))^2+Q(1,cind(3))^2)^(3/2))+1/64*(3-E0-E1)*(5-E0-E1)/((1+Q(0,cind(1))^2+Q(0,cind(2))^2+Q(0,cind(3))^2)^(3/2)*(1+Q(1,cind(1))^2+Q(1,cind(2))^2+Q(1,cind(3))^2)^(3/2))+15/4/((1+Q(0,cind(1))^2+Q(0,cind(2))^2+Q(0,cind(3))^2)^(3/2)*(1+Q(1,cind(1))^2+Q(1,cind(2))^2+Q(1,cind(3))^2)^(3/2))), expected=1/16*(15-E0^2-E1^2)/(E0^3*E1^3)
43.57 s
gammaloop-nextest-core> Location: crates/gammalooprs/src/graph/three_d_source.rs:7619
43.57 s
gammaloop-nextest-core>
43.57 s
gammaloop-nextest-core> ━━━━━━━━━━━━━━━━━━━━━━━━━━━━━━━━━━ BACKTRACE ━━━━━━━━━━━━━━━━━━━━━━━━━━━━━━━━━━━
43.57 s
gammaloop-nextest-core> 1: <color_eyre[51793ea62743adbd]::config::PanicHook>::panic_report<unknown>
43.57 s
gammaloop-nextest-core> at <unknown source file>:<unknown line>
43.57 s
gammaloop-nextest-core> 2: <color_eyre[51793ea62743adbd]::config::PanicHook>::into_panic_hook::{closure#0}<unknown>
43.57 s
gammaloop-nextest-core> at <unknown source file>:<unknown line>
43.57 s
gammaloop-nextest-core> 3: std[bcb96dfbba0ab899]::panicking::panic_with_hook<unknown>
43.57 s
gammaloop-nextest-core> at <unknown source file>:<unknown line>
43.57 s
gammaloop-nextest-core> 4: std[bcb96dfbba0ab899]::panicking::panic_handler::{closure#0}<unknown>
43.57 s
gammaloop-nextest-core> at <unknown source file>:<unknown line>
43.57 s
gammaloop-nextest-core> 5: std[bcb96dfbba0ab899]::sys::backtrace::__rust_end_short_backtrace::<std[bcb96dfbba0ab899]::panicking::panic_handler::{closure#0}, !><unknown>
43.57 s
gammaloop-nextest-core> at <unknown source file>:<unknown line>
43.57 s
gammaloop-nextest-core> 6: __rustc[6c289b9f9c454d21]::rust_begin_unwind<unknown>
43.57 s
gammaloop-nextest-core> at <unknown source file>:<unknown line>
43.57 s
gammaloop-nextest-core> 7: core[940e698046960fd5]::panicking::panic_fmt<unknown>
43.57 s
gammaloop-nextest-core> at <unknown source file>:<unknown line>
43.57 s
gammaloop-nextest-core> 8: <gammalooprs[24955f93fc9f4e0c]::graph::three_d_source::tests::pinched_affine_carrier_requires_occurrence_interpolation::{closure#0} as core[940e698046960fd5]::ops::function::FnOnce<()>>::call_once<unknown>
43.57 s
gammaloop-nextest-core> at <unknown source file>:<unknown line>
43.57 s
gammaloop-nextest-core> 9: test[75d6903177b1d7e9]::__rust_begin_short_backtrace::<core[940e698046960fd5]::result::Result<(), alloc[2ea6bcb46fca0c42]::string::String>, fn() -> core[940e698046960fd5]::result::Result<(), alloc[2ea6bcb46fca0c42]::string::String>><unknown>
43.57 s
gammaloop-nextest-core> at <unknown source file>:<unknown line>
43.57 s
gammaloop-nextest-core> 10: test[75d6903177b1d7e9]::run_test::{closure#0}<unknown>
43.57 s
gammaloop-nextest-core> at <unknown source file>:<unknown line>
43.57 s
gammaloop-nextest-core> 11: std[bcb96dfbba0ab899]::sys::backtrace::__rust_begin_short_backtrace::<test[75d6903177b1d7e9]::run_test::{closure#1}, ()><unknown>
43.57 s
gammaloop-nextest-core> at <unknown source file>:<unknown line>
43.57 s
gammaloop-nextest-core> 12: <std[bcb96dfbba0ab899]::thread::lifecycle::spawn_unchecked<test[75d6903177b1d7e9]::run_test::{closure#1}, ()>::{closure#1} as core[940e698046960fd5]::ops::function::FnOnce<()>>::call_once::{shim:vtable#0}<unknown>
43.57 s
gammaloop-nextest-core> at <unknown source file>:<unknown line>
43.57 s
gammaloop-nextest-core> 13: <std[bcb96dfbba0ab899]::sys::thread::unix::Thread>::new::thread_start<unknown>
43.57 s
gammaloop-nextest-core> at <unknown source file>:<unknown line>
43.57 s
gammaloop-nextest-core> 14: start_thread<unknown>
43.57 s
gammaloop-nextest-core> at <unknown source file>:<unknown line>
43.57 s
gammaloop-nextest-core> 15: __clone3<unknown>
43.57 s
gammaloop-nextest-core> at <unknown source file>:<unknown line>
43.57 s
gammaloop-nextest-core>
43.57 s
gammaloop-nextest-core> Run with COLORBT_SHOW_HIDDEN=1 environment variable to disable frame filtering.
43.57 s
gammaloop-nextest-core> Run with RUST_BACKTRACE=full to include source snippets.
43.57 s
gammaloop-nextest-core>
43.57 s
gammaloop-nextest-core> 3. gammalooprs::numerator::energy_degree::tests::canonical_class_cyclic_lifts_preserve_factorization_and_exact_bounds
43.57 s
gammaloop-nextest-core> failure: test failure with exit code 101
43.57 s
gammaloop-nextest-core> thread 'numerator::energy_degree::tests::canonical_class_cyclic_lifts_preserve_factorization_and_exact_bounds' (2289) panicked at crates/gammalooprs/src/numerator/energy_degree.rs:2850:13:
43.57 s
gammaloop-nextest-core> assertion failed: (collapsed - expression).collect_factors().is_zero()
43.57 s
gammaloop-nextest-core> stack backtrace:
43.57 s
gammaloop-nextest-core> 0: __rustc::rust_begin_unwind
43.57 s
gammaloop-nextest-core> 1: core::panicking::panic_fmt
43.57 s
gammaloop-nextest-core> 2: core::panicking::panic
43.57 s
gammaloop-nextest-core> 3: gammalooprs::numerator::energy_degree::tests::canonical_class_cyclic_lifts_preserve_factorization_and_exact_bounds
43.57 s
gammaloop-nextest-core> 4: <gammalooprs::numerator::energy_degree::tests::canonical_class_cyclic_lifts_preserve_factorization_and_exact_bounds::{closure#0} as core::ops::function::FnOnce<()>>::call_once
43.57 s
gammaloop-nextest-core> note: Some details are omitted, run with `RUST_BACKTRACE=full` for a verbose backtrace.
43.57 s
gammaloop-nextest-core> system-out
43.57 s
gammaloop-nextest-core> running 1 test
43.57 s
gammaloop-nextest-core> test numerator::energy_degree::tests::canonical_class_cyclic_lifts_preserve_factorization_and_exact_bounds ... FAILED
43.57 s
gammaloop-nextest-core>
43.57 s
gammaloop-nextest-core> failures:
43.57 s
gammaloop-nextest-core>
43.57 s
gammaloop-nextest-core> failures:
43.57 s
gammaloop-nextest-core> numerator::energy_degree::tests::canonical_class_cyclic_lifts_preserve_factorization_and_exact_bounds
43.57 s
gammaloop-nextest-core>
43.57 s
gammaloop-nextest-core> test result: FAILED. 0 passed; 1 failed; 0 ignored; 0 measured; 742 filtered out; finished in 0.01s
43.57 s
gammaloop-nextest-core> system-err
43.57 s
gammaloop-nextest-core> thread 'numerator::energy_degree::tests::canonical_class_cyclic_lifts_preserve_factorization_and_exact_bounds' (2289) panicked at crates/gammalooprs/src/numerator/energy_degree.rs:2850:13:
43.57 s
gammaloop-nextest-core> assertion failed: (collapsed - expression).collect_factors().is_zero()
43.57 s
gammaloop-nextest-core> stack backtrace:
43.57 s
gammaloop-nextest-core> 0: __rustc::rust_begin_unwind
43.57 s
gammaloop-nextest-core> 1: core::panicking::panic_fmt
43.57 s
gammaloop-nextest-core> 2: core::panicking::panic
43.57 s
gammaloop-nextest-core> 3: gammalooprs::numerator::energy_degree::tests::canonical_class_cyclic_lifts_preserve_factorization_and_exact_bounds
43.57 s
gammaloop-nextest-core> 4: <gammalooprs::numerator::energy_degree::tests::canonical_class_cyclic_lifts_preserve_factorization_and_exact_bounds::{closure#0} as core::ops::function::FnOnce<()>>::call_once
43.57 s
gammaloop-nextest-core> note: Some details are omitted, run with `RUST_BACKTRACE=full` for a verbose backtrace.
43.57 s
gammaloop-nextest-core>
43.57 s
gammaloop-nextest-core> 4. gammalooprs::uv::approx::local_4d::tests::canonical_uv_signed_multiloop_carriers_preserve_factorized_numerators
43.57 s
gammaloop-nextest-core> failure: test failure with exit code 101
43.57 s
gammaloop-nextest-core> system-out
43.57 s
gammaloop-nextest-core> running 1 test
43.57 s
gammaloop-nextest-core> test uv::approx::local_4d::tests::canonical_uv_signed_multiloop_carriers_preserve_factorized_numerators ... FAILED
43.57 s
gammaloop-nextest-core>
43.57 s
gammaloop-nextest-core> failures:
43.57 s
gammaloop-nextest-core>
43.57 s
gammaloop-nextest-core> failures:
43.57 s
gammaloop-nextest-core> uv::approx::local_4d::tests::canonical_uv_signed_multiloop_carriers_preserve_factorized_numerators
43.57 s
gammaloop-nextest-core>
43.57 s
gammaloop-nextest-core> test result: FAILED. 0 passed; 1 failed; 0 ignored; 0 measured; 742 filtered out; finished in 0.09s
43.57 s
gammaloop-nextest-core> system-err
43.57 s
gammaloop-nextest-core> The application panicked (crashed).
43.57 s
gammaloop-nextest-core> Message: assertion `left == right` failed
43.57 s
gammaloop-nextest-core> left: 2*(signed_multiloop::a+signed_multiloop::b)^5*gammalooprs::Q(gammalooprs::uv::class(0),spenso::cind(0))
43.57 s
gammaloop-nextest-core> right: -2*(signed_multiloop::a+signed_multiloop::b)^5*gammalooprs::Q(gammalooprs::uv::class(0),spenso::cind(0))
43.57 s
gammaloop-nextest-core> Location: crates/gammalooprs/src/uv/approx/local_4d.rs:1983
43.57 s
gammaloop-nextest-core>
43.57 s
gammaloop-nextest-core> ━━━━━━━━━━━━━━━━━━━━━━━━━━━━━━━━━━ BACKTRACE ━━━━━━━━━━━━━━━━━━━━━━━━━━━━━━━━━━━
43.57 s
gammaloop-nextest-core> 1: <color_eyre[51793ea62743adbd]::config::PanicHook>::panic_report<unknown>
43.57 s
gammaloop-nextest-core> at <unknown source file>:<unknown line>
43.57 s
gammaloop-nextest-core> 2: <color_eyre[51793ea62743adbd]::config::PanicHook>::into_panic_hook::{closure#0}<unknown>
43.57 s
gammaloop-nextest-core> at <unknown source file>:<unknown line>
43.57 s
gammaloop-nextest-core> 3: std[bcb96dfbba0ab899]::panicking::panic_with_hook<unknown>
43.57 s
gammaloop-nextest-core> at <unknown source file>:<unknown line>
43.57 s
gammaloop-nextest-core> 4: std[bcb96dfbba0ab899]::panicking::panic_handler::{closure#0}<unknown>
43.57 s
gammaloop-nextest-core> at <unknown source file>:<unknown line>
43.57 s
gammaloop-nextest-core> 5: std[bcb96dfbba0ab899]::sys::backtrace::__rust_end_short_backtrace::<std[bcb96dfbba0ab899]::panicking::panic_handler::{closure#0}, !><unknown>
43.57 s
gammaloop-nextest-core> at <unknown source file>:<unknown line>
43.57 s
gammaloop-nextest-core> 6: __rustc[6c289b9f9c454d21]::rust_begin_unwind<unknown>
43.57 s
gammaloop-nextest-core> at <unknown source file>:<unknown line>
43.57 s
gammaloop-nextest-core> 7: core[940e698046960fd5]::panicking::panic_fmt<unknown>
43.57 s
gammaloop-nextest-core> at <unknown source file>:<unknown line>
43.57 s
gammaloop-nextest-core> 8: core[940e698046960fd5]::panicking::assert_failed_inner<unknown>
43.57 s
gammaloop-nextest-core> at <unknown source file>:<unknown line>
43.57 s
gammaloop-nextest-core> 9: core[940e698046960fd5]::panicking::assert_failed::<symbolica[499970c26fd75ddd]::atom::Atom, symbolica[499970c26fd75ddd]::atom::Atom><unknown>
43.57 s
gammaloop-nextest-core> at <unknown source file>:<unknown line>
43.57 s
gammaloop-nextest-core> 10: gammalooprs[24955f93fc9f4e0c]::uv::approx::local_4d::tests::canonical_uv_signed_multiloop_carriers_preserve_factorized_numerators<unknown>
43.57 s
gammaloop-nextest-core> at <unknown source file>:<unknown line>
43.57 s
gammaloop-nextest-core> 11: <gammalooprs[24955f93fc9f4e0c]::uv::approx::local_4d::tests::canonical_uv_signed_multiloop_carriers_preserve_factorized_numerators::{closure#0} as core[940e698046960fd5]::ops::function::FnOnce<()>>::call_once<unknown>
43.57 s
gammaloop-nextest-core> at <unknown source file>:<unknown line>
43.57 s
gammaloop-nextest-core> 12: test[75d6903177b1d7e9]::__rust_begin_short_backtrace::<core[940e698046960fd5]::result::Result<(), alloc[2ea6bcb46fca0c42]::string::String>, fn() -> core[940e698046960fd5]::result::Result<(), alloc[2ea6bcb46fca0c42]::string::String>><unknown>
43.57 s
gammaloop-nextest-core> at <unknown source file>:<unknown line>
43.57 s
gammaloop-nextest-core> 13: test[75d6903177b1d7e9]::run_test::{closure#0}<unknown>
43.57 s
gammaloop-nextest-core> at <unknown source file>:<unknown line>
43.57 s
gammaloop-nextest-core> 14: std[bcb96dfbba0ab899]::sys::backtrace::__rust_begin_short_backtrace::<test[75d6903177b1d7e9]::run_test::{closure#1}, ()><unknown>
43.57 s
gammaloop-nextest-core> at <unknown source file>:<unknown line>
43.57 s
gammaloop-nextest-core> 15: <std[bcb96dfbba0ab899]::thread::lifecycle::spawn_unchecked<test[75d6903177b1d7e9]::run_test::{closure#1}, ()>::{closure#1} as core[940e698046960fd5]::ops::function::FnOnce<()>>::call_once::{shim:vtable#0}<unknown>
43.57 s
gammaloop-nextest-core> at <unknown source file>:<unknown line>
43.57 s
gammaloop-nextest-core> 16: <std[bcb96dfbba0ab899]::sys::thread::unix::Thread>::new::thread_start<unknown>
43.57 s
gammaloop-nextest-core> at <unknown source file>:<unknown line>
43.57 s
gammaloop-nextest-core> 17: start_thread<unknown>
43.57 s
gammaloop-nextest-core> at <unknown source file>:<unknown line>
43.57 s
gammaloop-nextest-core> 18: __clone3<unknown>
43.57 s
gammaloop-nextest-core> at <unknown source file>:<unknown line>
43.57 s
gammaloop-nextest-core>
43.57 s
gammaloop-nextest-core> Run with COLORBT_SHOW_HIDDEN=1 environment variable to disable frame filtering.
43.57 s
gammaloop-nextest-core> Run with RUST_BACKTRACE=full to include source snippets.
43.57 s
gammaloop-nextest-core>
43.57 s
gammaloop-nextest-core> 5. gammalooprs::uv::approx::local_4d::tests::canonical_uv_classes_certify_signed_aliases_and_preserve_raw_sectors
43.57 s
gammaloop-nextest-core> failure: test failure with exit code 101
43.57 s
gammaloop-nextest-core> Error:
43.57 s
gammaloop-nextest-core> 0: merged canonical UV numerator does not reproduce its source bucket
43.57 s
gammaloop-nextest-core>
43.57 s
gammaloop-nextest-core> Location:
43.57 s
gammaloop-nextest-core> crates/gammalooprs/src/uv/approx/local_4d.rs:367
43.57 s
gammaloop-nextest-core>
43.57 s
gammaloop-nextest-core> ━━━━━━━━━━━━━━━━━━━━━━━━━━━━━━━━━━ BACKTRACE ━━━━━━━━━━━━━━━━━━━━━━━━━━━━━━━━━━━
43.57 s
gammaloop-nextest-core> 1: <color_eyre[51793ea62743adbd]::config::EyreHook>::into_eyre_hook::{closure#0}<unknown>
43.57 s
gammaloop-nextest-core> at <unknown source file>:<unknown line>
43.57 s
gammaloop-nextest-core> 2: eyre[cb2fd339c0c40fca]::capture_handler<unknown>
43.57 s
gammaloop-nextest-core> at <unknown source file>:<unknown line>
43.57 s
gammaloop-nextest-core> 3: eyre[cb2fd339c0c40fca]::private::format_err<unknown>
43.57 s
gammaloop-nextest-core> at <unknown source file>:<unknown line>
43.57 s
gammaloop-nextest-core> 4: <gammalooprs[24955f93fc9f4e0c]::uv::approx::local_4d::FourDSector>::canonical_projection<unknown>
43.57 s
gammaloop-nextest-core> at <unknown source file>:<unknown line>
43.57 s
gammaloop-nextest-core> 5: gammalooprs[24955f93fc9f4e0c]::uv::approx::local_4d::tests::canonical_uv_classes_certify_signed_aliases_and_preserve_raw_sectors<unknown>
43.57 s
gammaloop-nextest-core> at <unknown source file>:<unknown line>
43.57 s
gammaloop-nextest-core> 6: <gammalooprs[24955f93fc9f4e0c]::uv::approx::local_4d::tests::canonical_uv_classes_certify_signed_aliases_and_preserve_raw_sectors::{closure#0} as core[940e698046960fd5]::ops::function::FnOnce<()>>::call_once<unknown>
43.57 s
gammaloop-nextest-core> at <unknown source file>:<unknown line>
43.57 s
gammaloop-nextest-core> 7: test[75d6903177b1d7e9]::__rust_begin_short_backtrace::<core[940e698046960fd5]::result::Result<(), alloc[2ea6bcb46fca0c42]::string::String>, fn() -> core[940e698046960fd5]::result::Result<(), alloc[2ea6bcb46fca0c42]::string::String>><unknown>
43.57 s
gammaloop-nextest-core> at <unknown source file>:<unknown line>
43.57 s
gammaloop-nextest-core> 8: test[75d6903177b1d7e9]::run_test::{closure#0}<unknown>
43.57 s
gammaloop-nextest-core> at <unknown source file>:<unknown line>
43.57 s
gammaloop-nextest-core> 9: std[bcb96dfbba0ab899]::sys::backtrace::__rust_begin_short_backtrace::<test[75d6903177b1d7e9]::run_test::{closure#1}, ()><unknown>
43.57 s
gammaloop-nextest-core> at <unknown source file>:<unknown line>
43.57 s
gammaloop-nextest-core> 10: <std[bcb96dfbba0ab899]::thread::lifecycle::spawn_unchecked<test[75d6903177b1d7e9]::run_test::{closure#1}, ()>::{closure#1} as core[940e698046960fd5]::ops::function::FnOnce<()>>::call_once::{shim:vtable#0}<unknown>
43.57 s
gammaloop-nextest-core> at <unknown source file>:<unknown line>
43.57 s
gammaloop-nextest-core> 11: <std[bcb96dfbba0ab899]::sys::thread::unix::Thread>::new::thread_start<unknown>
43.57 s
gammaloop-nextest-core> at <unknown source file>:<unknown line>
43.57 s
gammaloop-nextest-core> 12: start_thread<unknown>
43.57 s
gammaloop-nextest-core> at <unknown source file>:<unknown line>
43.58 s
gammaloop-nextest-core> 13: __clone3<unknown>
43.58 s
gammaloop-nextest-core> at <unknown source file>:<unknown line>
43.58 s
gammaloop-nextest-core>
43.58 s
gammaloop-nextest-core> Run with COLORBT_SHOW_HIDDEN=1 environment variable to disable frame filtering.
43.58 s
gammaloop-nextest-core> Run with RUST_BACKTRACE=full to include source snippets.
43.58 s
gammaloop-nextest-core> system-out
43.58 s
gammaloop-nextest-core> running 1 test
43.58 s
gammaloop-nextest-core> test uv::approx::local_4d::tests::canonical_uv_classes_certify_signed_aliases_and_preserve_raw_sectors ... FAILED
43.58 s
gammaloop-nextest-core>
43.58 s
gammaloop-nextest-core> failures:
43.58 s
gammaloop-nextest-core>
43.58 s
gammaloop-nextest-core> failures:
43.58 s
gammaloop-nextest-core> uv::approx::local_4d::tests::canonical_uv_classes_certify_signed_aliases_and_preserve_raw_sectors
43.58 s
gammaloop-nextest-core>
43.58 s
gammaloop-nextest-core> test result: FAILED. 0 passed; 1 failed; 0 ignored; 0 measured; 742 filtered out; finished in 0.11s
43.58 s
gammaloop-nextest-core> system-err
43.58 s
gammaloop-nextest-core> Error:
43.58 s
gammaloop-nextest-core> 0: merged canonical UV numerator does not reproduce its source bucket
43.58 s
gammaloop-nextest-core>
43.58 s
gammaloop-nextest-core> Location:
43.58 s
gammaloop-nextest-core> crates/gammalooprs/src/uv/approx/local_4d.rs:367
43.58 s
gammaloop-nextest-core>
43.58 s
gammaloop-nextest-core> ━━━━━━━━━━━━━━━━━━━━━━━━━━━━━━━━━━ BACKTRACE ━━━━━━━━━━━━━━━━━━━━━━━━━━━━━━━━━━━
43.58 s
gammaloop-nextest-core> 1: <color_eyre[51793ea62743adbd]::config::EyreHook>::into_eyre_hook::{closure#0}<unknown>
43.58 s
gammaloop-nextest-core> at <unknown source file>:<unknown line>
43.58 s
gammaloop-nextest-core> 2: eyre[cb2fd339c0c40fca]::capture_handler<unknown>
43.58 s
gammaloop-nextest-core> at <unknown source file>:<unknown line>
43.58 s
gammaloop-nextest-core> 3: eyre[cb2fd339c0c40fca]::private::format_err<unknown>
43.58 s
gammaloop-nextest-core> at <unknown source file>:<unknown line>
43.58 s
gammaloop-nextest-core> 4: <gammalooprs[24955f93fc9f4e0c]::uv::approx::local_4d::FourDSector>::canonical_projection<unknown>
43.58 s
gammaloop-nextest-core> at <unknown source file>:<unknown line>
43.58 s
gammaloop-nextest-core> 5: gammalooprs[24955f93fc9f4e0c]::uv::approx::local_4d::tests::canonical_uv_classes_certify_signed_aliases_and_preserve_raw_sectors<unknown>
43.58 s
gammaloop-nextest-core> at <unknown source file>:<unknown line>
43.58 s
gammaloop-nextest-core> 6: <gammalooprs[24955f93fc9f4e0c]::uv::approx::local_4d::tests::canonical_uv_classes_certify_signed_aliases_and_preserve_raw_sectors::{closure#0} as core[940e698046960fd5]::ops::function::FnOnce<()>>::call_once<unknown>
43.58 s
gammaloop-nextest-core> at <unknown source file>:<unknown line>
43.58 s
gammaloop-nextest-core> 7: test[75d6903177b1d7e9]::__rust_begin_short_backtrace::<core[940e698046960fd5]::result::Result<(), alloc[2ea6bcb46fca0c42]::string::String>, fn() -> core[940e698046960fd5]::result::Result<(), alloc[2ea6bcb46fca0c42]::string::String>><unknown>
43.58 s
gammaloop-nextest-core> at <unknown source file>:<unknown line>
43.58 s
gammaloop-nextest-core> 8: test[75d6903177b1d7e9]::run_test::{closure#0}<unknown>
43.58 s
gammaloop-nextest-core> at <unknown source file>:<unknown line>
43.58 s
gammaloop-nextest-core> 9: std[bcb96dfbba0ab899]::sys::backtrace::__rust_begin_short_backtrace::<test[75d6903177b1d7e9]::run_test::{closure#1}, ()><unknown>
43.58 s
gammaloop-nextest-core> at <unknown source file>:<unknown line>
43.58 s
gammaloop-nextest-core> 10: <std[bcb96dfbba0ab899]::thread::lifecycle::spawn_unchecked<test[75d6903177b1d7e9]::run_test::{closure#1}, ()>::{closure#1} as core[940e698046960fd5]::ops::function::FnOnce<()>>::call_once::{shim:vtable#0}<unknown>
43.58 s
gammaloop-nextest-core> at <unknown source file>:<unknown line>
43.58 s
gammaloop-nextest-core> 11: <std[bcb96dfbba0ab899]::sys::thread::unix::Thread>::new::thread_start<unknown>
43.58 s
gammaloop-nextest-core> at <unknown source file>:<unknown line>
43.58 s
gammaloop-nextest-core> 12: start_thread<unknown>
43.58 s
gammaloop-nextest-core> at <unknown source file>:<unknown line>
43.58 s
gammaloop-nextest-core> 13: __clone3<unknown>
43.58 s
gammaloop-nextest-core> at <unknown source file>:<unknown line>
43.58 s
gammaloop-nextest-core>
43.58 s
gammaloop-nextest-core> Run with COLORBT_SHOW_HIDDEN=1 environment variable to disable frame filtering.
43.58 s
gammaloop-nextest-core> Run with RUST_BACKTRACE=full to include source snippets.
43.58 s
gammaloop-nextest-core>
43.58 s
gammaloop-nextest-core> 6. gammalooprs::uv::approx::tests::direct_nested_scalar_banana_replays_complete_cff_at_depth_three
43.58 s
gammaloop-nextest-core> failure: test failure with exit code 101
43.58 s
gammaloop-nextest-core> Error:
43.58 s
gammaloop-nextest-core> 0: canonical UV numerator does not reproduce its source in the component frame
43.58 s
gammaloop-nextest-core>
43.58 s
gammaloop-nextest-core> Location:
43.58 s
gammaloop-nextest-core> crates/gammalooprs/src/uv/approx/local_4d.rs:354
43.58 s
gammaloop-nextest-core>
43.58 s
gammaloop-nextest-core> ━━━━━━━━━━━━━━━━━━━━━━━━━━━━━━━━━━ BACKTRACE ━━━━━━━━━━━━━━━━━━━━━━━━━━━━━━━━━━━
43.58 s
gammaloop-nextest-core> 1: <color_eyre[51793ea62743adbd]::config::EyreHook>::into_eyre_hook::{closure#0}<unknown>
43.58 s
gammaloop-nextest-core> at <unknown source file>:<unknown line>
43.58 s
gammaloop-nextest-core> 2: eyre[cb2fd339c0c40fca]::capture_handler<unknown>
43.58 s
gammaloop-nextest-core> at <unknown source file>:<unknown line>
43.58 s
gammaloop-nextest-core> 3: eyre[cb2fd339c0c40fca]::private::format_err<unknown>
43.58 s
gammaloop-nextest-core> at <unknown source file>:<unknown line>
43.58 s
gammaloop-nextest-core> 4: <gammalooprs[24955f93fc9f4e0c]::uv::approx::local_4d::FourDSector>::canonical_projection<unknown>
43.58 s
gammaloop-nextest-core> at <unknown source file>:<unknown line>
43.58 s
gammaloop-nextest-core> 5: <gammalooprs[24955f93fc9f4e0c]::uv::approx::projected_4d::Projected4dApproximation>::project_local_4d<unknown>
43.58 s
gammaloop-nextest-core> at <unknown source file>:<unknown line>
43.58 s
gammaloop-nextest-core> 6: <gammalooprs[24955f93fc9f4e0c]::uv::approx::Approximation>::compute_3d<unknown>
43.58 s
gammaloop-nextest-core> at <unknown source file>:<unknown line>
43.58 s
gammaloop-nextest-core> 7: gammalooprs[24955f93fc9f4e0c]::uv::approx::tests::direct_nested_scalar_banana_replays_complete_cff_at_depth_three::{closure#0}<unknown>
43.58 s
gammaloop-nextest-core> at <unknown source file>:<unknown line>
43.58 s
gammaloop-nextest-core> 8: gammalooprs[24955f93fc9f4e0c]::uv::approx::tests::direct_nested_scalar_banana_replays_complete_cff_at_depth_three<unknown>
43.58 s
gammaloop-nextest-core> at <unknown source file>:<unknown line>
43.58 s
gammaloop-nextest-core> 9: <gammalooprs[24955f93fc9f4e0c]::uv::approx::tests::direct_nested_scalar_banana_replays_complete_cff_at_depth_three::{closure#0} as core[940e698046960fd5]::ops::function::FnOnce<()>>::call_once<unknown>
43.58 s
gammaloop-nextest-core> at <unknown source file>:<unknown line>
43.58 s
gammaloop-nextest-core> 10: test[75d6903177b1d7e9]::__rust_begin_short_backtrace::<core[940e698046960fd5]::result::Result<(), alloc[2ea6bcb46fca0c42]::string::String>, fn() -> core[940e698046960fd5]::result::Result<(), alloc[2ea6bcb46fca0c42]::string::String>><unknown>
43.58 s
gammaloop-nextest-core> at <unknown source file>:<unknown line>
43.58 s
gammaloop-nextest-core> 11: test[75d6903177b1d7e9]::run_test::{closure#0}<unknown>
43.58 s
gammaloop-nextest-core> at <unknown source file>:<unknown line>
43.58 s
gammaloop-nextest-core> 12: std[bcb96dfbba0ab899]::sys::backtrace::__rust_begin_short_backtrace::<test[75d6903177b1d7e9]::run_test::{closure#1}, ()><unknown>
43.58 s
gammaloop-nextest-core> at <unknown source file>:<unknown line>
43.58 s
gammaloop-nextest-core> 13: <std[bcb96dfbba0ab899]::thread::lifecycle::spawn_unchecked<test[75d6903177b1d7e9]::run_test::{closure#1}, ()>::{closure#1} as core[940e698046960fd5]::ops::function::FnOnce<()>>::call_once::{shim:vtable#0}<unknown>
43.58 s
gammaloop-nextest-core> at <unknown source file>:<unknown line>
43.58 s
gammaloop-nextest-core> 14: <std[bcb96dfbba0ab899]::sys::thread::unix::Thread>::new::thread_start<unknown>
43.58 s
gammaloop-nextest-core> at <unknown source file>:<unknown line>
43.58 s
gammaloop-nextest-core> 15: start_thread<unknown>
43.58 s
gammaloop-nextest-core> at <unknown source file>:<unknown line>
43.58 s
gammaloop-nextest-core> 16: __clone3<unknown>
43.58 s
gammaloop-nextest-core> at <unknown source file>:<unknown line>
43.58 s
gammaloop-nextest-core>
43.58 s
gammaloop-nextest-core> Run with COLORBT_SHOW_HIDDEN=1 environment variable to disable frame filtering.
43.58 s
gammaloop-nextest-core> Run with RUST_BACKTRACE=full to include source snippets.
43.58 s
gammaloop-nextest-core> system-out
43.58 s
gammaloop-nextest-core> running 1 test
43.58 s
gammaloop-nextest-core> test uv::approx::tests::direct_nested_scalar_banana_replays_complete_cff_at_depth_three ... FAILED
43.58 s
gammaloop-nextest-core>
43.58 s
gammaloop-nextest-core> failures:
43.58 s
gammaloop-nextest-core>
43.58 s
gammaloop-nextest-core> failures:
43.58 s
gammaloop-nextest-core> uv::approx::tests::direct_nested_scalar_banana_replays_complete_cff_at_depth_three
43.58 s
gammaloop-nextest-core>
43.58 s
gammaloop-nextest-core> test result: FAILED. 0 passed; 1 failed; 0 ignored; 0 measured; 742 filtered out; finished in 0.09s
43.58 s
gammaloop-nextest-core> system-err
43.58 s
gammaloop-nextest-core> Error:
43.58 s
gammaloop-nextest-core> 0: canonical UV numerator does not reproduce its source in the component frame
43.58 s
gammaloop-nextest-core>
43.58 s
gammaloop-nextest-core> Location:
43.58 s
gammaloop-nextest-core> crates/gammalooprs/src/uv/approx/local_4d.rs:354
43.58 s
gammaloop-nextest-core>
43.58 s
gammaloop-nextest-core> ━━━━━━━━━━━━━━━━━━━━━━━━━━━━━━━━━━ BACKTRACE ━━━━━━━━━━━━━━━━━━━━━━━━━━━━━━━━━━━
43.58 s
gammaloop-nextest-core> 1: <color_eyre[51793ea62743adbd]::config::EyreHook>::into_eyre_hook::{closure#0}<unknown>
43.58 s
gammaloop-nextest-core> at <unknown source file>:<unknown line>
43.58 s
gammaloop-nextest-core> 2: eyre[cb2fd339c0c40fca]::capture_handler<unknown>
43.58 s
gammaloop-nextest-core> at <unknown source file>:<unknown line>
43.58 s
gammaloop-nextest-core> 3: eyre[cb2fd339c0c40fca]::private::format_err<unknown>
43.58 s
gammaloop-nextest-core> at <unknown source file>:<unknown line>
43.58 s
gammaloop-nextest-core> 4: <gammalooprs[24955f93fc9f4e0c]::uv::approx::local_4d::FourDSector>::canonical_projection<unknown>
43.58 s
gammaloop-nextest-core> at <unknown source file>:<unknown line>
43.58 s
gammaloop-nextest-core> 5: <gammalooprs[24955f93fc9f4e0c]::uv::approx::projected_4d::Projected4dApproximation>::project_local_4d<unknown>
43.58 s
gammaloop-nextest-core> at <unknown source file>:<unknown line>
43.58 s
gammaloop-nextest-core> 6: <gammalooprs[24955f93fc9f4e0c]::uv::approx::Approximation>::compute_3d<unknown>
43.58 s
gammaloop-nextest-core> at <unknown source file>:<unknown line>
43.58 s
gammaloop-nextest-core> 7: gammalooprs[24955f93fc9f4e0c]::uv::approx::tests::direct_nested_scalar_banana_replays_complete_cff_at_depth_three::{closure#0}<unknown>
43.58 s
gammaloop-nextest-core> at <unknown source file>:<unknown line>
43.58 s
gammaloop-nextest-core> 8: gammalooprs[24955f93fc9f4e0c]::uv::approx::tests::direct_nested_scalar_banana_replays_complete_cff_at_depth_three<unknown>
43.58 s
gammaloop-nextest-core> at <unknown source file>:<unknown line>
43.58 s
gammaloop-nextest-core> 9: <gammalooprs[24955f93fc9f4e0c]::uv::approx::tests::direct_nested_scalar_banana_replays_complete_cff_at_depth_three::{closure#0} as core[940e698046960fd5]::ops::function::FnOnce<()>>::call_once<unknown>
43.58 s
gammaloop-nextest-core> at <unknown source file>:<unknown line>
43.58 s
gammaloop-nextest-core> 10: test[75d6903177b1d7e9]::__rust_begin_short_backtrace::<core[940e698046960fd5]::result::Result<(), alloc[2ea6bcb46fca0c42]::string::String>, fn() -> core[940e698046960fd5]::result::Result<(), alloc[2ea6bcb46fca0c42]::string::String>><unknown>
43.58 s
gammaloop-nextest-core> at <unknown source file>:<unknown line>
43.58 s
gammaloop-nextest-core> 11: test[75d6903177b1d7e9]::run_test::{closure#0}<unknown>
43.58 s
gammaloop-nextest-core> at <unknown source file>:<unknown line>
43.58 s
gammaloop-nextest-core> 12: std[bcb96dfbba0ab899]::sys::backtrace::__rust_begin_short_backtrace::<test[75d6903177b1d7e9]::run_test::{closure#1}, ()><unknown>
43.58 s
gammaloop-nextest-core> at <unknown source file>:<unknown line>
43.58 s
gammaloop-nextest-core> 13: <std[bcb96dfbba0ab899]::thread::lifecycle::spawn_unchecked<test[75d6903177b1d7e9]::run_test::{closure#1}, ()>::{closure#1} as core[940e698046960fd5]::ops::function::FnOnce<()>>::call_once::{shim:vtable#0}<unknown>
43.58 s
gammaloop-nextest-core> at <unknown source file>:<unknown line>
43.58 s
gammaloop-nextest-core> 14: <std[bcb96dfbba0ab899]::sys::thread::unix::Thread>::new::thread_start<unknown>
43.58 s
gammaloop-nextest-core> at <unknown source file>:<unknown line>
43.58 s
gammaloop-nextest-core> 15: start_thread<unknown>
43.58 s
gammaloop-nextest-core> at <unknown source file>:<unknown line>
43.58 s
gammaloop-nextest-core> 16: __clone3<unknown>
43.58 s
gammaloop-nextest-core> at <unknown source file>:<unknown line>
43.58 s
gammaloop-nextest-core>
43.58 s
gammaloop-nextest-core> Run with COLORBT_SHOW_HIDDEN=1 environment variable to disable frame filtering.
43.58 s
gammaloop-nextest-core> Run with RUST_BACKTRACE=full to include source snippets.
43.58 s
gammaloop-nextest-core> =========================================
43.61 s
gammaloop-nextest-core> Extracting 1 binary, 1 build script output directory, and 1 linked path to /build/nextest-archive-VVI262
43.69 s
gammaloop-nextest-core> Extracted 7 files to /build/nextest-archive-VVI262 in 0.09s
43.72 s
gammaloop-nextest-core> ------------
43.72 s
gammaloop-nextest-core> Nextest run ID cbda4163-781e-4d32-8559-424c822c8364 with nextest profile: ci_gammaloop
43.72 s
gammaloop-nextest-core> Starting 105 tests across 1 binary
62.06 s
gammaloop-nextest-core> ------------
62.06 s
gammaloop-nextest-core> Summary [ 18.347s] 105 tests run: 105 passed , 0 skipped
62.11 s
gammaloop-nextest-core>
62.11 s
gammaloop-nextest-core> ========== nextest test summary ==========
62.11 s
gammaloop-nextest-core> report: target/nextest/ci_gammaloop/junit.xml
62.11 s
gammaloop-nextest-core> tests: 105, failures: 0, errors: 0
62.11 s
gammaloop-nextest-core> No failing testcases found.
62.11 s
gammaloop-nextest-core> =========================================
62.18 s
error: Cannot build '/nix/store/n61r02micjg0snakcv487zfdf4anp50s-gammaloop-nextest-core.drv '.
62.18 s
Reason: builder failed with exit code 100 .
62.18 s
Output paths:
62.18 s
/nix/store/xbaygav73qg6fbyhf734mhwpzkgjgnd5-gammaloop-nextest-core
62.18 s
Last 1069 log lines:
62.18 s
> Extracting 4 binaries (including 1 non-test binary), 1 build script output directory, and 2 linked paths to /build/nextest-archive-xcamp3
62.18 s
> Extracted 20 files to /build/nextest-archive-xcamp3 in 0.79s
62.18 s
> ------------
62.18 s
> Nextest run ID b421eb54-4ee9-4f9b-8160-24abaaab242f with nextest profile: ci_gammaloop
62.18 s
> Starting 379 tests across 3 binaries
62.18 s
> ------------
62.18 s
> Summary [ 1.391s] 379 tests run: 379 passed , 0 skipped
62.18 s
>
62.18 s
> ========== nextest test summary ==========
62.18 s
> report: target/nextest/ci_gammaloop/junit.xml
62.18 s
> tests: 379, failures: 0, errors: 0
62.18 s
> No failing testcases found.
62.18 s
> =========================================
62.18 s
> Extracting 1 binary and 1 linked path to /build/nextest-archive-fxbLs0
62.18 s
> Extracted 7 files to /build/nextest-archive-fxbLs0 in 0.07s
62.18 s
> ------------
62.18 s
> Nextest run ID 6bf7d592-ce67-4c5f-869a-c534f3c45f72 with nextest profile: ci_gammaloop
62.18 s
> Starting 19 tests across 1 binary
62.18 s
> ------------
62.18 s
> Summary [ 0.013s] 19 tests run: 19 passed , 0 skipped
62.18 s
>
62.18 s
> ========== nextest test summary ==========
62.18 s
> report: target/nextest/ci_gammaloop/junit.xml
62.18 s
> tests: 19, failures: 0, errors: 0
62.18 s
> No failing testcases found.
62.18 s
> =========================================
62.18 s
> Extracting 1 binary to /build/nextest-archive-OuDozE
62.18 s
> Extracted 4 files to /build/nextest-archive-OuDozE in 0.03s
62.18 s
> ------------
62.18 s
> Nextest run ID d2523067-980f-45bd-a79f-e66787f149d2 with nextest profile: ci_gammaloop
62.18 s
> Starting 0 tests across 1 binary
62.18 s
> ------------
62.18 s
> Summary [ 0.000s] 0 tests run: 0 passed , 0 skipped
62.18 s
>
62.18 s
> ========== nextest test summary ==========
62.18 s
> report: target/nextest/ci_gammaloop/junit.xml
62.18 s
> tests: 0, failures: 0, errors: 0
62.18 s
> No failing testcases found.
62.18 s
> =========================================
62.18 s
> Extracting 4 binaries, 1 build script output directory, and 2 linked paths to /build/nextest-archive-FtZm0W
62.18 s
> Extracted 18 files to /build/nextest-archive-FtZm0W in 0.50s
62.18 s
> ------------
62.18 s
> Nextest run ID a0e5fcbd-74c2-4e1a-beb9-e900a1e9eda2 with nextest profile: ci_gammaloop
62.18 s
> Starting 692 tests across 4 binaries (60 tests skipped , including 59 tests via profile.ci_gammaloop.default-filter )
62.18 s
> FAIL [ 0.107s] (159/692) gammalooprs graph::three_d_source::tests :: exact_taylor_vacuum_affine_circulation_preserves_energy_mapping
62.18 s
> stdout ---
62.18 s
>
62.18 s
> running 1 test
62.18 s
> test graph::three_d_source::tests::exact_taylor_vacuum_affine_circulation_preserves_energy_mapping ... FAILED
62.18 s
>
62.18 s
> failures:
62.18 s
>
62.18 s
> failures:
62.18 s
> graph::three_d_source::tests::exact_taylor_vacuum_affine_circulation_preserves_energy_mapping
62.18 s
>
62.18 s
> test result: FAILED. 0 passed; 1 failed; 0 ignored; 0 measured; 742 filtered out; finished in 0.10s
62.18 s
>
62.18 s
> stderr ---
62.18 s
> The application panicked (crashed).
62.18 s
> Message: assertion `left == right` failed
62.18 s
> left: (gammalooprs::mUVexp^2+(-gammalooprs::Q(1,spenso::cind(1))+gammalooprs::Q(4,spenso::cind(1)))^2+(-gammalooprs::Q(1,spenso::cind(2))+gammalooprs::Q(4,spenso::cind(2)))^2+(-gammalooprs::Q(1,spenso::cind(3))+gammalooprs::Q(4,spenso::cind(3)))^2)^(1/2)
62.18 s
> right: (gammalooprs::mUVexp^2+(gammalooprs::Q(1,spenso::cind(1))-gammalooprs::Q(4,spenso::cind(1)))^2+(gammalooprs::Q(1,spenso::cind(2))-gammalooprs::Q(4,spenso::cind(2)))^2+(gammalooprs::Q(1,spenso::cind(3))-gammalooprs::Q(4,spenso::cind(3)))^2)^(1/2)
62.18 s
> Location: crates/gammalooprs/src/graph/three_d_source.rs :7797
62.18 s
>
62.18 s
> ━━━━━━━━━━━━━━━━━━━━━━━━━━━━━━━━━━ BACKTRACE ━━━━━━━━━━━━━━━━━━━━━━━━━━━━━━━━━━━
62.18 s
> 1: <color_eyre[51793ea62743adbd]::config::PanicHook>::panic_report <unknown>
62.18 s
> at <unknown source file> :<unknown line>
62.18 s
> 2: <color_eyre[51793ea62743adbd]::config::PanicHook>::into_panic_hook::{closure#0} <unknown>
62.18 s
> at <unknown source file> :<unknown line>
62.18 s
> 3: std[bcb96dfbba0ab899]::panicking::panic_with_hook <unknown>
62.18 s
> at <unknown source file> :<unknown line>
62.18 s
> 4: std[bcb96dfbba0ab899]::panicking::panic_handler::{closure#0} <unknown>
62.18 s
> at <unknown source file> :<unknown line>
62.18 s
> 5: std[bcb96dfbba0ab899]::sys::backtrace::__rust_end_short_backtrace::<std[bcb96dfbba0ab899]::panicking::panic_handler::{closure#0}, !> <unknown>
62.18 s
> at <unknown source file> :<unknown line>
62.18 s
> 6: __rustc[6c289b9f9c454d21]::rust_begin_unwind <unknown>
62.18 s
> at <unknown source file> :<unknown line>
62.18 s
> 7: core[940e698046960fd5]::panicking::panic_fmt <unknown>
62.18 s
> at <unknown source file> :<unknown line>
62.18 s
> 8: core[940e698046960fd5]::panicking::assert_failed_inner <unknown>
62.18 s
> at <unknown source file> :<unknown line>
62.18 s
> 9: core[940e698046960fd5]::panicking::assert_failed::<symbolica[499970c26fd75ddd]::atom::Atom, symbolica[499970c26fd75ddd]::atom::Atom> <unknown>
62.18 s
> at <unknown source file> :<unknown line>
62.18 s
> 10: gammalooprs[24955f93fc9f4e0c]::graph::three_d_source::tests::exact_taylor_vacuum_affine_circulation_preserves_energy_mapping <unknown>
62.18 s
> at <unknown source file> :<unknown line>
62.18 s
> 11: <gammalooprs[24955f93fc9f4e0c]::graph::three_d_source::tests::exact_taylor_vacuum_affine_circulation_preserves_energy_mapping::{closure#0} as core[940e698046960fd5]::ops::function::FnOnce<()>>::call_once <unknown>
62.18 s
> at <unknown source file> :<unknown line>
62.18 s
> 12: test[75d6903177b1d7e9]::__rust_begin_short_backtrace::<core[940e698046960fd5]::result::Result<(), alloc[2ea6bcb46fca0c42]::string::String>, fn() -> core[940e698046960fd5]::result::Result<(), alloc[2ea6bcb46fca0c42]::string::String>> <unknown>
62.18 s
> at <unknown source file> :<unknown line>
62.18 s
> 13: test[75d6903177b1d7e9]::run_test::{closure#0} <unknown>
62.18 s
> at <unknown source file> :<unknown line>
62.18 s
> 14: std[bcb96dfbba0ab899]::sys::backtrace::__rust_begin_short_backtrace::<test[75d6903177b1d7e9]::run_test::{closure#1}, ()> <unknown>
62.18 s
> at <unknown source file> :<unknown line>
62.18 s
> 15: <std[bcb96dfbba0ab899]::thread::lifecycle::spawn_unchecked<test[75d6903177b1d7e9]::run_test::{closure#1}, ()>::{closure#1} as core[940e698046960fd5]::ops::function::FnOnce<()>>::call_once::{shim:vtable#0} <unknown>
62.18 s
> at <unknown source file> :<unknown line>
62.18 s
> 16: <std[bcb96dfbba0ab899]::sys::thread::unix::Thread>::new::thread_start <unknown>
62.18 s
> at <unknown source file> :<unknown line>
62.18 s
> 17: start_thread <unknown>
62.18 s
> at <unknown source file> :<unknown line>
62.18 s
> 18: __clone3 <unknown>
62.18 s
> at <unknown source file> :<unknown line>
62.18 s
>
62.18 s
> Run with COLORBT_SHOW_HIDDEN=1 environment variable to disable frame filtering.
62.18 s
> Run with RUST_BACKTRACE=full to include source snippets.
62.18 s
>
62.18 s
> FAIL [ 0.134s] (181/692) gammalooprs graph::three_d_source::tests :: pinched_affine_carrier_requires_occurrence_interpolation
62.18 s
> stdout ---
62.18 s
>
62.18 s
> running 1 test
62.18 s
> test graph::three_d_source::tests::pinched_affine_carrier_requires_occurrence_interpolation ... FAILED
62.18 s
>
62.18 s
> failures:
62.18 s
>
62.18 s
> failures:
62.18 s
> graph::three_d_source::tests::pinched_affine_carrier_requires_occurrence_interpolation
62.18 s
>
62.18 s
> test result: FAILED. 0 passed; 1 failed; 0 ignored; 0 measured; 742 filtered out; finished in 0.13s
62.18 s
>
62.18 s
> stderr ---
62.18 s
> The application panicked (crashed).
62.18 s
> Message: certified affine occurrence lift must reproduce the independent double contours: actual=-(-1/16*(3+E0)*(5+E0)/((1+Q(0,cind(1))^2+Q(0,cind(2))^2+Q(0,cind(3))^2)^(3/2)*(1+Q(1,cind(1))^2+Q(1,cind(2))^2+Q(1,cind(3))^2)^(3/2))-1/16*(3+E1)*(5+E1)/((1+Q(0,cind(1))^2+Q(0,cind(2))^2+Q(0,cind(3))^2)^(3/2)*(1+Q(1,cind(1))^2+Q(1,cind(2))^2+Q(1,cind(3))^2)^(3/2))-1/16*(3-E0)*(5-E0)/((1+Q(0,cind(1))^2+Q(0,cind(2))^2+Q(0,cind(3))^2)^(3/2)*(1+Q(1,cind(1))^2+Q(1,cind(2))^2+Q(1,cind(3))^2)^(3/2))-1/16*(3-E1)*(5-E1)/((1+Q(0,cind(1))^2+Q(0,cind(2))^2+Q(0,cind(3))^2)^(3/2)*(1+Q(1,cind(1))^2+Q(1,cind(2))^2+Q(1,cind(3))^2)^(3/2))+1/64*(3+E0+E1)*(5+E0+E1)/((1+Q(0,cind(1))^2+Q(0,cind(2))^2+Q(0,cind(3))^2)^(3/2)*(1+Q(1,cind(1))^2+Q(1,cind(2))^2+Q(1,cind(3))^2)^(3/2))+1/64*(3+E0-E1)*(5+E0-E1)/((1+Q(0,cind(1))^2+Q(0,cind(2))^2+Q(0,cind(3))^2)^(3/2)*(1+Q(1,cind(1))^2+Q(1,cind(2))^2+Q(1,cind(3))^2)^(3/2))+1/64*(3-E0+E1)*(5-E0+E1)/((1+Q(0,cind(1))^2+Q(0,cind(2))^2+Q(0,cind(3))^2)^(3/2)*(1+Q(1,cind(1))^2+Q(1,cind(2))^2+Q(1,cind(3))^2)^(3/2))+1/64*(3-E0-E1)*(5-E0-E1)/((1+Q(0,cind(1))^2+Q(0,cind(2))^2+Q(0,cind(3))^2)^(3/2)*(1+Q(1,cind(1))^2+Q(1,cind(2))^2+Q(1,cind(3))^2)^(3/2))+15/4/((1+Q(0,cind(1))^2+Q(0,cind(2))^2+Q(0,cind(3))^2)^(3/2)*(1+Q(1,cind(1))^2+Q(1,cind(2))^2+Q(1,cind(3))^2)^(3/2))), expected=1/16*(15-E0^2-E1^2)/(E0^3*E1^3)
62.18 s
> Location: crates/gammalooprs/src/graph/three_d_source.rs :7619
62.18 s
>
62.18 s
> ━━━━━━━━━━━━━━━━━━━━━━━━━━━━━━━━━━ BACKTRACE ━━━━━━━━━━━━━━━━━━━━━━━━━━━━━━━━━━━
62.18 s
> 1: <color_eyre[51793ea62743adbd]::config::PanicHook>::panic_report <unknown>
62.18 s
> at <unknown source file> :<unknown line>
62.18 s
> 2: <color_eyre[51793ea62743adbd]::config::PanicHook>::into_panic_hook::{closure#0} <unknown>
62.18 s
> at <unknown source file> :<unknown line>
62.18 s
> 3: std[bcb96dfbba0ab899]::panicking::panic_with_hook <unknown>
62.18 s
> at <unknown source file> :<unknown line>
62.18 s
> 4: std[bcb96dfbba0ab899]::panicking::panic_handler::{closure#0} <unknown>
62.18 s
> at <unknown source file> :<unknown line>
62.18 s
> 5: std[bcb96dfbba0ab899]::sys::backtrace::__rust_end_short_backtrace::<std[bcb96dfbba0ab899]::panicking::panic_handler::{closure#0}, !> <unknown>
62.18 s
> at <unknown source file> :<unknown line>
62.18 s
> 6: __rustc[6c289b9f9c454d21]::rust_begin_unwind <unknown>
62.18 s
> at <unknown source file> :<unknown line>
62.18 s
> 7: core[940e698046960fd5]::panicking::panic_fmt <unknown>
62.18 s
> at <unknown source file> :<unknown line>
62.18 s
> 8: <gammalooprs[24955f93fc9f4e0c]::graph::three_d_source::tests::pinched_affine_carrier_requires_occurrence_interpolation::{closure#0} as core[940e698046960fd5]::ops::function::FnOnce<()>>::call_once <unknown>
62.18 s
> at <unknown source file> :<unknown line>
62.18 s
> 9: test[75d6903177b1d7e9]::__rust_begin_short_backtrace::<core[940e698046960fd5]::result::Result<(), alloc[2ea6bcb46fca0c42]::string::String>, fn() -> core[940e698046960fd5]::result::Result<(), alloc[2ea6bcb46fca0c42]::string::String>> <unknown>
62.18 s
> at <unknown source file> :<unknown line>
62.18 s
> 10: test[75d6903177b1d7e9]::run_test::{closure#0} <unknown>
62.18 s
> at <unknown source file> :<unknown line>
62.18 s
> 11: std[bcb96dfbba0ab899]::sys::backtrace::__rust_begin_short_backtrace::<test[75d6903177b1d7e9]::run_test::{closure#1}, ()> <unknown>
62.18 s
> at <unknown source file> :<unknown line>
62.18 s
> 12: <std[bcb96dfbba0ab899]::thread::lifecycle::spawn_unchecked<test[75d6903177b1d7e9]::run_test::{closure#1}, ()>::{closure#1} as core[940e698046960fd5]::ops::function::FnOnce<()>>::call_once::{shim:vtable#0} <unknown>
62.18 s
> at <unknown source file> :<unknown line>
62.18 s
> 13: <std[bcb96dfbba0ab899]::sys::thread::unix::Thread>::new::thread_start <unknown>
62.18 s
> at <unknown source file> :<unknown line>
62.18 s
> 14: start_thread <unknown>
62.18 s
> at <unknown source file> :<unknown line>
62.18 s
> 15: __clone3 <unknown>
62.18 s
> at <unknown source file> :<unknown line>
62.18 s
>
62.18 s
> Run with COLORBT_SHOW_HIDDEN=1 environment variable to disable frame filtering.
62.18 s
> Run with RUST_BACKTRACE=full to include source snippets.
62.18 s
>
62.18 s
> FAIL [ 0.021s] (298/692) gammalooprs numerator::energy_degree::tests :: canonical_class_cyclic_lifts_preserve_factorization_and_exact_bounds
62.18 s
> stdout ---
62.18 s
>
62.18 s
> running 1 test
62.18 s
> test numerator::energy_degree::tests::canonical_class_cyclic_lifts_preserve_factorization_and_exact_bounds ... FAILED
62.18 s
>
62.18 s
> failures:
62.18 s
>
62.18 s
> failures:
62.18 s
> numerator::energy_degree::tests::canonical_class_cyclic_lifts_preserve_factorization_and_exact_bounds
62.18 s
>
62.18 s
> test result: FAILED. 0 passed; 1 failed; 0 ignored; 0 measured; 742 filtered out; finished in 0.01s
62.18 s
>
62.18 s
> stderr ---
62.18 s
>
62.18 s
> thread 'numerator::energy_degree::tests::canonical_class_cyclic_lifts_preserve_factorization_and_exact_bounds' (2289) panicked at crates/gammalooprs/src/numerator/energy_degree.rs:2850:13:
62.18 s
> assertion failed: (collapsed - expression).collect_factors().is_zero()
62.18 s
> stack backtrace:
62.18 s
> 0: __rustc::rust_begin_unwind
62.18 s
> 1: core::panicking::panic_fmt
62.18 s
> 2: core::panicking::panic
62.18 s
> 3: gammalooprs::numerator::energy_degree::tests::canonical_class_cyclic_lifts_preserve_factorization_and_exact_bounds
62.18 s
> 4: <gammalooprs::numerator::energy_degree::tests::canonical_class_cyclic_lifts_preserve_factorization_and_exact_bounds::{closure#0} as core::ops::function::FnOnce<()>>::call_once
62.18 s
> note: Some details are omitted, run with `RUST_BACKTRACE=full` for a verbose backtrace.
62.18 s
>
62.18 s
> FAIL [ 0.107s] (592/692) gammalooprs uv::approx::local_4d::tests :: canonical_uv_signed_multiloop_carriers_preserve_factorized_numerators
62.18 s
> stdout ---
62.18 s
>
62.18 s
> running 1 test
62.18 s
> test uv::approx::local_4d::tests::canonical_uv_signed_multiloop_carriers_preserve_factorized_numerators ... FAILED
62.18 s
>
62.18 s
> failures:
62.18 s
>
62.18 s
> failures:
62.18 s
> uv::approx::local_4d::tests::canonical_uv_signed_multiloop_carriers_preserve_factorized_numerators
62.18 s
>
62.18 s
> test result: FAILED. 0 passed; 1 failed; 0 ignored; 0 measured; 742 filtered out; finished in 0.09s
62.18 s
>
62.18 s
> stderr ---
62.18 s
> The application panicked (crashed).
62.18 s
> Message: assertion `left == right` failed
62.18 s
> left: 2*(signed_multiloop::a+signed_multiloop::b)^5*gammalooprs::Q(gammalooprs::uv::class(0),spenso::cind(0))
62.18 s
> right: -2*(signed_multiloop::a+signed_multiloop::b)^5*gammalooprs::Q(gammalooprs::uv::class(0),spenso::cind(0))
62.18 s
> Location: crates/gammalooprs/src/uv/approx/local_4d.rs :1983
62.18 s
>
62.18 s
> ━━━━━━━━━━━━━━━━━━━━━━━━━━━━━━━━━━ BACKTRACE ━━━━━━━━━━━━━━━━━━━━━━━━━━━━━━━━━━━
62.18 s
> 1: <color_eyre[51793ea62743adbd]::config::PanicHook>::panic_report <unknown>
62.18 s
> at <unknown source file> :<unknown line>
62.18 s
> 2: <color_eyre[51793ea62743adbd]::config::PanicHook>::into_panic_hook::{closure#0} <unknown>
62.18 s
> at <unknown source file> :<unknown line>
62.18 s
> 3: std[bcb96dfbba0ab899]::panicking::panic_with_hook <unknown>
62.18 s
> at <unknown source file> :<unknown line>
62.18 s
> 4: std[bcb96dfbba0ab899]::panicking::panic_handler::{closure#0} <unknown>
62.18 s
> at <unknown source file> :<unknown line>
62.18 s
> 5: std[bcb96dfbba0ab899]::sys::backtrace::__rust_end_short_backtrace::<std[bcb96dfbba0ab899]::panicking::panic_handler::{closure#0}, !> <unknown>
62.18 s
> at <unknown source file> :<unknown line>
62.18 s
> 6: __rustc[6c289b9f9c454d21]::rust_begin_unwind <unknown>
62.18 s
> at <unknown source file> :<unknown line>
62.18 s
> 7: core[940e698046960fd5]::panicking::panic_fmt <unknown>
62.18 s
> at <unknown source file> :<unknown line>
62.18 s
> 8: core[940e698046960fd5]::panicking::assert_failed_inner <unknown>
62.18 s
> at <unknown source file> :<unknown line>
62.18 s
> 9: core[940e698046960fd5]::panicking::assert_failed::<symbolica[499970c26fd75ddd]::atom::Atom, symbolica[499970c26fd75ddd]::atom::Atom> <unknown>
62.18 s
> at <unknown source file> :<unknown line>
62.18 s
> 10: gammalooprs[24955f93fc9f4e0c]::uv::approx::local_4d::tests::canonical_uv_signed_multiloop_carriers_preserve_factorized_numerators <unknown>
62.18 s
> at <unknown source file> :<unknown line>
62.18 s
> 11: <gammalooprs[24955f93fc9f4e0c]::uv::approx::local_4d::tests::canonical_uv_signed_multiloop_carriers_preserve_factorized_numerators::{closure#0} as core[940e698046960fd5]::ops::function::FnOnce<()>>::call_once <unknown>
62.18 s
> at <unknown source file> :<unknown line>
62.18 s
> 12: test[75d6903177b1d7e9]::__rust_begin_short_backtrace::<core[940e698046960fd5]::result::Result<(), alloc[2ea6bcb46fca0c42]::string::String>, fn() -> core[940e698046960fd5]::result::Result<(), alloc[2ea6bcb46fca0c42]::string::String>> <unknown>
62.18 s
> at <unknown source file> :<unknown line>
62.18 s
> 13: test[75d6903177b1d7e9]::run_test::{closure#0} <unknown>
62.18 s
> at <unknown source file> :<unknown line>
62.18 s
> 14: std[bcb96dfbba0ab899]::sys::backtrace::__rust_begin_short_backtrace::<test[75d6903177b1d7e9]::run_test::{closure#1}, ()> <unknown>
62.18 s
> at <unknown source file> :<unknown line>
62.18 s
> 15: <std[bcb96dfbba0ab899]::thread::lifecycle::spawn_unchecked<test[75d6903177b1d7e9]::run_test::{closure#1}, ()>::{closure#1} as core[940e698046960fd5]::ops::function::FnOnce<()>>::call_once::{shim:vtable#0} <unknown>
62.18 s
> at <unknown source file> :<unknown line>
62.18 s
> 16: <std[bcb96dfbba0ab899]::sys::thread::unix::Thread>::new::thread_start <unknown>
62.18 s
> at <unknown source file> :<unknown line>
62.18 s
> 17: start_thread <unknown>
62.18 s
> at <unknown source file> :<unknown line>
62.18 s
> 18: __clone3 <unknown>
62.18 s
> at <unknown source file> :<unknown line>
62.18 s
>
62.18 s
> Run with COLORBT_SHOW_HIDDEN=1 environment variable to disable frame filtering.
62.19 s
> Run with RUST_BACKTRACE=full to include source snippets.
62.19 s
>
62.19 s
> FAIL [ 0.129s] (593/692) gammalooprs uv::approx::local_4d::tests :: canonical_uv_classes_certify_signed_aliases_and_preserve_raw_sectors
62.19 s
> stdout ---
62.19 s
>
62.19 s
> running 1 test
62.19 s
> test uv::approx::local_4d::tests::canonical_uv_classes_certify_signed_aliases_and_preserve_raw_sectors ... FAILED
62.19 s
>
62.19 s
> failures:
62.19 s
>
62.19 s
> failures:
62.19 s
> uv::approx::local_4d::tests::canonical_uv_classes_certify_signed_aliases_and_preserve_raw_sectors
62.19 s
>
62.19 s
> test result: FAILED. 0 passed; 1 failed; 0 ignored; 0 measured; 742 filtered out; finished in 0.11s
62.19 s
>
62.19 s
> stderr ---
62.19 s
> Error:
62.19 s
> 0: merged canonical UV numerator does not reproduce its source bucket
62.19 s
>
62.19 s
> Location:
62.19 s
> crates/gammalooprs/src/uv/approx/local_4d.rs :367
62.19 s
>
62.19 s
> ━━━━━━━━━━━━━━━━━━━━━━━━━━━━━━━━━━ BACKTRACE ━━━━━━━━━━━━━━━━━━━━━━━━━━━━━━━━━━━
62.19 s
> 1: <color_eyre[51793ea62743adbd]::config::EyreHook>::into_eyre_hook::{closure#0} <unknown>
62.19 s
> at <unknown source file> :<unknown line>
62.19 s
> 2: eyre[cb2fd339c0c40fca]::capture_handler <unknown>
62.19 s
> at <unknown source file> :<unknown line>
62.19 s
> 3: eyre[cb2fd339c0c40fca]::private::format_err <unknown>
62.19 s
> at <unknown source file> :<unknown line>
62.19 s
> 4: <gammalooprs[24955f93fc9f4e0c]::uv::approx::local_4d::FourDSector>::canonical_projection <unknown>
62.19 s
> at <unknown source file> :<unknown line>
62.19 s
> 5: gammalooprs[24955f93fc9f4e0c]::uv::approx::local_4d::tests::canonical_uv_classes_certify_signed_aliases_and_preserve_raw_sectors <unknown>
62.19 s
> at <unknown source file> :<unknown line>
62.19 s
> 6: <gammalooprs[24955f93fc9f4e0c]::uv::approx::local_4d::tests::canonical_uv_classes_certify_signed_aliases_and_preserve_raw_sectors::{closure#0} as core[940e698046960fd5]::ops::function::FnOnce<()>>::call_once <unknown>
62.19 s
> at <unknown source file> :<unknown line>
62.19 s
> 7: test[75d6903177b1d7e9]::__rust_begin_short_backtrace::<core[940e698046960fd5]::result::Result<(), alloc[2ea6bcb46fca0c42]::string::String>, fn() -> core[940e698046960fd5]::result::Result<(), alloc[2ea6bcb46fca0c42]::string::String>> <unknown>
62.19 s
> at <unknown source file> :<unknown line>
62.19 s
> 8: test[75d6903177b1d7e9]::run_test::{closure#0} <unknown>
62.19 s
> at <unknown source file> :<unknown line>
62.19 s
> 9: std[bcb96dfbba0ab899]::sys::backtrace::__rust_begin_short_backtrace::<test[75d6903177b1d7e9]::run_test::{closure#1}, ()> <unknown>
62.19 s
> at <unknown source file> :<unknown line>
62.19 s
> 10: <std[bcb96dfbba0ab899]::thread::lifecycle::spawn_unchecked<test[75d6903177b1d7e9]::run_test::{closure#1}, ()>::{closure#1} as core[940e698046960fd5]::ops::function::FnOnce<()>>::call_once::{shim:vtable#0} <unknown>
62.19 s
> at <unknown source file> :<unknown line>
62.19 s
> 11: <std[bcb96dfbba0ab899]::sys::thread::unix::Thread>::new::thread_start <unknown>
62.19 s
> at <unknown source file> :<unknown line>
62.19 s
> 12: start_thread <unknown>
62.19 s
> at <unknown source file> :<unknown line>
62.19 s
> 13: __clone3 <unknown>
62.19 s
> at <unknown source file> :<unknown line>
62.19 s
>
62.19 s
> Run with COLORBT_SHOW_HIDDEN=1 environment variable to disable frame filtering.
62.19 s
> Run with RUST_BACKTRACE=full to include source snippets.
62.19 s
>
62.19 s
> FAIL [ 0.100s] (606/692) gammalooprs uv::approx::tests :: direct_nested_scalar_banana_replays_complete_cff_at_depth_three
62.19 s
> stdout ---
62.19 s
>
62.19 s
> running 1 test
62.19 s
> test uv::approx::tests::direct_nested_scalar_banana_replays_complete_cff_at_depth_three ... FAILED
62.19 s
>
62.19 s
> failures:
62.19 s
>
62.19 s
> failures:
62.19 s
> uv::approx::tests::direct_nested_scalar_banana_replays_complete_cff_at_depth_three
62.19 s
>
62.19 s
> test result: FAILED. 0 passed; 1 failed; 0 ignored; 0 measured; 742 filtered out; finished in 0.09s
62.19 s
>
62.19 s
> stderr ---
62.19 s
> Error:
62.19 s
> 0: canonical UV numerator does not reproduce its source in the component frame
62.19 s
>
62.19 s
> Location:
62.19 s
> crates/gammalooprs/src/uv/approx/local_4d.rs :354
62.19 s
>
62.19 s
> ━━━━━━━━━━━━━━━━━━━━━━━━━━━━━━━━━━ BACKTRACE ━━━━━━━━━━━━━━━━━━━━━━━━━━━━━━━━━━━
62.19 s
> 1: <color_eyre[51793ea62743adbd]::config::EyreHook>::into_eyre_hook::{closure#0} <unknown>
62.19 s
> at <unknown source file> :<unknown line>
62.19 s
> 2: eyre[cb2fd339c0c40fca]::capture_handler <unknown>
62.19 s
> at <unknown source file> :<unknown line>
62.19 s
> 3: eyre[cb2fd339c0c40fca]::private::format_err <unknown>
62.19 s
> at <unknown source file> :<unknown line>
62.19 s
> 4: <gammalooprs[24955f93fc9f4e0c]::uv::approx::local_4d::FourDSector>::canonical_projection <unknown>
62.19 s
> at <unknown source file> :<unknown line>
62.19 s
> 5: <gammalooprs[24955f93fc9f4e0c]::uv::approx::projected_4d::Projected4dApproximation>::project_local_4d <unknown>
62.19 s
> at <unknown source file> :<unknown line>
62.19 s
> 6: <gammalooprs[24955f93fc9f4e0c]::uv::approx::Approximation>::compute_3d <unknown>
62.19 s
> at <unknown source file> :<unknown line>
62.19 s
> 7: gammalooprs[24955f93fc9f4e0c]::uv::approx::tests::direct_nested_scalar_banana_replays_complete_cff_at_depth_three::{closure#0} <unknown>
62.19 s
> at <unknown source file> :<unknown line>
62.19 s
> 8: gammalooprs[24955f93fc9f4e0c]::uv::approx::tests::direct_nested_scalar_banana_replays_complete_cff_at_depth_three <unknown>
62.19 s
> at <unknown source file> :<unknown line>
62.19 s
> 9: <gammalooprs[24955f93fc9f4e0c]::uv::approx::tests::direct_nested_scalar_banana_replays_complete_cff_at_depth_three::{closure#0} as core[940e698046960fd5]::ops::function::FnOnce<()>>::call_once <unknown>
62.19 s
> at <unknown source file> :<unknown line>
62.19 s
> 10: test[75d6903177b1d7e9]::__rust_begin_short_backtrace::<core[940e698046960fd5]::result::Result<(), alloc[2ea6bcb46fca0c42]::string::String>, fn() -> core[940e698046960fd5]::result::Result<(), alloc[2ea6bcb46fca0c42]::string::String>> <unknown>
62.19 s
> at <unknown source file> :<unknown line>
62.19 s
> 11: test[75d6903177b1d7e9]::run_test::{closure#0} <unknown>
62.19 s
> at <unknown source file> :<unknown line>
62.19 s
> 12: std[bcb96dfbba0ab899]::sys::backtrace::__rust_begin_short_backtrace::<test[75d6903177b1d7e9]::run_test::{closure#1}, ()> <unknown>
62.19 s
> at <unknown source file> :<unknown line>
62.19 s
> 13: <std[bcb96dfbba0ab899]::thread::lifecycle::spawn_unchecked<test[75d6903177b1d7e9]::run_test::{closure#1}, ()>::{closure#1} as core[940e698046960fd5]::ops::function::FnOnce<()>>::call_once::{shim:vtable#0} <unknown>
62.19 s
> at <unknown source file> :<unknown line>
62.19 s
> 14: <std[bcb96dfbba0ab899]::sys::thread::unix::Thread>::new::thread_start <unknown>
62.19 s
> at <unknown source file> :<unknown line>
62.19 s
> 15: start_thread <unknown>
62.19 s
> at <unknown source file> :<unknown line>
62.19 s
> 16: __clone3 <unknown>
62.19 s
> at <unknown source file> :<unknown line>
62.19 s
>
62.19 s
> Run with COLORBT_SHOW_HIDDEN=1 environment variable to disable frame filtering.
62.19 s
> Run with RUST_BACKTRACE=full to include source snippets.
62.19 s
>
62.19 s
> ------------
62.19 s
> Summary [ 12.865s] 692 tests run: 686 passed , 6 failed , 60 skipped
62.19 s
> FAIL [ 0.107s] (159/692) gammalooprs graph::three_d_source::tests :: exact_taylor_vacuum_affine_circulation_preserves_energy_mapping
62.19 s
> stdout ---
62.19 s
>
62.19 s
> running 1 test
62.19 s
> test graph::three_d_source::tests::exact_taylor_vacuum_affine_circulation_preserves_energy_mapping ... FAILED
62.19 s
>
62.19 s
> failures:
62.19 s
>
62.19 s
> failures:
62.19 s
> graph::three_d_source::tests::exact_taylor_vacuum_affine_circulation_preserves_energy_mapping
62.19 s
>
62.19 s
> test result: FAILED. 0 passed; 1 failed; 0 ignored; 0 measured; 742 filtered out; finished in 0.10s
62.19 s
>
62.19 s
> stderr ---
62.19 s
> The application panicked (crashed).
62.19 s
> Message: assertion `left == right` failed
62.19 s
> left: (gammalooprs::mUVexp^2+(-gammalooprs::Q(1,spenso::cind(1))+gammalooprs::Q(4,spenso::cind(1)))^2+(-gammalooprs::Q(1,spenso::cind(2))+gammalooprs::Q(4,spenso::cind(2)))^2+(-gammalooprs::Q(1,spenso::cind(3))+gammalooprs::Q(4,spenso::cind(3)))^2)^(1/2)
62.19 s
> right: (gammalooprs::mUVexp^2+(gammalooprs::Q(1,spenso::cind(1))-gammalooprs::Q(4,spenso::cind(1)))^2+(gammalooprs::Q(1,spenso::cind(2))-gammalooprs::Q(4,spenso::cind(2)))^2+(gammalooprs::Q(1,spenso::cind(3))-gammalooprs::Q(4,spenso::cind(3)))^2)^(1/2)
62.19 s
> Location: crates/gammalooprs/src/graph/three_d_source.rs :7797
62.19 s
>
62.19 s
> ━━━━━━━━━━━━━━━━━━━━━━━━━━━━━━━━━━ BACKTRACE ━━━━━━━━━━━━━━━━━━━━━━━━━━━━━━━━━━━
62.19 s
> 1: <color_eyre[51793ea62743adbd]::config::PanicHook>::panic_report <unknown>
62.19 s
> at <unknown source file> :<unknown line>
62.19 s
> 2: <color_eyre[51793ea62743adbd]::config::PanicHook>::into_panic_hook::{closure#0} <unknown>
62.19 s
> at <unknown source file> :<unknown line>
62.19 s
> 3: std[bcb96dfbba0ab899]::panicking::panic_with_hook <unknown>
62.19 s
> at <unknown source file> :<unknown line>
62.19 s
> 4: std[bcb96dfbba0ab899]::panicking::panic_handler::{closure#0} <unknown>
62.19 s
> at <unknown source file> :<unknown line>
62.19 s
> 5: std[bcb96dfbba0ab899]::sys::backtrace::__rust_end_short_backtrace::<std[bcb96dfbba0ab899]::panicking::panic_handler::{closure#0}, !> <unknown>
62.19 s
> at <unknown source file> :<unknown line>
62.19 s
> 6: __rustc[6c289b9f9c454d21]::rust_begin_unwind <unknown>
62.19 s
> at <unknown source file> :<unknown line>
62.19 s
> 7: core[940e698046960fd5]::panicking::panic_fmt <unknown>
62.19 s
> at <unknown source file> :<unknown line>
62.19 s
> 8: core[940e698046960fd5]::panicking::assert_failed_inner <unknown>
62.19 s
> at <unknown source file> :<unknown line>
62.19 s
> 9: core[940e698046960fd5]::panicking::assert_failed::<symbolica[499970c26fd75ddd]::atom::Atom, symbolica[499970c26fd75ddd]::atom::Atom> <unknown>
62.19 s
> at <unknown source file> :<unknown line>
62.19 s
> 10: gammalooprs[24955f93fc9f4e0c]::graph::three_d_source::tests::exact_taylor_vacuum_affine_circulation_preserves_energy_mapping <unknown>
62.19 s
> at <unknown source file> :<unknown line>
62.19 s
> 11: <gammalooprs[24955f93fc9f4e0c]::graph::three_d_source::tests::exact_taylor_vacuum_affine_circulation_preserves_energy_mapping::{closure#0} as core[940e698046960fd5]::ops::function::FnOnce<()>>::call_once <unknown>
62.19 s
> at <unknown source file> :<unknown line>
62.19 s
> 12: test[75d6903177b1d7e9]::__rust_begin_short_backtrace::<core[940e698046960fd5]::result::Result<(), alloc[2ea6bcb46fca0c42]::string::String>, fn() -> core[940e698046960fd5]::result::Result<(), alloc[2ea6bcb46fca0c42]::string::String>> <unknown>
62.19 s
> at <unknown source file> :<unknown line>
62.19 s
> 13: test[75d6903177b1d7e9]::run_test::{closure#0} <unknown>
62.19 s
> at <unknown source file> :<unknown line>
62.19 s
> 14: std[bcb96dfbba0ab899]::sys::backtrace::__rust_begin_short_backtrace::<test[75d6903177b1d7e9]::run_test::{closure#1}, ()> <unknown>
62.19 s
> at <unknown source file> :<unknown line>
62.19 s
> 15: <std[bcb96dfbba0ab899]::thread::lifecycle::spawn_unchecked<test[75d6903177b1d7e9]::run_test::{closure#1}, ()>::{closure#1} as core[940e698046960fd5]::ops::function::FnOnce<()>>::call_once::{shim:vtable#0} <unknown>
62.19 s
> at <unknown source file> :<unknown line>
62.19 s
> 16: <std[bcb96dfbba0ab899]::sys::thread::unix::Thread>::new::thread_start <unknown>
62.19 s
> at <unknown source file> :<unknown line>
62.19 s
> 17: start_thread <unknown>
62.19 s
> at <unknown source file> :<unknown line>
62.19 s
> 18: __clone3 <unknown>
62.19 s
> at <unknown source file> :<unknown line>
62.19 s
>
62.19 s
> Run with COLORBT_SHOW_HIDDEN=1 environment variable to disable frame filtering.
62.19 s
> Run with RUST_BACKTRACE=full to include source snippets.
62.19 s
>
62.19 s
> FAIL [ 0.134s] (181/692) gammalooprs graph::three_d_source::tests :: pinched_affine_carrier_requires_occurrence_interpolation
62.19 s
> stdout ---
62.19 s
>
62.19 s
> running 1 test
62.19 s
> test graph::three_d_source::tests::pinched_affine_carrier_requires_occurrence_interpolation ... FAILED
62.19 s
>
62.19 s
> failures:
62.19 s
>
62.19 s
> failures:
62.19 s
> graph::three_d_source::tests::pinched_affine_carrier_requires_occurrence_interpolation
62.19 s
>
62.19 s
> test result: FAILED. 0 passed; 1 failed; 0 ignored; 0 measured; 742 filtered out; finished in 0.13s
62.19 s
>
62.19 s
> stderr ---
62.19 s
> The application panicked (crashed).
62.19 s
> Message: certified affine occurrence lift must reproduce the independent double contours: actual=-(-1/16*(3+E0)*(5+E0)/((1+Q(0,cind(1))^2+Q(0,cind(2))^2+Q(0,cind(3))^2)^(3/2)*(1+Q(1,cind(1))^2+Q(1,cind(2))^2+Q(1,cind(3))^2)^(3/2))-1/16*(3+E1)*(5+E1)/((1+Q(0,cind(1))^2+Q(0,cind(2))^2+Q(0,cind(3))^2)^(3/2)*(1+Q(1,cind(1))^2+Q(1,cind(2))^2+Q(1,cind(3))^2)^(3/2))-1/16*(3-E0)*(5-E0)/((1+Q(0,cind(1))^2+Q(0,cind(2))^2+Q(0,cind(3))^2)^(3/2)*(1+Q(1,cind(1))^2+Q(1,cind(2))^2+Q(1,cind(3))^2)^(3/2))-1/16*(3-E1)*(5-E1)/((1+Q(0,cind(1))^2+Q(0,cind(2))^2+Q(0,cind(3))^2)^(3/2)*(1+Q(1,cind(1))^2+Q(1,cind(2))^2+Q(1,cind(3))^2)^(3/2))+1/64*(3+E0+E1)*(5+E0+E1)/((1+Q(0,cind(1))^2+Q(0,cind(2))^2+Q(0,cind(3))^2)^(3/2)*(1+Q(1,cind(1))^2+Q(1,cind(2))^2+Q(1,cind(3))^2)^(3/2))+1/64*(3+E0-E1)*(5+E0-E1)/((1+Q(0,cind(1))^2+Q(0,cind(2))^2+Q(0,cind(3))^2)^(3/2)*(1+Q(1,cind(1))^2+Q(1,cind(2))^2+Q(1,cind(3))^2)^(3/2))+1/64*(3-E0+E1)*(5-E0+E1)/((1+Q(0,cind(1))^2+Q(0,cind(2))^2+Q(0,cind(3))^2)^(3/2)*(1+Q(1,cind(1))^2+Q(1,cind(2))^2+Q(1,cind(3))^2)^(3/2))+1/64*(3-E0-E1)*(5-E0-E1)/((1+Q(0,cind(1))^2+Q(0,cind(2))^2+Q(0,cind(3))^2)^(3/2)*(1+Q(1,cind(1))^2+Q(1,cind(2))^2+Q(1,cind(3))^2)^(3/2))+15/4/((1+Q(0,cind(1))^2+Q(0,cind(2))^2+Q(0,cind(3))^2)^(3/2)*(1+Q(1,cind(1))^2+Q(1,cind(2))^2+Q(1,cind(3))^2)^(3/2))), expected=1/16*(15-E0^2-E1^2)/(E0^3*E1^3)
62.19 s
> Location: crates/gammalooprs/src/graph/three_d_source.rs :7619
62.19 s
>
62.19 s
> ━━━━━━━━━━━━━━━━━━━━━━━━━━━━━━━━━━ BACKTRACE ━━━━━━━━━━━━━━━━━━━━━━━━━━━━━━━━━━━
62.19 s
> 1: <color_eyre[51793ea62743adbd]::config::PanicHook>::panic_report <unknown>
62.19 s
> at <unknown source file> :<unknown line>
62.19 s
> 2: <color_eyre[51793ea62743adbd]::config::PanicHook>::into_panic_hook::{closure#0} <unknown>
62.19 s
> at <unknown source file> :<unknown line>
62.19 s
> 3: std[bcb96dfbba0ab899]::panicking::panic_with_hook <unknown>
62.19 s
> at <unknown source file> :<unknown line>
62.19 s
> 4: std[bcb96dfbba0ab899]::panicking::panic_handler::{closure#0} <unknown>
62.19 s
> at <unknown source file> :<unknown line>
62.19 s
> 5: std[bcb96dfbba0ab899]::sys::backtrace::__rust_end_short_backtrace::<std[bcb96dfbba0ab899]::panicking::panic_handler::{closure#0}, !> <unknown>
62.19 s
> at <unknown source file> :<unknown line>
62.19 s
> 6: __rustc[6c289b9f9c454d21]::rust_begin_unwind <unknown>
62.19 s
> at <unknown source file> :<unknown line>
62.19 s
> 7: core[940e698046960fd5]::panicking::panic_fmt <unknown>
62.19 s
> at <unknown source file> :<unknown line>
62.19 s
> 8: <gammalooprs[24955f93fc9f4e0c]::graph::three_d_source::tests::pinched_affine_carrier_requires_occurrence_interpolation::{closure#0} as core[940e698046960fd5]::ops::function::FnOnce<()>>::call_once <unknown>
62.19 s
> at <unknown source file> :<unknown line>
62.19 s
> 9: test[75d6903177b1d7e9]::__rust_begin_short_backtrace::<core[940e698046960fd5]::result::Result<(), alloc[2ea6bcb46fca0c42]::string::String>, fn() -> core[940e698046960fd5]::result::Result<(), alloc[2ea6bcb46fca0c42]::string::String>> <unknown>
62.19 s
> at <unknown source file> :<unknown line>
62.19 s
> 10: test[75d6903177b1d7e9]::run_test::{closure#0} <unknown>
62.19 s
> at <unknown source file> :<unknown line>
62.19 s
> 11: std[bcb96dfbba0ab899]::sys::backtrace::__rust_begin_short_backtrace::<test[75d6903177b1d7e9]::run_test::{closure#1}, ()> <unknown>
62.19 s
> at <unknown source file> :<unknown line>
62.19 s
> 12: <std[bcb96dfbba0ab899]::thread::lifecycle::spawn_unchecked<test[75d6903177b1d7e9]::run_test::{closure#1}, ()>::{closure#1} as core[940e698046960fd5]::ops::function::FnOnce<()>>::call_once::{shim:vtable#0} <unknown>
62.19 s
> at <unknown source file> :<unknown line>
62.19 s
> 13: <std[bcb96dfbba0ab899]::sys::thread::unix::Thread>::new::thread_start <unknown>
62.19 s
> at <unknown source file> :<unknown line>
62.19 s
> 14: start_thread <unknown>
62.19 s
> at <unknown source file> :<unknown line>
62.19 s
> 15: __clone3 <unknown>
62.19 s
> at <unknown source file> :<unknown line>
62.19 s
>
62.19 s
> Run with COLORBT_SHOW_HIDDEN=1 environment variable to disable frame filtering.
62.19 s
> Run with RUST_BACKTRACE=full to include source snippets.
62.19 s
>
62.19 s
> FAIL [ 0.021s] (298/692) gammalooprs numerator::energy_degree::tests :: canonical_class_cyclic_lifts_preserve_factorization_and_exact_bounds
62.19 s
> stdout ---
62.19 s
>
62.19 s
> running 1 test
62.19 s
> test numerator::energy_degree::tests::canonical_class_cyclic_lifts_preserve_factorization_and_exact_bounds ... FAILED
62.19 s
>
62.19 s
> failures:
62.19 s
>
62.19 s
> failures:
62.19 s
> numerator::energy_degree::tests::canonical_class_cyclic_lifts_preserve_factorization_and_exact_bounds
62.19 s
>
62.19 s
> test result: FAILED. 0 passed; 1 failed; 0 ignored; 0 measured; 742 filtered out; finished in 0.01s
62.19 s
>
62.19 s
> stderr ---
62.19 s
>
62.19 s
> thread 'numerator::energy_degree::tests::canonical_class_cyclic_lifts_preserve_factorization_and_exact_bounds' (2289) panicked at crates/gammalooprs/src/numerator/energy_degree.rs:2850:13:
62.19 s
> assertion failed: (collapsed - expression).collect_factors().is_zero()
62.19 s
> stack backtrace:
62.19 s
> 0: __rustc::rust_begin_unwind
62.19 s
> 1: core::panicking::panic_fmt
62.19 s
> 2: core::panicking::panic
62.19 s
> 3: gammalooprs::numerator::energy_degree::tests::canonical_class_cyclic_lifts_preserve_factorization_and_exact_bounds
62.19 s
> 4: <gammalooprs::numerator::energy_degree::tests::canonical_class_cyclic_lifts_preserve_factorization_and_exact_bounds::{closure#0} as core::ops::function::FnOnce<()>>::call_once
62.19 s
> note: Some details are omitted, run with `RUST_BACKTRACE=full` for a verbose backtrace.
62.19 s
>
62.19 s
> FAIL [ 0.107s] (592/692) gammalooprs uv::approx::local_4d::tests :: canonical_uv_signed_multiloop_carriers_preserve_factorized_numerators
62.19 s
> stdout ---
62.19 s
>
62.19 s
> running 1 test
62.19 s
> test uv::approx::local_4d::tests::canonical_uv_signed_multiloop_carriers_preserve_factorized_numerators ... FAILED
62.19 s
>
62.19 s
> failures:
62.19 s
>
62.19 s
> failures:
62.19 s
> uv::approx::local_4d::tests::canonical_uv_signed_multiloop_carriers_preserve_factorized_numerators
62.19 s
>
62.19 s
> test result: FAILED. 0 passed; 1 failed; 0 ignored; 0 measured; 742 filtered out; finished in 0.09s
62.19 s
>
62.19 s
> stderr ---
62.19 s
> The application panicked (crashed).
62.19 s
> Message: assertion `left == right` failed
62.19 s
> left: 2*(signed_multiloop::a+signed_multiloop::b)^5*gammalooprs::Q(gammalooprs::uv::class(0),spenso::cind(0))
62.19 s
> right: -2*(signed_multiloop::a+signed_multiloop::b)^5*gammalooprs::Q(gammalooprs::uv::class(0),spenso::cind(0))
62.19 s
> Location: crates/gammalooprs/src/uv/approx/local_4d.rs :1983
62.19 s
>
62.19 s
> ━━━━━━━━━━━━━━━━━━━━━━━━━━━━━━━━━━ BACKTRACE ━━━━━━━━━━━━━━━━━━━━━━━━━━━━━━━━━━━
62.19 s
> 1: <color_eyre[51793ea62743adbd]::config::PanicHook>::panic_report <unknown>
62.19 s
> at <unknown source file> :<unknown line>
62.19 s
> 2: <color_eyre[51793ea62743adbd]::config::PanicHook>::into_panic_hook::{closure#0} <unknown>
62.19 s
> at <unknown source file> :<unknown line>
62.19 s
> 3: std[bcb96dfbba0ab899]::panicking::panic_with_hook <unknown>
62.19 s
> at <unknown source file> :<unknown line>
62.19 s
> 4: std[bcb96dfbba0ab899]::panicking::panic_handler::{closure#0} <unknown>
62.19 s
> at <unknown source file> :<unknown line>
62.19 s
> 5: std[bcb96dfbba0ab899]::sys::backtrace::__rust_end_short_backtrace::<std[bcb96dfbba0ab899]::panicking::panic_handler::{closure#0}, !> <unknown>
62.19 s
> at <unknown source file> :<unknown line>
62.19 s
> 6: __rustc[6c289b9f9c454d21]::rust_begin_unwind <unknown>
62.19 s
> at <unknown source file> :<unknown line>
62.19 s
> 7: core[940e698046960fd5]::panicking::panic_fmt <unknown>
62.19 s
> at <unknown source file> :<unknown line>
62.19 s
> 8: core[940e698046960fd5]::panicking::assert_failed_inner <unknown>
62.19 s
> at <unknown source file> :<unknown line>
62.19 s
> 9: core[940e698046960fd5]::panicking::assert_failed::<symbolica[499970c26fd75ddd]::atom::Atom, symbolica[499970c26fd75ddd]::atom::Atom> <unknown>
62.19 s
> at <unknown source file> :<unknown line>
62.19 s
> 10: gammalooprs[24955f93fc9f4e0c]::uv::approx::local_4d::tests::canonical_uv_signed_multiloop_carriers_preserve_factorized_numerators <unknown>
62.19 s
> at <unknown source file> :<unknown line>
62.19 s
> 11: <gammalooprs[24955f93fc9f4e0c]::uv::approx::local_4d::tests::canonical_uv_signed_multiloop_carriers_preserve_factorized_numerators::{closure#0} as core[940e698046960fd5]::ops::function::FnOnce<()>>::call_once <unknown>
62.19 s
> at <unknown source file> :<unknown line>
62.19 s
> 12: test[75d6903177b1d7e9]::__rust_begin_short_backtrace::<core[940e698046960fd5]::result::Result<(), alloc[2ea6bcb46fca0c42]::string::String>, fn() -> core[940e698046960fd5]::result::Result<(), alloc[2ea6bcb46fca0c42]::string::String>> <unknown>
62.19 s
> at <unknown source file> :<unknown line>
62.19 s
> 13: test[75d6903177b1d7e9]::run_test::{closure#0} <unknown>
62.19 s
> at <unknown source file> :<unknown line>
62.19 s
> 14: std[bcb96dfbba0ab899]::sys::backtrace::__rust_begin_short_backtrace::<test[75d6903177b1d7e9]::run_test::{closure#1}, ()> <unknown>
62.19 s
> at <unknown source file> :<unknown line>
62.19 s
> 15: <std[bcb96dfbba0ab899]::thread::lifecycle::spawn_unchecked<test[75d6903177b1d7e9]::run_test::{closure#1}, ()>::{closure#1} as core[940e698046960fd5]::ops::function::FnOnce<()>>::call_once::{shim:vtable#0} <unknown>
62.19 s
> at <unknown source file> :<unknown line>
62.19 s
> 16: <std[bcb96dfbba0ab899]::sys::thread::unix::Thread>::new::thread_start <unknown>
62.19 s
> at <unknown source file> :<unknown line>
62.19 s
> 17: start_thread <unknown>
62.19 s
> at <unknown source file> :<unknown line>
62.19 s
> 18: __clone3 <unknown>
62.19 s
> at <unknown source file> :<unknown line>
62.19 s
>
62.19 s
> Run with COLORBT_SHOW_HIDDEN=1 environment variable to disable frame filtering.
62.19 s
> Run with RUST_BACKTRACE=full to include source snippets.
62.19 s
>
62.19 s
> FAIL [ 0.129s] (593/692) gammalooprs uv::approx::local_4d::tests :: canonical_uv_classes_certify_signed_aliases_and_preserve_raw_sectors
62.19 s
> stdout ---
62.19 s
>
62.19 s
> running 1 test
62.19 s
> test uv::approx::local_4d::tests::canonical_uv_classes_certify_signed_aliases_and_preserve_raw_sectors ... FAILED
62.19 s
>
62.19 s
> failures:
62.19 s
>
62.19 s
> failures:
62.19 s
> uv::approx::local_4d::tests::canonical_uv_classes_certify_signed_aliases_and_preserve_raw_sectors
62.19 s
>
62.19 s
> test result: FAILED. 0 passed; 1 failed; 0 ignored; 0 measured; 742 filtered out; finished in 0.11s
62.19 s
>
62.19 s
> stderr ---
62.19 s
> Error:
62.19 s
> 0: merged canonical UV numerator does not reproduce its source bucket
62.19 s
>
62.19 s
> Location:
62.19 s
> crates/gammalooprs/src/uv/approx/local_4d.rs :367
62.19 s
>
62.19 s
> ━━━━━━━━━━━━━━━━━━━━━━━━━━━━━━━━━━ BACKTRACE ━━━━━━━━━━━━━━━━━━━━━━━━━━━━━━━━━━━
62.19 s
> 1: <color_eyre[51793ea62743adbd]::config::EyreHook>::into_eyre_hook::{closure#0} <unknown>
62.19 s
> at <unknown source file> :<unknown line>
62.19 s
> 2: eyre[cb2fd339c0c40fca]::capture_handler <unknown>
62.19 s
> at <unknown source file> :<unknown line>
62.19 s
> 3: eyre[cb2fd339c0c40fca]::private::format_err <unknown>
62.19 s
> at <unknown source file> :<unknown line>
62.19 s
> 4: <gammalooprs[24955f93fc9f4e0c]::uv::approx::local_4d::FourDSector>::canonical_projection <unknown>
62.19 s
> at <unknown source file> :<unknown line>
62.19 s
> 5: gammalooprs[24955f93fc9f4e0c]::uv::approx::local_4d::tests::canonical_uv_classes_certify_signed_aliases_and_preserve_raw_sectors <unknown>
62.19 s
> at <unknown source file> :<unknown line>
62.19 s
> 6: <gammalooprs[24955f93fc9f4e0c]::uv::approx::local_4d::tests::canonical_uv_classes_certify_signed_aliases_and_preserve_raw_sectors::{closure#0} as core[940e698046960fd5]::ops::function::FnOnce<()>>::call_once <unknown>
62.19 s
> at <unknown source file> :<unknown line>
62.19 s
> 7: test[75d6903177b1d7e9]::__rust_begin_short_backtrace::<core[940e698046960fd5]::result::Result<(), alloc[2ea6bcb46fca0c42]::string::String>, fn() -> core[940e698046960fd5]::result::Result<(), alloc[2ea6bcb46fca0c42]::string::String>> <unknown>
62.19 s
> at <unknown source file> :<unknown line>
62.19 s
> 8: test[75d6903177b1d7e9]::run_test::{closure#0} <unknown>
62.19 s
> at <unknown source file> :<unknown line>
62.19 s
> 9: std[bcb96dfbba0ab899]::sys::backtrace::__rust_begin_short_backtrace::<test[75d6903177b1d7e9]::run_test::{closure#1}, ()> <unknown>
62.19 s
> at <unknown source file> :<unknown line>
62.19 s
> 10: <std[bcb96dfbba0ab899]::thread::lifecycle::spawn_unchecked<test[75d6903177b1d7e9]::run_test::{closure#1}, ()>::{closure#1} as core[940e698046960fd5]::ops::function::FnOnce<()>>::call_once::{shim:vtable#0} <unknown>
62.19 s
> at <unknown source file> :<unknown line>
62.19 s
> 11: <std[bcb96dfbba0ab899]::sys::thread::unix::Thread>::new::thread_start <unknown>
62.19 s
> at <unknown source file> :<unknown line>
62.19 s
> 12: start_thread <unknown>
62.19 s
> at <unknown source file> :<unknown line>
62.19 s
> 13: __clone3 <unknown>
62.19 s
> at <unknown source file> :<unknown line>
62.19 s
>
62.19 s
> Run with COLORBT_SHOW_HIDDEN=1 environment variable to disable frame filtering.
62.19 s
> Run with RUST_BACKTRACE=full to include source snippets.
62.19 s
>
62.19 s
> FAIL [ 0.100s] (606/692) gammalooprs uv::approx::tests :: direct_nested_scalar_banana_replays_complete_cff_at_depth_three
62.19 s
> stdout ---
62.19 s
>
62.19 s
> running 1 test
62.19 s
> test uv::approx::tests::direct_nested_scalar_banana_replays_complete_cff_at_depth_three ... FAILED
62.19 s
>
62.19 s
> failures:
62.19 s
>
62.19 s
> failures:
62.19 s
> uv::approx::tests::direct_nested_scalar_banana_replays_complete_cff_at_depth_three
62.19 s
>
62.19 s
> test result: FAILED. 0 passed; 1 failed; 0 ignored; 0 measured; 742 filtered out; finished in 0.09s
62.19 s
>
62.19 s
> stderr ---
62.19 s
> Error:
62.19 s
> 0: canonical UV numerator does not reproduce its source in the component frame
62.19 s
>
62.19 s
> Location:
62.19 s
> crates/gammalooprs/src/uv/approx/local_4d.rs :354
62.19 s
>
62.19 s
> ━━━━━━━━━━━━━━━━━━━━━━━━━━━━━━━━━━ BACKTRACE ━━━━━━━━━━━━━━━━━━━━━━━━━━━━━━━━━━━
62.19 s
> 1: <color_eyre[51793ea62743adbd]::config::EyreHook>::into_eyre_hook::{closure#0} <unknown>
62.19 s
> at <unknown source file> :<unknown line>
62.19 s
> 2: eyre[cb2fd339c0c40fca]::capture_handler <unknown>
62.19 s
> at <unknown source file> :<unknown line>
62.19 s
> 3: eyre[cb2fd339c0c40fca]::private::format_err <unknown>
62.19 s
> at <unknown source file> :<unknown line>
62.19 s
> 4: <gammalooprs[24955f93fc9f4e0c]::uv::approx::local_4d::FourDSector>::canonical_projection <unknown>
62.19 s
> at <unknown source file> :<unknown line>
62.19 s
> 5: <gammalooprs[24955f93fc9f4e0c]::uv::approx::projected_4d::Projected4dApproximation>::project_local_4d <unknown>
62.19 s
> at <unknown source file> :<unknown line>
62.19 s
> 6: <gammalooprs[24955f93fc9f4e0c]::uv::approx::Approximation>::compute_3d <unknown>
62.19 s
> at <unknown source file> :<unknown line>
62.19 s
> 7: gammalooprs[24955f93fc9f4e0c]::uv::approx::tests::direct_nested_scalar_banana_replays_complete_cff_at_depth_three::{closure#0} <unknown>
62.19 s
> at <unknown source file> :<unknown line>
62.19 s
> 8: gammalooprs[24955f93fc9f4e0c]::uv::approx::tests::direct_nested_scalar_banana_replays_complete_cff_at_depth_three <unknown>
62.19 s
> at <unknown source file> :<unknown line>
62.19 s
> 9: <gammalooprs[24955f93fc9f4e0c]::uv::approx::tests::direct_nested_scalar_banana_replays_complete_cff_at_depth_three::{closure#0} as core[940e698046960fd5]::ops::function::FnOnce<()>>::call_once <unknown>
62.19 s
> at <unknown source file> :<unknown line>
62.19 s
> 10: test[75d6903177b1d7e9]::__rust_begin_short_backtrace::<core[940e698046960fd5]::result::Result<(), alloc[2ea6bcb46fca0c42]::string::String>, fn() -> core[940e698046960fd5]::result::Result<(), alloc[2ea6bcb46fca0c42]::string::String>> <unknown>
62.19 s
> at <unknown source file> :<unknown line>
62.19 s
> 11: test[75d6903177b1d7e9]::run_test::{closure#0} <unknown>
62.19 s
> at <unknown source file> :<unknown line>
62.19 s
> 12: std[bcb96dfbba0ab899]::sys::backtrace::__rust_begin_short_backtrace::<test[75d6903177b1d7e9]::run_test::{closure#1}, ()> <unknown>
62.19 s
> at <unknown source file> :<unknown line>
62.19 s
> 13: <std[bcb96dfbba0ab899]::thread::lifecycle::spawn_unchecked<test[75d6903177b1d7e9]::run_test::{closure#1}, ()>::{closure#1} as core[940e698046960fd5]::ops::function::FnOnce<()>>::call_once::{shim:vtable#0} <unknown>
62.19 s
> at <unknown source file> :<unknown line>
62.19 s
> 14: <std[bcb96dfbba0ab899]::sys::thread::unix::Thread>::new::thread_start <unknown>
62.19 s
> at <unknown source file> :<unknown line>
62.19 s
> 15: start_thread <unknown>
62.19 s
> at <unknown source file> :<unknown line>
62.19 s
> 16: __clone3 <unknown>
62.19 s
> at <unknown source file> :<unknown line>
62.19 s
>
62.19 s
> Run with COLORBT_SHOW_HIDDEN=1 environment variable to disable frame filtering.
62.19 s
> Run with RUST_BACKTRACE=full to include source snippets.
62.19 s
>
62.19 s
> error : test run failed
62.19 s
>
62.19 s
> ========== nextest test summary ==========
62.19 s
> report: target/nextest/ci_gammaloop/junit.xml
62.19 s
> tests: 692, failures: 6, errors: 0
62.19 s
>
62.19 s
> 1. gammalooprs::graph::three_d_source::tests::exact_taylor_vacuum_affine_circulation_preserves_energy_mapping
62.19 s
> failure: test failure with exit code 101
62.19 s
> system-out
62.19 s
> running 1 test
62.19 s
> test graph::three_d_source::tests::exact_taylor_vacuum_affine_circulation_preserves_energy_mapping ... FAILED
62.19 s
>
62.19 s
> failures:
62.19 s
>
62.19 s
> failures:
62.19 s
> graph::three_d_source::tests::exact_taylor_vacuum_affine_circulation_preserves_energy_mapping
62.19 s
>
62.19 s
> test result: FAILED. 0 passed; 1 failed; 0 ignored; 0 measured; 742 filtered out; finished in 0.10s
62.19 s
> system-err
62.19 s
> The application panicked (crashed).
62.19 s
> Message: assertion `left == right` failed
62.19 s
> left: (gammalooprs::mUVexp^2+(-gammalooprs::Q(1,spenso::cind(1))+gammalooprs::Q(4,spenso::cind(1)))^2+(-gammalooprs::Q(1,spenso::cind(2))+gammalooprs::Q(4,spenso::cind(2)))^2+(-gammalooprs::Q(1,spenso::cind(3))+gammalooprs::Q(4,spenso::cind(3)))^2)^(1/2)
62.19 s
> right: (gammalooprs::mUVexp^2+(gammalooprs::Q(1,spenso::cind(1))-gammalooprs::Q(4,spenso::cind(1)))^2+(gammalooprs::Q(1,spenso::cind(2))-gammalooprs::Q(4,spenso::cind(2)))^2+(gammalooprs::Q(1,spenso::cind(3))-gammalooprs::Q(4,spenso::cind(3)))^2)^(1/2)
62.19 s
> Location: crates/gammalooprs/src/graph/three_d_source.rs:7797
62.19 s
>
62.19 s
> ━━━━━━━━━━━━━━━━━━━━━━━━━━━━━━━━━━ BACKTRACE ━━━━━━━━━━━━━━━━━━━━━━━━━━━━━━━━━━━
62.19 s
> 1: <color_eyre[51793ea62743adbd]::config::PanicHook>::panic_report<unknown>
62.19 s
> at <unknown source file>:<unknown line>
62.19 s
> 2: <color_eyre[51793ea62743adbd]::config::PanicHook>::into_panic_hook::{closure#0}<unknown>
62.19 s
> at <unknown source file>:<unknown line>
62.19 s
> 3: std[bcb96dfbba0ab899]::panicking::panic_with_hook<unknown>
62.19 s
> at <unknown source file>:<unknown line>
62.19 s
> 4: std[bcb96dfbba0ab899]::panicking::panic_handler::{closure#0}<unknown>
62.19 s
> at <unknown source file>:<unknown line>
62.19 s
> 5: std[bcb96dfbba0ab899]::sys::backtrace::__rust_end_short_backtrace::<std[bcb96dfbba0ab899]::panicking::panic_handler::{closure#0}, !><unknown>
62.19 s
> at <unknown source file>:<unknown line>
62.19 s
> 6: __rustc[6c289b9f9c454d21]::rust_begin_unwind<unknown>
62.19 s
> at <unknown source file>:<unknown line>
62.19 s
> 7: core[940e698046960fd5]::panicking::panic_fmt<unknown>
62.19 s
> at <unknown source file>:<unknown line>
62.19 s
> 8: core[940e698046960fd5]::panicking::assert_failed_inner<unknown>
62.19 s
> at <unknown source file>:<unknown line>
62.19 s
> 9: core[940e698046960fd5]::panicking::assert_failed::<symbolica[499970c26fd75ddd]::atom::Atom, symbolica[499970c26fd75ddd]::atom::Atom><unknown>
62.19 s
> at <unknown source file>:<unknown line>
62.19 s
> 10: gammalooprs[24955f93fc9f4e0c]::graph::three_d_source::tests::exact_taylor_vacuum_affine_circulation_preserves_energy_mapping<unknown>
62.19 s
> at <unknown source file>:<unknown line>
62.19 s
> 11: <gammalooprs[24955f93fc9f4e0c]::graph::three_d_source::tests::exact_taylor_vacuum_affine_circulation_preserves_energy_mapping::{closure#0} as core[940e698046960fd5]::ops::function::FnOnce<()>>::call_once<unknown>
62.19 s
> at <unknown source file>:<unknown line>
62.19 s
> 12: test[75d6903177b1d7e9]::__rust_begin_short_backtrace::<core[940e698046960fd5]::result::Result<(), alloc[2ea6bcb46fca0c42]::string::String>, fn() -> core[940e698046960fd5]::result::Result<(), alloc[2ea6bcb46fca0c42]::string::String>><unknown>
62.19 s
> at <unknown source file>:<unknown line>
62.19 s
> 13: test[75d6903177b1d7e9]::run_test::{closure#0}<unknown>
62.19 s
> at <unknown source file>:<unknown line>
62.19 s
> 14: std[bcb96dfbba0ab899]::sys::backtrace::__rust_begin_short_backtrace::<test[75d6903177b1d7e9]::run_test::{closure#1}, ()><unknown>
62.19 s
> at <unknown source file>:<unknown line>
62.19 s
> 15: <std[bcb96dfbba0ab899]::thread::lifecycle::spawn_unchecked<test[75d6903177b1d7e9]::run_test::{closure#1}, ()>::{closure#1} as core[940e698046960fd5]::ops::function::FnOnce<()>>::call_once::{shim:vtable#0}<unknown>
62.19 s
> at <unknown source file>:<unknown line>
62.19 s
> 16: <std[bcb96dfbba0ab899]::sys::thread::unix::Thread>::new::thread_start<unknown>
62.19 s
> at <unknown source file>:<unknown line>
62.19 s
> 17: start_thread<unknown>
62.19 s
> at <unknown source file>:<unknown line>
62.19 s
> 18: __clone3<unknown>
62.19 s
> at <unknown source file>:<unknown line>
62.19 s
>
62.19 s
> Run with COLORBT_SHOW_HIDDEN=1 environment variable to disable frame filtering.
62.19 s
> Run with RUST_BACKTRACE=full to include source snippets.
62.19 s
>
62.19 s
> 2. gammalooprs::graph::three_d_source::tests::pinched_affine_carrier_requires_occurrence_interpolation
62.19 s
> failure: test failure with exit code 101
62.19 s
> system-out
62.19 s
> running 1 test
62.19 s
> test graph::three_d_source::tests::pinched_affine_carrier_requires_occurrence_interpolation ... FAILED
62.19 s
>
62.19 s
> failures:
62.19 s
>
62.19 s
> failures:
62.19 s
> graph::three_d_source::tests::pinched_affine_carrier_requires_occurrence_interpolation
62.19 s
>
62.19 s
> test result: FAILED. 0 passed; 1 failed; 0 ignored; 0 measured; 742 filtered out; finished in 0.13s
62.19 s
> system-err
62.19 s
> The application panicked (crashed).
62.19 s
> Message: certified affine occurrence lift must reproduce the independent double contours: actual=-(-1/16*(3+E0)*(5+E0)/((1+Q(0,cind(1))^2+Q(0,cind(2))^2+Q(0,cind(3))^2)^(3/2)*(1+Q(1,cind(1))^2+Q(1,cind(2))^2+Q(1,cind(3))^2)^(3/2))-1/16*(3+E1)*(5+E1)/((1+Q(0,cind(1))^2+Q(0,cind(2))^2+Q(0,cind(3))^2)^(3/2)*(1+Q(1,cind(1))^2+Q(1,cind(2))^2+Q(1,cind(3))^2)^(3/2))-1/16*(3-E0)*(5-E0)/((1+Q(0,cind(1))^2+Q(0,cind(2))^2+Q(0,cind(3))^2)^(3/2)*(1+Q(1,cind(1))^2+Q(1,cind(2))^2+Q(1,cind(3))^2)^(3/2))-1/16*(3-E1)*(5-E1)/((1+Q(0,cind(1))^2+Q(0,cind(2))^2+Q(0,cind(3))^2)^(3/2)*(1+Q(1,cind(1))^2+Q(1,cind(2))^2+Q(1,cind(3))^2)^(3/2))+1/64*(3+E0+E1)*(5+E0+E1)/((1+Q(0,cind(1))^2+Q(0,cind(2))^2+Q(0,cind(3))^2)^(3/2)*(1+Q(1,cind(1))^2+Q(1,cind(2))^2+Q(1,cind(3))^2)^(3/2))+1/64*(3+E0-E1)*(5+E0-E1)/((1+Q(0,cind(1))^2+Q(0,cind(2))^2+Q(0,cind(3))^2)^(3/2)*(1+Q(1,cind(1))^2+Q(1,cind(2))^2+Q(1,cind(3))^2)^(3/2))+1/64*(3-E0+E1)*(5-E0+E1)/((1+Q(0,cind(1))^2+Q(0,cind(2))^2+Q(0,cind(3))^2)^(3/2)*(1+Q(1,cind(1))^2+Q(1,cind(2))^2+Q(1,cind(3))^2)^(3/2))+1/64*(3-E0-E1)*(5-E0-E1)/((1+Q(0,cind(1))^2+Q(0,cind(2))^2+Q(0,cind(3))^2)^(3/2)*(1+Q(1,cind(1))^2+Q(1,cind(2))^2+Q(1,cind(3))^2)^(3/2))+15/4/((1+Q(0,cind(1))^2+Q(0,cind(2))^2+Q(0,cind(3))^2)^(3/2)*(1+Q(1,cind(1))^2+Q(1,cind(2))^2+Q(1,cind(3))^2)^(3/2))), expected=1/16*(15-E0^2-E1^2)/(E0^3*E1^3)
62.19 s
> Location: crates/gammalooprs/src/graph/three_d_source.rs:7619
62.19 s
>
62.19 s
> ━━━━━━━━━━━━━━━━━━━━━━━━━━━━━━━━━━ BACKTRACE ━━━━━━━━━━━━━━━━━━━━━━━━━━━━━━━━━━━
62.19 s
> 1: <color_eyre[51793ea62743adbd]::config::PanicHook>::panic_report<unknown>
62.19 s
> at <unknown source file>:<unknown line>
62.19 s
> 2: <color_eyre[51793ea62743adbd]::config::PanicHook>::into_panic_hook::{closure#0}<unknown>
62.19 s
> at <unknown source file>:<unknown line>
62.19 s
> 3: std[bcb96dfbba0ab899]::panicking::panic_with_hook<unknown>
62.19 s
> at <unknown source file>:<unknown line>
62.19 s
> 4: std[bcb96dfbba0ab899]::panicking::panic_handler::{closure#0}<unknown>
62.19 s
> at <unknown source file>:<unknown line>
62.19 s
> 5: std[bcb96dfbba0ab899]::sys::backtrace::__rust_end_short_backtrace::<std[bcb96dfbba0ab899]::panicking::panic_handler::{closure#0}, !><unknown>
62.19 s
> at <unknown source file>:<unknown line>
62.19 s
> 6: __rustc[6c289b9f9c454d21]::rust_begin_unwind<unknown>
62.19 s
> at <unknown source file>:<unknown line>
62.19 s
> 7: core[940e698046960fd5]::panicking::panic_fmt<unknown>
62.19 s
> at <unknown source file>:<unknown line>
62.19 s
> 8: <gammalooprs[24955f93fc9f4e0c]::graph::three_d_source::tests::pinched_affine_carrier_requires_occurrence_interpolation::{closure#0} as core[940e698046960fd5]::ops::function::FnOnce<()>>::call_once<unknown>
62.19 s
> at <unknown source file>:<unknown line>
62.19 s
> 9: test[75d6903177b1d7e9]::__rust_begin_short_backtrace::<core[940e698046960fd5]::result::Result<(), alloc[2ea6bcb46fca0c42]::string::String>, fn() -> core[940e698046960fd5]::result::Result<(), alloc[2ea6bcb46fca0c42]::string::String>><unknown>
62.19 s
> at <unknown source file>:<unknown line>
62.19 s
> 10: test[75d6903177b1d7e9]::run_test::{closure#0}<unknown>
62.19 s
> at <unknown source file>:<unknown line>
62.19 s
> 11: std[bcb96dfbba0ab899]::sys::backtrace::__rust_begin_short_backtrace::<test[75d6903177b1d7e9]::run_test::{closure#1}, ()><unknown>
62.19 s
> at <unknown source file>:<unknown line>
62.19 s
> 12: <std[bcb96dfbba0ab899]::thread::lifecycle::spawn_unchecked<test[75d6903177b1d7e9]::run_test::{closure#1}, ()>::{closure#1} as core[940e698046960fd5]::ops::function::FnOnce<()>>::call_once::{shim:vtable#0}<unknown>
62.19 s
> at <unknown source file>:<unknown line>
62.19 s
> 13: <std[bcb96dfbba0ab899]::sys::thread::unix::Thread>::new::thread_start<unknown>
62.19 s
> at <unknown source file>:<unknown line>
62.19 s
> 14: start_thread<unknown>
62.19 s
> at <unknown source file>:<unknown line>
62.19 s
> 15: __clone3<unknown>
62.19 s
> at <unknown source file>:<unknown line>
62.19 s
>
62.19 s
> Run with COLORBT_SHOW_HIDDEN=1 environment variable to disable frame filtering.
62.19 s
> Run with RUST_BACKTRACE=full to include source snippets.
62.19 s
>
62.19 s
> 3. gammalooprs::numerator::energy_degree::tests::canonical_class_cyclic_lifts_preserve_factorization_and_exact_bounds
62.19 s
> failure: test failure with exit code 101
62.19 s
> thread 'numerator::energy_degree::tests::canonical_class_cyclic_lifts_preserve_factorization_and_exact_bounds' (2289) panicked at crates/gammalooprs/src/numerator/energy_degree.rs:2850:13:
62.19 s
> assertion failed: (collapsed - expression).collect_factors().is_zero()
62.19 s
> stack backtrace:
62.19 s
> 0: __rustc::rust_begin_unwind
62.19 s
> 1: core::panicking::panic_fmt
62.19 s
> 2: core::panicking::panic
62.19 s
> 3: gammalooprs::numerator::energy_degree::tests::canonical_class_cyclic_lifts_preserve_factorization_and_exact_bounds
62.19 s
> 4: <gammalooprs::numerator::energy_degree::tests::canonical_class_cyclic_lifts_preserve_factorization_and_exact_bounds::{closure#0} as core::ops::function::FnOnce<()>>::call_once
62.19 s
> note: Some details are omitted, run with `RUST_BACKTRACE=full` for a verbose backtrace.
62.19 s
> system-out
62.19 s
> running 1 test
62.19 s
> test numerator::energy_degree::tests::canonical_class_cyclic_lifts_preserve_factorization_and_exact_bounds ... FAILED
62.19 s
>
62.19 s
> failures:
62.19 s
>
62.19 s
> failures:
62.19 s
> numerator::energy_degree::tests::canonical_class_cyclic_lifts_preserve_factorization_and_exact_bounds
62.19 s
>
62.19 s
> test result: FAILED. 0 passed; 1 failed; 0 ignored; 0 measured; 742 filtered out; finished in 0.01s
62.19 s
> system-err
62.19 s
> thread 'numerator::energy_degree::tests::canonical_class_cyclic_lifts_preserve_factorization_and_exact_bounds' (2289) panicked at crates/gammalooprs/src/numerator/energy_degree.rs:2850:13:
62.19 s
> assertion failed: (collapsed - expression).collect_factors().is_zero()
62.19 s
> stack backtrace:
62.19 s
> 0: __rustc::rust_begin_unwind
62.19 s
> 1: core::panicking::panic_fmt
62.19 s
> 2: core::panicking::panic
62.19 s
> 3: gammalooprs::numerator::energy_degree::tests::canonical_class_cyclic_lifts_preserve_factorization_and_exact_bounds
62.19 s
> 4: <gammalooprs::numerator::energy_degree::tests::canonical_class_cyclic_lifts_preserve_factorization_and_exact_bounds::{closure#0} as core::ops::function::FnOnce<()>>::call_once
62.19 s
> note: Some details are omitted, run with `RUST_BACKTRACE=full` for a verbose backtrace.
62.19 s
>
62.19 s
> 4. gammalooprs::uv::approx::local_4d::tests::canonical_uv_signed_multiloop_carriers_preserve_factorized_numerators
62.19 s
> failure: test failure with exit code 101
62.19 s
> system-out
62.19 s
> running 1 test
62.19 s
> test uv::approx::local_4d::tests::canonical_uv_signed_multiloop_carriers_preserve_factorized_numerators ... FAILED
62.19 s
>
62.19 s
> failures:
62.19 s
>
62.19 s
> failures:
62.19 s
> uv::approx::local_4d::tests::canonical_uv_signed_multiloop_carriers_preserve_factorized_numerators
62.19 s
>
62.19 s
> test result: FAILED. 0 passed; 1 failed; 0 ignored; 0 measured; 742 filtered out; finished in 0.09s
62.19 s
> system-err
62.19 s
> The application panicked (crashed).
62.19 s
> Message: assertion `left == right` failed
62.19 s
> left: 2*(signed_multiloop::a+signed_multiloop::b)^5*gammalooprs::Q(gammalooprs::uv::class(0),spenso::cind(0))
62.19 s
> right: -2*(signed_multiloop::a+signed_multiloop::b)^5*gammalooprs::Q(gammalooprs::uv::class(0),spenso::cind(0))
62.19 s
> Location: crates/gammalooprs/src/uv/approx/local_4d.rs:1983
62.19 s
>
62.19 s
> ━━━━━━━━━━━━━━━━━━━━━━━━━━━━━━━━━━ BACKTRACE ━━━━━━━━━━━━━━━━━━━━━━━━━━━━━━━━━━━
62.19 s
> 1: <color_eyre[51793ea62743adbd]::config::PanicHook>::panic_report<unknown>
62.19 s
> at <unknown source file>:<unknown line>
62.19 s
> 2: <color_eyre[51793ea62743adbd]::config::PanicHook>::into_panic_hook::{closure#0}<unknown>
62.19 s
> at <unknown source file>:<unknown line>
62.19 s
> 3: std[bcb96dfbba0ab899]::panicking::panic_with_hook<unknown>
62.19 s
> at <unknown source file>:<unknown line>
62.19 s
> 4: std[bcb96dfbba0ab899]::panicking::panic_handler::{closure#0}<unknown>
62.19 s
> at <unknown source file>:<unknown line>
62.19 s
> 5: std[bcb96dfbba0ab899]::sys::backtrace::__rust_end_short_backtrace::<std[bcb96dfbba0ab899]::panicking::panic_handler::{closure#0}, !><unknown>
62.19 s
> at <unknown source file>:<unknown line>
62.19 s
> 6: __rustc[6c289b9f9c454d21]::rust_begin_unwind<unknown>
62.19 s
> at <unknown source file>:<unknown line>
62.19 s
> 7: core[940e698046960fd5]::panicking::panic_fmt<unknown>
62.19 s
> at <unknown source file>:<unknown line>
62.19 s
> 8: core[940e698046960fd5]::panicking::assert_failed_inner<unknown>
62.19 s
> at <unknown source file>:<unknown line>
62.19 s
> 9: core[940e698046960fd5]::panicking::assert_failed::<symbolica[499970c26fd75ddd]::atom::Atom, symbolica[499970c26fd75ddd]::atom::Atom><unknown>
62.19 s
> at <unknown source file>:<unknown line>
62.19 s
> 10: gammalooprs[24955f93fc9f4e0c]::uv::approx::local_4d::tests::canonical_uv_signed_multiloop_carriers_preserve_factorized_numerators<unknown>
62.19 s
> at <unknown source file>:<unknown line>
62.19 s
> 11: <gammalooprs[24955f93fc9f4e0c]::uv::approx::local_4d::tests::canonical_uv_signed_multiloop_carriers_preserve_factorized_numerators::{closure#0} as core[940e698046960fd5]::ops::function::FnOnce<()>>::call_once<unknown>
62.19 s
> at <unknown source file>:<unknown line>
62.19 s
> 12: test[75d6903177b1d7e9]::__rust_begin_short_backtrace::<core[940e698046960fd5]::result::Result<(), alloc[2ea6bcb46fca0c42]::string::String>, fn() -> core[940e698046960fd5]::result::Result<(), alloc[2ea6bcb46fca0c42]::string::String>><unknown>
62.19 s
> at <unknown source file>:<unknown line>
62.19 s
> 13: test[75d6903177b1d7e9]::run_test::{closure#0}<unknown>
62.19 s
> at <unknown source file>:<unknown line>
62.19 s
> 14: std[bcb96dfbba0ab899]::sys::backtrace::__rust_begin_short_backtrace::<test[75d6903177b1d7e9]::run_test::{closure#1}, ()><unknown>
62.19 s
> at <unknown source file>:<unknown line>
62.19 s
> 15: <std[bcb96dfbba0ab899]::thread::lifecycle::spawn_unchecked<test[75d6903177b1d7e9]::run_test::{closure#1}, ()>::{closure#1} as core[940e698046960fd5]::ops::function::FnOnce<()>>::call_once::{shim:vtable#0}<unknown>
62.19 s
> at <unknown source file>:<unknown line>
62.20 s
> 16: <std[bcb96dfbba0ab899]::sys::thread::unix::Thread>::new::thread_start<unknown>
62.20 s
> at <unknown source file>:<unknown line>
62.20 s
> 17: start_thread<unknown>
62.20 s
> at <unknown source file>:<unknown line>
62.20 s
> 18: __clone3<unknown>
62.20 s
> at <unknown source file>:<unknown line>
62.20 s
>
62.20 s
> Run with COLORBT_SHOW_HIDDEN=1 environment variable to disable frame filtering.
62.20 s
> Run with RUST_BACKTRACE=full to include source snippets.
62.20 s
>
62.20 s
> 5. gammalooprs::uv::approx::local_4d::tests::canonical_uv_classes_certify_signed_aliases_and_preserve_raw_sectors
62.20 s
> failure: test failure with exit code 101
62.20 s
> Error:
62.20 s
> 0: merged canonical UV numerator does not reproduce its source bucket
62.20 s
>
62.20 s
> Location:
62.20 s
> crates/gammalooprs/src/uv/approx/local_4d.rs:367
62.20 s
>
62.20 s
> ━━━━━━━━━━━━━━━━━━━━━━━━━━━━━━━━━━ BACKTRACE ━━━━━━━━━━━━━━━━━━━━━━━━━━━━━━━━━━━
62.20 s
> 1: <color_eyre[51793ea62743adbd]::config::EyreHook>::into_eyre_hook::{closure#0}<unknown>
62.20 s
> at <unknown source file>:<unknown line>
62.20 s
> 2: eyre[cb2fd339c0c40fca]::capture_handler<unknown>
62.20 s
> at <unknown source file>:<unknown line>
62.20 s
> 3: eyre[cb2fd339c0c40fca]::private::format_err<unknown>
62.20 s
> at <unknown source file>:<unknown line>
62.20 s
> 4: <gammalooprs[24955f93fc9f4e0c]::uv::approx::local_4d::FourDSector>::canonical_projection<unknown>
62.20 s
> at <unknown source file>:<unknown line>
62.20 s
> 5: gammalooprs[24955f93fc9f4e0c]::uv::approx::local_4d::tests::canonical_uv_classes_certify_signed_aliases_and_preserve_raw_sectors<unknown>
62.20 s
> at <unknown source file>:<unknown line>
62.20 s
> 6: <gammalooprs[24955f93fc9f4e0c]::uv::approx::local_4d::tests::canonical_uv_classes_certify_signed_aliases_and_preserve_raw_sectors::{closure#0} as core[940e698046960fd5]::ops::function::FnOnce<()>>::call_once<unknown>
62.20 s
> at <unknown source file>:<unknown line>
62.20 s
> 7: test[75d6903177b1d7e9]::__rust_begin_short_backtrace::<core[940e698046960fd5]::result::Result<(), alloc[2ea6bcb46fca0c42]::string::String>, fn() -> core[940e698046960fd5]::result::Result<(), alloc[2ea6bcb46fca0c42]::string::String>><unknown>
62.20 s
> at <unknown source file>:<unknown line>
62.20 s
> 8: test[75d6903177b1d7e9]::run_test::{closure#0}<unknown>
62.20 s
> at <unknown source file>:<unknown line>
62.20 s
> 9: std[bcb96dfbba0ab899]::sys::backtrace::__rust_begin_short_backtrace::<test[75d6903177b1d7e9]::run_test::{closure#1}, ()><unknown>
62.20 s
> at <unknown source file>:<unknown line>
62.20 s
> 10: <std[bcb96dfbba0ab899]::thread::lifecycle::spawn_unchecked<test[75d6903177b1d7e9]::run_test::{closure#1}, ()>::{closure#1} as core[940e698046960fd5]::ops::function::FnOnce<()>>::call_once::{shim:vtable#0}<unknown>
62.20 s
> at <unknown source file>:<unknown line>
62.20 s
> 11: <std[bcb96dfbba0ab899]::sys::thread::unix::Thread>::new::thread_start<unknown>
62.20 s
> at <unknown source file>:<unknown line>
62.20 s
> 12: start_thread<unknown>
62.20 s
> at <unknown source file>:<unknown line>
62.20 s
> 13: __clone3<unknown>
62.20 s
> at <unknown source file>:<unknown line>
62.20 s
>
62.20 s
> Run with COLORBT_SHOW_HIDDEN=1 environment variable to disable frame filtering.
62.20 s
> Run with RUST_BACKTRACE=full to include source snippets.
62.20 s
> system-out
62.20 s
> running 1 test
62.20 s
> test uv::approx::local_4d::tests::canonical_uv_classes_certify_signed_aliases_and_preserve_raw_sectors ... FAILED
62.20 s
>
62.20 s
> failures:
62.20 s
>
62.20 s
> failures:
62.20 s
> uv::approx::local_4d::tests::canonical_uv_classes_certify_signed_aliases_and_preserve_raw_sectors
62.20 s
>
62.20 s
> test result: FAILED. 0 passed; 1 failed; 0 ignored; 0 measured; 742 filtered out; finished in 0.11s
62.20 s
> system-err
62.20 s
> Error:
62.20 s
> 0: merged canonical UV numerator does not reproduce its source bucket
62.20 s
>
62.20 s
> Location:
62.20 s
> crates/gammalooprs/src/uv/approx/local_4d.rs:367
62.20 s
>
62.20 s
> ━━━━━━━━━━━━━━━━━━━━━━━━━━━━━━━━━━ BACKTRACE ━━━━━━━━━━━━━━━━━━━━━━━━━━━━━━━━━━━
62.20 s
> 1: <color_eyre[51793ea62743adbd]::config::EyreHook>::into_eyre_hook::{closure#0}<unknown>
62.20 s
> at <unknown source file>:<unknown line>
62.20 s
> 2: eyre[cb2fd339c0c40fca]::capture_handler<unknown>
62.20 s
> at <unknown source file>:<unknown line>
62.20 s
> 3: eyre[cb2fd339c0c40fca]::private::format_err<unknown>
62.20 s
> at <unknown source file>:<unknown line>
62.20 s
> 4: <gammalooprs[24955f93fc9f4e0c]::uv::approx::local_4d::FourDSector>::canonical_projection<unknown>
62.20 s
> at <unknown source file>:<unknown line>
62.20 s
> 5: gammalooprs[24955f93fc9f4e0c]::uv::approx::local_4d::tests::canonical_uv_classes_certify_signed_aliases_and_preserve_raw_sectors<unknown>
62.20 s
> at <unknown source file>:<unknown line>
62.20 s
> 6: <gammalooprs[24955f93fc9f4e0c]::uv::approx::local_4d::tests::canonical_uv_classes_certify_signed_aliases_and_preserve_raw_sectors::{closure#0} as core[940e698046960fd5]::ops::function::FnOnce<()>>::call_once<unknown>
62.20 s
> at <unknown source file>:<unknown line>
62.20 s
> 7: test[75d6903177b1d7e9]::__rust_begin_short_backtrace::<core[940e698046960fd5]::result::Result<(), alloc[2ea6bcb46fca0c42]::string::String>, fn() -> core[940e698046960fd5]::result::Result<(), alloc[2ea6bcb46fca0c42]::string::String>><unknown>
62.20 s
> at <unknown source file>:<unknown line>
62.20 s
> 8: test[75d6903177b1d7e9]::run_test::{closure#0}<unknown>
62.20 s
> at <unknown source file>:<unknown line>
62.20 s
> 9: std[bcb96dfbba0ab899]::sys::backtrace::__rust_begin_short_backtrace::<test[75d6903177b1d7e9]::run_test::{closure#1}, ()><unknown>
62.20 s
> at <unknown source file>:<unknown line>
62.20 s
> 10: <std[bcb96dfbba0ab899]::thread::lifecycle::spawn_unchecked<test[75d6903177b1d7e9]::run_test::{closure#1}, ()>::{closure#1} as core[940e698046960fd5]::ops::function::FnOnce<()>>::call_once::{shim:vtable#0}<unknown>
62.20 s
> at <unknown source file>:<unknown line>
62.20 s
> 11: <std[bcb96dfbba0ab899]::sys::thread::unix::Thread>::new::thread_start<unknown>
62.20 s
> at <unknown source file>:<unknown line>
62.20 s
> 12: start_thread<unknown>
62.20 s
> at <unknown source file>:<unknown line>
62.20 s
> 13: __clone3<unknown>
62.20 s
> at <unknown source file>:<unknown line>
62.20 s
>
62.20 s
> Run with COLORBT_SHOW_HIDDEN=1 environment variable to disable frame filtering.
62.20 s
> Run with RUST_BACKTRACE=full to include source snippets.
62.20 s
>
62.20 s
> 6. gammalooprs::uv::approx::tests::direct_nested_scalar_banana_replays_complete_cff_at_depth_three
62.20 s
> failure: test failure with exit code 101
62.20 s
> Error:
62.20 s
> 0: canonical UV numerator does not reproduce its source in the component frame
62.20 s
>
62.20 s
> Location:
62.20 s
> crates/gammalooprs/src/uv/approx/local_4d.rs:354
62.20 s
>
62.20 s
> ━━━━━━━━━━━━━━━━━━━━━━━━━━━━━━━━━━ BACKTRACE ━━━━━━━━━━━━━━━━━━━━━━━━━━━━━━━━━━━
62.20 s
> 1: <color_eyre[51793ea62743adbd]::config::EyreHook>::into_eyre_hook::{closure#0}<unknown>
62.20 s
> at <unknown source file>:<unknown line>
62.20 s
> 2: eyre[cb2fd339c0c40fca]::capture_handler<unknown>
62.20 s
> at <unknown source file>:<unknown line>
62.20 s
> 3: eyre[cb2fd339c0c40fca]::private::format_err<unknown>
62.20 s
> at <unknown source file>:<unknown line>
62.20 s
> 4: <gammalooprs[24955f93fc9f4e0c]::uv::approx::local_4d::FourDSector>::canonical_projection<unknown>
62.20 s
> at <unknown source file>:<unknown line>
62.20 s
> 5: <gammalooprs[24955f93fc9f4e0c]::uv::approx::projected_4d::Projected4dApproximation>::project_local_4d<unknown>
62.20 s
> at <unknown source file>:<unknown line>
62.20 s
> 6: <gammalooprs[24955f93fc9f4e0c]::uv::approx::Approximation>::compute_3d<unknown>
62.20 s
> at <unknown source file>:<unknown line>
62.20 s
> 7: gammalooprs[24955f93fc9f4e0c]::uv::approx::tests::direct_nested_scalar_banana_replays_complete_cff_at_depth_three::{closure#0}<unknown>
62.20 s
> at <unknown source file>:<unknown line>
62.20 s
> 8: gammalooprs[24955f93fc9f4e0c]::uv::approx::tests::direct_nested_scalar_banana_replays_complete_cff_at_depth_three<unknown>
62.20 s
> at <unknown source file>:<unknown line>
62.20 s
> 9: <gammalooprs[24955f93fc9f4e0c]::uv::approx::tests::direct_nested_scalar_banana_replays_complete_cff_at_depth_three::{closure#0} as core[940e698046960fd5]::ops::function::FnOnce<()>>::call_once<unknown>
62.20 s
> at <unknown source file>:<unknown line>
62.20 s
> 10: test[75d6903177b1d7e9]::__rust_begin_short_backtrace::<core[940e698046960fd5]::result::Result<(), alloc[2ea6bcb46fca0c42]::string::String>, fn() -> core[940e698046960fd5]::result::Result<(), alloc[2ea6bcb46fca0c42]::string::String>><unknown>
62.20 s
> at <unknown source file>:<unknown line>
62.20 s
> 11: test[75d6903177b1d7e9]::run_test::{closure#0}<unknown>
62.20 s
> at <unknown source file>:<unknown line>
62.20 s
> 12: std[bcb96dfbba0ab899]::sys::backtrace::__rust_begin_short_backtrace::<test[75d6903177b1d7e9]::run_test::{closure#1}, ()><unknown>
62.20 s
> at <unknown source file>:<unknown line>
62.20 s
> 13: <std[bcb96dfbba0ab899]::thread::lifecycle::spawn_unchecked<test[75d6903177b1d7e9]::run_test::{closure#1}, ()>::{closure#1} as core[940e698046960fd5]::ops::function::FnOnce<()>>::call_once::{shim:vtable#0}<unknown>
62.20 s
> at <unknown source file>:<unknown line>
62.20 s
> 14: <std[bcb96dfbba0ab899]::sys::thread::unix::Thread>::new::thread_start<unknown>
62.20 s
> at <unknown source file>:<unknown line>
62.20 s
> 15: start_thread<unknown>
62.20 s
> at <unknown source file>:<unknown line>
62.20 s
> 16: __clone3<unknown>
62.20 s
> at <unknown source file>:<unknown line>
62.20 s
>
62.20 s
> Run with COLORBT_SHOW_HIDDEN=1 environment variable to disable frame filtering.
62.20 s
> Run with RUST_BACKTRACE=full to include source snippets.
62.20 s
> system-out
62.20 s
> running 1 test
62.20 s
> test uv::approx::tests::direct_nested_scalar_banana_replays_complete_cff_at_depth_three ... FAILED
62.20 s
>
62.20 s
> failures:
62.20 s
>
62.20 s
> failures:
62.20 s
> uv::approx::tests::direct_nested_scalar_banana_replays_complete_cff_at_depth_three
62.20 s
>
62.20 s
> test result: FAILED. 0 passed; 1 failed; 0 ignored; 0 measured; 742 filtered out; finished in 0.09s
62.20 s
> system-err
62.20 s
> Error:
62.20 s
> 0: canonical UV numerator does not reproduce its source in the component frame
62.20 s
>
62.20 s
> Location:
62.20 s
> crates/gammalooprs/src/uv/approx/local_4d.rs:354
62.20 s
>
62.20 s
> ━━━━━━━━━━━━━━━━━━━━━━━━━━━━━━━━━━ BACKTRACE ━━━━━━━━━━━━━━━━━━━━━━━━━━━━━━━━━━━
62.20 s
> 1: <color_eyre[51793ea62743adbd]::config::EyreHook>::into_eyre_hook::{closure#0}<unknown>
62.20 s
> at <unknown source file>:<unknown line>
62.20 s
> 2: eyre[cb2fd339c0c40fca]::capture_handler<unknown>
62.20 s
> at <unknown source file>:<unknown line>
62.20 s
> 3: eyre[cb2fd339c0c40fca]::private::format_err<unknown>
62.20 s
> at <unknown source file>:<unknown line>
62.20 s
> 4: <gammalooprs[24955f93fc9f4e0c]::uv::approx::local_4d::FourDSector>::canonical_projection<unknown>
62.20 s
> at <unknown source file>:<unknown line>
62.20 s
> 5: <gammalooprs[24955f93fc9f4e0c]::uv::approx::projected_4d::Projected4dApproximation>::project_local_4d<unknown>
62.20 s
> at <unknown source file>:<unknown line>
62.20 s
> 6: <gammalooprs[24955f93fc9f4e0c]::uv::approx::Approximation>::compute_3d<unknown>
62.20 s
> at <unknown source file>:<unknown line>
62.20 s
> 7: gammalooprs[24955f93fc9f4e0c]::uv::approx::tests::direct_nested_scalar_banana_replays_complete_cff_at_depth_three::{closure#0}<unknown>
62.20 s
> at <unknown source file>:<unknown line>
62.20 s
> 8: gammalooprs[24955f93fc9f4e0c]::uv::approx::tests::direct_nested_scalar_banana_replays_complete_cff_at_depth_three<unknown>
62.20 s
> at <unknown source file>:<unknown line>
62.20 s
> 9: <gammalooprs[24955f93fc9f4e0c]::uv::approx::tests::direct_nested_scalar_banana_replays_complete_cff_at_depth_three::{closure#0} as core[940e698046960fd5]::ops::function::FnOnce<()>>::call_once<unknown>
62.20 s
> at <unknown source file>:<unknown line>
62.20 s
> 10: test[75d6903177b1d7e9]::__rust_begin_short_backtrace::<core[940e698046960fd5]::result::Result<(), alloc[2ea6bcb46fca0c42]::string::String>, fn() -> core[940e698046960fd5]::result::Result<(), alloc[2ea6bcb46fca0c42]::string::String>><unknown>
62.20 s
> at <unknown source file>:<unknown line>
62.20 s
> 11: test[75d6903177b1d7e9]::run_test::{closure#0}<unknown>
62.20 s
> at <unknown source file>:<unknown line>
62.20 s
> 12: std[bcb96dfbba0ab899]::sys::backtrace::__rust_begin_short_backtrace::<test[75d6903177b1d7e9]::run_test::{closure#1}, ()><unknown>
62.20 s
> at <unknown source file>:<unknown line>
62.20 s
> 13: <std[bcb96dfbba0ab899]::thread::lifecycle::spawn_unchecked<test[75d6903177b1d7e9]::run_test::{closure#1}, ()>::{closure#1} as core[940e698046960fd5]::ops::function::FnOnce<()>>::call_once::{shim:vtable#0}<unknown>
62.20 s
> at <unknown source file>:<unknown line>
62.20 s
> 14: <std[bcb96dfbba0ab899]::sys::thread::unix::Thread>::new::thread_start<unknown>
62.20 s
> at <unknown source file>:<unknown line>
62.20 s
> 15: start_thread<unknown>
62.20 s
> at <unknown source file>:<unknown line>
62.20 s
> 16: __clone3<unknown>
62.20 s
> at <unknown source file>:<unknown line>
62.20 s
>
62.20 s
> Run with COLORBT_SHOW_HIDDEN=1 environment variable to disable frame filtering.
62.20 s
> Run with RUST_BACKTRACE=full to include source snippets.
62.20 s
> =========================================
62.20 s
> Extracting 1 binary, 1 build script output directory, and 1 linked path to /build/nextest-archive-VVI262
62.20 s
> Extracted 7 files to /build/nextest-archive-VVI262 in 0.09s
62.20 s
> ------------
62.20 s
> Nextest run ID cbda4163-781e-4d32-8559-424c822c8364 with nextest profile: ci_gammaloop
62.20 s
> Starting 105 tests across 1 binary
62.20 s
> ------------
62.20 s
> Summary [ 18.347s] 105 tests run: 105 passed , 0 skipped
62.20 s
>
62.20 s
> ========== nextest test summary ==========
62.20 s
> report: target/nextest/ci_gammaloop/junit.xml
62.20 s
> tests: 105, failures: 0, errors: 0
62.20 s
> No failing testcases found.
62.20 s
> =========================================
62.20 s
For full logs, run:
62.20 s
nix log /nix/store/n61r02micjg0snakcv487zfdf4anp50s-gammaloop-nextest-core.drv
62.35 s
[0 built (1 failed ), 0.0 Run failed.