0.00 s
$ /nix/store/9ypz3flqsrl5xl495mm8h645gadjsxi1-coreutils-9.11/bin/timeout --kill-after=15s 7200s /nix/store/23zk8sgzamrbmj1fday15szf7f2279s8-nix-2.34.7/bin/nix --extra-experimental-features nix-command --extra-experimental-features flakes flake clone git+https://github.com/alphal00p/gammaloop --dest /tmp/nix-ci-worker/stable-pwd/repo/
0.08 s
Cloning into '/tmp/nix-ci-worker/stable-pwd/repo'...
0.72 s
remote: Enumerating objects: 84521, done.
0.83 s
remote: Counting objects: 0% (1/8838)
remote: Counting objects: 1% (89/8838)
remote: Counting objects: 2% (177/8838)
remote: Counting objects: 3% (266/8838)
remote: Counting objects: 4% (354/8838)
remote: Counting objects: 5% (442/8838)
remote: Counting objects: 6% (531/8838)
remote: Counting objects: 7% (619/8838)
remote: Counting objects: 8% (708/8838)
remote: Counting objects: 9% (796/8838)
remote: Counting objects: 10% (884/8838)
remote: Counting objects: 11% (973/8838)
remote: Counting objects: 12% (1061/8838)
remote: Counting objects: 13% (1149/8838)
remote: Counting objects: 14% (1238/8838)
remote: Counting objects: 15% (1326/8838)
remote: Counting objects: 16% (1415/8838)
remote: Counting objects: 17% (1503/8838)
remote: Counting objects: 18% (1591/8838)
remote: Counting objects: 19% (1680/8838)
remote: Counting objects: 20% (1768/8838)
remote: Counting objects: 21% (1856/8838)
remote: Counting objects: 22% (1945/8838)
remote: Counting objects: 23% (2033/8838)
remote: Counting objects: 24% (2122/8838)
remote: Counting objects: 25% (2210/8838)
remote: Counting objects: 26% (2298/8838)
remote: Counting objects: 27% (2387/8838)
remote: Counting objects: 28% (2475/8838)
remote: Counting objects: 29% (2564/8838)
remote: Counting objects: 30% (2652/8838)
remote: Counting objects: 31% (2740/8838)
remote: Counting objects: 32% (2829/8838)
remote: Counting objects: 33% (2917/8838)
remote: Counting objects: 34% (3005/8838)
remote: Counting objects: 35% (3094/8838)
remote: Counting objects: 36% (3182/8838)
remote: Counting objects: 37% (3271/8838)
remote: Counting objects: 38% (3359/8838)
remote: Counting objects: 39% (3447/8838)
remote: Counting objects: 40% (3536/8838)
remote: Counting objects: 41% (3624/8838)
remote: Counting objects: 42% (3712/8838)
remote: Counting objects: 43% (3801/8838)
remote: Counting objects: 44% (3889/8838)
remote: Counting objects: 45% (3978/8838)
remote: Counting objects: 46% (4066/8838)
remote: Counting objects: 47% (4154/8838)
remote: Counting objects: 48% (4243/8838)
remote: Counting objects: 49% (4331/8838)
remote: Counting objects: 50% (4419/8838)
remote: Counting objects: 51% (4508/8838)
remote: Counting objects: 52% (4596/8838)
remote: Counting objects: 53% (4685/8838)
remote: Counting objects: 54% (4773/8838)
remote: Counting objects: 55% (4861/8838)
remote: Counting objects: 56% (4950/8838)
remote: Counting objects: 57% (5038/8838)
remote: Counting objects: 58% (5127/8838)
remote: Counting objects: 59% (5215/8838)
remote: Counting objects: 60% (5303/8838)
remote: Counting objects: 61% (5392/8838)
remote: Counting objects: 62% (5480/8838)
remote: Counting objects: 63% (5568/8838)
remote: Counting objects: 64% (5657/8838)
remote: Counting objects: 65% (5745/8838)
remote: Counting objects: 66% (5834/8838)
remote: Counting objects: 67% (5922/8838)
remote: Counting objects: 68% (6010/8838)
remote: Counting objects: 69% (6099/8838)
remote: Counting objects: 70% (6187/8838)
remote: Counting objects: 71% (6275/8838)
remote: Counting objects: 72% (6364/8838)
remote: Counting objects: 73% (6452/8838)
remote: Counting objects: 74% (6541/8838)
remote: Counting objects: 75% (6629/8838)
remote: Counting objects: 76% (6717/8838)
remote: Counting objects: 77% (6806/8838)
remote: Counting objects: 78% (6894/8838)
remote: Counting objects: 79% (6983/8838)
remote: Counting objects: 80% (7071/8838)
remote: Counting objects: 81% (7159/8838)
remote: Counting objects: 82% (7248/8838)
remote: Counting objects: 83% (7336/8838)
remote: Counting objects: 84% (7424/8838)
remote: Counting objects: 85% (7513/8838)
remote: Counting objects: 86% (7601/8838)
remote: Counting objects: 87% (7690/8838)
remote: Counting objects: 88% (7778/8838)
remote: Counting objects: 89% (7866/8838)
remote: Counting objects: 90% (7955/8838)
remote: Counting objects: 91% (8043/8838)
remote: Counting objects: 92% (8131/8838)
remote: Counting objects: 93% (8220/8838)
remote: Counting objects: 94% (8308/8838)
remote: Counting objects: 95% (8397/8838)
remote: Counting objects: 96% (8485/8838)
remote: Counting objects: 97% (8573/8838)
remote: Counting objects: 98% (8662/8838)
remote: Counting objects: 99% (8750/8838)
remote: Counting objects: 100% (8838/8838)
remote: Counting objects: 100% (8838/8838), done.
2.69 s
remote: Compressing objects: 0% (1/1883)
remote: Compressing objects: 1% (19/1883)
remote: Compressing objects: 2% (38/1883)
remote: Compressing objects: 3% (57/1883)
remote: Compressing objects: 4% (76/1883)
remote: Compressing objects: 5% (95/1883)
remote: Compressing objects: 6% (113/1883)
remote: Compressing objects: 7% (132/1883)
remote: Compressing objects: 8% (151/1883)
remote: Compressing objects: 9% (170/1883)
remote: Compressing objects: 10% (189/1883)
remote: Compressing objects: 11% (208/1883)
remote: Compressing objects: 11% (218/1883)
remote: Compressing objects: 12% (226/1883)
remote: Compressing objects: 13% (245/1883)
remote: Compressing objects: 14% (264/1883)
remote: Compressing objects: 15% (283/1883)
remote: Compressing objects: 16% (302/1883)
remote: Compressing objects: 17% (321/1883)
remote: Compressing objects: 18% (339/1883)
remote: Compressing objects: 19% (358/1883)
remote: Compressing objects: 20% (377/1883)
remote: Compressing objects: 21% (396/1883)
remote: Compressing objects: 22% (415/1883)
remote: Compressing objects: 23% (434/1883)
remote: Compressing objects: 24% (452/1883)
remote: Compressing objects: 25% (471/1883)
remote: Compressing objects: 26% (490/1883)
remote: Compressing objects: 27% (509/1883)
remote: Compressing objects: 28% (528/1883)
remote: Compressing objects: 29% (547/1883)
remote: Compressing objects: 30% (565/1883)
remote: Compressing objects: 31% (584/1883)
remote: Compressing objects: 32% (603/1883)
remote: Compressing objects: 33% (622/1883)
remote: Compressing objects: 34% (641/1883)
remote: Compressing objects: 35% (660/1883)
remote: Compressing objects: 36% (678/1883)
remote: Compressing objects: 37% (697/1883)
remote: Compressing objects: 38% (716/1883)
remote: Compressing objects: 39% (735/1883)
remote: Compressing objects: 40% (754/1883)
remote: Compressing objects: 41% (773/1883)
remote: Compressing objects: 42% (791/1883)
remote: Compressing objects: 43% (810/1883)
remote: Compressing objects: 44% (829/1883)
remote: Compressing objects: 45% (848/1883)
remote: Compressing objects: 46% (867/1883)
remote: Compressing objects: 47% (886/1883)
remote: Compressing objects: 48% (904/1883)
remote: Compressing objects: 49% (923/1883)
remote: Compressing objects: 50% (942/1883)
remote: Compressing objects: 51% (961/1883)
remote: Compressing objects: 52% (980/1883)
remote: Compressing objects: 53% (998/1883)
remote: Compressing objects: 54% (1017/1883)
remote: Compressing objects: 55% (1036/1883)
remote: Compressing objects: 56% (1055/1883)
remote: Compressing objects: 57% (1074/1883)
remote: Compressing objects: 58% (1093/1883)
remote: Compressing objects: 59% (1111/1883)
remote: Compressing objects: 60% (1130/1883)
remote: Compressing objects: 61% (1149/1883)
remote: Compressing objects: 62% (1168/1883)
remote: Compressing objects: 63% (1187/1883)
remote: Compressing objects: 64% (1206/1883)
remote: Compressing objects: 65% (1224/1883)
remote: Compressing objects: 66% (1243/1883)
remote: Compressing objects: 67% (1262/1883)
remote: Compressing objects: 68% (1281/1883)
remote: Compressing objects: 69% (1300/1883)
remote: Compressing objects: 70% (1319/1883)
remote: Compressing objects: 71% (1337/1883)
remote: Compressing objects: 72% (1356/1883)
remote: Compressing objects: 73% (1375/1883)
remote: Compressing objects: 74% (1394/1883)
remote: Compressing objects: 75% (1413/1883)
remote: Compressing objects: 76% (1432/1883)
remote: Compressing objects: 77% (1450/1883)
remote: Compressing objects: 78% (1469/1883)
remote: Compressing objects: 79% (1488/1883)
remote: Compressing objects: 80% (1507/1883)
remote: Compressing objects: 81% (1526/1883)
remote: Compressing objects: 82% (1545/1883)
remote: Compressing objects: 83% (1563/1883)
remote: Compressing objects: 84% (1582/1883)
remote: Compressing objects: 85% (1601/1883)
remote: Compressing objects: 86% (1620/1883)
remote: Compressing objects: 87% (1639/1883)
remote: Compressing objects: 88% (1658/1883)
remote: Compressing objects: 89% (1676/1883)
remote: Compressing objects: 90% (1695/1883)
remote: Compressing objects: 91% (1714/1883)
remote: Compressing objects: 92% (1733/1883)
remote: Compressing objects: 93% (1752/1883)
remote: Compressing objects: 94% (1771/1883)
remote: Compressing objects: 95% (1789/1883)
remote: Compressing objects: 96% (1808/1883)
remote: Compressing objects: 97% (1827/1883)
remote: Compressing objects: 98% (1846/1883)
remote: Compressing objects: 99% (1865/1883)
remote: Compressing objects: 100% (1883/1883)
remote: Compressing objects: 100% (1883/1883), done.
7.08 s
Receiving objects: 0% (1/84521)
Receiving objects: 1% (846/84521)
Receiving objects: 2% (1691/84521)
Receiving objects: 3% (2536/84521)
Receiving objects: 4% (3381/84521)
Receiving objects: 5% (4227/84521)
Receiving objects: 6% (5072/84521)
Receiving objects: 7% (5917/84521)
Receiving objects: 8% (6762/84521)
Receiving objects: 9% (7607/84521), 15.31 MiB | 30.60 MiB/s
Receiving objects: 10% (8453/84521), 15.31 MiB | 30.60 MiB/s
Receiving objects: 11% (9298/84521), 15.31 MiB | 30.60 MiB/s
Receiving objects: 12% (10143/84521), 15.31 MiB | 30.60 MiB/s
Receiving objects: 13% (10988/84521), 15.31 MiB | 30.60 MiB/s
Receiving objects: 14% (11833/84521), 15.31 MiB | 30.60 MiB/s
Receiving objects: 15% (12679/84521), 15.31 MiB | 30.60 MiB/s
Receiving objects: 16% (13524/84521), 15.31 MiB | 30.60 MiB/s
Receiving objects: 17% (14369/84521), 15.31 MiB | 30.60 MiB/s
Receiving objects: 18% (15214/84521), 15.31 MiB | 30.60 MiB/s
Receiving objects: 19% (16059/84521), 15.31 MiB | 30.60 MiB/s
Receiving objects: 20% (16905/84521), 15.31 MiB | 30.60 MiB/s
Receiving objects: 21% (17750/84521), 15.31 MiB | 30.60 MiB/s
Receiving objects: 22% (18595/84521), 15.31 MiB | 30.60 MiB/s
Receiving objects: 23% (19440/84521), 15.31 MiB | 30.60 MiB/s
Receiving objects: 24% (20286/84521), 15.31 MiB | 30.60 MiB/s
Receiving objects: 25% (21131/84521), 15.31 MiB | 30.60 MiB/s
Receiving objects: 26% (21976/84521), 15.31 MiB | 30.60 MiB/s
Receiving objects: 27% (22821/84521), 15.31 MiB | 30.60 MiB/s
Receiving objects: 28% (23666/84521), 15.31 MiB | 30.60 MiB/s
Receiving objects: 29% (24512/84521), 15.31 MiB | 30.60 MiB/s
Receiving objects: 30% (25357/84521), 15.31 MiB | 30.60 MiB/s
Receiving objects: 31% (26202/84521), 15.31 MiB | 30.60 MiB/s
Receiving objects: 32% (27047/84521), 15.31 MiB | 30.60 MiB/s
Receiving objects: 33% (27892/84521), 15.31 MiB | 30.60 MiB/s
Receiving objects: 34% (28738/84521), 15.31 MiB | 30.60 MiB/s
Receiving objects: 35% (29583/84521), 15.31 MiB | 30.60 MiB/s
Receiving objects: 36% (30428/84521), 15.31 MiB | 30.60 MiB/s
Receiving objects: 37% (31273/84521), 15.31 MiB | 30.60 MiB/s
Receiving objects: 38% (32118/84521), 15.31 MiB | 30.60 MiB/s
Receiving objects: 39% (32964/84521), 15.31 MiB | 30.60 MiB/s
Receiving objects: 40% (33809/84521), 15.31 MiB | 30.60 MiB/s
Receiving objects: 40% (34118/84521), 34.20 MiB | 34.20 MiB/s
Receiving objects: 41% (34654/84521), 34.20 MiB | 34.20 MiB/s
Receiving objects: 42% (35499/84521), 34.20 MiB | 34.20 MiB/s
Receiving objects: 43% (36345/84521), 34.20 MiB | 34.20 MiB/s
Receiving objects: 44% (37190/84521), 34.20 MiB | 34.20 MiB/s
Receiving objects: 45% (38035/84521), 34.20 MiB | 34.20 MiB/s
Receiving objects: 46% (38880/84521), 34.20 MiB | 34.20 MiB/s
Receiving objects: 47% (39725/84521), 34.20 MiB | 34.20 MiB/s
Receiving objects: 48% (40571/84521), 34.20 MiB | 34.20 MiB/s
Receiving objects: 49% (41416/84521), 34.20 MiB | 34.20 MiB/s
Receiving objects: 50% (42261/84521), 34.20 MiB | 34.20 MiB/s
Receiving objects: 51% (43106/84521), 34.20 MiB | 34.20 MiB/s
Receiving objects: 52% (43951/84521), 34.20 MiB | 34.20 MiB/s
Receiving objects: 53% (44797/84521), 52.26 MiB | 34.13 MiB/s
Receiving objects: 54% (45642/84521), 52.26 MiB | 34.13 MiB/s
Receiving objects: 55% (46487/84521), 52.26 MiB | 34.13 MiB/s
Receiving objects: 56% (47332/84521), 52.26 MiB | 34.13 MiB/s
Receiving objects: 57% (48177/84521), 52.26 MiB | 34.13 MiB/s
Receiving objects: 58% (49023/84521), 52.26 MiB | 34.13 MiB/s
Receiving objects: 59% (49868/84521), 52.26 MiB | 34.13 MiB/s
Receiving objects: 59% (50130/84521), 52.26 MiB | 34.13 MiB/s
Receiving objects: 60% (50713/84521), 52.26 MiB | 34.13 MiB/s
Receiving objects: 61% (51558/84521), 71.73 MiB | 34.51 MiB/s
Receiving objects: 62% (52404/84521), 71.73 MiB | 34.51 MiB/s
Receiving objects: 63% (53249/84521), 71.73 MiB | 34.51 MiB/s
Receiving objects: 64% (54094/84521), 71.73 MiB | 34.51 MiB/s
Receiving objects: 65% (54939/84521), 71.73 MiB | 34.51 MiB/s
Receiving objects: 66% (55784/84521), 71.73 MiB | 34.51 MiB/s
Receiving objects: 67% (56630/84521), 71.73 MiB | 34.51 MiB/s
Receiving objects: 67% (57350/84521), 91.25 MiB | 34.74 MiB/s
Receiving objects: 68% (57475/84521), 91.25 MiB | 34.74 MiB/s
Receiving objects: 69% (58320/84521), 91.25 MiB | 34.74 MiB/s
Receiving objects: 70% (59165/84521), 91.25 MiB | 34.74 MiB/s
Receiving objects: 71% (60010/84521), 91.25 MiB | 34.74 MiB/s
Receiving objects: 72% (60856/84521), 110.41 MiB | 35.32 MiB/s
Receiving objects: 73% (61701/84521), 110.41 MiB | 35.32 MiB/s
Receiving objects: 74% (62546/84521), 110.41 MiB | 35.32 MiB/s
Receiving objects: 75% (63391/84521), 110.41 MiB | 35.32 MiB/s
Receiving objects: 76% (64236/84521), 110.41 MiB | 35.32 MiB/s
Receiving objects: 77% (65082/84521), 126.80 MiB | 34.97 MiB/s
Receiving objects: 78% (65927/84521), 126.80 MiB | 34.97 MiB/s
Receiving objects: 79% (66772/84521), 126.80 MiB | 34.97 MiB/s
Receiving objects: 80% (67617/84521), 126.80 MiB | 34.97 MiB/s
Receiving objects: 81% (68463/84521), 126.80 MiB | 34.97 MiB/s
Receiving objects: 82% (69308/84521), 126.80 MiB | 34.97 MiB/s
Receiving objects: 83% (70153/84521), 126.80 MiB | 34.97 MiB/s
Receiving objects: 84% (70998/84521), 126.80 MiB | 34.97 MiB/s
Receiving objects: 85% (71843/84521), 126.80 MiB | 34.97 MiB/s
Receiving objects: 86% (72689/84521), 126.80 MiB | 34.97 MiB/s
Receiving objects: 87% (73534/84521), 126.80 MiB | 34.97 MiB/s
Receiving objects: 87% (74125/84521), 126.80 MiB | 34.97 MiB/s
Receiving objects: 88% (74379/84521), 145.68 MiB | 35.02 MiB/s
Receiving objects: 89% (75224/84521), 145.68 MiB | 35.02 MiB/s
Receiving objects: 90% (76069/84521), 145.68 MiB | 35.02 MiB/s
Receiving objects: 91% (76915/84521), 145.68 MiB | 35.02 MiB/s
Receiving objects: 92% (77760/84521), 145.68 MiB | 35.02 MiB/s
Receiving objects: 93% (78605/84521), 145.68 MiB | 35.02 MiB/s
Receiving objects: 94% (79450/84521), 145.68 MiB | 35.02 MiB/s
Receiving objects: 95% (80295/84521), 145.68 MiB | 35.02 MiB/s
Receiving objects: 96% (81141/84521), 145.68 MiB | 35.02 MiB/s
Receiving objects: 97% (81986/84521), 145.68 MiB | 35.02 MiB/s
Receiving objects: 98% (82831/84521), 145.68 MiB | 35.02 MiB/s
Receiving objects: 99% (83676/84521), 145.68 MiB | 35.02 MiB/s
remote: Total 84521 (delta 7644), reused 7034 (delta 6953), pack-reused 75683 (from 2)
7.08 s
Receiving objects: 100% (84521/84521), 145.68 MiB | 35.02 MiB/s
Receiving objects: 100% (84521/84521), 153.92 MiB | 35.06 MiB/s, done.
8.07 s
Resolving deltas: 0% (0/57185)
Resolving deltas: 1% (573/57185)
Resolving deltas: 2% (1144/57185)
Resolving deltas: 3% (1716/57185)
Resolving deltas: 4% (2288/57185)
Resolving deltas: 5% (2860/57185)
Resolving deltas: 6% (3432/57185)
Resolving deltas: 7% (4007/57185)
Resolving deltas: 8% (4576/57185)
Resolving deltas: 9% (5148/57185)
Resolving deltas: 10% (5719/57185)
Resolving deltas: 11% (6291/57185)
Resolving deltas: 12% (6863/57185)
Resolving deltas: 13% (7435/57185)
Resolving deltas: 14% (8006/57185)
Resolving deltas: 15% (8578/57185)
Resolving deltas: 16% (9150/57185)
Resolving deltas: 17% (9723/57185)
Resolving deltas: 18% (10295/57185)
Resolving deltas: 19% (10866/57185)
Resolving deltas: 20% (11439/57185)
Resolving deltas: 21% (12009/57185)
Resolving deltas: 22% (12581/57185)
Resolving deltas: 23% (13153/57185)
Resolving deltas: 24% (13725/57185)
Resolving deltas: 25% (14298/57185)
Resolving deltas: 26% (14869/57185)
Resolving deltas: 27% (15440/57185)
Resolving deltas: 28% (16012/57185)
Resolving deltas: 29% (16584/57185)
Resolving deltas: 30% (17158/57185)
Resolving deltas: 31% (17728/57185)
Resolving deltas: 32% (18300/57185)
Resolving deltas: 33% (18872/57185)
Resolving deltas: 34% (19443/57185)
Resolving deltas: 35% (20015/57185)
Resolving deltas: 36% (20588/57185)
Resolving deltas: 37% (21160/57185)
Resolving deltas: 38% (21731/57185)
Resolving deltas: 39% (22303/57185)
Resolving deltas: 40% (22874/57185)
Resolving deltas: 41% (23447/57185)
Resolving deltas: 42% (24018/57185)
Resolving deltas: 43% (24591/57185)
Resolving deltas: 44% (25162/57185)
Resolving deltas: 45% (25734/57185)
Resolving deltas: 46% (26306/57185)
Resolving deltas: 47% (26877/57185)
Resolving deltas: 48% (27449/57185)
Resolving deltas: 49% (28021/57185)
Resolving deltas: 50% (28594/57185)
Resolving deltas: 51% (29165/57185)
Resolving deltas: 52% (29737/57185)
Resolving deltas: 53% (30309/57185)
Resolving deltas: 54% (30882/57185)
Resolving deltas: 55% (31452/57185)
Resolving deltas: 56% (32024/57185)
Resolving deltas: 57% (32596/57185)
Resolving deltas: 58% (33168/57185)
Resolving deltas: 59% (33740/57185)
Resolving deltas: 60% (34312/57185)
Resolving deltas: 61% (34883/57185)
Resolving deltas: 62% (35455/57185)
Resolving deltas: 63% (36031/57185)
Resolving deltas: 64% (36599/57185)
Resolving deltas: 65% (37171/57185)
Resolving deltas: 66% (37743/57185)
Resolving deltas: 67% (38314/57185)
Resolving deltas: 68% (38886/57185)
Resolving deltas: 69% (39458/57185)
Resolving deltas: 70% (40030/57185)
Resolving deltas: 71% (40603/57185)
Resolving deltas: 72% (41175/57185)
Resolving deltas: 73% (41746/57185)
Resolving deltas: 74% (42318/57185)
Resolving deltas: 75% (42889/57185)
Resolving deltas: 76% (43461/57185)
Resolving deltas: 77% (44033/57185)
Resolving deltas: 78% (44605/57185)
Resolving deltas: 79% (45179/57185)
Resolving deltas: 80% (45748/57185)
Resolving deltas: 81% (46320/57185)
Resolving deltas: 82% (46893/57185)
Resolving deltas: 83% (47464/57185)
Resolving deltas: 84% (48036/57185)
Resolving deltas: 85% (48610/57185)
Resolving deltas: 86% (49180/57185)
Resolving deltas: 87% (49751/57185)
Resolving deltas: 88% (50323/57185)
Resolving deltas: 89% (50895/57185)
Resolving deltas: 90% (51467/57185)
Resolving deltas: 91% (52040/57185)
Resolving deltas: 92% (52611/57185)
Resolving deltas: 93% (53183/57185)
Resolving deltas: 94% (53754/57185)
Resolving deltas: 95% (54327/57185)
Resolving deltas: 96% (54898/57185)
Resolving deltas: 97% (55470/57185)
Resolving deltas: 98% (56042/57185)
Resolving deltas: 99% (56614/57185)
Resolving deltas: 100% (57185/57185)
Resolving deltas: 100% (57185/57185), done.
8.51 s
Fetching commit b8396f3a3080d196a947879eb877a2d842d871ef for faster_uv_from_4d ...
8.51 s
$ /nix/store/bcnisk3ydfgv26v2gw3zlky24g00yww2-git-2.54.0/bin/git fetch origin b8396f3a3080d196a947879eb877a2d842d871ef
8.94 s
From https://github.com/alphal00p/gammaloop
8.94 s
* branch b8396f3a3080d196a947879eb877a2d842d871ef -> FETCH_HEAD
8.95 s
$ /nix/store/9ypz3flqsrl5xl495mm8h645gadjsxi1-coreutils-9.11/bin/timeout --kill-after=15s 7200s /nix/store/bcnisk3ydfgv26v2gw3zlky24g00yww2-git-2.54.0/bin/git -c advice.detachedHead=false checkout b8396f3a3080d196a947879eb877a2d842d871ef
9.26 s
HEAD is now at b8396f3a3 canonicalize uv classes and prepare bounded cff mappings
9.27 s
$ /nix/store/9ypz3flqsrl5xl495mm8h645gadjsxi1-coreutils-9.11/bin/timeout --kill-after=15s 7200s /nix/store/23zk8sgzamrbmj1fday15szf7f2279s8-nix-2.34.7/bin/nix --extra-experimental-features nix-command --extra-experimental-features flakes --log-format internal-json run .#packages.x86_64-linux.nix-ci-check-gammaloop-nextest-core --print-build-logs
14.04 s
14.29 s
Downloading cached gammaloop-nextest-binaries-core-gammaloop-api from https://cache.nix-ci.com
14.29 s
Downloading cached gammaloop-nextest-binaries-core-gammalooprs from https://cache.nix-ci.com
15.43 s
Downloaded cached gammaloop-nextest-binaries-core-gammalooprs (87.6 MiB) in 1.1s
15.43 s
Progress: 0 of 4 built, 1 of 2 downloaded from cache (1 downloading)
15.65 s
Downloaded cached gammaloop-nextest-binaries-core-gammaloop-api (120.5 MiB) in 1.3s
15.65 s
Progress: 0 of 3 built, 2 of 2 downloaded from cache
15.68 s
Building /nix/store/m509m4h0022wr0a7g7rmfj92lr3gjxgb-gammaloop-nextest-binaries-core.drv
15.76 s
[gammaloop-nextest-binaries-core:post-build] Uploading to the NixCI cache: /nix/store/85c07rvz3lys243fhv085lgzcxqb7i4g-gammaloop-nextest-binaries-core
15.81 s
[gammaloop-nextest-binaries-core:post-build] warning: 'warn-short-path-literals' is deprecated, use 'lint-short-path-literals = ignore' instead
15.81 s
[gammaloop-nextest-binaries-core:post-build] copying 1 paths...
15.82 s
[gammaloop-nextest-binaries-core:post-build] copying path '/nix/store/85c07rvz3lys243fhv085lgzcxqb7i4g-gammaloop-nextest-binaries-core' to 'https://cache.nix-ci.com'...
15.90 s
[gammaloop-nextest-binaries-core:post-build] warning: 'warn-short-path-literals' is deprecated, use 'lint-short-path-literals = ignore' instead
16.03 s
[gammaloop-nextest-binaries-core:post-build] copying 0 paths...
16.05 s
Uploaded gammaloop-nextest-binaries-core in 301ms
16.05 s
Progress: 1 of 3 built, 2 of 2 downloaded from cache
16.05 s
Built gammaloop-nextest-binaries-core in 367ms
16.14 s
Building /nix/store/qnnlbmskxs6qdw7g83l4j9lk6fljm3rg-nix-ci-check-gammaloop-nextest-core.drv
16.21 s
[nix-ci-check-gammaloop-nextest-core:post-build] Uploading to the NixCI cache: /nix/store/p2blzz4i90w8lcchgkbvvfhyfi4snxcq-nix-ci-check-gammaloop-nextest-core
16.25 s
[nix-ci-check-gammaloop-nextest-core:post-build] warning: 'warn-short-path-literals' is deprecated, use 'lint-short-path-literals = ignore' instead
16.27 s
[nix-ci-check-gammaloop-nextest-core:post-build] copying 1 paths...
16.27 s
[nix-ci-check-gammaloop-nextest-core:post-build] copying path '/nix/store/p2blzz4i90w8lcchgkbvvfhyfi4snxcq-nix-ci-check-gammaloop-nextest-core' to 'https://cache.nix-ci.com'...
16.35 s
[nix-ci-check-gammaloop-nextest-core:post-build] warning: 'warn-short-path-literals' is deprecated, use 'lint-short-path-literals = ignore' instead
16.54 s
[nix-ci-check-gammaloop-nextest-core:post-build] copying 0 paths...
16.57 s
Uploaded nix-ci-check-gammaloop-nextest-core in 367ms
16.57 s
Progress: 2 of 3 built, 2 of 2 downloaded from cache
16.57 s
Built nix-ci-check-gammaloop-nextest-core in 427ms
16.57 s
Progress: 3 of 3 built, 2 of 2 downloaded from cache
22.17 s
evaluating derivation 'g
copying '/nix/store/9a5p
evaluating derivation 'g
copying '/nix/store/9a5p
evaluating derivation 'g
copying '/nix/store/9a5p
evaluating derivation 'g
copying '/nix/store/9a5p
evaluating derivation 'g
copying '/nix/store/9a5p
evaluating derivation 'g
copying '/nix/store/9a5p
evaluating derivation 'g
copying '/nix/store/9a5p
evaluating derivation 'g
copying '/nix/store/9a5p
evaluating derivation 'g
querying gammaloop-nexte
[0 /1 built, 0.0 KiB DL]
[1 /0 /1 built, 0.0 KiB DLgammaloop-nextest-core> Extracting 4 binaries (including 1 non-test binary), 1 build script output directory, and 2 linked paths to /build/nextest-archive-nIhoaY
22.89 s
gammaloop-nextest-core> Extracted 20 files to /build/nextest-archive-nIhoaY in 0.72s
22.90 s
gammaloop-nextest-core> ------------
22.90 s
gammaloop-nextest-core> Nextest run ID c9c95688-4363-46a1-9e07-8d868b3ce035 with nextest profile: ci_gammaloop
22.90 s
gammaloop-nextest-core> Starting 379 tests across 3 binaries
24.21 s
gammaloop-nextest-core> ------------
24.21 s
gammaloop-nextest-core> Summary [ 1.312s] 379 tests run: 379 passed , 0 skipped
24.35 s
gammaloop-nextest-core>
24.35 s
gammaloop-nextest-core> ========== nextest test summary ==========
24.35 s
gammaloop-nextest-core> report: target/nextest/ci_gammaloop/junit.xml
24.35 s
gammaloop-nextest-core> tests: 379, failures: 0, errors: 0
24.35 s
gammaloop-nextest-core> No failing testcases found.
24.35 s
gammaloop-nextest-core> =========================================
24.36 s
gammaloop-nextest-core> Extracting 1 binary and 1 linked path to /build/nextest-archive-hgzjQi
24.43 s
gammaloop-nextest-core> Extracted 7 files to /build/nextest-archive-hgzjQi in 0.07s
24.44 s
gammaloop-nextest-core> ------------
24.44 s
gammaloop-nextest-core> Nextest run ID 297a6a2c-a0b0-4df3-bc0c-e9d00ecc4210 with nextest profile: ci_gammaloop
24.44 s
gammaloop-nextest-core> Starting 19 tests across 1 binary
24.45 s
gammaloop-nextest-core> ------------
24.45 s
gammaloop-nextest-core> Summary [ 0.011s] 19 tests run: 19 passed , 0 skipped
24.49 s
gammaloop-nextest-core>
24.49 s
gammaloop-nextest-core> ========== nextest test summary ==========
24.49 s
gammaloop-nextest-core> report: target/nextest/ci_gammaloop/junit.xml
24.49 s
gammaloop-nextest-core> tests: 19, failures: 0, errors: 0
24.49 s
gammaloop-nextest-core> No failing testcases found.
24.49 s
gammaloop-nextest-core> =========================================
24.51 s
gammaloop-nextest-core> Extracting 1 binary to /build/nextest-archive-gpMHxe
24.54 s
gammaloop-nextest-core> Extracted 4 files to /build/nextest-archive-gpMHxe in 0.03s
24.55 s
gammaloop-nextest-core> ------------
24.55 s
gammaloop-nextest-core> Nextest run ID 40b109a1-5b38-4e32-80f9-9cc74dc4e175 with nextest profile: ci_gammaloop
24.55 s
gammaloop-nextest-core> Starting 0 tests across 1 binary
24.55 s
gammaloop-nextest-core> ------------
24.55 s
gammaloop-nextest-core> Summary [ 0.000s] 0 tests run: 0 passed , 0 skipped
24.58 s
gammaloop-nextest-core>
24.58 s
gammaloop-nextest-core> ========== nextest test summary ==========
24.58 s
gammaloop-nextest-core> report: target/nextest/ci_gammaloop/junit.xml
24.58 s
gammaloop-nextest-core> tests: 0, failures: 0, errors: 0
24.58 s
gammaloop-nextest-core> No failing testcases found.
24.58 s
gammaloop-nextest-core> =========================================
24.60 s
gammaloop-nextest-core> Extracting 4 binaries, 1 build script output directory, and 2 linked paths to /build/nextest-archive-veI02p
25.08 s
gammaloop-nextest-core> Extracted 18 files to /build/nextest-archive-veI02p in 0.48s
25.09 s
gammaloop-nextest-core> ------------
25.09 s
gammaloop-nextest-core> Nextest run ID 9b18db9d-669d-4429-b041-c06f56d2a531 with nextest profile: ci_gammaloop
25.09 s
gammaloop-nextest-core> Starting 692 tests across 4 binaries (60 tests skipped , including 59 tests via profile.ci_gammaloop.default-filter )
26.03 s
gammaloop-nextest-core> FAIL [ 0.118s] (149/692) gammalooprs graph::three_d_source::tests :: exact_taylor_vacuum_affine_circulation_preserves_energy_mapping
26.03 s
gammaloop-nextest-core> stdout ---
26.03 s
gammaloop-nextest-core>
26.03 s
gammaloop-nextest-core> running 1 test
26.03 s
gammaloop-nextest-core> test graph::three_d_source::tests::exact_taylor_vacuum_affine_circulation_preserves_energy_mapping ... FAILED
26.03 s
gammaloop-nextest-core>
26.03 s
gammaloop-nextest-core> failures:
26.03 s
gammaloop-nextest-core>
26.03 s
gammaloop-nextest-core> failures:
26.03 s
gammaloop-nextest-core> graph::three_d_source::tests::exact_taylor_vacuum_affine_circulation_preserves_energy_mapping
26.03 s
gammaloop-nextest-core>
26.03 s
gammaloop-nextest-core> test result: FAILED. 0 passed; 1 failed; 0 ignored; 0 measured; 742 filtered out; finished in 0.10s
26.03 s
gammaloop-nextest-core>
26.03 s
gammaloop-nextest-core> stderr ---
26.03 s
gammaloop-nextest-core> The application panicked (crashed).
26.03 s
gammaloop-nextest-core> Message: assertion `left == right` failed
26.03 s
gammaloop-nextest-core> left: (gammalooprs::mUVexp^2+(-gammalooprs::Q(1,spenso::cind(1))+gammalooprs::Q(4,spenso::cind(1)))^2+(-gammalooprs::Q(1,spenso::cind(2))+gammalooprs::Q(4,spenso::cind(2)))^2+(-gammalooprs::Q(1,spenso::cind(3))+gammalooprs::Q(4,spenso::cind(3)))^2)^(1/2)
26.03 s
gammaloop-nextest-core> right: (gammalooprs::mUVexp^2+(gammalooprs::Q(1,spenso::cind(1))-gammalooprs::Q(4,spenso::cind(1)))^2+(gammalooprs::Q(1,spenso::cind(2))-gammalooprs::Q(4,spenso::cind(2)))^2+(gammalooprs::Q(1,spenso::cind(3))-gammalooprs::Q(4,spenso::cind(3)))^2)^(1/2)
26.03 s
gammaloop-nextest-core> Location: crates/gammalooprs/src/graph/three_d_source.rs :7797
26.03 s
gammaloop-nextest-core>
26.03 s
gammaloop-nextest-core> ━━━━━━━━━━━━━━━━━━━━━━━━━━━━━━━━━━ BACKTRACE ━━━━━━━━━━━━━━━━━━━━━━━━━━━━━━━━━━━
26.03 s
gammaloop-nextest-core> 1: <color_eyre[51793ea62743adbd]::config::PanicHook>::panic_report <unknown>
26.03 s
gammaloop-nextest-core> at <unknown source file> :<unknown line>
26.03 s
gammaloop-nextest-core> 2: <color_eyre[51793ea62743adbd]::config::PanicHook>::into_panic_hook::{closure#0} <unknown>
26.03 s
gammaloop-nextest-core> at <unknown source file> :<unknown line>
26.03 s
gammaloop-nextest-core> 3: std[bcb96dfbba0ab899]::panicking::panic_with_hook <unknown>
26.03 s
gammaloop-nextest-core> at <unknown source file> :<unknown line>
26.03 s
gammaloop-nextest-core> 4: std[bcb96dfbba0ab899]::panicking::panic_handler::{closure#0} <unknown>
26.03 s
gammaloop-nextest-core> at <unknown source file> :<unknown line>
26.03 s
gammaloop-nextest-core> 5: std[bcb96dfbba0ab899]::sys::backtrace::__rust_end_short_backtrace::<std[bcb96dfbba0ab899]::panicking::panic_handler::{closure#0}, !> <unknown>
26.03 s
gammaloop-nextest-core> at <unknown source file> :<unknown line>
26.03 s
gammaloop-nextest-core> 6: __rustc[6c289b9f9c454d21]::rust_begin_unwind <unknown>
26.03 s
gammaloop-nextest-core> at <unknown source file> :<unknown line>
26.03 s
gammaloop-nextest-core> 7: core[940e698046960fd5]::panicking::panic_fmt <unknown>
26.03 s
gammaloop-nextest-core> at <unknown source file> :<unknown line>
26.03 s
gammaloop-nextest-core> 8: core[940e698046960fd5]::panicking::assert_failed_inner <unknown>
26.03 s
gammaloop-nextest-core> at <unknown source file> :<unknown line>
26.03 s
gammaloop-nextest-core> 9: core[940e698046960fd5]::panicking::assert_failed::<symbolica[499970c26fd75ddd]::atom::Atom, symbolica[499970c26fd75ddd]::atom::Atom> <unknown>
26.03 s
gammaloop-nextest-core> at <unknown source file> :<unknown line>
26.03 s
gammaloop-nextest-core> 10: gammalooprs[24955f93fc9f4e0c]::graph::three_d_source::tests::exact_taylor_vacuum_affine_circulation_preserves_energy_mapping <unknown>
26.03 s
gammaloop-nextest-core> at <unknown source file> :<unknown line>
26.03 s
gammaloop-nextest-core> 11: <gammalooprs[24955f93fc9f4e0c]::graph::three_d_source::tests::exact_taylor_vacuum_affine_circulation_preserves_energy_mapping::{closure#0} as core[940e698046960fd5]::ops::function::FnOnce<()>>::call_once <unknown>
26.03 s
gammaloop-nextest-core> at <unknown source file> :<unknown line>
26.03 s
gammaloop-nextest-core> 12: test[75d6903177b1d7e9]::__rust_begin_short_backtrace::<core[940e698046960fd5]::result::Result<(), alloc[2ea6bcb46fca0c42]::string::String>, fn() -> core[940e698046960fd5]::result::Result<(), alloc[2ea6bcb46fca0c42]::string::String>> <unknown>
26.03 s
gammaloop-nextest-core> at <unknown source file> :<unknown line>
26.03 s
gammaloop-nextest-core> 13: test[75d6903177b1d7e9]::run_test::{closure#0} <unknown>
26.03 s
gammaloop-nextest-core> at <unknown source file> :<unknown line>
26.03 s
gammaloop-nextest-core> 14: std[bcb96dfbba0ab899]::sys::backtrace::__rust_begin_short_backtrace::<test[75d6903177b1d7e9]::run_test::{closure#1}, ()> <unknown>
26.03 s
gammaloop-nextest-core> at <unknown source file> :<unknown line>
26.03 s
gammaloop-nextest-core> 15: <std[bcb96dfbba0ab899]::thread::lifecycle::spawn_unchecked<test[75d6903177b1d7e9]::run_test::{closure#1}, ()>::{closure#1} as core[940e698046960fd5]::ops::function::FnOnce<()>>::call_once::{shim:vtable#0} <unknown>
26.03 s
gammaloop-nextest-core> at <unknown source file> :<unknown line>
26.03 s
gammaloop-nextest-core> 16: <std[bcb96dfbba0ab899]::sys::thread::unix::Thread>::new::thread_start <unknown>
26.03 s
gammaloop-nextest-core> at <unknown source file> :<unknown line>
26.03 s
gammaloop-nextest-core> 17: start_thread <unknown>
26.03 s
gammaloop-nextest-core> at <unknown source file> :<unknown line>
26.03 s
gammaloop-nextest-core> 18: __clone3 <unknown>
26.03 s
gammaloop-nextest-core> at <unknown source file> :<unknown line>
26.03 s
gammaloop-nextest-core>
26.03 s
gammaloop-nextest-core> Run with COLORBT_SHOW_HIDDEN=1 environment variable to disable frame filtering.
26.03 s
gammaloop-nextest-core> Run with RUST_BACKTRACE=full to include source snippets.
26.03 s
gammaloop-nextest-core>
26.07 s
gammaloop-nextest-core> FAIL [ 0.117s] (161/692) gammalooprs graph::three_d_source::tests :: pinched_affine_carrier_requires_occurrence_interpolation
26.07 s
gammaloop-nextest-core> stdout ---
26.07 s
gammaloop-nextest-core>
26.07 s
gammaloop-nextest-core> running 1 test
26.07 s
gammaloop-nextest-core> test graph::three_d_source::tests::pinched_affine_carrier_requires_occurrence_interpolation ... FAILED
26.07 s
gammaloop-nextest-core>
26.07 s
gammaloop-nextest-core> failures:
26.07 s
gammaloop-nextest-core>
26.07 s
gammaloop-nextest-core> failures:
26.07 s
gammaloop-nextest-core> graph::three_d_source::tests::pinched_affine_carrier_requires_occurrence_interpolation
26.07 s
gammaloop-nextest-core>
26.07 s
gammaloop-nextest-core> test result: FAILED. 0 passed; 1 failed; 0 ignored; 0 measured; 742 filtered out; finished in 0.11s
26.07 s
gammaloop-nextest-core>
26.07 s
gammaloop-nextest-core> stderr ---
26.07 s
gammaloop-nextest-core> The application panicked (crashed).
26.07 s
gammaloop-nextest-core> Message: certified affine occurrence lift must reproduce the independent double contours: actual=-(-1/16*(3+E0)*(5+E0)/((1+Q(0,cind(1))^2+Q(0,cind(2))^2+Q(0,cind(3))^2)^(3/2)*(1+Q(1,cind(1))^2+Q(1,cind(2))^2+Q(1,cind(3))^2)^(3/2))-1/16*(3+E1)*(5+E1)/((1+Q(0,cind(1))^2+Q(0,cind(2))^2+Q(0,cind(3))^2)^(3/2)*(1+Q(1,cind(1))^2+Q(1,cind(2))^2+Q(1,cind(3))^2)^(3/2))-1/16*(3-E0)*(5-E0)/((1+Q(0,cind(1))^2+Q(0,cind(2))^2+Q(0,cind(3))^2)^(3/2)*(1+Q(1,cind(1))^2+Q(1,cind(2))^2+Q(1,cind(3))^2)^(3/2))-1/16*(3-E1)*(5-E1)/((1+Q(0,cind(1))^2+Q(0,cind(2))^2+Q(0,cind(3))^2)^(3/2)*(1+Q(1,cind(1))^2+Q(1,cind(2))^2+Q(1,cind(3))^2)^(3/2))+1/64*(3+E0+E1)*(5+E0+E1)/((1+Q(0,cind(1))^2+Q(0,cind(2))^2+Q(0,cind(3))^2)^(3/2)*(1+Q(1,cind(1))^2+Q(1,cind(2))^2+Q(1,cind(3))^2)^(3/2))+1/64*(3+E0-E1)*(5+E0-E1)/((1+Q(0,cind(1))^2+Q(0,cind(2))^2+Q(0,cind(3))^2)^(3/2)*(1+Q(1,cind(1))^2+Q(1,cind(2))^2+Q(1,cind(3))^2)^(3/2))+1/64*(3-E0+E1)*(5-E0+E1)/((1+Q(0,cind(1))^2+Q(0,cind(2))^2+Q(0,cind(3))^2)^(3/2)*(1+Q(1,cind(1))^2+Q(1,cind(2))^2+Q(1,cind(3))^2)^(3/2))+1/64*(3-E0-E1)*(5-E0-E1)/((1+Q(0,cind(1))^2+Q(0,cind(2))^2+Q(0,cind(3))^2)^(3/2)*(1+Q(1,cind(1))^2+Q(1,cind(2))^2+Q(1,cind(3))^2)^(3/2))+15/4/((1+Q(0,cind(1))^2+Q(0,cind(2))^2+Q(0,cind(3))^2)^(3/2)*(1+Q(1,cind(1))^2+Q(1,cind(2))^2+Q(1,cind(3))^2)^(3/2))), expected=1/16*(15-E0^2-E1^2)/(E0^3*E1^3)
26.07 s
gammaloop-nextest-core> Location: crates/gammalooprs/src/graph/three_d_source.rs :7619
26.07 s
gammaloop-nextest-core>
26.07 s
gammaloop-nextest-core> ━━━━━━━━━━━━━━━━━━━━━━━━━━━━━━━━━━ BACKTRACE ━━━━━━━━━━━━━━━━━━━━━━━━━━━━━━━━━━━
26.07 s
gammaloop-nextest-core> 1: <color_eyre[51793ea62743adbd]::config::PanicHook>::panic_report <unknown>
26.07 s
gammaloop-nextest-core> at <unknown source file> :<unknown line>
26.07 s
gammaloop-nextest-core> 2: <color_eyre[51793ea62743adbd]::config::PanicHook>::into_panic_hook::{closure#0} <unknown>
26.07 s
gammaloop-nextest-core> at <unknown source file> :<unknown line>
26.07 s
gammaloop-nextest-core> 3: std[bcb96dfbba0ab899]::panicking::panic_with_hook <unknown>
26.07 s
gammaloop-nextest-core> at <unknown source file> :<unknown line>
26.07 s
gammaloop-nextest-core> 4: std[bcb96dfbba0ab899]::panicking::panic_handler::{closure#0} <unknown>
26.07 s
gammaloop-nextest-core> at <unknown source file> :<unknown line>
26.07 s
gammaloop-nextest-core> 5: std[bcb96dfbba0ab899]::sys::backtrace::__rust_end_short_backtrace::<std[bcb96dfbba0ab899]::panicking::panic_handler::{closure#0}, !> <unknown>
26.07 s
gammaloop-nextest-core> at <unknown source file> :<unknown line>
26.07 s
gammaloop-nextest-core> 6: __rustc[6c289b9f9c454d21]::rust_begin_unwind <unknown>
26.07 s
gammaloop-nextest-core> at <unknown source file> :<unknown line>
26.07 s
gammaloop-nextest-core> 7: core[940e698046960fd5]::panicking::panic_fmt <unknown>
26.07 s
gammaloop-nextest-core> at <unknown source file> :<unknown line>
26.07 s
gammaloop-nextest-core> 8: <gammalooprs[24955f93fc9f4e0c]::graph::three_d_source::tests::pinched_affine_carrier_requires_occurrence_interpolation::{closure#0} as core[940e698046960fd5]::ops::function::FnOnce<()>>::call_once <unknown>
26.07 s
gammaloop-nextest-core> at <unknown source file> :<unknown line>
26.07 s
gammaloop-nextest-core> 9: test[75d6903177b1d7e9]::__rust_begin_short_backtrace::<core[940e698046960fd5]::result::Result<(), alloc[2ea6bcb46fca0c42]::string::String>, fn() -> core[940e698046960fd5]::result::Result<(), alloc[2ea6bcb46fca0c42]::string::String>> <unknown>
26.07 s
gammaloop-nextest-core> at <unknown source file> :<unknown line>
26.07 s
gammaloop-nextest-core> 10: test[75d6903177b1d7e9]::run_test::{closure#0} <unknown>
26.07 s
gammaloop-nextest-core> at <unknown source file> :<unknown line>
26.07 s
gammaloop-nextest-core> 11: std[bcb96dfbba0ab899]::sys::backtrace::__rust_begin_short_backtrace::<test[75d6903177b1d7e9]::run_test::{closure#1}, ()> <unknown>
26.07 s
gammaloop-nextest-core> at <unknown source file> :<unknown line>
26.07 s
gammaloop-nextest-core> 12: <std[bcb96dfbba0ab899]::thread::lifecycle::spawn_unchecked<test[75d6903177b1d7e9]::run_test::{closure#1}, ()>::{closure#1} as core[940e698046960fd5]::ops::function::FnOnce<()>>::call_once::{shim:vtable#0} <unknown>
26.07 s
gammaloop-nextest-core> at <unknown source file> :<unknown line>
26.07 s
gammaloop-nextest-core> 13: <std[bcb96dfbba0ab899]::sys::thread::unix::Thread>::new::thread_start <unknown>
26.07 s
gammaloop-nextest-core> at <unknown source file> :<unknown line>
26.07 s
gammaloop-nextest-core> 14: start_thread <unknown>
26.07 s
gammaloop-nextest-core> at <unknown source file> :<unknown line>
26.07 s
gammaloop-nextest-core> 15: __clone3 <unknown>
26.07 s
gammaloop-nextest-core> at <unknown source file> :<unknown line>
26.08 s
gammaloop-nextest-core>
26.08 s
gammaloop-nextest-core> Run with COLORBT_SHOW_HIDDEN=1 environment variable to disable frame filtering.
26.08 s
gammaloop-nextest-core> Run with RUST_BACKTRACE=full to include source snippets.
26.08 s
gammaloop-nextest-core>
26.33 s
gammaloop-nextest-core> FAIL [ 0.014s] (286/692) gammalooprs numerator::energy_degree::tests :: canonical_class_cyclic_lifts_preserve_factorization_and_exact_bounds
26.33 s
gammaloop-nextest-core> stdout ---
26.33 s
gammaloop-nextest-core>
26.33 s
gammaloop-nextest-core> running 1 test
26.33 s
gammaloop-nextest-core> test numerator::energy_degree::tests::canonical_class_cyclic_lifts_preserve_factorization_and_exact_bounds ... FAILED
26.33 s
gammaloop-nextest-core>
26.33 s
gammaloop-nextest-core> failures:
26.33 s
gammaloop-nextest-core>
26.33 s
gammaloop-nextest-core> failures:
26.33 s
gammaloop-nextest-core> numerator::energy_degree::tests::canonical_class_cyclic_lifts_preserve_factorization_and_exact_bounds
26.33 s
gammaloop-nextest-core>
26.33 s
gammaloop-nextest-core> test result: FAILED. 0 passed; 1 failed; 0 ignored; 0 measured; 742 filtered out; finished in 0.01s
26.33 s
gammaloop-nextest-core>
26.33 s
gammaloop-nextest-core> stderr ---
26.33 s
gammaloop-nextest-core>
26.33 s
gammaloop-nextest-core> thread 'numerator::energy_degree::tests::canonical_class_cyclic_lifts_preserve_factorization_and_exact_bounds' (2265) panicked at crates/gammalooprs/src/numerator/energy_degree.rs:2850:13:
26.33 s
gammaloop-nextest-core> assertion failed: (collapsed - expression).collect_factors().is_zero()
26.33 s
gammaloop-nextest-core> stack backtrace:
26.33 s
gammaloop-nextest-core> 0: __rustc::rust_begin_unwind
26.33 s
gammaloop-nextest-core> 1: core::panicking::panic_fmt
26.33 s
gammaloop-nextest-core> 2: core::panicking::panic
26.33 s
gammaloop-nextest-core> 3: gammalooprs::numerator::energy_degree::tests::canonical_class_cyclic_lifts_preserve_factorization_and_exact_bounds
26.33 s
gammaloop-nextest-core> 4: <gammalooprs::numerator::energy_degree::tests::canonical_class_cyclic_lifts_preserve_factorization_and_exact_bounds::{closure#0} as core::ops::function::FnOnce<()>>::call_once
26.33 s
gammaloop-nextest-core> note: Some details are omitted, run with `RUST_BACKTRACE=full` for a verbose backtrace.
26.33 s
gammaloop-nextest-core>
27.70 s
gammaloop-nextest-core> FAIL [ 0.074s] (587/692) gammalooprs uv::approx::local_4d::tests :: canonical_uv_classes_certify_signed_aliases_and_preserve_raw_sectors
27.70 s
gammaloop-nextest-core> stdout ---
27.70 s
gammaloop-nextest-core>
27.70 s
gammaloop-nextest-core> running 1 test
27.70 s
gammaloop-nextest-core> test uv::approx::local_4d::tests::canonical_uv_classes_certify_signed_aliases_and_preserve_raw_sectors ... FAILED
27.70 s
gammaloop-nextest-core>
27.70 s
gammaloop-nextest-core> failures:
27.70 s
gammaloop-nextest-core>
27.70 s
gammaloop-nextest-core> failures:
27.70 s
gammaloop-nextest-core> uv::approx::local_4d::tests::canonical_uv_classes_certify_signed_aliases_and_preserve_raw_sectors
27.70 s
gammaloop-nextest-core>
27.70 s
gammaloop-nextest-core> test result: FAILED. 0 passed; 1 failed; 0 ignored; 0 measured; 742 filtered out; finished in 0.07s
27.70 s
gammaloop-nextest-core>
27.70 s
gammaloop-nextest-core> stderr ---
27.70 s
gammaloop-nextest-core> Error:
27.70 s
gammaloop-nextest-core> 0: merged canonical UV numerator does not reproduce its source bucket
27.70 s
gammaloop-nextest-core>
27.70 s
gammaloop-nextest-core> Location:
27.70 s
gammaloop-nextest-core> crates/gammalooprs/src/uv/approx/local_4d.rs :367
27.70 s
gammaloop-nextest-core>
27.70 s
gammaloop-nextest-core> ━━━━━━━━━━━━━━━━━━━━━━━━━━━━━━━━━━ BACKTRACE ━━━━━━━━━━━━━━━━━━━━━━━━━━━━━━━━━━━
27.70 s
gammaloop-nextest-core> 1: <color_eyre[51793ea62743adbd]::config::EyreHook>::into_eyre_hook::{closure#0} <unknown>
27.70 s
gammaloop-nextest-core> at <unknown source file> :<unknown line>
27.70 s
gammaloop-nextest-core> 2: eyre[cb2fd339c0c40fca]::capture_handler <unknown>
27.70 s
gammaloop-nextest-core> at <unknown source file> :<unknown line>
27.70 s
gammaloop-nextest-core> 3: eyre[cb2fd339c0c40fca]::private::format_err <unknown>
27.70 s
gammaloop-nextest-core> at <unknown source file> :<unknown line>
27.70 s
gammaloop-nextest-core> 4: <gammalooprs[24955f93fc9f4e0c]::uv::approx::local_4d::FourDSector>::canonical_projection <unknown>
27.70 s
gammaloop-nextest-core> at <unknown source file> :<unknown line>
27.70 s
gammaloop-nextest-core> 5: gammalooprs[24955f93fc9f4e0c]::uv::approx::local_4d::tests::canonical_uv_classes_certify_signed_aliases_and_preserve_raw_sectors <unknown>
27.70 s
gammaloop-nextest-core> at <unknown source file> :<unknown line>
27.70 s
gammaloop-nextest-core> 6: <gammalooprs[24955f93fc9f4e0c]::uv::approx::local_4d::tests::canonical_uv_classes_certify_signed_aliases_and_preserve_raw_sectors::{closure#0} as core[940e698046960fd5]::ops::function::FnOnce<()>>::call_once <unknown>
27.70 s
gammaloop-nextest-core> at <unknown source file> :<unknown line>
27.70 s
gammaloop-nextest-core> 7: test[75d6903177b1d7e9]::__rust_begin_short_backtrace::<core[940e698046960fd5]::result::Result<(), alloc[2ea6bcb46fca0c42]::string::String>, fn() -> core[940e698046960fd5]::result::Result<(), alloc[2ea6bcb46fca0c42]::string::String>> <unknown>
27.70 s
gammaloop-nextest-core> at <unknown source file> :<unknown line>
27.70 s
gammaloop-nextest-core> 8: test[75d6903177b1d7e9]::run_test::{closure#0} <unknown>
27.70 s
gammaloop-nextest-core> at <unknown source file> :<unknown line>
27.70 s
gammaloop-nextest-core> 9: std[bcb96dfbba0ab899]::sys::backtrace::__rust_begin_short_backtrace::<test[75d6903177b1d7e9]::run_test::{closure#1}, ()> <unknown>
27.70 s
gammaloop-nextest-core> at <unknown source file> :<unknown line>
27.70 s
gammaloop-nextest-core> 10: <std[bcb96dfbba0ab899]::thread::lifecycle::spawn_unchecked<test[75d6903177b1d7e9]::run_test::{closure#1}, ()>::{closure#1} as core[940e698046960fd5]::ops::function::FnOnce<()>>::call_once::{shim:vtable#0} <unknown>
27.70 s
gammaloop-nextest-core> at <unknown source file> :<unknown line>
27.70 s
gammaloop-nextest-core> 11: <std[bcb96dfbba0ab899]::sys::thread::unix::Thread>::new::thread_start <unknown>
27.70 s
gammaloop-nextest-core> at <unknown source file> :<unknown line>
27.70 s
gammaloop-nextest-core> 12: start_thread <unknown>
27.70 s
gammaloop-nextest-core> at <unknown source file> :<unknown line>
27.70 s
gammaloop-nextest-core> 13: __clone3 <unknown>
27.70 s
gammaloop-nextest-core> at <unknown source file> :<unknown line>
27.70 s
gammaloop-nextest-core>
27.70 s
gammaloop-nextest-core> Run with COLORBT_SHOW_HIDDEN=1 environment variable to disable frame filtering.
27.70 s
gammaloop-nextest-core> Run with RUST_BACKTRACE=full to include source snippets.
27.70 s
gammaloop-nextest-core>
27.74 s
gammaloop-nextest-core> FAIL [ 0.096s] (593/692) gammalooprs uv::approx::local_4d::tests :: canonical_uv_signed_multiloop_carriers_preserve_factorized_numerators
27.74 s
gammaloop-nextest-core> stdout ---
27.74 s
gammaloop-nextest-core>
27.74 s
gammaloop-nextest-core> running 1 test
27.74 s
gammaloop-nextest-core> test uv::approx::local_4d::tests::canonical_uv_signed_multiloop_carriers_preserve_factorized_numerators ... FAILED
27.74 s
gammaloop-nextest-core>
27.74 s
gammaloop-nextest-core> failures:
27.74 s
gammaloop-nextest-core>
27.74 s
gammaloop-nextest-core> failures:
27.74 s
gammaloop-nextest-core> uv::approx::local_4d::tests::canonical_uv_signed_multiloop_carriers_preserve_factorized_numerators
27.74 s
gammaloop-nextest-core>
27.74 s
gammaloop-nextest-core> test result: FAILED. 0 passed; 1 failed; 0 ignored; 0 measured; 742 filtered out; finished in 0.08s
27.74 s
gammaloop-nextest-core>
27.74 s
gammaloop-nextest-core> stderr ---
27.74 s
gammaloop-nextest-core> The application panicked (crashed).
27.74 s
gammaloop-nextest-core> Message: assertion `left == right` failed
27.74 s
gammaloop-nextest-core> left: 2*(signed_multiloop::a+signed_multiloop::b)^5*gammalooprs::Q(gammalooprs::uv::class(0),spenso::cind(0))
27.74 s
gammaloop-nextest-core> right: -2*(signed_multiloop::a+signed_multiloop::b)^5*gammalooprs::Q(gammalooprs::uv::class(0),spenso::cind(0))
27.74 s
gammaloop-nextest-core> Location: crates/gammalooprs/src/uv/approx/local_4d.rs :1983
27.74 s
gammaloop-nextest-core>
27.74 s
gammaloop-nextest-core> ━━━━━━━━━━━━━━━━━━━━━━━━━━━━━━━━━━ BACKTRACE ━━━━━━━━━━━━━━━━━━━━━━━━━━━━━━━━━━━
27.74 s
gammaloop-nextest-core> 1: <color_eyre[51793ea62743adbd]::config::PanicHook>::panic_report <unknown>
27.74 s
gammaloop-nextest-core> at <unknown source file> :<unknown line>
27.74 s
gammaloop-nextest-core> 2: <color_eyre[51793ea62743adbd]::config::PanicHook>::into_panic_hook::{closure#0} <unknown>
27.74 s
gammaloop-nextest-core> at <unknown source file> :<unknown line>
27.74 s
gammaloop-nextest-core> 3: std[bcb96dfbba0ab899]::panicking::panic_with_hook <unknown>
27.74 s
gammaloop-nextest-core> at <unknown source file> :<unknown line>
27.74 s
gammaloop-nextest-core> 4: std[bcb96dfbba0ab899]::panicking::panic_handler::{closure#0} <unknown>
27.74 s
gammaloop-nextest-core> at <unknown source file> :<unknown line>
27.74 s
gammaloop-nextest-core> 5: std[bcb96dfbba0ab899]::sys::backtrace::__rust_end_short_backtrace::<std[bcb96dfbba0ab899]::panicking::panic_handler::{closure#0}, !> <unknown>
27.74 s
gammaloop-nextest-core> at <unknown source file> :<unknown line>
27.74 s
gammaloop-nextest-core> 6: __rustc[6c289b9f9c454d21]::rust_begin_unwind <unknown>
27.74 s
gammaloop-nextest-core> at <unknown source file> :<unknown line>
27.74 s
gammaloop-nextest-core> 7: core[940e698046960fd5]::panicking::panic_fmt <unknown>
27.74 s
gammaloop-nextest-core> at <unknown source file> :<unknown line>
27.74 s
gammaloop-nextest-core> 8: core[940e698046960fd5]::panicking::assert_failed_inner <unknown>
27.74 s
gammaloop-nextest-core> at <unknown source file> :<unknown line>
27.74 s
gammaloop-nextest-core> 9: core[940e698046960fd5]::panicking::assert_failed::<symbolica[499970c26fd75ddd]::atom::Atom, symbolica[499970c26fd75ddd]::atom::Atom> <unknown>
27.74 s
gammaloop-nextest-core> at <unknown source file> :<unknown line>
27.74 s
gammaloop-nextest-core> 10: gammalooprs[24955f93fc9f4e0c]::uv::approx::local_4d::tests::canonical_uv_signed_multiloop_carriers_preserve_factorized_numerators <unknown>
27.74 s
gammaloop-nextest-core> at <unknown source file> :<unknown line>
27.74 s
gammaloop-nextest-core> 11: <gammalooprs[24955f93fc9f4e0c]::uv::approx::local_4d::tests::canonical_uv_signed_multiloop_carriers_preserve_factorized_numerators::{closure#0} as core[940e698046960fd5]::ops::function::FnOnce<()>>::call_once <unknown>
27.74 s
gammaloop-nextest-core> at <unknown source file> :<unknown line>
27.74 s
gammaloop-nextest-core> 12: test[75d6903177b1d7e9]::__rust_begin_short_backtrace::<core[940e698046960fd5]::result::Result<(), alloc[2ea6bcb46fca0c42]::string::String>, fn() -> core[940e698046960fd5]::result::Result<(), alloc[2ea6bcb46fca0c42]::string::String>> <unknown>
27.74 s
gammaloop-nextest-core> at <unknown source file> :<unknown line>
27.74 s
gammaloop-nextest-core> 13: test[75d6903177b1d7e9]::run_test::{closure#0} <unknown>
27.74 s
gammaloop-nextest-core> at <unknown source file> :<unknown line>
27.74 s
gammaloop-nextest-core> 14: std[bcb96dfbba0ab899]::sys::backtrace::__rust_begin_short_backtrace::<test[75d6903177b1d7e9]::run_test::{closure#1}, ()> <unknown>
27.74 s
gammaloop-nextest-core> at <unknown source file> :<unknown line>
27.74 s
gammaloop-nextest-core> 15: <std[bcb96dfbba0ab899]::thread::lifecycle::spawn_unchecked<test[75d6903177b1d7e9]::run_test::{closure#1}, ()>::{closure#1} as core[940e698046960fd5]::ops::function::FnOnce<()>>::call_once::{shim:vtable#0} <unknown>
27.74 s
gammaloop-nextest-core> at <unknown source file> :<unknown line>
27.74 s
gammaloop-nextest-core> 16: <std[bcb96dfbba0ab899]::sys::thread::unix::Thread>::new::thread_start <unknown>
27.74 s
gammaloop-nextest-core> at <unknown source file> :<unknown line>
27.74 s
gammaloop-nextest-core> 17: start_thread <unknown>
27.74 s
gammaloop-nextest-core> at <unknown source file> :<unknown line>
27.74 s
gammaloop-nextest-core> 18: __clone3 <unknown>
27.74 s
gammaloop-nextest-core> at <unknown source file> :<unknown line>
27.74 s
gammaloop-nextest-core>
27.74 s
gammaloop-nextest-core> Run with COLORBT_SHOW_HIDDEN=1 environment variable to disable frame filtering.
27.74 s
gammaloop-nextest-core> Run with RUST_BACKTRACE=full to include source snippets.
27.74 s
gammaloop-nextest-core>
27.91 s
gammaloop-nextest-core> FAIL [ 0.112s] (605/692) gammalooprs uv::approx::tests :: direct_nested_scalar_banana_replays_complete_cff_at_depth_three
27.91 s
gammaloop-nextest-core> stdout ---
27.91 s
gammaloop-nextest-core>
27.91 s
gammaloop-nextest-core> running 1 test
27.91 s
gammaloop-nextest-core> test uv::approx::tests::direct_nested_scalar_banana_replays_complete_cff_at_depth_three ... FAILED
27.91 s
gammaloop-nextest-core>
27.91 s
gammaloop-nextest-core> failures:
27.91 s
gammaloop-nextest-core>
27.91 s
gammaloop-nextest-core> failures:
27.91 s
gammaloop-nextest-core> uv::approx::tests::direct_nested_scalar_banana_replays_complete_cff_at_depth_three
27.91 s
gammaloop-nextest-core>
27.91 s
gammaloop-nextest-core> test result: FAILED. 0 passed; 1 failed; 0 ignored; 0 measured; 742 filtered out; finished in 0.10s
27.91 s
gammaloop-nextest-core>
27.91 s
gammaloop-nextest-core> stderr ---
27.91 s
gammaloop-nextest-core> Error:
27.91 s
gammaloop-nextest-core> 0: canonical UV numerator does not reproduce its source in the component frame
27.91 s
gammaloop-nextest-core>
27.91 s
gammaloop-nextest-core> Location:
27.91 s
gammaloop-nextest-core> crates/gammalooprs/src/uv/approx/local_4d.rs :354
27.91 s
gammaloop-nextest-core>
27.91 s
gammaloop-nextest-core> ━━━━━━━━━━━━━━━━━━━━━━━━━━━━━━━━━━ BACKTRACE ━━━━━━━━━━━━━━━━━━━━━━━━━━━━━━━━━━━
27.91 s
gammaloop-nextest-core> 1: <color_eyre[51793ea62743adbd]::config::EyreHook>::into_eyre_hook::{closure#0} <unknown>
27.91 s
gammaloop-nextest-core> at <unknown source file> :<unknown line>
27.91 s
gammaloop-nextest-core> 2: eyre[cb2fd339c0c40fca]::capture_handler <unknown>
27.91 s
gammaloop-nextest-core> at <unknown source file> :<unknown line>
27.91 s
gammaloop-nextest-core> 3: eyre[cb2fd339c0c40fca]::private::format_err <unknown>
27.91 s
gammaloop-nextest-core> at <unknown source file> :<unknown line>
27.91 s
gammaloop-nextest-core> 4: <gammalooprs[24955f93fc9f4e0c]::uv::approx::local_4d::FourDSector>::canonical_projection <unknown>
27.91 s
gammaloop-nextest-core> at <unknown source file> :<unknown line>
27.91 s
gammaloop-nextest-core> 5: <gammalooprs[24955f93fc9f4e0c]::uv::approx::projected_4d::Projected4dApproximation>::project_local_4d <unknown>
27.91 s
gammaloop-nextest-core> at <unknown source file> :<unknown line>
27.91 s
gammaloop-nextest-core> 6: <gammalooprs[24955f93fc9f4e0c]::uv::approx::Approximation>::compute_3d <unknown>
27.91 s
gammaloop-nextest-core> at <unknown source file> :<unknown line>
27.91 s
gammaloop-nextest-core> 7: gammalooprs[24955f93fc9f4e0c]::uv::approx::tests::direct_nested_scalar_banana_replays_complete_cff_at_depth_three::{closure#0} <unknown>
27.91 s
gammaloop-nextest-core> at <unknown source file> :<unknown line>
27.91 s
gammaloop-nextest-core> 8: gammalooprs[24955f93fc9f4e0c]::uv::approx::tests::direct_nested_scalar_banana_replays_complete_cff_at_depth_three <unknown>
27.91 s
gammaloop-nextest-core> at <unknown source file> :<unknown line>
27.91 s
gammaloop-nextest-core> 9: <gammalooprs[24955f93fc9f4e0c]::uv::approx::tests::direct_nested_scalar_banana_replays_complete_cff_at_depth_three::{closure#0} as core[940e698046960fd5]::ops::function::FnOnce<()>>::call_once <unknown>
27.91 s
gammaloop-nextest-core> at <unknown source file> :<unknown line>
27.91 s
gammaloop-nextest-core> 10: test[75d6903177b1d7e9]::__rust_begin_short_backtrace::<core[940e698046960fd5]::result::Result<(), alloc[2ea6bcb46fca0c42]::string::String>, fn() -> core[940e698046960fd5]::result::Result<(), alloc[2ea6bcb46fca0c42]::string::String>> <unknown>
27.91 s
gammaloop-nextest-core> at <unknown source file> :<unknown line>
27.91 s
gammaloop-nextest-core> 11: test[75d6903177b1d7e9]::run_test::{closure#0} <unknown>
27.91 s
gammaloop-nextest-core> at <unknown source file> :<unknown line>
27.91 s
gammaloop-nextest-core> 12: std[bcb96dfbba0ab899]::sys::backtrace::__rust_begin_short_backtrace::<test[75d6903177b1d7e9]::run_test::{closure#1}, ()> <unknown>
27.91 s
gammaloop-nextest-core> at <unknown source file> :<unknown line>
27.91 s
gammaloop-nextest-core> 13: <std[bcb96dfbba0ab899]::thread::lifecycle::spawn_unchecked<test[75d6903177b1d7e9]::run_test::{closure#1}, ()>::{closure#1} as core[940e698046960fd5]::ops::function::FnOnce<()>>::call_once::{shim:vtable#0} <unknown>
27.91 s
gammaloop-nextest-core> at <unknown source file> :<unknown line>
27.91 s
gammaloop-nextest-core> 14: <std[bcb96dfbba0ab899]::sys::thread::unix::Thread>::new::thread_start <unknown>
27.91 s
gammaloop-nextest-core> at <unknown source file> :<unknown line>
27.91 s
gammaloop-nextest-core> 15: start_thread <unknown>
27.91 s
gammaloop-nextest-core> at <unknown source file> :<unknown line>
27.91 s
gammaloop-nextest-core> 16: __clone3 <unknown>
27.91 s
gammaloop-nextest-core> at <unknown source file> :<unknown line>
27.91 s
gammaloop-nextest-core>
27.91 s
gammaloop-nextest-core> Run with COLORBT_SHOW_HIDDEN=1 environment variable to disable frame filtering.
27.91 s
gammaloop-nextest-core> Run with RUST_BACKTRACE=full to include source snippets.
27.91 s
gammaloop-nextest-core>
37.93 s
gammaloop-nextest-core> ------------
37.93 s
gammaloop-nextest-core> Summary [ 12.837s] 692 tests run: 686 passed , 6 failed , 60 skipped
37.93 s
gammaloop-nextest-core> FAIL [ 0.118s] (149/692) gammalooprs graph::three_d_source::tests :: exact_taylor_vacuum_affine_circulation_preserves_energy_mapping
37.93 s
gammaloop-nextest-core> stdout ---
37.93 s
gammaloop-nextest-core>
37.93 s
gammaloop-nextest-core> running 1 test
37.93 s
gammaloop-nextest-core> test graph::three_d_source::tests::exact_taylor_vacuum_affine_circulation_preserves_energy_mapping ... FAILED
37.93 s
gammaloop-nextest-core>
37.93 s
gammaloop-nextest-core> failures:
37.93 s
gammaloop-nextest-core>
37.93 s
gammaloop-nextest-core> failures:
37.93 s
gammaloop-nextest-core> graph::three_d_source::tests::exact_taylor_vacuum_affine_circulation_preserves_energy_mapping
37.93 s
gammaloop-nextest-core>
37.93 s
gammaloop-nextest-core> test result: FAILED. 0 passed; 1 failed; 0 ignored; 0 measured; 742 filtered out; finished in 0.10s
37.93 s
gammaloop-nextest-core>
37.93 s
gammaloop-nextest-core> stderr ---
37.93 s
gammaloop-nextest-core> The application panicked (crashed).
37.93 s
gammaloop-nextest-core> Message: assertion `left == right` failed
37.93 s
gammaloop-nextest-core> left: (gammalooprs::mUVexp^2+(-gammalooprs::Q(1,spenso::cind(1))+gammalooprs::Q(4,spenso::cind(1)))^2+(-gammalooprs::Q(1,spenso::cind(2))+gammalooprs::Q(4,spenso::cind(2)))^2+(-gammalooprs::Q(1,spenso::cind(3))+gammalooprs::Q(4,spenso::cind(3)))^2)^(1/2)
37.93 s
gammaloop-nextest-core> right: (gammalooprs::mUVexp^2+(gammalooprs::Q(1,spenso::cind(1))-gammalooprs::Q(4,spenso::cind(1)))^2+(gammalooprs::Q(1,spenso::cind(2))-gammalooprs::Q(4,spenso::cind(2)))^2+(gammalooprs::Q(1,spenso::cind(3))-gammalooprs::Q(4,spenso::cind(3)))^2)^(1/2)
37.93 s
gammaloop-nextest-core> Location: crates/gammalooprs/src/graph/three_d_source.rs :7797
37.93 s
gammaloop-nextest-core>
37.93 s
gammaloop-nextest-core> ━━━━━━━━━━━━━━━━━━━━━━━━━━━━━━━━━━ BACKTRACE ━━━━━━━━━━━━━━━━━━━━━━━━━━━━━━━━━━━
37.93 s
gammaloop-nextest-core> 1: <color_eyre[51793ea62743adbd]::config::PanicHook>::panic_report <unknown>
37.93 s
gammaloop-nextest-core> at <unknown source file> :<unknown line>
37.93 s
gammaloop-nextest-core> 2: <color_eyre[51793ea62743adbd]::config::PanicHook>::into_panic_hook::{closure#0} <unknown>
37.93 s
gammaloop-nextest-core> at <unknown source file> :<unknown line>
37.93 s
gammaloop-nextest-core> 3: std[bcb96dfbba0ab899]::panicking::panic_with_hook <unknown>
37.93 s
gammaloop-nextest-core> at <unknown source file> :<unknown line>
37.93 s
gammaloop-nextest-core> 4: std[bcb96dfbba0ab899]::panicking::panic_handler::{closure#0} <unknown>
37.93 s
gammaloop-nextest-core> at <unknown source file> :<unknown line>
37.93 s
gammaloop-nextest-core> 5: std[bcb96dfbba0ab899]::sys::backtrace::__rust_end_short_backtrace::<std[bcb96dfbba0ab899]::panicking::panic_handler::{closure#0}, !> <unknown>
37.93 s
gammaloop-nextest-core> at <unknown source file> :<unknown line>
37.93 s
gammaloop-nextest-core> 6: __rustc[6c289b9f9c454d21]::rust_begin_unwind <unknown>
37.93 s
gammaloop-nextest-core> at <unknown source file> :<unknown line>
37.93 s
gammaloop-nextest-core> 7: core[940e698046960fd5]::panicking::panic_fmt <unknown>
37.93 s
gammaloop-nextest-core> at <unknown source file> :<unknown line>
37.93 s
gammaloop-nextest-core> 8: core[940e698046960fd5]::panicking::assert_failed_inner <unknown>
37.93 s
gammaloop-nextest-core> at <unknown source file> :<unknown line>
37.93 s
gammaloop-nextest-core> 9: core[940e698046960fd5]::panicking::assert_failed::<symbolica[499970c26fd75ddd]::atom::Atom, symbolica[499970c26fd75ddd]::atom::Atom> <unknown>
37.93 s
gammaloop-nextest-core> at <unknown source file> :<unknown line>
37.93 s
gammaloop-nextest-core> 10: gammalooprs[24955f93fc9f4e0c]::graph::three_d_source::tests::exact_taylor_vacuum_affine_circulation_preserves_energy_mapping <unknown>
37.93 s
gammaloop-nextest-core> at <unknown source file> :<unknown line>
37.93 s
gammaloop-nextest-core> 11: <gammalooprs[24955f93fc9f4e0c]::graph::three_d_source::tests::exact_taylor_vacuum_affine_circulation_preserves_energy_mapping::{closure#0} as core[940e698046960fd5]::ops::function::FnOnce<()>>::call_once <unknown>
37.93 s
gammaloop-nextest-core> at <unknown source file> :<unknown line>
37.93 s
gammaloop-nextest-core> 12: test[75d6903177b1d7e9]::__rust_begin_short_backtrace::<core[940e698046960fd5]::result::Result<(), alloc[2ea6bcb46fca0c42]::string::String>, fn() -> core[940e698046960fd5]::result::Result<(), alloc[2ea6bcb46fca0c42]::string::String>> <unknown>
37.93 s
gammaloop-nextest-core> at <unknown source file> :<unknown line>
37.93 s
gammaloop-nextest-core> 13: test[75d6903177b1d7e9]::run_test::{closure#0} <unknown>
37.93 s
gammaloop-nextest-core> at <unknown source file> :<unknown line>
37.93 s
gammaloop-nextest-core> 14: std[bcb96dfbba0ab899]::sys::backtrace::__rust_begin_short_backtrace::<test[75d6903177b1d7e9]::run_test::{closure#1}, ()> <unknown>
37.93 s
gammaloop-nextest-core> at <unknown source file> :<unknown line>
37.93 s
gammaloop-nextest-core> 15: <std[bcb96dfbba0ab899]::thread::lifecycle::spawn_unchecked<test[75d6903177b1d7e9]::run_test::{closure#1}, ()>::{closure#1} as core[940e698046960fd5]::ops::function::FnOnce<()>>::call_once::{shim:vtable#0} <unknown>
37.93 s
gammaloop-nextest-core> at <unknown source file> :<unknown line>
37.93 s
gammaloop-nextest-core> 16: <std[bcb96dfbba0ab899]::sys::thread::unix::Thread>::new::thread_start <unknown>
37.93 s
gammaloop-nextest-core> at <unknown source file> :<unknown line>
37.93 s
gammaloop-nextest-core> 17: start_thread <unknown>
37.93 s
gammaloop-nextest-core> at <unknown source file> :<unknown line>
37.93 s
gammaloop-nextest-core> 18: __clone3 <unknown>
37.93 s
gammaloop-nextest-core> at <unknown source file> :<unknown line>
37.93 s
gammaloop-nextest-core>
37.93 s
gammaloop-nextest-core> Run with COLORBT_SHOW_HIDDEN=1 environment variable to disable frame filtering.
37.93 s
gammaloop-nextest-core> Run with RUST_BACKTRACE=full to include source snippets.
37.93 s
gammaloop-nextest-core>
37.93 s
gammaloop-nextest-core> FAIL [ 0.117s] (161/692) gammalooprs graph::three_d_source::tests :: pinched_affine_carrier_requires_occurrence_interpolation
37.93 s
gammaloop-nextest-core> stdout ---
37.93 s
gammaloop-nextest-core>
37.93 s
gammaloop-nextest-core> running 1 test
37.93 s
gammaloop-nextest-core> test graph::three_d_source::tests::pinched_affine_carrier_requires_occurrence_interpolation ... FAILED
37.93 s
gammaloop-nextest-core>
37.93 s
gammaloop-nextest-core> failures:
37.93 s
gammaloop-nextest-core>
37.93 s
gammaloop-nextest-core> failures:
37.93 s
gammaloop-nextest-core> graph::three_d_source::tests::pinched_affine_carrier_requires_occurrence_interpolation
37.93 s
gammaloop-nextest-core>
37.93 s
gammaloop-nextest-core> test result: FAILED. 0 passed; 1 failed; 0 ignored; 0 measured; 742 filtered out; finished in 0.11s
37.93 s
gammaloop-nextest-core>
37.93 s
gammaloop-nextest-core> stderr ---
37.93 s
gammaloop-nextest-core> The application panicked (crashed).
37.93 s
gammaloop-nextest-core> Message: certified affine occurrence lift must reproduce the independent double contours: actual=-(-1/16*(3+E0)*(5+E0)/((1+Q(0,cind(1))^2+Q(0,cind(2))^2+Q(0,cind(3))^2)^(3/2)*(1+Q(1,cind(1))^2+Q(1,cind(2))^2+Q(1,cind(3))^2)^(3/2))-1/16*(3+E1)*(5+E1)/((1+Q(0,cind(1))^2+Q(0,cind(2))^2+Q(0,cind(3))^2)^(3/2)*(1+Q(1,cind(1))^2+Q(1,cind(2))^2+Q(1,cind(3))^2)^(3/2))-1/16*(3-E0)*(5-E0)/((1+Q(0,cind(1))^2+Q(0,cind(2))^2+Q(0,cind(3))^2)^(3/2)*(1+Q(1,cind(1))^2+Q(1,cind(2))^2+Q(1,cind(3))^2)^(3/2))-1/16*(3-E1)*(5-E1)/((1+Q(0,cind(1))^2+Q(0,cind(2))^2+Q(0,cind(3))^2)^(3/2)*(1+Q(1,cind(1))^2+Q(1,cind(2))^2+Q(1,cind(3))^2)^(3/2))+1/64*(3+E0+E1)*(5+E0+E1)/((1+Q(0,cind(1))^2+Q(0,cind(2))^2+Q(0,cind(3))^2)^(3/2)*(1+Q(1,cind(1))^2+Q(1,cind(2))^2+Q(1,cind(3))^2)^(3/2))+1/64*(3+E0-E1)*(5+E0-E1)/((1+Q(0,cind(1))^2+Q(0,cind(2))^2+Q(0,cind(3))^2)^(3/2)*(1+Q(1,cind(1))^2+Q(1,cind(2))^2+Q(1,cind(3))^2)^(3/2))+1/64*(3-E0+E1)*(5-E0+E1)/((1+Q(0,cind(1))^2+Q(0,cind(2))^2+Q(0,cind(3))^2)^(3/2)*(1+Q(1,cind(1))^2+Q(1,cind(2))^2+Q(1,cind(3))^2)^(3/2))+1/64*(3-E0-E1)*(5-E0-E1)/((1+Q(0,cind(1))^2+Q(0,cind(2))^2+Q(0,cind(3))^2)^(3/2)*(1+Q(1,cind(1))^2+Q(1,cind(2))^2+Q(1,cind(3))^2)^(3/2))+15/4/((1+Q(0,cind(1))^2+Q(0,cind(2))^2+Q(0,cind(3))^2)^(3/2)*(1+Q(1,cind(1))^2+Q(1,cind(2))^2+Q(1,cind(3))^2)^(3/2))), expected=1/16*(15-E0^2-E1^2)/(E0^3*E1^3)
37.93 s
gammaloop-nextest-core> Location: crates/gammalooprs/src/graph/three_d_source.rs :7619
37.93 s
gammaloop-nextest-core>
37.93 s
gammaloop-nextest-core> ━━━━━━━━━━━━━━━━━━━━━━━━━━━━━━━━━━ BACKTRACE ━━━━━━━━━━━━━━━━━━━━━━━━━━━━━━━━━━━
37.93 s
gammaloop-nextest-core> 1: <color_eyre[51793ea62743adbd]::config::PanicHook>::panic_report <unknown>
37.93 s
gammaloop-nextest-core> at <unknown source file> :<unknown line>
37.93 s
gammaloop-nextest-core> 2: <color_eyre[51793ea62743adbd]::config::PanicHook>::into_panic_hook::{closure#0} <unknown>
37.93 s
gammaloop-nextest-core> at <unknown source file> :<unknown line>
37.93 s
gammaloop-nextest-core> 3: std[bcb96dfbba0ab899]::panicking::panic_with_hook <unknown>
37.93 s
gammaloop-nextest-core> at <unknown source file> :<unknown line>
37.93 s
gammaloop-nextest-core> 4: std[bcb96dfbba0ab899]::panicking::panic_handler::{closure#0} <unknown>
37.93 s
gammaloop-nextest-core> at <unknown source file> :<unknown line>
37.93 s
gammaloop-nextest-core> 5: std[bcb96dfbba0ab899]::sys::backtrace::__rust_end_short_backtrace::<std[bcb96dfbba0ab899]::panicking::panic_handler::{closure#0}, !> <unknown>
37.93 s
gammaloop-nextest-core> at <unknown source file> :<unknown line>
37.93 s
gammaloop-nextest-core> 6: __rustc[6c289b9f9c454d21]::rust_begin_unwind <unknown>
37.93 s
gammaloop-nextest-core> at <unknown source file> :<unknown line>
37.93 s
gammaloop-nextest-core> 7: core[940e698046960fd5]::panicking::panic_fmt <unknown>
37.93 s
gammaloop-nextest-core> at <unknown source file> :<unknown line>
37.93 s
gammaloop-nextest-core> 8: <gammalooprs[24955f93fc9f4e0c]::graph::three_d_source::tests::pinched_affine_carrier_requires_occurrence_interpolation::{closure#0} as core[940e698046960fd5]::ops::function::FnOnce<()>>::call_once <unknown>
37.93 s
gammaloop-nextest-core> at <unknown source file> :<unknown line>
37.93 s
gammaloop-nextest-core> 9: test[75d6903177b1d7e9]::__rust_begin_short_backtrace::<core[940e698046960fd5]::result::Result<(), alloc[2ea6bcb46fca0c42]::string::String>, fn() -> core[940e698046960fd5]::result::Result<(), alloc[2ea6bcb46fca0c42]::string::String>> <unknown>
37.93 s
gammaloop-nextest-core> at <unknown source file> :<unknown line>
37.93 s
gammaloop-nextest-core> 10: test[75d6903177b1d7e9]::run_test::{closure#0} <unknown>
37.93 s
gammaloop-nextest-core> at <unknown source file> :<unknown line>
37.93 s
gammaloop-nextest-core> 11: std[bcb96dfbba0ab899]::sys::backtrace::__rust_begin_short_backtrace::<test[75d6903177b1d7e9]::run_test::{closure#1}, ()> <unknown>
37.93 s
gammaloop-nextest-core> at <unknown source file> :<unknown line>
37.93 s
gammaloop-nextest-core> 12: <std[bcb96dfbba0ab899]::thread::lifecycle::spawn_unchecked<test[75d6903177b1d7e9]::run_test::{closure#1}, ()>::{closure#1} as core[940e698046960fd5]::ops::function::FnOnce<()>>::call_once::{shim:vtable#0} <unknown>
37.93 s
gammaloop-nextest-core> at <unknown source file> :<unknown line>
37.93 s
gammaloop-nextest-core> 13: <std[bcb96dfbba0ab899]::sys::thread::unix::Thread>::new::thread_start <unknown>
37.93 s
gammaloop-nextest-core> at <unknown source file> :<unknown line>
37.93 s
gammaloop-nextest-core> 14: start_thread <unknown>
37.93 s
gammaloop-nextest-core> at <unknown source file> :<unknown line>
37.93 s
gammaloop-nextest-core> 15: __clone3 <unknown>
37.93 s
gammaloop-nextest-core> at <unknown source file> :<unknown line>
37.93 s
gammaloop-nextest-core>
37.93 s
gammaloop-nextest-core> Run with COLORBT_SHOW_HIDDEN=1 environment variable to disable frame filtering.
37.93 s
gammaloop-nextest-core> Run with RUST_BACKTRACE=full to include source snippets.
37.93 s
gammaloop-nextest-core>
37.93 s
gammaloop-nextest-core> FAIL [ 0.014s] (286/692) gammalooprs numerator::energy_degree::tests :: canonical_class_cyclic_lifts_preserve_factorization_and_exact_bounds
37.93 s
gammaloop-nextest-core> stdout ---
37.93 s
gammaloop-nextest-core>
37.93 s
gammaloop-nextest-core> running 1 test
37.93 s
gammaloop-nextest-core> test numerator::energy_degree::tests::canonical_class_cyclic_lifts_preserve_factorization_and_exact_bounds ... FAILED
37.93 s
gammaloop-nextest-core>
37.93 s
gammaloop-nextest-core> failures:
37.93 s
gammaloop-nextest-core>
37.93 s
gammaloop-nextest-core> failures:
37.93 s
gammaloop-nextest-core> numerator::energy_degree::tests::canonical_class_cyclic_lifts_preserve_factorization_and_exact_bounds
37.93 s
gammaloop-nextest-core>
37.93 s
gammaloop-nextest-core> test result: FAILED. 0 passed; 1 failed; 0 ignored; 0 measured; 742 filtered out; finished in 0.01s
37.93 s
gammaloop-nextest-core>
37.93 s
gammaloop-nextest-core> stderr ---
37.93 s
gammaloop-nextest-core>
37.93 s
gammaloop-nextest-core> thread 'numerator::energy_degree::tests::canonical_class_cyclic_lifts_preserve_factorization_and_exact_bounds' (2265) panicked at crates/gammalooprs/src/numerator/energy_degree.rs:2850:13:
37.93 s
gammaloop-nextest-core> assertion failed: (collapsed - expression).collect_factors().is_zero()
37.93 s
gammaloop-nextest-core> stack backtrace:
37.93 s
gammaloop-nextest-core> 0: __rustc::rust_begin_unwind
37.93 s
gammaloop-nextest-core> 1: core::panicking::panic_fmt
37.93 s
gammaloop-nextest-core> 2: core::panicking::panic
37.93 s
gammaloop-nextest-core> 3: gammalooprs::numerator::energy_degree::tests::canonical_class_cyclic_lifts_preserve_factorization_and_exact_bounds
37.93 s
gammaloop-nextest-core> 4: <gammalooprs::numerator::energy_degree::tests::canonical_class_cyclic_lifts_preserve_factorization_and_exact_bounds::{closure#0} as core::ops::function::FnOnce<()>>::call_once
37.93 s
gammaloop-nextest-core> note: Some details are omitted, run with `RUST_BACKTRACE=full` for a verbose backtrace.
37.93 s
gammaloop-nextest-core>
37.93 s
gammaloop-nextest-core> FAIL [ 0.074s] (587/692) gammalooprs uv::approx::local_4d::tests :: canonical_uv_classes_certify_signed_aliases_and_preserve_raw_sectors
37.93 s
gammaloop-nextest-core> stdout ---
37.93 s
gammaloop-nextest-core>
37.93 s
gammaloop-nextest-core> running 1 test
37.93 s
gammaloop-nextest-core> test uv::approx::local_4d::tests::canonical_uv_classes_certify_signed_aliases_and_preserve_raw_sectors ... FAILED
37.93 s
gammaloop-nextest-core>
37.93 s
gammaloop-nextest-core> failures:
37.93 s
gammaloop-nextest-core>
37.93 s
gammaloop-nextest-core> failures:
37.93 s
gammaloop-nextest-core> uv::approx::local_4d::tests::canonical_uv_classes_certify_signed_aliases_and_preserve_raw_sectors
37.93 s
gammaloop-nextest-core>
37.93 s
gammaloop-nextest-core> test result: FAILED. 0 passed; 1 failed; 0 ignored; 0 measured; 742 filtered out; finished in 0.07s
37.93 s
gammaloop-nextest-core>
37.93 s
gammaloop-nextest-core> stderr ---
37.93 s
gammaloop-nextest-core> Error:
37.93 s
gammaloop-nextest-core> 0: merged canonical UV numerator does not reproduce its source bucket
37.93 s
gammaloop-nextest-core>
37.93 s
gammaloop-nextest-core> Location:
37.93 s
gammaloop-nextest-core> crates/gammalooprs/src/uv/approx/local_4d.rs :367
37.93 s
gammaloop-nextest-core>
37.93 s
gammaloop-nextest-core> ━━━━━━━━━━━━━━━━━━━━━━━━━━━━━━━━━━ BACKTRACE ━━━━━━━━━━━━━━━━━━━━━━━━━━━━━━━━━━━
37.93 s
gammaloop-nextest-core> 1: <color_eyre[51793ea62743adbd]::config::EyreHook>::into_eyre_hook::{closure#0} <unknown>
37.93 s
gammaloop-nextest-core> at <unknown source file> :<unknown line>
37.93 s
gammaloop-nextest-core> 2: eyre[cb2fd339c0c40fca]::capture_handler <unknown>
37.93 s
gammaloop-nextest-core> at <unknown source file> :<unknown line>
37.93 s
gammaloop-nextest-core> 3: eyre[cb2fd339c0c40fca]::private::format_err <unknown>
37.93 s
gammaloop-nextest-core> at <unknown source file> :<unknown line>
37.93 s
gammaloop-nextest-core> 4: <gammalooprs[24955f93fc9f4e0c]::uv::approx::local_4d::FourDSector>::canonical_projection <unknown>
37.93 s
gammaloop-nextest-core> at <unknown source file> :<unknown line>
37.93 s
gammaloop-nextest-core> 5: gammalooprs[24955f93fc9f4e0c]::uv::approx::local_4d::tests::canonical_uv_classes_certify_signed_aliases_and_preserve_raw_sectors <unknown>
37.93 s
gammaloop-nextest-core> at <unknown source file> :<unknown line>
37.93 s
gammaloop-nextest-core> 6: <gammalooprs[24955f93fc9f4e0c]::uv::approx::local_4d::tests::canonical_uv_classes_certify_signed_aliases_and_preserve_raw_sectors::{closure#0} as core[940e698046960fd5]::ops::function::FnOnce<()>>::call_once <unknown>
37.93 s
gammaloop-nextest-core> at <unknown source file> :<unknown line>
37.93 s
gammaloop-nextest-core> 7: test[75d6903177b1d7e9]::__rust_begin_short_backtrace::<core[940e698046960fd5]::result::Result<(), alloc[2ea6bcb46fca0c42]::string::String>, fn() -> core[940e698046960fd5]::result::Result<(), alloc[2ea6bcb46fca0c42]::string::String>> <unknown>
37.93 s
gammaloop-nextest-core> at <unknown source file> :<unknown line>
37.93 s
gammaloop-nextest-core> 8: test[75d6903177b1d7e9]::run_test::{closure#0} <unknown>
37.93 s
gammaloop-nextest-core> at <unknown source file> :<unknown line>
37.93 s
gammaloop-nextest-core> 9: std[bcb96dfbba0ab899]::sys::backtrace::__rust_begin_short_backtrace::<test[75d6903177b1d7e9]::run_test::{closure#1}, ()> <unknown>
37.93 s
gammaloop-nextest-core> at <unknown source file> :<unknown line>
37.93 s
gammaloop-nextest-core> 10: <std[bcb96dfbba0ab899]::thread::lifecycle::spawn_unchecked<test[75d6903177b1d7e9]::run_test::{closure#1}, ()>::{closure#1} as core[940e698046960fd5]::ops::function::FnOnce<()>>::call_once::{shim:vtable#0} <unknown>
37.93 s
gammaloop-nextest-core> at <unknown source file> :<unknown line>
37.93 s
gammaloop-nextest-core> 11: <std[bcb96dfbba0ab899]::sys::thread::unix::Thread>::new::thread_start <unknown>
37.93 s
gammaloop-nextest-core> at <unknown source file> :<unknown line>
37.93 s
gammaloop-nextest-core> 12: start_thread <unknown>
37.93 s
gammaloop-nextest-core> at <unknown source file> :<unknown line>
37.93 s
gammaloop-nextest-core> 13: __clone3 <unknown>
37.93 s
gammaloop-nextest-core> at <unknown source file> :<unknown line>
37.93 s
gammaloop-nextest-core>
37.93 s
gammaloop-nextest-core> Run with COLORBT_SHOW_HIDDEN=1 environment variable to disable frame filtering.
37.93 s
gammaloop-nextest-core> Run with RUST_BACKTRACE=full to include source snippets.
37.93 s
gammaloop-nextest-core>
37.93 s
gammaloop-nextest-core> FAIL [ 0.096s] (593/692) gammalooprs uv::approx::local_4d::tests :: canonical_uv_signed_multiloop_carriers_preserve_factorized_numerators
37.93 s
gammaloop-nextest-core> stdout ---
37.93 s
gammaloop-nextest-core>
37.93 s
gammaloop-nextest-core> running 1 test
37.93 s
gammaloop-nextest-core> test uv::approx::local_4d::tests::canonical_uv_signed_multiloop_carriers_preserve_factorized_numerators ... FAILED
37.93 s
gammaloop-nextest-core>
37.93 s
gammaloop-nextest-core> failures:
37.93 s
gammaloop-nextest-core>
37.93 s
gammaloop-nextest-core> failures:
37.93 s
gammaloop-nextest-core> uv::approx::local_4d::tests::canonical_uv_signed_multiloop_carriers_preserve_factorized_numerators
37.93 s
gammaloop-nextest-core>
37.93 s
gammaloop-nextest-core> test result: FAILED. 0 passed; 1 failed; 0 ignored; 0 measured; 742 filtered out; finished in 0.08s
37.93 s
gammaloop-nextest-core>
37.93 s
gammaloop-nextest-core> stderr ---
37.93 s
gammaloop-nextest-core> The application panicked (crashed).
37.93 s
gammaloop-nextest-core> Message: assertion `left == right` failed
37.93 s
gammaloop-nextest-core> left: 2*(signed_multiloop::a+signed_multiloop::b)^5*gammalooprs::Q(gammalooprs::uv::class(0),spenso::cind(0))
37.93 s
gammaloop-nextest-core> right: -2*(signed_multiloop::a+signed_multiloop::b)^5*gammalooprs::Q(gammalooprs::uv::class(0),spenso::cind(0))
37.93 s
gammaloop-nextest-core> Location: crates/gammalooprs/src/uv/approx/local_4d.rs :1983
37.93 s
gammaloop-nextest-core>
37.93 s
gammaloop-nextest-core> ━━━━━━━━━━━━━━━━━━━━━━━━━━━━━━━━━━ BACKTRACE ━━━━━━━━━━━━━━━━━━━━━━━━━━━━━━━━━━━
37.93 s
gammaloop-nextest-core> 1: <color_eyre[51793ea62743adbd]::config::PanicHook>::panic_report <unknown>
37.93 s
gammaloop-nextest-core> at <unknown source file> :<unknown line>
37.93 s
gammaloop-nextest-core> 2: <color_eyre[51793ea62743adbd]::config::PanicHook>::into_panic_hook::{closure#0} <unknown>
37.93 s
gammaloop-nextest-core> at <unknown source file> :<unknown line>
37.93 s
gammaloop-nextest-core> 3: std[bcb96dfbba0ab899]::panicking::panic_with_hook <unknown>
37.93 s
gammaloop-nextest-core> at <unknown source file> :<unknown line>
37.93 s
gammaloop-nextest-core> 4: std[bcb96dfbba0ab899]::panicking::panic_handler::{closure#0} <unknown>
37.93 s
gammaloop-nextest-core> at <unknown source file> :<unknown line>
37.93 s
gammaloop-nextest-core> 5: std[bcb96dfbba0ab899]::sys::backtrace::__rust_end_short_backtrace::<std[bcb96dfbba0ab899]::panicking::panic_handler::{closure#0}, !> <unknown>
37.93 s
gammaloop-nextest-core> at <unknown source file> :<unknown line>
37.93 s
gammaloop-nextest-core> 6: __rustc[6c289b9f9c454d21]::rust_begin_unwind <unknown>
37.93 s
gammaloop-nextest-core> at <unknown source file> :<unknown line>
37.93 s
gammaloop-nextest-core> 7: core[940e698046960fd5]::panicking::panic_fmt <unknown>
37.93 s
gammaloop-nextest-core> at <unknown source file> :<unknown line>
37.93 s
gammaloop-nextest-core> 8: core[940e698046960fd5]::panicking::assert_failed_inner <unknown>
37.93 s
gammaloop-nextest-core> at <unknown source file> :<unknown line>
37.93 s
gammaloop-nextest-core> 9: core[940e698046960fd5]::panicking::assert_failed::<symbolica[499970c26fd75ddd]::atom::Atom, symbolica[499970c26fd75ddd]::atom::Atom> <unknown>
37.93 s
gammaloop-nextest-core> at <unknown source file> :<unknown line>
37.93 s
gammaloop-nextest-core> 10: gammalooprs[24955f93fc9f4e0c]::uv::approx::local_4d::tests::canonical_uv_signed_multiloop_carriers_preserve_factorized_numerators <unknown>
37.93 s
gammaloop-nextest-core> at <unknown source file> :<unknown line>
37.93 s
gammaloop-nextest-core> 11: <gammalooprs[24955f93fc9f4e0c]::uv::approx::local_4d::tests::canonical_uv_signed_multiloop_carriers_preserve_factorized_numerators::{closure#0} as core[940e698046960fd5]::ops::function::FnOnce<()>>::call_once <unknown>
37.93 s
gammaloop-nextest-core> at <unknown source file> :<unknown line>
37.93 s
gammaloop-nextest-core> 12: test[75d6903177b1d7e9]::__rust_begin_short_backtrace::<core[940e698046960fd5]::result::Result<(), alloc[2ea6bcb46fca0c42]::string::String>, fn() -> core[940e698046960fd5]::result::Result<(), alloc[2ea6bcb46fca0c42]::string::String>> <unknown>
37.93 s
gammaloop-nextest-core> at <unknown source file> :<unknown line>
37.93 s
gammaloop-nextest-core> 13: test[75d6903177b1d7e9]::run_test::{closure#0} <unknown>
37.93 s
gammaloop-nextest-core> at <unknown source file> :<unknown line>
37.93 s
gammaloop-nextest-core> 14: std[bcb96dfbba0ab899]::sys::backtrace::__rust_begin_short_backtrace::<test[75d6903177b1d7e9]::run_test::{closure#1}, ()> <unknown>
37.93 s
gammaloop-nextest-core> at <unknown source file> :<unknown line>
37.93 s
gammaloop-nextest-core> 15: <std[bcb96dfbba0ab899]::thread::lifecycle::spawn_unchecked<test[75d6903177b1d7e9]::run_test::{closure#1}, ()>::{closure#1} as core[940e698046960fd5]::ops::function::FnOnce<()>>::call_once::{shim:vtable#0} <unknown>
37.93 s
gammaloop-nextest-core> at <unknown source file> :<unknown line>
37.93 s
gammaloop-nextest-core> 16: <std[bcb96dfbba0ab899]::sys::thread::unix::Thread>::new::thread_start <unknown>
37.93 s
gammaloop-nextest-core> at <unknown source file> :<unknown line>
37.93 s
gammaloop-nextest-core> 17: start_thread <unknown>
37.93 s
gammaloop-nextest-core> at <unknown source file> :<unknown line>
37.93 s
gammaloop-nextest-core> 18: __clone3 <unknown>
37.93 s
gammaloop-nextest-core> at <unknown source file> :<unknown line>
37.93 s
gammaloop-nextest-core>
37.93 s
gammaloop-nextest-core> Run with COLORBT_SHOW_HIDDEN=1 environment variable to disable frame filtering.
37.93 s
gammaloop-nextest-core> Run with RUST_BACKTRACE=full to include source snippets.
37.93 s
gammaloop-nextest-core>
37.93 s
gammaloop-nextest-core> FAIL [ 0.112s] (605/692) gammalooprs uv::approx::tests :: direct_nested_scalar_banana_replays_complete_cff_at_depth_three
37.93 s
gammaloop-nextest-core> stdout ---
37.93 s
gammaloop-nextest-core>
37.93 s
gammaloop-nextest-core> running 1 test
37.93 s
gammaloop-nextest-core> test uv::approx::tests::direct_nested_scalar_banana_replays_complete_cff_at_depth_three ... FAILED
37.93 s
gammaloop-nextest-core>
37.93 s
gammaloop-nextest-core> failures:
37.93 s
gammaloop-nextest-core>
37.93 s
gammaloop-nextest-core> failures:
37.93 s
gammaloop-nextest-core> uv::approx::tests::direct_nested_scalar_banana_replays_complete_cff_at_depth_three
37.93 s
gammaloop-nextest-core>
37.93 s
gammaloop-nextest-core> test result: FAILED. 0 passed; 1 failed; 0 ignored; 0 measured; 742 filtered out; finished in 0.10s
37.93 s
gammaloop-nextest-core>
37.93 s
gammaloop-nextest-core> stderr ---
37.93 s
gammaloop-nextest-core> Error:
37.93 s
gammaloop-nextest-core> 0: canonical UV numerator does not reproduce its source in the component frame
37.93 s
gammaloop-nextest-core>
37.93 s
gammaloop-nextest-core> Location:
37.93 s
gammaloop-nextest-core> crates/gammalooprs/src/uv/approx/local_4d.rs :354
37.93 s
gammaloop-nextest-core>
37.93 s
gammaloop-nextest-core> ━━━━━━━━━━━━━━━━━━━━━━━━━━━━━━━━━━ BACKTRACE ━━━━━━━━━━━━━━━━━━━━━━━━━━━━━━━━━━━
37.93 s
gammaloop-nextest-core> 1: <color_eyre[51793ea62743adbd]::config::EyreHook>::into_eyre_hook::{closure#0} <unknown>
37.93 s
gammaloop-nextest-core> at <unknown source file> :<unknown line>
37.93 s
gammaloop-nextest-core> 2: eyre[cb2fd339c0c40fca]::capture_handler <unknown>
37.93 s
gammaloop-nextest-core> at <unknown source file> :<unknown line>
37.93 s
gammaloop-nextest-core> 3: eyre[cb2fd339c0c40fca]::private::format_err <unknown>
37.93 s
gammaloop-nextest-core> at <unknown source file> :<unknown line>
37.93 s
gammaloop-nextest-core> 4: <gammalooprs[24955f93fc9f4e0c]::uv::approx::local_4d::FourDSector>::canonical_projection <unknown>
37.93 s
gammaloop-nextest-core> at <unknown source file> :<unknown line>
37.93 s
gammaloop-nextest-core> 5: <gammalooprs[24955f93fc9f4e0c]::uv::approx::projected_4d::Projected4dApproximation>::project_local_4d <unknown>
37.93 s
gammaloop-nextest-core> at <unknown source file> :<unknown line>
37.93 s
gammaloop-nextest-core> 6: <gammalooprs[24955f93fc9f4e0c]::uv::approx::Approximation>::compute_3d <unknown>
37.93 s
gammaloop-nextest-core> at <unknown source file> :<unknown line>
37.93 s
gammaloop-nextest-core> 7: gammalooprs[24955f93fc9f4e0c]::uv::approx::tests::direct_nested_scalar_banana_replays_complete_cff_at_depth_three::{closure#0} <unknown>
37.93 s
gammaloop-nextest-core> at <unknown source file> :<unknown line>
37.93 s
gammaloop-nextest-core> 8: gammalooprs[24955f93fc9f4e0c]::uv::approx::tests::direct_nested_scalar_banana_replays_complete_cff_at_depth_three <unknown>
37.93 s
gammaloop-nextest-core> at <unknown source file> :<unknown line>
37.93 s
gammaloop-nextest-core> 9: <gammalooprs[24955f93fc9f4e0c]::uv::approx::tests::direct_nested_scalar_banana_replays_complete_cff_at_depth_three::{closure#0} as core[940e698046960fd5]::ops::function::FnOnce<()>>::call_once <unknown>
37.93 s
gammaloop-nextest-core> at <unknown source file> :<unknown line>
37.93 s
gammaloop-nextest-core> 10: test[75d6903177b1d7e9]::__rust_begin_short_backtrace::<core[940e698046960fd5]::result::Result<(), alloc[2ea6bcb46fca0c42]::string::String>, fn() -> core[940e698046960fd5]::result::Result<(), alloc[2ea6bcb46fca0c42]::string::String>> <unknown>
37.93 s
gammaloop-nextest-core> at <unknown source file> :<unknown line>
37.93 s
gammaloop-nextest-core> 11: test[75d6903177b1d7e9]::run_test::{closure#0} <unknown>
37.93 s
gammaloop-nextest-core> at <unknown source file> :<unknown line>
37.93 s
gammaloop-nextest-core> 12: std[bcb96dfbba0ab899]::sys::backtrace::__rust_begin_short_backtrace::<test[75d6903177b1d7e9]::run_test::{closure#1}, ()> <unknown>
37.93 s
gammaloop-nextest-core> at <unknown source file> :<unknown line>
37.93 s
gammaloop-nextest-core> 13: <std[bcb96dfbba0ab899]::thread::lifecycle::spawn_unchecked<test[75d6903177b1d7e9]::run_test::{closure#1}, ()>::{closure#1} as core[940e698046960fd5]::ops::function::FnOnce<()>>::call_once::{shim:vtable#0} <unknown>
37.93 s
gammaloop-nextest-core> at <unknown source file> :<unknown line>
37.93 s
gammaloop-nextest-core> 14: <std[bcb96dfbba0ab899]::sys::thread::unix::Thread>::new::thread_start <unknown>
37.93 s
gammaloop-nextest-core> at <unknown source file> :<unknown line>
37.93 s
gammaloop-nextest-core> 15: start_thread <unknown>
37.93 s
gammaloop-nextest-core> at <unknown source file> :<unknown line>
37.93 s
gammaloop-nextest-core> 16: __clone3 <unknown>
37.93 s
gammaloop-nextest-core> at <unknown source file> :<unknown line>
37.93 s
gammaloop-nextest-core>
37.93 s
gammaloop-nextest-core> Run with COLORBT_SHOW_HIDDEN=1 environment variable to disable frame filtering.
37.93 s
gammaloop-nextest-core> Run with RUST_BACKTRACE=full to include source snippets.
37.93 s
gammaloop-nextest-core>
37.99 s
gammaloop-nextest-core> error : test run failed
38.02 s
gammaloop-nextest-core>
38.02 s
gammaloop-nextest-core> ========== nextest test summary ==========
38.02 s
gammaloop-nextest-core> report: target/nextest/ci_gammaloop/junit.xml
38.02 s
gammaloop-nextest-core> tests: 692, failures: 6, errors: 0
38.02 s
gammaloop-nextest-core>
38.02 s
gammaloop-nextest-core> 1. gammalooprs::graph::three_d_source::tests::exact_taylor_vacuum_affine_circulation_preserves_energy_mapping
38.02 s
gammaloop-nextest-core> failure: test failure with exit code 101
38.02 s
gammaloop-nextest-core> system-out
38.02 s
gammaloop-nextest-core> running 1 test
38.02 s
gammaloop-nextest-core> test graph::three_d_source::tests::exact_taylor_vacuum_affine_circulation_preserves_energy_mapping ... FAILED
38.02 s
gammaloop-nextest-core>
38.02 s
gammaloop-nextest-core> failures:
38.02 s
gammaloop-nextest-core>
38.02 s
gammaloop-nextest-core> failures:
38.02 s
gammaloop-nextest-core> graph::three_d_source::tests::exact_taylor_vacuum_affine_circulation_preserves_energy_mapping
38.02 s
gammaloop-nextest-core>
38.02 s
gammaloop-nextest-core> test result: FAILED. 0 passed; 1 failed; 0 ignored; 0 measured; 742 filtered out; finished in 0.10s
38.02 s
gammaloop-nextest-core> system-err
38.02 s
gammaloop-nextest-core> The application panicked (crashed).
38.02 s
gammaloop-nextest-core> Message: assertion `left == right` failed
38.02 s
gammaloop-nextest-core> left: (gammalooprs::mUVexp^2+(-gammalooprs::Q(1,spenso::cind(1))+gammalooprs::Q(4,spenso::cind(1)))^2+(-gammalooprs::Q(1,spenso::cind(2))+gammalooprs::Q(4,spenso::cind(2)))^2+(-gammalooprs::Q(1,spenso::cind(3))+gammalooprs::Q(4,spenso::cind(3)))^2)^(1/2)
38.02 s
gammaloop-nextest-core> right: (gammalooprs::mUVexp^2+(gammalooprs::Q(1,spenso::cind(1))-gammalooprs::Q(4,spenso::cind(1)))^2+(gammalooprs::Q(1,spenso::cind(2))-gammalooprs::Q(4,spenso::cind(2)))^2+(gammalooprs::Q(1,spenso::cind(3))-gammalooprs::Q(4,spenso::cind(3)))^2)^(1/2)
38.02 s
gammaloop-nextest-core> Location: crates/gammalooprs/src/graph/three_d_source.rs:7797
38.02 s
gammaloop-nextest-core>
38.02 s
gammaloop-nextest-core> ━━━━━━━━━━━━━━━━━━━━━━━━━━━━━━━━━━ BACKTRACE ━━━━━━━━━━━━━━━━━━━━━━━━━━━━━━━━━━━
38.02 s
gammaloop-nextest-core> 1: <color_eyre[51793ea62743adbd]::config::PanicHook>::panic_report<unknown>
38.02 s
gammaloop-nextest-core> at <unknown source file>:<unknown line>
38.02 s
gammaloop-nextest-core> 2: <color_eyre[51793ea62743adbd]::config::PanicHook>::into_panic_hook::{closure#0}<unknown>
38.02 s
gammaloop-nextest-core> at <unknown source file>:<unknown line>
38.02 s
gammaloop-nextest-core> 3: std[bcb96dfbba0ab899]::panicking::panic_with_hook<unknown>
38.02 s
gammaloop-nextest-core> at <unknown source file>:<unknown line>
38.02 s
gammaloop-nextest-core> 4: std[bcb96dfbba0ab899]::panicking::panic_handler::{closure#0}<unknown>
38.02 s
gammaloop-nextest-core> at <unknown source file>:<unknown line>
38.02 s
gammaloop-nextest-core> 5: std[bcb96dfbba0ab899]::sys::backtrace::__rust_end_short_backtrace::<std[bcb96dfbba0ab899]::panicking::panic_handler::{closure#0}, !><unknown>
38.02 s
gammaloop-nextest-core> at <unknown source file>:<unknown line>
38.02 s
gammaloop-nextest-core> 6: __rustc[6c289b9f9c454d21]::rust_begin_unwind<unknown>
38.02 s
gammaloop-nextest-core> at <unknown source file>:<unknown line>
38.02 s
gammaloop-nextest-core> 7: core[940e698046960fd5]::panicking::panic_fmt<unknown>
38.02 s
gammaloop-nextest-core> at <unknown source file>:<unknown line>
38.02 s
gammaloop-nextest-core> 8: core[940e698046960fd5]::panicking::assert_failed_inner<unknown>
38.02 s
gammaloop-nextest-core> at <unknown source file>:<unknown line>
38.02 s
gammaloop-nextest-core> 9: core[940e698046960fd5]::panicking::assert_failed::<symbolica[499970c26fd75ddd]::atom::Atom, symbolica[499970c26fd75ddd]::atom::Atom><unknown>
38.02 s
gammaloop-nextest-core> at <unknown source file>:<unknown line>
38.02 s
gammaloop-nextest-core> 10: gammalooprs[24955f93fc9f4e0c]::graph::three_d_source::tests::exact_taylor_vacuum_affine_circulation_preserves_energy_mapping<unknown>
38.02 s
gammaloop-nextest-core> at <unknown source file>:<unknown line>
38.02 s
gammaloop-nextest-core> 11: <gammalooprs[24955f93fc9f4e0c]::graph::three_d_source::tests::exact_taylor_vacuum_affine_circulation_preserves_energy_mapping::{closure#0} as core[940e698046960fd5]::ops::function::FnOnce<()>>::call_once<unknown>
38.02 s
gammaloop-nextest-core> at <unknown source file>:<unknown line>
38.02 s
gammaloop-nextest-core> 12: test[75d6903177b1d7e9]::__rust_begin_short_backtrace::<core[940e698046960fd5]::result::Result<(), alloc[2ea6bcb46fca0c42]::string::String>, fn() -> core[940e698046960fd5]::result::Result<(), alloc[2ea6bcb46fca0c42]::string::String>><unknown>
38.02 s
gammaloop-nextest-core> at <unknown source file>:<unknown line>
38.02 s
gammaloop-nextest-core> 13: test[75d6903177b1d7e9]::run_test::{closure#0}<unknown>
38.02 s
gammaloop-nextest-core> at <unknown source file>:<unknown line>
38.02 s
gammaloop-nextest-core> 14: std[bcb96dfbba0ab899]::sys::backtrace::__rust_begin_short_backtrace::<test[75d6903177b1d7e9]::run_test::{closure#1}, ()><unknown>
38.02 s
gammaloop-nextest-core> at <unknown source file>:<unknown line>
38.02 s
gammaloop-nextest-core> 15: <std[bcb96dfbba0ab899]::thread::lifecycle::spawn_unchecked<test[75d6903177b1d7e9]::run_test::{closure#1}, ()>::{closure#1} as core[940e698046960fd5]::ops::function::FnOnce<()>>::call_once::{shim:vtable#0}<unknown>
38.02 s
gammaloop-nextest-core> at <unknown source file>:<unknown line>
38.02 s
gammaloop-nextest-core> 16: <std[bcb96dfbba0ab899]::sys::thread::unix::Thread>::new::thread_start<unknown>
38.02 s
gammaloop-nextest-core> at <unknown source file>:<unknown line>
38.02 s
gammaloop-nextest-core> 17: start_thread<unknown>
38.02 s
gammaloop-nextest-core> at <unknown source file>:<unknown line>
38.02 s
gammaloop-nextest-core> 18: __clone3<unknown>
38.02 s
gammaloop-nextest-core> at <unknown source file>:<unknown line>
38.02 s
gammaloop-nextest-core>
38.02 s
gammaloop-nextest-core> Run with COLORBT_SHOW_HIDDEN=1 environment variable to disable frame filtering.
38.02 s
gammaloop-nextest-core> Run with RUST_BACKTRACE=full to include source snippets.
38.02 s
gammaloop-nextest-core>
38.02 s
gammaloop-nextest-core> 2. gammalooprs::graph::three_d_source::tests::pinched_affine_carrier_requires_occurrence_interpolation
38.02 s
gammaloop-nextest-core> failure: test failure with exit code 101
38.02 s
gammaloop-nextest-core> system-out
38.02 s
gammaloop-nextest-core> running 1 test
38.02 s
gammaloop-nextest-core> test graph::three_d_source::tests::pinched_affine_carrier_requires_occurrence_interpolation ... FAILED
38.02 s
gammaloop-nextest-core>
38.02 s
gammaloop-nextest-core> failures:
38.02 s
gammaloop-nextest-core>
38.02 s
gammaloop-nextest-core> failures:
38.02 s
gammaloop-nextest-core> graph::three_d_source::tests::pinched_affine_carrier_requires_occurrence_interpolation
38.02 s
gammaloop-nextest-core>
38.02 s
gammaloop-nextest-core> test result: FAILED. 0 passed; 1 failed; 0 ignored; 0 measured; 742 filtered out; finished in 0.11s
38.02 s
gammaloop-nextest-core> system-err
38.02 s
gammaloop-nextest-core> The application panicked (crashed).
38.02 s
gammaloop-nextest-core> Message: certified affine occurrence lift must reproduce the independent double contours: actual=-(-1/16*(3+E0)*(5+E0)/((1+Q(0,cind(1))^2+Q(0,cind(2))^2+Q(0,cind(3))^2)^(3/2)*(1+Q(1,cind(1))^2+Q(1,cind(2))^2+Q(1,cind(3))^2)^(3/2))-1/16*(3+E1)*(5+E1)/((1+Q(0,cind(1))^2+Q(0,cind(2))^2+Q(0,cind(3))^2)^(3/2)*(1+Q(1,cind(1))^2+Q(1,cind(2))^2+Q(1,cind(3))^2)^(3/2))-1/16*(3-E0)*(5-E0)/((1+Q(0,cind(1))^2+Q(0,cind(2))^2+Q(0,cind(3))^2)^(3/2)*(1+Q(1,cind(1))^2+Q(1,cind(2))^2+Q(1,cind(3))^2)^(3/2))-1/16*(3-E1)*(5-E1)/((1+Q(0,cind(1))^2+Q(0,cind(2))^2+Q(0,cind(3))^2)^(3/2)*(1+Q(1,cind(1))^2+Q(1,cind(2))^2+Q(1,cind(3))^2)^(3/2))+1/64*(3+E0+E1)*(5+E0+E1)/((1+Q(0,cind(1))^2+Q(0,cind(2))^2+Q(0,cind(3))^2)^(3/2)*(1+Q(1,cind(1))^2+Q(1,cind(2))^2+Q(1,cind(3))^2)^(3/2))+1/64*(3+E0-E1)*(5+E0-E1)/((1+Q(0,cind(1))^2+Q(0,cind(2))^2+Q(0,cind(3))^2)^(3/2)*(1+Q(1,cind(1))^2+Q(1,cind(2))^2+Q(1,cind(3))^2)^(3/2))+1/64*(3-E0+E1)*(5-E0+E1)/((1+Q(0,cind(1))^2+Q(0,cind(2))^2+Q(0,cind(3))^2)^(3/2)*(1+Q(1,cind(1))^2+Q(1,cind(2))^2+Q(1,cind(3))^2)^(3/2))+1/64*(3-E0-E1)*(5-E0-E1)/((1+Q(0,cind(1))^2+Q(0,cind(2))^2+Q(0,cind(3))^2)^(3/2)*(1+Q(1,cind(1))^2+Q(1,cind(2))^2+Q(1,cind(3))^2)^(3/2))+15/4/((1+Q(0,cind(1))^2+Q(0,cind(2))^2+Q(0,cind(3))^2)^(3/2)*(1+Q(1,cind(1))^2+Q(1,cind(2))^2+Q(1,cind(3))^2)^(3/2))), expected=1/16*(15-E0^2-E1^2)/(E0^3*E1^3)
38.02 s
gammaloop-nextest-core> Location: crates/gammalooprs/src/graph/three_d_source.rs:7619
38.02 s
gammaloop-nextest-core>
38.02 s
gammaloop-nextest-core> ━━━━━━━━━━━━━━━━━━━━━━━━━━━━━━━━━━ BACKTRACE ━━━━━━━━━━━━━━━━━━━━━━━━━━━━━━━━━━━
38.02 s
gammaloop-nextest-core> 1: <color_eyre[51793ea62743adbd]::config::PanicHook>::panic_report<unknown>
38.02 s
gammaloop-nextest-core> at <unknown source file>:<unknown line>
38.02 s
gammaloop-nextest-core> 2: <color_eyre[51793ea62743adbd]::config::PanicHook>::into_panic_hook::{closure#0}<unknown>
38.02 s
gammaloop-nextest-core> at <unknown source file>:<unknown line>
38.02 s
gammaloop-nextest-core> 3: std[bcb96dfbba0ab899]::panicking::panic_with_hook<unknown>
38.02 s
gammaloop-nextest-core> at <unknown source file>:<unknown line>
38.02 s
gammaloop-nextest-core> 4: std[bcb96dfbba0ab899]::panicking::panic_handler::{closure#0}<unknown>
38.02 s
gammaloop-nextest-core> at <unknown source file>:<unknown line>
38.02 s
gammaloop-nextest-core> 5: std[bcb96dfbba0ab899]::sys::backtrace::__rust_end_short_backtrace::<std[bcb96dfbba0ab899]::panicking::panic_handler::{closure#0}, !><unknown>
38.02 s
gammaloop-nextest-core> at <unknown source file>:<unknown line>
38.02 s
gammaloop-nextest-core> 6: __rustc[6c289b9f9c454d21]::rust_begin_unwind<unknown>
38.02 s
gammaloop-nextest-core> at <unknown source file>:<unknown line>
38.02 s
gammaloop-nextest-core> 7: core[940e698046960fd5]::panicking::panic_fmt<unknown>
38.02 s
gammaloop-nextest-core> at <unknown source file>:<unknown line>
38.02 s
gammaloop-nextest-core> 8: <gammalooprs[24955f93fc9f4e0c]::graph::three_d_source::tests::pinched_affine_carrier_requires_occurrence_interpolation::{closure#0} as core[940e698046960fd5]::ops::function::FnOnce<()>>::call_once<unknown>
38.02 s
gammaloop-nextest-core> at <unknown source file>:<unknown line>
38.02 s
gammaloop-nextest-core> 9: test[75d6903177b1d7e9]::__rust_begin_short_backtrace::<core[940e698046960fd5]::result::Result<(), alloc[2ea6bcb46fca0c42]::string::String>, fn() -> core[940e698046960fd5]::result::Result<(), alloc[2ea6bcb46fca0c42]::string::String>><unknown>
38.02 s
gammaloop-nextest-core> at <unknown source file>:<unknown line>
38.02 s
gammaloop-nextest-core> 10: test[75d6903177b1d7e9]::run_test::{closure#0}<unknown>
38.02 s
gammaloop-nextest-core> at <unknown source file>:<unknown line>
38.02 s
gammaloop-nextest-core> 11: std[bcb96dfbba0ab899]::sys::backtrace::__rust_begin_short_backtrace::<test[75d6903177b1d7e9]::run_test::{closure#1}, ()><unknown>
38.02 s
gammaloop-nextest-core> at <unknown source file>:<unknown line>
38.02 s
gammaloop-nextest-core> 12: <std[bcb96dfbba0ab899]::thread::lifecycle::spawn_unchecked<test[75d6903177b1d7e9]::run_test::{closure#1}, ()>::{closure#1} as core[940e698046960fd5]::ops::function::FnOnce<()>>::call_once::{shim:vtable#0}<unknown>
38.02 s
gammaloop-nextest-core> at <unknown source file>:<unknown line>
38.02 s
gammaloop-nextest-core> 13: <std[bcb96dfbba0ab899]::sys::thread::unix::Thread>::new::thread_start<unknown>
38.02 s
gammaloop-nextest-core> at <unknown source file>:<unknown line>
38.02 s
gammaloop-nextest-core> 14: start_thread<unknown>
38.02 s
gammaloop-nextest-core> at <unknown source file>:<unknown line>
38.02 s
gammaloop-nextest-core> 15: __clone3<unknown>
38.02 s
gammaloop-nextest-core> at <unknown source file>:<unknown line>
38.02 s
gammaloop-nextest-core>
38.02 s
gammaloop-nextest-core> Run with COLORBT_SHOW_HIDDEN=1 environment variable to disable frame filtering.
38.02 s
gammaloop-nextest-core> Run with RUST_BACKTRACE=full to include source snippets.
38.02 s
gammaloop-nextest-core>
38.02 s
gammaloop-nextest-core> 3. gammalooprs::numerator::energy_degree::tests::canonical_class_cyclic_lifts_preserve_factorization_and_exact_bounds
38.02 s
gammaloop-nextest-core> failure: test failure with exit code 101
38.02 s
gammaloop-nextest-core> thread 'numerator::energy_degree::tests::canonical_class_cyclic_lifts_preserve_factorization_and_exact_bounds' (2265) panicked at crates/gammalooprs/src/numerator/energy_degree.rs:2850:13:
38.02 s
gammaloop-nextest-core> assertion failed: (collapsed - expression).collect_factors().is_zero()
38.02 s
gammaloop-nextest-core> stack backtrace:
38.02 s
gammaloop-nextest-core> 0: __rustc::rust_begin_unwind
38.02 s
gammaloop-nextest-core> 1: core::panicking::panic_fmt
38.02 s
gammaloop-nextest-core> 2: core::panicking::panic
38.02 s
gammaloop-nextest-core> 3: gammalooprs::numerator::energy_degree::tests::canonical_class_cyclic_lifts_preserve_factorization_and_exact_bounds
38.02 s
gammaloop-nextest-core> 4: <gammalooprs::numerator::energy_degree::tests::canonical_class_cyclic_lifts_preserve_factorization_and_exact_bounds::{closure#0} as core::ops::function::FnOnce<()>>::call_once
38.02 s
gammaloop-nextest-core> note: Some details are omitted, run with `RUST_BACKTRACE=full` for a verbose backtrace.
38.02 s
gammaloop-nextest-core> system-out
38.02 s
gammaloop-nextest-core> running 1 test
38.02 s
gammaloop-nextest-core> test numerator::energy_degree::tests::canonical_class_cyclic_lifts_preserve_factorization_and_exact_bounds ... FAILED
38.02 s
gammaloop-nextest-core>
38.02 s
gammaloop-nextest-core> failures:
38.02 s
gammaloop-nextest-core>
38.02 s
gammaloop-nextest-core> failures:
38.02 s
gammaloop-nextest-core> numerator::energy_degree::tests::canonical_class_cyclic_lifts_preserve_factorization_and_exact_bounds
38.02 s
gammaloop-nextest-core>
38.02 s
gammaloop-nextest-core> test result: FAILED. 0 passed; 1 failed; 0 ignored; 0 measured; 742 filtered out; finished in 0.01s
38.02 s
gammaloop-nextest-core> system-err
38.02 s
gammaloop-nextest-core> thread 'numerator::energy_degree::tests::canonical_class_cyclic_lifts_preserve_factorization_and_exact_bounds' (2265) panicked at crates/gammalooprs/src/numerator/energy_degree.rs:2850:13:
38.02 s
gammaloop-nextest-core> assertion failed: (collapsed - expression).collect_factors().is_zero()
38.02 s
gammaloop-nextest-core> stack backtrace:
38.02 s
gammaloop-nextest-core> 0: __rustc::rust_begin_unwind
38.02 s
gammaloop-nextest-core> 1: core::panicking::panic_fmt
38.02 s
gammaloop-nextest-core> 2: core::panicking::panic
38.02 s
gammaloop-nextest-core> 3: gammalooprs::numerator::energy_degree::tests::canonical_class_cyclic_lifts_preserve_factorization_and_exact_bounds
38.02 s
gammaloop-nextest-core> 4: <gammalooprs::numerator::energy_degree::tests::canonical_class_cyclic_lifts_preserve_factorization_and_exact_bounds::{closure#0} as core::ops::function::FnOnce<()>>::call_once
38.02 s
gammaloop-nextest-core> note: Some details are omitted, run with `RUST_BACKTRACE=full` for a verbose backtrace.
38.02 s
gammaloop-nextest-core>
38.02 s
gammaloop-nextest-core> 4. gammalooprs::uv::approx::local_4d::tests::canonical_uv_classes_certify_signed_aliases_and_preserve_raw_sectors
38.02 s
gammaloop-nextest-core> failure: test failure with exit code 101
38.02 s
gammaloop-nextest-core> Error:
38.02 s
gammaloop-nextest-core> 0: merged canonical UV numerator does not reproduce its source bucket
38.02 s
gammaloop-nextest-core>
38.02 s
gammaloop-nextest-core> Location:
38.02 s
gammaloop-nextest-core> crates/gammalooprs/src/uv/approx/local_4d.rs:367
38.02 s
gammaloop-nextest-core>
38.02 s
gammaloop-nextest-core> ━━━━━━━━━━━━━━━━━━━━━━━━━━━━━━━━━━ BACKTRACE ━━━━━━━━━━━━━━━━━━━━━━━━━━━━━━━━━━━
38.02 s
gammaloop-nextest-core> 1: <color_eyre[51793ea62743adbd]::config::EyreHook>::into_eyre_hook::{closure#0}<unknown>
38.02 s
gammaloop-nextest-core> at <unknown source file>:<unknown line>
38.02 s
gammaloop-nextest-core> 2: eyre[cb2fd339c0c40fca]::capture_handler<unknown>
38.02 s
gammaloop-nextest-core> at <unknown source file>:<unknown line>
38.02 s
gammaloop-nextest-core> 3: eyre[cb2fd339c0c40fca]::private::format_err<unknown>
38.02 s
gammaloop-nextest-core> at <unknown source file>:<unknown line>
38.02 s
gammaloop-nextest-core> 4: <gammalooprs[24955f93fc9f4e0c]::uv::approx::local_4d::FourDSector>::canonical_projection<unknown>
38.02 s
gammaloop-nextest-core> at <unknown source file>:<unknown line>
38.02 s
gammaloop-nextest-core> 5: gammalooprs[24955f93fc9f4e0c]::uv::approx::local_4d::tests::canonical_uv_classes_certify_signed_aliases_and_preserve_raw_sectors<unknown>
38.02 s
gammaloop-nextest-core> at <unknown source file>:<unknown line>
38.02 s
gammaloop-nextest-core> 6: <gammalooprs[24955f93fc9f4e0c]::uv::approx::local_4d::tests::canonical_uv_classes_certify_signed_aliases_and_preserve_raw_sectors::{closure#0} as core[940e698046960fd5]::ops::function::FnOnce<()>>::call_once<unknown>
38.02 s
gammaloop-nextest-core> at <unknown source file>:<unknown line>
38.02 s
gammaloop-nextest-core> 7: test[75d6903177b1d7e9]::__rust_begin_short_backtrace::<core[940e698046960fd5]::result::Result<(), alloc[2ea6bcb46fca0c42]::string::String>, fn() -> core[940e698046960fd5]::result::Result<(), alloc[2ea6bcb46fca0c42]::string::String>><unknown>
38.02 s
gammaloop-nextest-core> at <unknown source file>:<unknown line>
38.02 s
gammaloop-nextest-core> 8: test[75d6903177b1d7e9]::run_test::{closure#0}<unknown>
38.02 s
gammaloop-nextest-core> at <unknown source file>:<unknown line>
38.02 s
gammaloop-nextest-core> 9: std[bcb96dfbba0ab899]::sys::backtrace::__rust_begin_short_backtrace::<test[75d6903177b1d7e9]::run_test::{closure#1}, ()><unknown>
38.02 s
gammaloop-nextest-core> at <unknown source file>:<unknown line>
38.02 s
gammaloop-nextest-core> 10: <std[bcb96dfbba0ab899]::thread::lifecycle::spawn_unchecked<test[75d6903177b1d7e9]::run_test::{closure#1}, ()>::{closure#1} as core[940e698046960fd5]::ops::function::FnOnce<()>>::call_once::{shim:vtable#0}<unknown>
38.02 s
gammaloop-nextest-core> at <unknown source file>:<unknown line>
38.02 s
gammaloop-nextest-core> 11: <std[bcb96dfbba0ab899]::sys::thread::unix::Thread>::new::thread_start<unknown>
38.02 s
gammaloop-nextest-core> at <unknown source file>:<unknown line>
38.02 s
gammaloop-nextest-core> 12: start_thread<unknown>
38.02 s
gammaloop-nextest-core> at <unknown source file>:<unknown line>
38.02 s
gammaloop-nextest-core> 13: __clone3<unknown>
38.02 s
gammaloop-nextest-core> at <unknown source file>:<unknown line>
38.02 s
gammaloop-nextest-core>
38.02 s
gammaloop-nextest-core> Run with COLORBT_SHOW_HIDDEN=1 environment variable to disable frame filtering.
38.02 s
gammaloop-nextest-core> Run with RUST_BACKTRACE=full to include source snippets.
38.02 s
gammaloop-nextest-core> system-out
38.02 s
gammaloop-nextest-core> running 1 test
38.02 s
gammaloop-nextest-core> test uv::approx::local_4d::tests::canonical_uv_classes_certify_signed_aliases_and_preserve_raw_sectors ... FAILED
38.02 s
gammaloop-nextest-core>
38.02 s
gammaloop-nextest-core> failures:
38.02 s
gammaloop-nextest-core>
38.02 s
gammaloop-nextest-core> failures:
38.02 s
gammaloop-nextest-core> uv::approx::local_4d::tests::canonical_uv_classes_certify_signed_aliases_and_preserve_raw_sectors
38.02 s
gammaloop-nextest-core>
38.02 s
gammaloop-nextest-core> test result: FAILED. 0 passed; 1 failed; 0 ignored; 0 measured; 742 filtered out; finished in 0.07s
38.02 s
gammaloop-nextest-core> system-err
38.02 s
gammaloop-nextest-core> Error:
38.02 s
gammaloop-nextest-core> 0: merged canonical UV numerator does not reproduce its source bucket
38.02 s
gammaloop-nextest-core>
38.02 s
gammaloop-nextest-core> Location:
38.02 s
gammaloop-nextest-core> crates/gammalooprs/src/uv/approx/local_4d.rs:367
38.02 s
gammaloop-nextest-core>
38.02 s
gammaloop-nextest-core> ━━━━━━━━━━━━━━━━━━━━━━━━━━━━━━━━━━ BACKTRACE ━━━━━━━━━━━━━━━━━━━━━━━━━━━━━━━━━━━
38.02 s
gammaloop-nextest-core> 1: <color_eyre[51793ea62743adbd]::config::EyreHook>::into_eyre_hook::{closure#0}<unknown>
38.02 s
gammaloop-nextest-core> at <unknown source file>:<unknown line>
38.02 s
gammaloop-nextest-core> 2: eyre[cb2fd339c0c40fca]::capture_handler<unknown>
38.02 s
gammaloop-nextest-core> at <unknown source file>:<unknown line>
38.02 s
gammaloop-nextest-core> 3: eyre[cb2fd339c0c40fca]::private::format_err<unknown>
38.02 s
gammaloop-nextest-core> at <unknown source file>:<unknown line>
38.02 s
gammaloop-nextest-core> 4: <gammalooprs[24955f93fc9f4e0c]::uv::approx::local_4d::FourDSector>::canonical_projection<unknown>
38.02 s
gammaloop-nextest-core> at <unknown source file>:<unknown line>
38.02 s
gammaloop-nextest-core> 5: gammalooprs[24955f93fc9f4e0c]::uv::approx::local_4d::tests::canonical_uv_classes_certify_signed_aliases_and_preserve_raw_sectors<unknown>
38.02 s
gammaloop-nextest-core> at <unknown source file>:<unknown line>
38.02 s
gammaloop-nextest-core> 6: <gammalooprs[24955f93fc9f4e0c]::uv::approx::local_4d::tests::canonical_uv_classes_certify_signed_aliases_and_preserve_raw_sectors::{closure#0} as core[940e698046960fd5]::ops::function::FnOnce<()>>::call_once<unknown>
38.02 s
gammaloop-nextest-core> at <unknown source file>:<unknown line>
38.02 s
gammaloop-nextest-core> 7: test[75d6903177b1d7e9]::__rust_begin_short_backtrace::<core[940e698046960fd5]::result::Result<(), alloc[2ea6bcb46fca0c42]::string::String>, fn() -> core[940e698046960fd5]::result::Result<(), alloc[2ea6bcb46fca0c42]::string::String>><unknown>
38.02 s
gammaloop-nextest-core> at <unknown source file>:<unknown line>
38.02 s
gammaloop-nextest-core> 8: test[75d6903177b1d7e9]::run_test::{closure#0}<unknown>
38.02 s
gammaloop-nextest-core> at <unknown source file>:<unknown line>
38.02 s
gammaloop-nextest-core> 9: std[bcb96dfbba0ab899]::sys::backtrace::__rust_begin_short_backtrace::<test[75d6903177b1d7e9]::run_test::{closure#1}, ()><unknown>
38.02 s
gammaloop-nextest-core> at <unknown source file>:<unknown line>
38.02 s
gammaloop-nextest-core> 10: <std[bcb96dfbba0ab899]::thread::lifecycle::spawn_unchecked<test[75d6903177b1d7e9]::run_test::{closure#1}, ()>::{closure#1} as core[940e698046960fd5]::ops::function::FnOnce<()>>::call_once::{shim:vtable#0}<unknown>
38.02 s
gammaloop-nextest-core> at <unknown source file>:<unknown line>
38.02 s
gammaloop-nextest-core> 11: <std[bcb96dfbba0ab899]::sys::thread::unix::Thread>::new::thread_start<unknown>
38.02 s
gammaloop-nextest-core> at <unknown source file>:<unknown line>
38.02 s
gammaloop-nextest-core> 12: start_thread<unknown>
38.02 s
gammaloop-nextest-core> at <unknown source file>:<unknown line>
38.02 s
gammaloop-nextest-core> 13: __clone3<unknown>
38.02 s
gammaloop-nextest-core> at <unknown source file>:<unknown line>
38.02 s
gammaloop-nextest-core>
38.02 s
gammaloop-nextest-core> Run with COLORBT_SHOW_HIDDEN=1 environment variable to disable frame filtering.
38.02 s
gammaloop-nextest-core> Run with RUST_BACKTRACE=full to include source snippets.
38.02 s
gammaloop-nextest-core>
38.02 s
gammaloop-nextest-core> 5. gammalooprs::uv::approx::local_4d::tests::canonical_uv_signed_multiloop_carriers_preserve_factorized_numerators
38.02 s
gammaloop-nextest-core> failure: test failure with exit code 101
38.02 s
gammaloop-nextest-core> system-out
38.02 s
gammaloop-nextest-core> running 1 test
38.02 s
gammaloop-nextest-core> test uv::approx::local_4d::tests::canonical_uv_signed_multiloop_carriers_preserve_factorized_numerators ... FAILED
38.02 s
gammaloop-nextest-core>
38.02 s
gammaloop-nextest-core> failures:
38.02 s
gammaloop-nextest-core>
38.02 s
gammaloop-nextest-core> failures:
38.02 s
gammaloop-nextest-core> uv::approx::local_4d::tests::canonical_uv_signed_multiloop_carriers_preserve_factorized_numerators
38.02 s
gammaloop-nextest-core>
38.02 s
gammaloop-nextest-core> test result: FAILED. 0 passed; 1 failed; 0 ignored; 0 measured; 742 filtered out; finished in 0.08s
38.02 s
gammaloop-nextest-core> system-err
38.02 s
gammaloop-nextest-core> The application panicked (crashed).
38.02 s
gammaloop-nextest-core> Message: assertion `left == right` failed
38.02 s
gammaloop-nextest-core> left: 2*(signed_multiloop::a+signed_multiloop::b)^5*gammalooprs::Q(gammalooprs::uv::class(0),spenso::cind(0))
38.02 s
gammaloop-nextest-core> right: -2*(signed_multiloop::a+signed_multiloop::b)^5*gammalooprs::Q(gammalooprs::uv::class(0),spenso::cind(0))
38.02 s
gammaloop-nextest-core> Location: crates/gammalooprs/src/uv/approx/local_4d.rs:1983
38.02 s
gammaloop-nextest-core>
38.02 s
gammaloop-nextest-core> ━━━━━━━━━━━━━━━━━━━━━━━━━━━━━━━━━━ BACKTRACE ━━━━━━━━━━━━━━━━━━━━━━━━━━━━━━━━━━━
38.02 s
gammaloop-nextest-core> 1: <color_eyre[51793ea62743adbd]::config::PanicHook>::panic_report<unknown>
38.02 s
gammaloop-nextest-core> at <unknown source file>:<unknown line>
38.02 s
gammaloop-nextest-core> 2: <color_eyre[51793ea62743adbd]::config::PanicHook>::into_panic_hook::{closure#0}<unknown>
38.02 s
gammaloop-nextest-core> at <unknown source file>:<unknown line>
38.02 s
gammaloop-nextest-core> 3: std[bcb96dfbba0ab899]::panicking::panic_with_hook<unknown>
38.02 s
gammaloop-nextest-core> at <unknown source file>:<unknown line>
38.02 s
gammaloop-nextest-core> 4: std[bcb96dfbba0ab899]::panicking::panic_handler::{closure#0}<unknown>
38.02 s
gammaloop-nextest-core> at <unknown source file>:<unknown line>
38.02 s
gammaloop-nextest-core> 5: std[bcb96dfbba0ab899]::sys::backtrace::__rust_end_short_backtrace::<std[bcb96dfbba0ab899]::panicking::panic_handler::{closure#0}, !><unknown>
38.02 s
gammaloop-nextest-core> at <unknown source file>:<unknown line>
38.02 s
gammaloop-nextest-core> 6: __rustc[6c289b9f9c454d21]::rust_begin_unwind<unknown>
38.02 s
gammaloop-nextest-core> at <unknown source file>:<unknown line>
38.02 s
gammaloop-nextest-core> 7: core[940e698046960fd5]::panicking::panic_fmt<unknown>
38.02 s
gammaloop-nextest-core> at <unknown source file>:<unknown line>
38.02 s
gammaloop-nextest-core> 8: core[940e698046960fd5]::panicking::assert_failed_inner<unknown>
38.02 s
gammaloop-nextest-core> at <unknown source file>:<unknown line>
38.02 s
gammaloop-nextest-core> 9: core[940e698046960fd5]::panicking::assert_failed::<symbolica[499970c26fd75ddd]::atom::Atom, symbolica[499970c26fd75ddd]::atom::Atom><unknown>
38.02 s
gammaloop-nextest-core> at <unknown source file>:<unknown line>
38.02 s
gammaloop-nextest-core> 10: gammalooprs[24955f93fc9f4e0c]::uv::approx::local_4d::tests::canonical_uv_signed_multiloop_carriers_preserve_factorized_numerators<unknown>
38.02 s
gammaloop-nextest-core> at <unknown source file>:<unknown line>
38.02 s
gammaloop-nextest-core> 11: <gammalooprs[24955f93fc9f4e0c]::uv::approx::local_4d::tests::canonical_uv_signed_multiloop_carriers_preserve_factorized_numerators::{closure#0} as core[940e698046960fd5]::ops::function::FnOnce<()>>::call_once<unknown>
38.02 s
gammaloop-nextest-core> at <unknown source file>:<unknown line>
38.02 s
gammaloop-nextest-core> 12: test[75d6903177b1d7e9]::__rust_begin_short_backtrace::<core[940e698046960fd5]::result::Result<(), alloc[2ea6bcb46fca0c42]::string::String>, fn() -> core[940e698046960fd5]::result::Result<(), alloc[2ea6bcb46fca0c42]::string::String>><unknown>
38.02 s
gammaloop-nextest-core> at <unknown source file>:<unknown line>
38.02 s
gammaloop-nextest-core> 13: test[75d6903177b1d7e9]::run_test::{closure#0}<unknown>
38.02 s
gammaloop-nextest-core> at <unknown source file>:<unknown line>
38.02 s
gammaloop-nextest-core> 14: std[bcb96dfbba0ab899]::sys::backtrace::__rust_begin_short_backtrace::<test[75d6903177b1d7e9]::run_test::{closure#1}, ()><unknown>
38.02 s
gammaloop-nextest-core> at <unknown source file>:<unknown line>
38.02 s
gammaloop-nextest-core> 15: <std[bcb96dfbba0ab899]::thread::lifecycle::spawn_unchecked<test[75d6903177b1d7e9]::run_test::{closure#1}, ()>::{closure#1} as core[940e698046960fd5]::ops::function::FnOnce<()>>::call_once::{shim:vtable#0}<unknown>
38.02 s
gammaloop-nextest-core> at <unknown source file>:<unknown line>
38.02 s
gammaloop-nextest-core> 16: <std[bcb96dfbba0ab899]::sys::thread::unix::Thread>::new::thread_start<unknown>
38.02 s
gammaloop-nextest-core> at <unknown source file>:<unknown line>
38.02 s
gammaloop-nextest-core> 17: start_thread<unknown>
38.02 s
gammaloop-nextest-core> at <unknown source file>:<unknown line>
38.02 s
gammaloop-nextest-core> 18: __clone3<unknown>
38.02 s
gammaloop-nextest-core> at <unknown source file>:<unknown line>
38.02 s
gammaloop-nextest-core>
38.02 s
gammaloop-nextest-core> Run with COLORBT_SHOW_HIDDEN=1 environment variable to disable frame filtering.
38.02 s
gammaloop-nextest-core> Run with RUST_BACKTRACE=full to include source snippets.
38.02 s
gammaloop-nextest-core>
38.02 s
gammaloop-nextest-core> 6. gammalooprs::uv::approx::tests::direct_nested_scalar_banana_replays_complete_cff_at_depth_three
38.02 s
gammaloop-nextest-core> failure: test failure with exit code 101
38.02 s
gammaloop-nextest-core> Error:
38.02 s
gammaloop-nextest-core> 0: canonical UV numerator does not reproduce its source in the component frame
38.02 s
gammaloop-nextest-core>
38.02 s
gammaloop-nextest-core> Location:
38.02 s
gammaloop-nextest-core> crates/gammalooprs/src/uv/approx/local_4d.rs:354
38.02 s
gammaloop-nextest-core>
38.02 s
gammaloop-nextest-core> ━━━━━━━━━━━━━━━━━━━━━━━━━━━━━━━━━━ BACKTRACE ━━━━━━━━━━━━━━━━━━━━━━━━━━━━━━━━━━━
38.02 s
gammaloop-nextest-core> 1: <color_eyre[51793ea62743adbd]::config::EyreHook>::into_eyre_hook::{closure#0}<unknown>
38.02 s
gammaloop-nextest-core> at <unknown source file>:<unknown line>
38.02 s
gammaloop-nextest-core> 2: eyre[cb2fd339c0c40fca]::capture_handler<unknown>
38.02 s
gammaloop-nextest-core> at <unknown source file>:<unknown line>
38.02 s
gammaloop-nextest-core> 3: eyre[cb2fd339c0c40fca]::private::format_err<unknown>
38.02 s
gammaloop-nextest-core> at <unknown source file>:<unknown line>
38.02 s
gammaloop-nextest-core> 4: <gammalooprs[24955f93fc9f4e0c]::uv::approx::local_4d::FourDSector>::canonical_projection<unknown>
38.02 s
gammaloop-nextest-core> at <unknown source file>:<unknown line>
38.02 s
gammaloop-nextest-core> 5: <gammalooprs[24955f93fc9f4e0c]::uv::approx::projected_4d::Projected4dApproximation>::project_local_4d<unknown>
38.02 s
gammaloop-nextest-core> at <unknown source file>:<unknown line>
38.02 s
gammaloop-nextest-core> 6: <gammalooprs[24955f93fc9f4e0c]::uv::approx::Approximation>::compute_3d<unknown>
38.02 s
gammaloop-nextest-core> at <unknown source file>:<unknown line>
38.02 s
gammaloop-nextest-core> 7: gammalooprs[24955f93fc9f4e0c]::uv::approx::tests::direct_nested_scalar_banana_replays_complete_cff_at_depth_three::{closure#0}<unknown>
38.02 s
gammaloop-nextest-core> at <unknown source file>:<unknown line>
38.02 s
gammaloop-nextest-core> 8: gammalooprs[24955f93fc9f4e0c]::uv::approx::tests::direct_nested_scalar_banana_replays_complete_cff_at_depth_three<unknown>
38.02 s
gammaloop-nextest-core> at <unknown source file>:<unknown line>
38.02 s
gammaloop-nextest-core> 9: <gammalooprs[24955f93fc9f4e0c]::uv::approx::tests::direct_nested_scalar_banana_replays_complete_cff_at_depth_three::{closure#0} as core[940e698046960fd5]::ops::function::FnOnce<()>>::call_once<unknown>
38.02 s
gammaloop-nextest-core> at <unknown source file>:<unknown line>
38.02 s
gammaloop-nextest-core> 10: test[75d6903177b1d7e9]::__rust_begin_short_backtrace::<core[940e698046960fd5]::result::Result<(), alloc[2ea6bcb46fca0c42]::string::String>, fn() -> core[940e698046960fd5]::result::Result<(), alloc[2ea6bcb46fca0c42]::string::String>><unknown>
38.02 s
gammaloop-nextest-core> at <unknown source file>:<unknown line>
38.02 s
gammaloop-nextest-core> 11: test[75d6903177b1d7e9]::run_test::{closure#0}<unknown>
38.02 s
gammaloop-nextest-core> at <unknown source file>:<unknown line>
38.02 s
gammaloop-nextest-core> 12: std[bcb96dfbba0ab899]::sys::backtrace::__rust_begin_short_backtrace::<test[75d6903177b1d7e9]::run_test::{closure#1}, ()><unknown>
38.02 s
gammaloop-nextest-core> at <unknown source file>:<unknown line>
38.02 s
gammaloop-nextest-core> 13: <std[bcb96dfbba0ab899]::thread::lifecycle::spawn_unchecked<test[75d6903177b1d7e9]::run_test::{closure#1}, ()>::{closure#1} as core[940e698046960fd5]::ops::function::FnOnce<()>>::call_once::{shim:vtable#0}<unknown>
38.02 s
gammaloop-nextest-core> at <unknown source file>:<unknown line>
38.02 s
gammaloop-nextest-core> 14: <std[bcb96dfbba0ab899]::sys::thread::unix::Thread>::new::thread_start<unknown>
38.02 s
gammaloop-nextest-core> at <unknown source file>:<unknown line>
38.02 s
gammaloop-nextest-core> 15: start_thread<unknown>
38.02 s
gammaloop-nextest-core> at <unknown source file>:<unknown line>
38.02 s
gammaloop-nextest-core> 16: __clone3<unknown>
38.02 s
gammaloop-nextest-core> at <unknown source file>:<unknown line>
38.02 s
gammaloop-nextest-core>
38.02 s
gammaloop-nextest-core> Run with COLORBT_SHOW_HIDDEN=1 environment variable to disable frame filtering.
38.02 s
gammaloop-nextest-core> Run with RUST_BACKTRACE=full to include source snippets.
38.02 s
gammaloop-nextest-core> system-out
38.02 s
gammaloop-nextest-core> running 1 test
38.02 s
gammaloop-nextest-core> test uv::approx::tests::direct_nested_scalar_banana_replays_complete_cff_at_depth_three ... FAILED
38.02 s
gammaloop-nextest-core>
38.02 s
gammaloop-nextest-core> failures:
38.03 s
gammaloop-nextest-core>
38.03 s
gammaloop-nextest-core> failures:
38.03 s
gammaloop-nextest-core> uv::approx::tests::direct_nested_scalar_banana_replays_complete_cff_at_depth_three
38.03 s
gammaloop-nextest-core>
38.03 s
gammaloop-nextest-core> test result: FAILED. 0 passed; 1 failed; 0 ignored; 0 measured; 742 filtered out; finished in 0.10s
38.03 s
gammaloop-nextest-core> system-err
38.03 s
gammaloop-nextest-core> Error:
38.03 s
gammaloop-nextest-core> 0: canonical UV numerator does not reproduce its source in the component frame
38.03 s
gammaloop-nextest-core>
38.03 s
gammaloop-nextest-core> Location:
38.03 s
gammaloop-nextest-core> crates/gammalooprs/src/uv/approx/local_4d.rs:354
38.03 s
gammaloop-nextest-core>
38.03 s
gammaloop-nextest-core> ━━━━━━━━━━━━━━━━━━━━━━━━━━━━━━━━━━ BACKTRACE ━━━━━━━━━━━━━━━━━━━━━━━━━━━━━━━━━━━
38.03 s
gammaloop-nextest-core> 1: <color_eyre[51793ea62743adbd]::config::EyreHook>::into_eyre_hook::{closure#0}<unknown>
38.03 s
gammaloop-nextest-core> at <unknown source file>:<unknown line>
38.03 s
gammaloop-nextest-core> 2: eyre[cb2fd339c0c40fca]::capture_handler<unknown>
38.03 s
gammaloop-nextest-core> at <unknown source file>:<unknown line>
38.03 s
gammaloop-nextest-core> 3: eyre[cb2fd339c0c40fca]::private::format_err<unknown>
38.03 s
gammaloop-nextest-core> at <unknown source file>:<unknown line>
38.03 s
gammaloop-nextest-core> 4: <gammalooprs[24955f93fc9f4e0c]::uv::approx::local_4d::FourDSector>::canonical_projection<unknown>
38.03 s
gammaloop-nextest-core> at <unknown source file>:<unknown line>
38.03 s
gammaloop-nextest-core> 5: <gammalooprs[24955f93fc9f4e0c]::uv::approx::projected_4d::Projected4dApproximation>::project_local_4d<unknown>
38.03 s
gammaloop-nextest-core> at <unknown source file>:<unknown line>
38.03 s
gammaloop-nextest-core> 6: <gammalooprs[24955f93fc9f4e0c]::uv::approx::Approximation>::compute_3d<unknown>
38.03 s
gammaloop-nextest-core> at <unknown source file>:<unknown line>
38.03 s
gammaloop-nextest-core> 7: gammalooprs[24955f93fc9f4e0c]::uv::approx::tests::direct_nested_scalar_banana_replays_complete_cff_at_depth_three::{closure#0}<unknown>
38.03 s
gammaloop-nextest-core> at <unknown source file>:<unknown line>
38.03 s
gammaloop-nextest-core> 8: gammalooprs[24955f93fc9f4e0c]::uv::approx::tests::direct_nested_scalar_banana_replays_complete_cff_at_depth_three<unknown>
38.03 s
gammaloop-nextest-core> at <unknown source file>:<unknown line>
38.03 s
gammaloop-nextest-core> 9: <gammalooprs[24955f93fc9f4e0c]::uv::approx::tests::direct_nested_scalar_banana_replays_complete_cff_at_depth_three::{closure#0} as core[940e698046960fd5]::ops::function::FnOnce<()>>::call_once<unknown>
38.03 s
gammaloop-nextest-core> at <unknown source file>:<unknown line>
38.03 s
gammaloop-nextest-core> 10: test[75d6903177b1d7e9]::__rust_begin_short_backtrace::<core[940e698046960fd5]::result::Result<(), alloc[2ea6bcb46fca0c42]::string::String>, fn() -> core[940e698046960fd5]::result::Result<(), alloc[2ea6bcb46fca0c42]::string::String>><unknown>
38.03 s
gammaloop-nextest-core> at <unknown source file>:<unknown line>
38.03 s
gammaloop-nextest-core> 11: test[75d6903177b1d7e9]::run_test::{closure#0}<unknown>
38.03 s
gammaloop-nextest-core> at <unknown source file>:<unknown line>
38.03 s
gammaloop-nextest-core> 12: std[bcb96dfbba0ab899]::sys::backtrace::__rust_begin_short_backtrace::<test[75d6903177b1d7e9]::run_test::{closure#1}, ()><unknown>
38.03 s
gammaloop-nextest-core> at <unknown source file>:<unknown line>
38.03 s
gammaloop-nextest-core> 13: <std[bcb96dfbba0ab899]::thread::lifecycle::spawn_unchecked<test[75d6903177b1d7e9]::run_test::{closure#1}, ()>::{closure#1} as core[940e698046960fd5]::ops::function::FnOnce<()>>::call_once::{shim:vtable#0}<unknown>
38.03 s
gammaloop-nextest-core> at <unknown source file>:<unknown line>
38.03 s
gammaloop-nextest-core> 14: <std[bcb96dfbba0ab899]::sys::thread::unix::Thread>::new::thread_start<unknown>
38.03 s
gammaloop-nextest-core> at <unknown source file>:<unknown line>
38.03 s
gammaloop-nextest-core> 15: start_thread<unknown>
38.03 s
gammaloop-nextest-core> at <unknown source file>:<unknown line>
38.03 s
gammaloop-nextest-core> 16: __clone3<unknown>
38.03 s
gammaloop-nextest-core> at <unknown source file>:<unknown line>
38.03 s
gammaloop-nextest-core>
38.03 s
gammaloop-nextest-core> Run with COLORBT_SHOW_HIDDEN=1 environment variable to disable frame filtering.
38.03 s
gammaloop-nextest-core> Run with RUST_BACKTRACE=full to include source snippets.
38.03 s
gammaloop-nextest-core> =========================================
38.04 s
gammaloop-nextest-core> Extracting 1 binary, 1 build script output directory, and 1 linked path to /build/nextest-archive-oEVmZd
38.13 s
gammaloop-nextest-core> Extracted 7 files to /build/nextest-archive-oEVmZd in 0.09s
38.14 s
gammaloop-nextest-core> ------------
38.14 s
gammaloop-nextest-core> Nextest run ID 3e787ab3-399d-4410-b34e-cb5136fc8045 with nextest profile: ci_gammaloop
38.14 s
gammaloop-nextest-core> Starting 105 tests across 1 binary
55.63 s
gammaloop-nextest-core> ------------
55.63 s
gammaloop-nextest-core> Summary [ 17.491s] 105 tests run: 105 passed , 0 skipped
55.67 s
gammaloop-nextest-core>
55.67 s
gammaloop-nextest-core> ========== nextest test summary ==========
55.67 s
gammaloop-nextest-core> report: target/nextest/ci_gammaloop/junit.xml
55.67 s
gammaloop-nextest-core> tests: 105, failures: 0, errors: 0
55.67 s
gammaloop-nextest-core> No failing testcases found.
55.67 s
gammaloop-nextest-core> =========================================
55.73 s
error: Cannot build '/nix/store/n61r02micjg0snakcv487zfdf4anp50s-gammaloop-nextest-core.drv '.
55.73 s
Reason: builder failed with exit code 100 .
55.73 s
Output paths:
55.73 s
/nix/store/xbaygav73qg6fbyhf734mhwpzkgjgnd5-gammaloop-nextest-core
55.73 s
Last 1069 log lines:
55.73 s
> Extracting 4 binaries (including 1 non-test binary), 1 build script output directory, and 2 linked paths to /build/nextest-archive-nIhoaY
55.73 s
> Extracted 20 files to /build/nextest-archive-nIhoaY in 0.72s
55.73 s
> ------------
55.73 s
> Nextest run ID c9c95688-4363-46a1-9e07-8d868b3ce035 with nextest profile: ci_gammaloop
55.73 s
> Starting 379 tests across 3 binaries
55.73 s
> ------------
55.73 s
> Summary [ 1.312s] 379 tests run: 379 passed , 0 skipped
55.73 s
>
55.73 s
> ========== nextest test summary ==========
55.73 s
> report: target/nextest/ci_gammaloop/junit.xml
55.73 s
> tests: 379, failures: 0, errors: 0
55.73 s
> No failing testcases found.
55.73 s
> =========================================
55.73 s
> Extracting 1 binary and 1 linked path to /build/nextest-archive-hgzjQi
55.73 s
> Extracted 7 files to /build/nextest-archive-hgzjQi in 0.07s
55.73 s
> ------------
55.73 s
> Nextest run ID 297a6a2c-a0b0-4df3-bc0c-e9d00ecc4210 with nextest profile: ci_gammaloop
55.73 s
> Starting 19 tests across 1 binary
55.73 s
> ------------
55.73 s
> Summary [ 0.011s] 19 tests run: 19 passed , 0 skipped
55.73 s
>
55.73 s
> ========== nextest test summary ==========
55.73 s
> report: target/nextest/ci_gammaloop/junit.xml
55.73 s
> tests: 19, failures: 0, errors: 0
55.73 s
> No failing testcases found.
55.73 s
> =========================================
55.73 s
> Extracting 1 binary to /build/nextest-archive-gpMHxe
55.73 s
> Extracted 4 files to /build/nextest-archive-gpMHxe in 0.03s
55.73 s
> ------------
55.73 s
> Nextest run ID 40b109a1-5b38-4e32-80f9-9cc74dc4e175 with nextest profile: ci_gammaloop
55.73 s
> Starting 0 tests across 1 binary
55.73 s
> ------------
55.73 s
> Summary [ 0.000s] 0 tests run: 0 passed , 0 skipped
55.73 s
>
55.73 s
> ========== nextest test summary ==========
55.73 s
> report: target/nextest/ci_gammaloop/junit.xml
55.73 s
> tests: 0, failures: 0, errors: 0
55.73 s
> No failing testcases found.
55.73 s
> =========================================
55.73 s
> Extracting 4 binaries, 1 build script output directory, and 2 linked paths to /build/nextest-archive-veI02p
55.73 s
> Extracted 18 files to /build/nextest-archive-veI02p in 0.48s
55.73 s
> ------------
55.73 s
> Nextest run ID 9b18db9d-669d-4429-b041-c06f56d2a531 with nextest profile: ci_gammaloop
55.73 s
> Starting 692 tests across 4 binaries (60 tests skipped , including 59 tests via profile.ci_gammaloop.default-filter )
55.73 s
> FAIL [ 0.118s] (149/692) gammalooprs graph::three_d_source::tests :: exact_taylor_vacuum_affine_circulation_preserves_energy_mapping
55.73 s
> stdout ---
55.73 s
>
55.73 s
> running 1 test
55.73 s
> test graph::three_d_source::tests::exact_taylor_vacuum_affine_circulation_preserves_energy_mapping ... FAILED
55.73 s
>
55.73 s
> failures:
55.73 s
>
55.73 s
> failures:
55.73 s
> graph::three_d_source::tests::exact_taylor_vacuum_affine_circulation_preserves_energy_mapping
55.73 s
>
55.73 s
> test result: FAILED. 0 passed; 1 failed; 0 ignored; 0 measured; 742 filtered out; finished in 0.10s
55.73 s
>
55.73 s
> stderr ---
55.73 s
> The application panicked (crashed).
55.73 s
> Message: assertion `left == right` failed
55.73 s
> left: (gammalooprs::mUVexp^2+(-gammalooprs::Q(1,spenso::cind(1))+gammalooprs::Q(4,spenso::cind(1)))^2+(-gammalooprs::Q(1,spenso::cind(2))+gammalooprs::Q(4,spenso::cind(2)))^2+(-gammalooprs::Q(1,spenso::cind(3))+gammalooprs::Q(4,spenso::cind(3)))^2)^(1/2)
55.73 s
> right: (gammalooprs::mUVexp^2+(gammalooprs::Q(1,spenso::cind(1))-gammalooprs::Q(4,spenso::cind(1)))^2+(gammalooprs::Q(1,spenso::cind(2))-gammalooprs::Q(4,spenso::cind(2)))^2+(gammalooprs::Q(1,spenso::cind(3))-gammalooprs::Q(4,spenso::cind(3)))^2)^(1/2)
55.73 s
> Location: crates/gammalooprs/src/graph/three_d_source.rs :7797
55.73 s
>
55.73 s
> ━━━━━━━━━━━━━━━━━━━━━━━━━━━━━━━━━━ BACKTRACE ━━━━━━━━━━━━━━━━━━━━━━━━━━━━━━━━━━━
55.73 s
> 1: <color_eyre[51793ea62743adbd]::config::PanicHook>::panic_report <unknown>
55.73 s
> at <unknown source file> :<unknown line>
55.73 s
> 2: <color_eyre[51793ea62743adbd]::config::PanicHook>::into_panic_hook::{closure#0} <unknown>
55.73 s
> at <unknown source file> :<unknown line>
55.73 s
> 3: std[bcb96dfbba0ab899]::panicking::panic_with_hook <unknown>
55.73 s
> at <unknown source file> :<unknown line>
55.73 s
> 4: std[bcb96dfbba0ab899]::panicking::panic_handler::{closure#0} <unknown>
55.73 s
> at <unknown source file> :<unknown line>
55.73 s
> 5: std[bcb96dfbba0ab899]::sys::backtrace::__rust_end_short_backtrace::<std[bcb96dfbba0ab899]::panicking::panic_handler::{closure#0}, !> <unknown>
55.73 s
> at <unknown source file> :<unknown line>
55.73 s
> 6: __rustc[6c289b9f9c454d21]::rust_begin_unwind <unknown>
55.73 s
> at <unknown source file> :<unknown line>
55.73 s
> 7: core[940e698046960fd5]::panicking::panic_fmt <unknown>
55.73 s
> at <unknown source file> :<unknown line>
55.73 s
> 8: core[940e698046960fd5]::panicking::assert_failed_inner <unknown>
55.73 s
> at <unknown source file> :<unknown line>
55.73 s
> 9: core[940e698046960fd5]::panicking::assert_failed::<symbolica[499970c26fd75ddd]::atom::Atom, symbolica[499970c26fd75ddd]::atom::Atom> <unknown>
55.73 s
> at <unknown source file> :<unknown line>
55.73 s
> 10: gammalooprs[24955f93fc9f4e0c]::graph::three_d_source::tests::exact_taylor_vacuum_affine_circulation_preserves_energy_mapping <unknown>
55.73 s
> at <unknown source file> :<unknown line>
55.73 s
> 11: <gammalooprs[24955f93fc9f4e0c]::graph::three_d_source::tests::exact_taylor_vacuum_affine_circulation_preserves_energy_mapping::{closure#0} as core[940e698046960fd5]::ops::function::FnOnce<()>>::call_once <unknown>
55.73 s
> at <unknown source file> :<unknown line>
55.73 s
> 12: test[75d6903177b1d7e9]::__rust_begin_short_backtrace::<core[940e698046960fd5]::result::Result<(), alloc[2ea6bcb46fca0c42]::string::String>, fn() -> core[940e698046960fd5]::result::Result<(), alloc[2ea6bcb46fca0c42]::string::String>> <unknown>
55.73 s
> at <unknown source file> :<unknown line>
55.73 s
> 13: test[75d6903177b1d7e9]::run_test::{closure#0} <unknown>
55.73 s
> at <unknown source file> :<unknown line>
55.73 s
> 14: std[bcb96dfbba0ab899]::sys::backtrace::__rust_begin_short_backtrace::<test[75d6903177b1d7e9]::run_test::{closure#1}, ()> <unknown>
55.73 s
> at <unknown source file> :<unknown line>
55.73 s
> 15: <std[bcb96dfbba0ab899]::thread::lifecycle::spawn_unchecked<test[75d6903177b1d7e9]::run_test::{closure#1}, ()>::{closure#1} as core[940e698046960fd5]::ops::function::FnOnce<()>>::call_once::{shim:vtable#0} <unknown>
55.73 s
> at <unknown source file> :<unknown line>
55.73 s
> 16: <std[bcb96dfbba0ab899]::sys::thread::unix::Thread>::new::thread_start <unknown>
55.73 s
> at <unknown source file> :<unknown line>
55.73 s
> 17: start_thread <unknown>
55.73 s
> at <unknown source file> :<unknown line>
55.73 s
> 18: __clone3 <unknown>
55.73 s
> at <unknown source file> :<unknown line>
55.73 s
>
55.73 s
> Run with COLORBT_SHOW_HIDDEN=1 environment variable to disable frame filtering.
55.73 s
> Run with RUST_BACKTRACE=full to include source snippets.
55.73 s
>
55.73 s
> FAIL [ 0.117s] (161/692) gammalooprs graph::three_d_source::tests :: pinched_affine_carrier_requires_occurrence_interpolation
55.73 s
> stdout ---
55.73 s
>
55.73 s
> running 1 test
55.73 s
> test graph::three_d_source::tests::pinched_affine_carrier_requires_occurrence_interpolation ... FAILED
55.73 s
>
55.73 s
> failures:
55.73 s
>
55.73 s
> failures:
55.73 s
> graph::three_d_source::tests::pinched_affine_carrier_requires_occurrence_interpolation
55.73 s
>
55.73 s
> test result: FAILED. 0 passed; 1 failed; 0 ignored; 0 measured; 742 filtered out; finished in 0.11s
55.73 s
>
55.73 s
> stderr ---
55.73 s
> The application panicked (crashed).
55.73 s
> Message: certified affine occurrence lift must reproduce the independent double contours: actual=-(-1/16*(3+E0)*(5+E0)/((1+Q(0,cind(1))^2+Q(0,cind(2))^2+Q(0,cind(3))^2)^(3/2)*(1+Q(1,cind(1))^2+Q(1,cind(2))^2+Q(1,cind(3))^2)^(3/2))-1/16*(3+E1)*(5+E1)/((1+Q(0,cind(1))^2+Q(0,cind(2))^2+Q(0,cind(3))^2)^(3/2)*(1+Q(1,cind(1))^2+Q(1,cind(2))^2+Q(1,cind(3))^2)^(3/2))-1/16*(3-E0)*(5-E0)/((1+Q(0,cind(1))^2+Q(0,cind(2))^2+Q(0,cind(3))^2)^(3/2)*(1+Q(1,cind(1))^2+Q(1,cind(2))^2+Q(1,cind(3))^2)^(3/2))-1/16*(3-E1)*(5-E1)/((1+Q(0,cind(1))^2+Q(0,cind(2))^2+Q(0,cind(3))^2)^(3/2)*(1+Q(1,cind(1))^2+Q(1,cind(2))^2+Q(1,cind(3))^2)^(3/2))+1/64*(3+E0+E1)*(5+E0+E1)/((1+Q(0,cind(1))^2+Q(0,cind(2))^2+Q(0,cind(3))^2)^(3/2)*(1+Q(1,cind(1))^2+Q(1,cind(2))^2+Q(1,cind(3))^2)^(3/2))+1/64*(3+E0-E1)*(5+E0-E1)/((1+Q(0,cind(1))^2+Q(0,cind(2))^2+Q(0,cind(3))^2)^(3/2)*(1+Q(1,cind(1))^2+Q(1,cind(2))^2+Q(1,cind(3))^2)^(3/2))+1/64*(3-E0+E1)*(5-E0+E1)/((1+Q(0,cind(1))^2+Q(0,cind(2))^2+Q(0,cind(3))^2)^(3/2)*(1+Q(1,cind(1))^2+Q(1,cind(2))^2+Q(1,cind(3))^2)^(3/2))+1/64*(3-E0-E1)*(5-E0-E1)/((1+Q(0,cind(1))^2+Q(0,cind(2))^2+Q(0,cind(3))^2)^(3/2)*(1+Q(1,cind(1))^2+Q(1,cind(2))^2+Q(1,cind(3))^2)^(3/2))+15/4/((1+Q(0,cind(1))^2+Q(0,cind(2))^2+Q(0,cind(3))^2)^(3/2)*(1+Q(1,cind(1))^2+Q(1,cind(2))^2+Q(1,cind(3))^2)^(3/2))), expected=1/16*(15-E0^2-E1^2)/(E0^3*E1^3)
55.73 s
> Location: crates/gammalooprs/src/graph/three_d_source.rs :7619
55.73 s
>
55.73 s
> ━━━━━━━━━━━━━━━━━━━━━━━━━━━━━━━━━━ BACKTRACE ━━━━━━━━━━━━━━━━━━━━━━━━━━━━━━━━━━━
55.73 s
> 1: <color_eyre[51793ea62743adbd]::config::PanicHook>::panic_report <unknown>
55.73 s
> at <unknown source file> :<unknown line>
55.73 s
> 2: <color_eyre[51793ea62743adbd]::config::PanicHook>::into_panic_hook::{closure#0} <unknown>
55.73 s
> at <unknown source file> :<unknown line>
55.73 s
> 3: std[bcb96dfbba0ab899]::panicking::panic_with_hook <unknown>
55.73 s
> at <unknown source file> :<unknown line>
55.73 s
> 4: std[bcb96dfbba0ab899]::panicking::panic_handler::{closure#0} <unknown>
55.73 s
> at <unknown source file> :<unknown line>
55.73 s
> 5: std[bcb96dfbba0ab899]::sys::backtrace::__rust_end_short_backtrace::<std[bcb96dfbba0ab899]::panicking::panic_handler::{closure#0}, !> <unknown>
55.73 s
> at <unknown source file> :<unknown line>
55.73 s
> 6: __rustc[6c289b9f9c454d21]::rust_begin_unwind <unknown>
55.73 s
> at <unknown source file> :<unknown line>
55.73 s
> 7: core[940e698046960fd5]::panicking::panic_fmt <unknown>
55.73 s
> at <unknown source file> :<unknown line>
55.73 s
> 8: <gammalooprs[24955f93fc9f4e0c]::graph::three_d_source::tests::pinched_affine_carrier_requires_occurrence_interpolation::{closure#0} as core[940e698046960fd5]::ops::function::FnOnce<()>>::call_once <unknown>
55.73 s
> at <unknown source file> :<unknown line>
55.73 s
> 9: test[75d6903177b1d7e9]::__rust_begin_short_backtrace::<core[940e698046960fd5]::result::Result<(), alloc[2ea6bcb46fca0c42]::string::String>, fn() -> core[940e698046960fd5]::result::Result<(), alloc[2ea6bcb46fca0c42]::string::String>> <unknown>
55.73 s
> at <unknown source file> :<unknown line>
55.73 s
> 10: test[75d6903177b1d7e9]::run_test::{closure#0} <unknown>
55.73 s
> at <unknown source file> :<unknown line>
55.73 s
> 11: std[bcb96dfbba0ab899]::sys::backtrace::__rust_begin_short_backtrace::<test[75d6903177b1d7e9]::run_test::{closure#1}, ()> <unknown>
55.73 s
> at <unknown source file> :<unknown line>
55.73 s
> 12: <std[bcb96dfbba0ab899]::thread::lifecycle::spawn_unchecked<test[75d6903177b1d7e9]::run_test::{closure#1}, ()>::{closure#1} as core[940e698046960fd5]::ops::function::FnOnce<()>>::call_once::{shim:vtable#0} <unknown>
55.73 s
> at <unknown source file> :<unknown line>
55.73 s
> 13: <std[bcb96dfbba0ab899]::sys::thread::unix::Thread>::new::thread_start <unknown>
55.73 s
> at <unknown source file> :<unknown line>
55.73 s
> 14: start_thread <unknown>
55.73 s
> at <unknown source file> :<unknown line>
55.73 s
> 15: __clone3 <unknown>
55.73 s
> at <unknown source file> :<unknown line>
55.73 s
>
55.73 s
> Run with COLORBT_SHOW_HIDDEN=1 environment variable to disable frame filtering.
55.73 s
> Run with RUST_BACKTRACE=full to include source snippets.
55.73 s
>
55.73 s
> FAIL [ 0.014s] (286/692) gammalooprs numerator::energy_degree::tests :: canonical_class_cyclic_lifts_preserve_factorization_and_exact_bounds
55.73 s
> stdout ---
55.73 s
>
55.73 s
> running 1 test
55.73 s
> test numerator::energy_degree::tests::canonical_class_cyclic_lifts_preserve_factorization_and_exact_bounds ... FAILED
55.73 s
>
55.73 s
> failures:
55.73 s
>
55.73 s
> failures:
55.73 s
> numerator::energy_degree::tests::canonical_class_cyclic_lifts_preserve_factorization_and_exact_bounds
55.73 s
>
55.73 s
> test result: FAILED. 0 passed; 1 failed; 0 ignored; 0 measured; 742 filtered out; finished in 0.01s
55.73 s
>
55.73 s
> stderr ---
55.73 s
>
55.73 s
> thread 'numerator::energy_degree::tests::canonical_class_cyclic_lifts_preserve_factorization_and_exact_bounds' (2265) panicked at crates/gammalooprs/src/numerator/energy_degree.rs:2850:13:
55.73 s
> assertion failed: (collapsed - expression).collect_factors().is_zero()
55.73 s
> stack backtrace:
55.73 s
> 0: __rustc::rust_begin_unwind
55.73 s
> 1: core::panicking::panic_fmt
55.73 s
> 2: core::panicking::panic
55.73 s
> 3: gammalooprs::numerator::energy_degree::tests::canonical_class_cyclic_lifts_preserve_factorization_and_exact_bounds
55.73 s
> 4: <gammalooprs::numerator::energy_degree::tests::canonical_class_cyclic_lifts_preserve_factorization_and_exact_bounds::{closure#0} as core::ops::function::FnOnce<()>>::call_once
55.73 s
> note: Some details are omitted, run with `RUST_BACKTRACE=full` for a verbose backtrace.
55.73 s
>
55.73 s
> FAIL [ 0.074s] (587/692) gammalooprs uv::approx::local_4d::tests :: canonical_uv_classes_certify_signed_aliases_and_preserve_raw_sectors
55.73 s
> stdout ---
55.73 s
>
55.73 s
> running 1 test
55.73 s
> test uv::approx::local_4d::tests::canonical_uv_classes_certify_signed_aliases_and_preserve_raw_sectors ... FAILED
55.73 s
>
55.73 s
> failures:
55.73 s
>
55.73 s
> failures:
55.73 s
> uv::approx::local_4d::tests::canonical_uv_classes_certify_signed_aliases_and_preserve_raw_sectors
55.73 s
>
55.73 s
> test result: FAILED. 0 passed; 1 failed; 0 ignored; 0 measured; 742 filtered out; finished in 0.07s
55.73 s
>
55.73 s
> stderr ---
55.73 s
> Error:
55.73 s
> 0: merged canonical UV numerator does not reproduce its source bucket
55.73 s
>
55.73 s
> Location:
55.73 s
> crates/gammalooprs/src/uv/approx/local_4d.rs :367
55.73 s
>
55.73 s
> ━━━━━━━━━━━━━━━━━━━━━━━━━━━━━━━━━━ BACKTRACE ━━━━━━━━━━━━━━━━━━━━━━━━━━━━━━━━━━━
55.73 s
> 1: <color_eyre[51793ea62743adbd]::config::EyreHook>::into_eyre_hook::{closure#0} <unknown>
55.73 s
> at <unknown source file> :<unknown line>
55.73 s
> 2: eyre[cb2fd339c0c40fca]::capture_handler <unknown>
55.73 s
> at <unknown source file> :<unknown line>
55.73 s
> 3: eyre[cb2fd339c0c40fca]::private::format_err <unknown>
55.73 s
> at <unknown source file> :<unknown line>
55.73 s
> 4: <gammalooprs[24955f93fc9f4e0c]::uv::approx::local_4d::FourDSector>::canonical_projection <unknown>
55.73 s
> at <unknown source file> :<unknown line>
55.73 s
> 5: gammalooprs[24955f93fc9f4e0c]::uv::approx::local_4d::tests::canonical_uv_classes_certify_signed_aliases_and_preserve_raw_sectors <unknown>
55.73 s
> at <unknown source file> :<unknown line>
55.73 s
> 6: <gammalooprs[24955f93fc9f4e0c]::uv::approx::local_4d::tests::canonical_uv_classes_certify_signed_aliases_and_preserve_raw_sectors::{closure#0} as core[940e698046960fd5]::ops::function::FnOnce<()>>::call_once <unknown>
55.73 s
> at <unknown source file> :<unknown line>
55.73 s
> 7: test[75d6903177b1d7e9]::__rust_begin_short_backtrace::<core[940e698046960fd5]::result::Result<(), alloc[2ea6bcb46fca0c42]::string::String>, fn() -> core[940e698046960fd5]::result::Result<(), alloc[2ea6bcb46fca0c42]::string::String>> <unknown>
55.73 s
> at <unknown source file> :<unknown line>
55.73 s
> 8: test[75d6903177b1d7e9]::run_test::{closure#0} <unknown>
55.73 s
> at <unknown source file> :<unknown line>
55.73 s
> 9: std[bcb96dfbba0ab899]::sys::backtrace::__rust_begin_short_backtrace::<test[75d6903177b1d7e9]::run_test::{closure#1}, ()> <unknown>
55.73 s
> at <unknown source file> :<unknown line>
55.73 s
> 10: <std[bcb96dfbba0ab899]::thread::lifecycle::spawn_unchecked<test[75d6903177b1d7e9]::run_test::{closure#1}, ()>::{closure#1} as core[940e698046960fd5]::ops::function::FnOnce<()>>::call_once::{shim:vtable#0} <unknown>
55.73 s
> at <unknown source file> :<unknown line>
55.73 s
> 11: <std[bcb96dfbba0ab899]::sys::thread::unix::Thread>::new::thread_start <unknown>
55.73 s
> at <unknown source file> :<unknown line>
55.73 s
> 12: start_thread <unknown>
55.73 s
> at <unknown source file> :<unknown line>
55.73 s
> 13: __clone3 <unknown>
55.73 s
> at <unknown source file> :<unknown line>
55.73 s
>
55.73 s
> Run with COLORBT_SHOW_HIDDEN=1 environment variable to disable frame filtering.
55.73 s
> Run with RUST_BACKTRACE=full to include source snippets.
55.73 s
>
55.73 s
> FAIL [ 0.096s] (593/692) gammalooprs uv::approx::local_4d::tests :: canonical_uv_signed_multiloop_carriers_preserve_factorized_numerators
55.73 s
> stdout ---
55.73 s
>
55.73 s
> running 1 test
55.73 s
> test uv::approx::local_4d::tests::canonical_uv_signed_multiloop_carriers_preserve_factorized_numerators ... FAILED
55.73 s
>
55.73 s
> failures:
55.73 s
>
55.73 s
> failures:
55.73 s
> uv::approx::local_4d::tests::canonical_uv_signed_multiloop_carriers_preserve_factorized_numerators
55.73 s
>
55.73 s
> test result: FAILED. 0 passed; 1 failed; 0 ignored; 0 measured; 742 filtered out; finished in 0.08s
55.73 s
>
55.73 s
> stderr ---
55.73 s
> The application panicked (crashed).
55.73 s
> Message: assertion `left == right` failed
55.73 s
> left: 2*(signed_multiloop::a+signed_multiloop::b)^5*gammalooprs::Q(gammalooprs::uv::class(0),spenso::cind(0))
55.73 s
> right: -2*(signed_multiloop::a+signed_multiloop::b)^5*gammalooprs::Q(gammalooprs::uv::class(0),spenso::cind(0))
55.73 s
> Location: crates/gammalooprs/src/uv/approx/local_4d.rs :1983
55.73 s
>
55.73 s
> ━━━━━━━━━━━━━━━━━━━━━━━━━━━━━━━━━━ BACKTRACE ━━━━━━━━━━━━━━━━━━━━━━━━━━━━━━━━━━━
55.73 s
> 1: <color_eyre[51793ea62743adbd]::config::PanicHook>::panic_report <unknown>
55.73 s
> at <unknown source file> :<unknown line>
55.73 s
> 2: <color_eyre[51793ea62743adbd]::config::PanicHook>::into_panic_hook::{closure#0} <unknown>
55.73 s
> at <unknown source file> :<unknown line>
55.73 s
> 3: std[bcb96dfbba0ab899]::panicking::panic_with_hook <unknown>
55.73 s
> at <unknown source file> :<unknown line>
55.73 s
> 4: std[bcb96dfbba0ab899]::panicking::panic_handler::{closure#0} <unknown>
55.73 s
> at <unknown source file> :<unknown line>
55.73 s
> 5: std[bcb96dfbba0ab899]::sys::backtrace::__rust_end_short_backtrace::<std[bcb96dfbba0ab899]::panicking::panic_handler::{closure#0}, !> <unknown>
55.73 s
> at <unknown source file> :<unknown line>
55.73 s
> 6: __rustc[6c289b9f9c454d21]::rust_begin_unwind <unknown>
55.73 s
> at <unknown source file> :<unknown line>
55.73 s
> 7: core[940e698046960fd5]::panicking::panic_fmt <unknown>
55.73 s
> at <unknown source file> :<unknown line>
55.73 s
> 8: core[940e698046960fd5]::panicking::assert_failed_inner <unknown>
55.73 s
> at <unknown source file> :<unknown line>
55.73 s
> 9: core[940e698046960fd5]::panicking::assert_failed::<symbolica[499970c26fd75ddd]::atom::Atom, symbolica[499970c26fd75ddd]::atom::Atom> <unknown>
55.73 s
> at <unknown source file> :<unknown line>
55.73 s
> 10: gammalooprs[24955f93fc9f4e0c]::uv::approx::local_4d::tests::canonical_uv_signed_multiloop_carriers_preserve_factorized_numerators <unknown>
55.73 s
> at <unknown source file> :<unknown line>
55.73 s
> 11: <gammalooprs[24955f93fc9f4e0c]::uv::approx::local_4d::tests::canonical_uv_signed_multiloop_carriers_preserve_factorized_numerators::{closure#0} as core[940e698046960fd5]::ops::function::FnOnce<()>>::call_once <unknown>
55.73 s
> at <unknown source file> :<unknown line>
55.73 s
> 12: test[75d6903177b1d7e9]::__rust_begin_short_backtrace::<core[940e698046960fd5]::result::Result<(), alloc[2ea6bcb46fca0c42]::string::String>, fn() -> core[940e698046960fd5]::result::Result<(), alloc[2ea6bcb46fca0c42]::string::String>> <unknown>
55.73 s
> at <unknown source file> :<unknown line>
55.73 s
> 13: test[75d6903177b1d7e9]::run_test::{closure#0} <unknown>
55.73 s
> at <unknown source file> :<unknown line>
55.73 s
> 14: std[bcb96dfbba0ab899]::sys::backtrace::__rust_begin_short_backtrace::<test[75d6903177b1d7e9]::run_test::{closure#1}, ()> <unknown>
55.73 s
> at <unknown source file> :<unknown line>
55.73 s
> 15: <std[bcb96dfbba0ab899]::thread::lifecycle::spawn_unchecked<test[75d6903177b1d7e9]::run_test::{closure#1}, ()>::{closure#1} as core[940e698046960fd5]::ops::function::FnOnce<()>>::call_once::{shim:vtable#0} <unknown>
55.73 s
> at <unknown source file> :<unknown line>
55.73 s
> 16: <std[bcb96dfbba0ab899]::sys::thread::unix::Thread>::new::thread_start <unknown>
55.73 s
> at <unknown source file> :<unknown line>
55.73 s
> 17: start_thread <unknown>
55.73 s
> at <unknown source file> :<unknown line>
55.73 s
> 18: __clone3 <unknown>
55.73 s
> at <unknown source file> :<unknown line>
55.73 s
>
55.73 s
> Run with COLORBT_SHOW_HIDDEN=1 environment variable to disable frame filtering.
55.73 s
> Run with RUST_BACKTRACE=full to include source snippets.
55.73 s
>
55.73 s
> FAIL [ 0.112s] (605/692) gammalooprs uv::approx::tests :: direct_nested_scalar_banana_replays_complete_cff_at_depth_three
55.73 s
> stdout ---
55.73 s
>
55.73 s
> running 1 test
55.73 s
> test uv::approx::tests::direct_nested_scalar_banana_replays_complete_cff_at_depth_three ... FAILED
55.73 s
>
55.73 s
> failures:
55.73 s
>
55.73 s
> failures:
55.73 s
> uv::approx::tests::direct_nested_scalar_banana_replays_complete_cff_at_depth_three
55.73 s
>
55.73 s
> test result: FAILED. 0 passed; 1 failed; 0 ignored; 0 measured; 742 filtered out; finished in 0.10s
55.73 s
>
55.73 s
> stderr ---
55.73 s
> Error:
55.73 s
> 0: canonical UV numerator does not reproduce its source in the component frame
55.73 s
>
55.73 s
> Location:
55.73 s
> crates/gammalooprs/src/uv/approx/local_4d.rs :354
55.73 s
>
55.73 s
> ━━━━━━━━━━━━━━━━━━━━━━━━━━━━━━━━━━ BACKTRACE ━━━━━━━━━━━━━━━━━━━━━━━━━━━━━━━━━━━
55.73 s
> 1: <color_eyre[51793ea62743adbd]::config::EyreHook>::into_eyre_hook::{closure#0} <unknown>
55.73 s
> at <unknown source file> :<unknown line>
55.73 s
> 2: eyre[cb2fd339c0c40fca]::capture_handler <unknown>
55.73 s
> at <unknown source file> :<unknown line>
55.73 s
> 3: eyre[cb2fd339c0c40fca]::private::format_err <unknown>
55.73 s
> at <unknown source file> :<unknown line>
55.73 s
> 4: <gammalooprs[24955f93fc9f4e0c]::uv::approx::local_4d::FourDSector>::canonical_projection <unknown>
55.73 s
> at <unknown source file> :<unknown line>
55.73 s
> 5: <gammalooprs[24955f93fc9f4e0c]::uv::approx::projected_4d::Projected4dApproximation>::project_local_4d <unknown>
55.73 s
> at <unknown source file> :<unknown line>
55.73 s
> 6: <gammalooprs[24955f93fc9f4e0c]::uv::approx::Approximation>::compute_3d <unknown>
55.73 s
> at <unknown source file> :<unknown line>
55.73 s
> 7: gammalooprs[24955f93fc9f4e0c]::uv::approx::tests::direct_nested_scalar_banana_replays_complete_cff_at_depth_three::{closure#0} <unknown>
55.73 s
> at <unknown source file> :<unknown line>
55.73 s
> 8: gammalooprs[24955f93fc9f4e0c]::uv::approx::tests::direct_nested_scalar_banana_replays_complete_cff_at_depth_three <unknown>
55.73 s
> at <unknown source file> :<unknown line>
55.73 s
> 9: <gammalooprs[24955f93fc9f4e0c]::uv::approx::tests::direct_nested_scalar_banana_replays_complete_cff_at_depth_three::{closure#0} as core[940e698046960fd5]::ops::function::FnOnce<()>>::call_once <unknown>
55.73 s
> at <unknown source file> :<unknown line>
55.73 s
> 10: test[75d6903177b1d7e9]::__rust_begin_short_backtrace::<core[940e698046960fd5]::result::Result<(), alloc[2ea6bcb46fca0c42]::string::String>, fn() -> core[940e698046960fd5]::result::Result<(), alloc[2ea6bcb46fca0c42]::string::String>> <unknown>
55.73 s
> at <unknown source file> :<unknown line>
55.73 s
> 11: test[75d6903177b1d7e9]::run_test::{closure#0} <unknown>
55.73 s
> at <unknown source file> :<unknown line>
55.73 s
> 12: std[bcb96dfbba0ab899]::sys::backtrace::__rust_begin_short_backtrace::<test[75d6903177b1d7e9]::run_test::{closure#1}, ()> <unknown>
55.73 s
> at <unknown source file> :<unknown line>
55.73 s
> 13: <std[bcb96dfbba0ab899]::thread::lifecycle::spawn_unchecked<test[75d6903177b1d7e9]::run_test::{closure#1}, ()>::{closure#1} as core[940e698046960fd5]::ops::function::FnOnce<()>>::call_once::{shim:vtable#0} <unknown>
55.73 s
> at <unknown source file> :<unknown line>
55.73 s
> 14: <std[bcb96dfbba0ab899]::sys::thread::unix::Thread>::new::thread_start <unknown>
55.73 s
> at <unknown source file> :<unknown line>
55.73 s
> 15: start_thread <unknown>
55.73 s
> at <unknown source file> :<unknown line>
55.73 s
> 16: __clone3 <unknown>
55.73 s
> at <unknown source file> :<unknown line>
55.73 s
>
55.73 s
> Run with COLORBT_SHOW_HIDDEN=1 environment variable to disable frame filtering.
55.73 s
> Run with RUST_BACKTRACE=full to include source snippets.
55.73 s
>
55.73 s
> ------------
55.73 s
> Summary [ 12.837s] 692 tests run: 686 passed , 6 failed , 60 skipped
55.73 s
> FAIL [ 0.118s] (149/692) gammalooprs graph::three_d_source::tests :: exact_taylor_vacuum_affine_circulation_preserves_energy_mapping
55.73 s
> stdout ---
55.73 s
>
55.73 s
> running 1 test
55.73 s
> test graph::three_d_source::tests::exact_taylor_vacuum_affine_circulation_preserves_energy_mapping ... FAILED
55.73 s
>
55.73 s
> failures:
55.73 s
>
55.73 s
> failures:
55.73 s
> graph::three_d_source::tests::exact_taylor_vacuum_affine_circulation_preserves_energy_mapping
55.73 s
>
55.73 s
> test result: FAILED. 0 passed; 1 failed; 0 ignored; 0 measured; 742 filtered out; finished in 0.10s
55.73 s
>
55.73 s
> stderr ---
55.73 s
> The application panicked (crashed).
55.73 s
> Message: assertion `left == right` failed
55.73 s
> left: (gammalooprs::mUVexp^2+(-gammalooprs::Q(1,spenso::cind(1))+gammalooprs::Q(4,spenso::cind(1)))^2+(-gammalooprs::Q(1,spenso::cind(2))+gammalooprs::Q(4,spenso::cind(2)))^2+(-gammalooprs::Q(1,spenso::cind(3))+gammalooprs::Q(4,spenso::cind(3)))^2)^(1/2)
55.73 s
> right: (gammalooprs::mUVexp^2+(gammalooprs::Q(1,spenso::cind(1))-gammalooprs::Q(4,spenso::cind(1)))^2+(gammalooprs::Q(1,spenso::cind(2))-gammalooprs::Q(4,spenso::cind(2)))^2+(gammalooprs::Q(1,spenso::cind(3))-gammalooprs::Q(4,spenso::cind(3)))^2)^(1/2)
55.73 s
> Location: crates/gammalooprs/src/graph/three_d_source.rs :7797
55.73 s
>
55.73 s
> ━━━━━━━━━━━━━━━━━━━━━━━━━━━━━━━━━━ BACKTRACE ━━━━━━━━━━━━━━━━━━━━━━━━━━━━━━━━━━━
55.73 s
> 1: <color_eyre[51793ea62743adbd]::config::PanicHook>::panic_report <unknown>
55.73 s
> at <unknown source file> :<unknown line>
55.73 s
> 2: <color_eyre[51793ea62743adbd]::config::PanicHook>::into_panic_hook::{closure#0} <unknown>
55.73 s
> at <unknown source file> :<unknown line>
55.73 s
> 3: std[bcb96dfbba0ab899]::panicking::panic_with_hook <unknown>
55.73 s
> at <unknown source file> :<unknown line>
55.73 s
> 4: std[bcb96dfbba0ab899]::panicking::panic_handler::{closure#0} <unknown>
55.73 s
> at <unknown source file> :<unknown line>
55.73 s
> 5: std[bcb96dfbba0ab899]::sys::backtrace::__rust_end_short_backtrace::<std[bcb96dfbba0ab899]::panicking::panic_handler::{closure#0}, !> <unknown>
55.73 s
> at <unknown source file> :<unknown line>
55.73 s
> 6: __rustc[6c289b9f9c454d21]::rust_begin_unwind <unknown>
55.73 s
> at <unknown source file> :<unknown line>
55.73 s
> 7: core[940e698046960fd5]::panicking::panic_fmt <unknown>
55.73 s
> at <unknown source file> :<unknown line>
55.73 s
> 8: core[940e698046960fd5]::panicking::assert_failed_inner <unknown>
55.73 s
> at <unknown source file> :<unknown line>
55.73 s
> 9: core[940e698046960fd5]::panicking::assert_failed::<symbolica[499970c26fd75ddd]::atom::Atom, symbolica[499970c26fd75ddd]::atom::Atom> <unknown>
55.73 s
> at <unknown source file> :<unknown line>
55.73 s
> 10: gammalooprs[24955f93fc9f4e0c]::graph::three_d_source::tests::exact_taylor_vacuum_affine_circulation_preserves_energy_mapping <unknown>
55.73 s
> at <unknown source file> :<unknown line>
55.73 s
> 11: <gammalooprs[24955f93fc9f4e0c]::graph::three_d_source::tests::exact_taylor_vacuum_affine_circulation_preserves_energy_mapping::{closure#0} as core[940e698046960fd5]::ops::function::FnOnce<()>>::call_once <unknown>
55.73 s
> at <unknown source file> :<unknown line>
55.73 s
> 12: test[75d6903177b1d7e9]::__rust_begin_short_backtrace::<core[940e698046960fd5]::result::Result<(), alloc[2ea6bcb46fca0c42]::string::String>, fn() -> core[940e698046960fd5]::result::Result<(), alloc[2ea6bcb46fca0c42]::string::String>> <unknown>
55.73 s
> at <unknown source file> :<unknown line>
55.73 s
> 13: test[75d6903177b1d7e9]::run_test::{closure#0} <unknown>
55.73 s
> at <unknown source file> :<unknown line>
55.73 s
> 14: std[bcb96dfbba0ab899]::sys::backtrace::__rust_begin_short_backtrace::<test[75d6903177b1d7e9]::run_test::{closure#1}, ()> <unknown>
55.73 s
> at <unknown source file> :<unknown line>
55.73 s
> 15: <std[bcb96dfbba0ab899]::thread::lifecycle::spawn_unchecked<test[75d6903177b1d7e9]::run_test::{closure#1}, ()>::{closure#1} as core[940e698046960fd5]::ops::function::FnOnce<()>>::call_once::{shim:vtable#0} <unknown>
55.73 s
> at <unknown source file> :<unknown line>
55.73 s
> 16: <std[bcb96dfbba0ab899]::sys::thread::unix::Thread>::new::thread_start <unknown>
55.73 s
> at <unknown source file> :<unknown line>
55.73 s
> 17: start_thread <unknown>
55.73 s
> at <unknown source file> :<unknown line>
55.73 s
> 18: __clone3 <unknown>
55.73 s
> at <unknown source file> :<unknown line>
55.73 s
>
55.73 s
> Run with COLORBT_SHOW_HIDDEN=1 environment variable to disable frame filtering.
55.73 s
> Run with RUST_BACKTRACE=full to include source snippets.
55.73 s
>
55.73 s
> FAIL [ 0.117s] (161/692) gammalooprs graph::three_d_source::tests :: pinched_affine_carrier_requires_occurrence_interpolation
55.73 s
> stdout ---
55.73 s
>
55.73 s
> running 1 test
55.73 s
> test graph::three_d_source::tests::pinched_affine_carrier_requires_occurrence_interpolation ... FAILED
55.73 s
>
55.73 s
> failures:
55.73 s
>
55.73 s
> failures:
55.73 s
> graph::three_d_source::tests::pinched_affine_carrier_requires_occurrence_interpolation
55.73 s
>
55.73 s
> test result: FAILED. 0 passed; 1 failed; 0 ignored; 0 measured; 742 filtered out; finished in 0.11s
55.73 s
>
55.73 s
> stderr ---
55.73 s
> The application panicked (crashed).
55.73 s
> Message: certified affine occurrence lift must reproduce the independent double contours: actual=-(-1/16*(3+E0)*(5+E0)/((1+Q(0,cind(1))^2+Q(0,cind(2))^2+Q(0,cind(3))^2)^(3/2)*(1+Q(1,cind(1))^2+Q(1,cind(2))^2+Q(1,cind(3))^2)^(3/2))-1/16*(3+E1)*(5+E1)/((1+Q(0,cind(1))^2+Q(0,cind(2))^2+Q(0,cind(3))^2)^(3/2)*(1+Q(1,cind(1))^2+Q(1,cind(2))^2+Q(1,cind(3))^2)^(3/2))-1/16*(3-E0)*(5-E0)/((1+Q(0,cind(1))^2+Q(0,cind(2))^2+Q(0,cind(3))^2)^(3/2)*(1+Q(1,cind(1))^2+Q(1,cind(2))^2+Q(1,cind(3))^2)^(3/2))-1/16*(3-E1)*(5-E1)/((1+Q(0,cind(1))^2+Q(0,cind(2))^2+Q(0,cind(3))^2)^(3/2)*(1+Q(1,cind(1))^2+Q(1,cind(2))^2+Q(1,cind(3))^2)^(3/2))+1/64*(3+E0+E1)*(5+E0+E1)/((1+Q(0,cind(1))^2+Q(0,cind(2))^2+Q(0,cind(3))^2)^(3/2)*(1+Q(1,cind(1))^2+Q(1,cind(2))^2+Q(1,cind(3))^2)^(3/2))+1/64*(3+E0-E1)*(5+E0-E1)/((1+Q(0,cind(1))^2+Q(0,cind(2))^2+Q(0,cind(3))^2)^(3/2)*(1+Q(1,cind(1))^2+Q(1,cind(2))^2+Q(1,cind(3))^2)^(3/2))+1/64*(3-E0+E1)*(5-E0+E1)/((1+Q(0,cind(1))^2+Q(0,cind(2))^2+Q(0,cind(3))^2)^(3/2)*(1+Q(1,cind(1))^2+Q(1,cind(2))^2+Q(1,cind(3))^2)^(3/2))+1/64*(3-E0-E1)*(5-E0-E1)/((1+Q(0,cind(1))^2+Q(0,cind(2))^2+Q(0,cind(3))^2)^(3/2)*(1+Q(1,cind(1))^2+Q(1,cind(2))^2+Q(1,cind(3))^2)^(3/2))+15/4/((1+Q(0,cind(1))^2+Q(0,cind(2))^2+Q(0,cind(3))^2)^(3/2)*(1+Q(1,cind(1))^2+Q(1,cind(2))^2+Q(1,cind(3))^2)^(3/2))), expected=1/16*(15-E0^2-E1^2)/(E0^3*E1^3)
55.73 s
> Location: crates/gammalooprs/src/graph/three_d_source.rs :7619
55.73 s
>
55.73 s
> ━━━━━━━━━━━━━━━━━━━━━━━━━━━━━━━━━━ BACKTRACE ━━━━━━━━━━━━━━━━━━━━━━━━━━━━━━━━━━━
55.73 s
> 1: <color_eyre[51793ea62743adbd]::config::PanicHook>::panic_report <unknown>
55.73 s
> at <unknown source file> :<unknown line>
55.73 s
> 2: <color_eyre[51793ea62743adbd]::config::PanicHook>::into_panic_hook::{closure#0} <unknown>
55.73 s
> at <unknown source file> :<unknown line>
55.73 s
> 3: std[bcb96dfbba0ab899]::panicking::panic_with_hook <unknown>
55.73 s
> at <unknown source file> :<unknown line>
55.73 s
> 4: std[bcb96dfbba0ab899]::panicking::panic_handler::{closure#0} <unknown>
55.73 s
> at <unknown source file> :<unknown line>
55.73 s
> 5: std[bcb96dfbba0ab899]::sys::backtrace::__rust_end_short_backtrace::<std[bcb96dfbba0ab899]::panicking::panic_handler::{closure#0}, !> <unknown>
55.73 s
> at <unknown source file> :<unknown line>
55.73 s
> 6: __rustc[6c289b9f9c454d21]::rust_begin_unwind <unknown>
55.73 s
> at <unknown source file> :<unknown line>
55.73 s
> 7: core[940e698046960fd5]::panicking::panic_fmt <unknown>
55.73 s
> at <unknown source file> :<unknown line>
55.73 s
> 8: <gammalooprs[24955f93fc9f4e0c]::graph::three_d_source::tests::pinched_affine_carrier_requires_occurrence_interpolation::{closure#0} as core[940e698046960fd5]::ops::function::FnOnce<()>>::call_once <unknown>
55.73 s
> at <unknown source file> :<unknown line>
55.73 s
> 9: test[75d6903177b1d7e9]::__rust_begin_short_backtrace::<core[940e698046960fd5]::result::Result<(), alloc[2ea6bcb46fca0c42]::string::String>, fn() -> core[940e698046960fd5]::result::Result<(), alloc[2ea6bcb46fca0c42]::string::String>> <unknown>
55.73 s
> at <unknown source file> :<unknown line>
55.73 s
> 10: test[75d6903177b1d7e9]::run_test::{closure#0} <unknown>
55.73 s
> at <unknown source file> :<unknown line>
55.73 s
> 11: std[bcb96dfbba0ab899]::sys::backtrace::__rust_begin_short_backtrace::<test[75d6903177b1d7e9]::run_test::{closure#1}, ()> <unknown>
55.73 s
> at <unknown source file> :<unknown line>
55.73 s
> 12: <std[bcb96dfbba0ab899]::thread::lifecycle::spawn_unchecked<test[75d6903177b1d7e9]::run_test::{closure#1}, ()>::{closure#1} as core[940e698046960fd5]::ops::function::FnOnce<()>>::call_once::{shim:vtable#0} <unknown>
55.73 s
> at <unknown source file> :<unknown line>
55.73 s
> 13: <std[bcb96dfbba0ab899]::sys::thread::unix::Thread>::new::thread_start <unknown>
55.73 s
> at <unknown source file> :<unknown line>
55.73 s
> 14: start_thread <unknown>
55.73 s
> at <unknown source file> :<unknown line>
55.73 s
> 15: __clone3 <unknown>
55.73 s
> at <unknown source file> :<unknown line>
55.73 s
>
55.73 s
> Run with COLORBT_SHOW_HIDDEN=1 environment variable to disable frame filtering.
55.73 s
> Run with RUST_BACKTRACE=full to include source snippets.
55.73 s
>
55.73 s
> FAIL [ 0.014s] (286/692) gammalooprs numerator::energy_degree::tests :: canonical_class_cyclic_lifts_preserve_factorization_and_exact_bounds
55.73 s
> stdout ---
55.73 s
>
55.73 s
> running 1 test
55.73 s
> test numerator::energy_degree::tests::canonical_class_cyclic_lifts_preserve_factorization_and_exact_bounds ... FAILED
55.73 s
>
55.73 s
> failures:
55.73 s
>
55.73 s
> failures:
55.73 s
> numerator::energy_degree::tests::canonical_class_cyclic_lifts_preserve_factorization_and_exact_bounds
55.73 s
>
55.73 s
> test result: FAILED. 0 passed; 1 failed; 0 ignored; 0 measured; 742 filtered out; finished in 0.01s
55.73 s
>
55.73 s
> stderr ---
55.73 s
>
55.73 s
> thread 'numerator::energy_degree::tests::canonical_class_cyclic_lifts_preserve_factorization_and_exact_bounds' (2265) panicked at crates/gammalooprs/src/numerator/energy_degree.rs:2850:13:
55.73 s
> assertion failed: (collapsed - expression).collect_factors().is_zero()
55.73 s
> stack backtrace:
55.73 s
> 0: __rustc::rust_begin_unwind
55.73 s
> 1: core::panicking::panic_fmt
55.73 s
> 2: core::panicking::panic
55.73 s
> 3: gammalooprs::numerator::energy_degree::tests::canonical_class_cyclic_lifts_preserve_factorization_and_exact_bounds
55.73 s
> 4: <gammalooprs::numerator::energy_degree::tests::canonical_class_cyclic_lifts_preserve_factorization_and_exact_bounds::{closure#0} as core::ops::function::FnOnce<()>>::call_once
55.73 s
> note: Some details are omitted, run with `RUST_BACKTRACE=full` for a verbose backtrace.
55.73 s
>
55.73 s
> FAIL [ 0.074s] (587/692) gammalooprs uv::approx::local_4d::tests :: canonical_uv_classes_certify_signed_aliases_and_preserve_raw_sectors
55.73 s
> stdout ---
55.73 s
>
55.73 s
> running 1 test
55.73 s
> test uv::approx::local_4d::tests::canonical_uv_classes_certify_signed_aliases_and_preserve_raw_sectors ... FAILED
55.73 s
>
55.73 s
> failures:
55.73 s
>
55.73 s
> failures:
55.73 s
> uv::approx::local_4d::tests::canonical_uv_classes_certify_signed_aliases_and_preserve_raw_sectors
55.73 s
>
55.73 s
> test result: FAILED. 0 passed; 1 failed; 0 ignored; 0 measured; 742 filtered out; finished in 0.07s
55.73 s
>
55.73 s
> stderr ---
55.73 s
> Error:
55.73 s
> 0: merged canonical UV numerator does not reproduce its source bucket
55.73 s
>
55.73 s
> Location:
55.73 s
> crates/gammalooprs/src/uv/approx/local_4d.rs :367
55.73 s
>
55.73 s
> ━━━━━━━━━━━━━━━━━━━━━━━━━━━━━━━━━━ BACKTRACE ━━━━━━━━━━━━━━━━━━━━━━━━━━━━━━━━━━━
55.73 s
> 1: <color_eyre[51793ea62743adbd]::config::EyreHook>::into_eyre_hook::{closure#0} <unknown>
55.73 s
> at <unknown source file> :<unknown line>
55.73 s
> 2: eyre[cb2fd339c0c40fca]::capture_handler <unknown>
55.73 s
> at <unknown source file> :<unknown line>
55.73 s
> 3: eyre[cb2fd339c0c40fca]::private::format_err <unknown>
55.73 s
> at <unknown source file> :<unknown line>
55.73 s
> 4: <gammalooprs[24955f93fc9f4e0c]::uv::approx::local_4d::FourDSector>::canonical_projection <unknown>
55.73 s
> at <unknown source file> :<unknown line>
55.73 s
> 5: gammalooprs[24955f93fc9f4e0c]::uv::approx::local_4d::tests::canonical_uv_classes_certify_signed_aliases_and_preserve_raw_sectors <unknown>
55.73 s
> at <unknown source file> :<unknown line>
55.73 s
> 6: <gammalooprs[24955f93fc9f4e0c]::uv::approx::local_4d::tests::canonical_uv_classes_certify_signed_aliases_and_preserve_raw_sectors::{closure#0} as core[940e698046960fd5]::ops::function::FnOnce<()>>::call_once <unknown>
55.73 s
> at <unknown source file> :<unknown line>
55.73 s
> 7: test[75d6903177b1d7e9]::__rust_begin_short_backtrace::<core[940e698046960fd5]::result::Result<(), alloc[2ea6bcb46fca0c42]::string::String>, fn() -> core[940e698046960fd5]::result::Result<(), alloc[2ea6bcb46fca0c42]::string::String>> <unknown>
55.73 s
> at <unknown source file> :<unknown line>
55.73 s
> 8: test[75d6903177b1d7e9]::run_test::{closure#0} <unknown>
55.73 s
> at <unknown source file> :<unknown line>
55.73 s
> 9: std[bcb96dfbba0ab899]::sys::backtrace::__rust_begin_short_backtrace::<test[75d6903177b1d7e9]::run_test::{closure#1}, ()> <unknown>
55.73 s
> at <unknown source file> :<unknown line>
55.73 s
> 10: <std[bcb96dfbba0ab899]::thread::lifecycle::spawn_unchecked<test[75d6903177b1d7e9]::run_test::{closure#1}, ()>::{closure#1} as core[940e698046960fd5]::ops::function::FnOnce<()>>::call_once::{shim:vtable#0} <unknown>
55.73 s
> at <unknown source file> :<unknown line>
55.73 s
> 11: <std[bcb96dfbba0ab899]::sys::thread::unix::Thread>::new::thread_start <unknown>
55.73 s
> at <unknown source file> :<unknown line>
55.73 s
> 12: start_thread <unknown>
55.73 s
> at <unknown source file> :<unknown line>
55.73 s
> 13: __clone3 <unknown>
55.73 s
> at <unknown source file> :<unknown line>
55.73 s
>
55.73 s
> Run with COLORBT_SHOW_HIDDEN=1 environment variable to disable frame filtering.
55.73 s
> Run with RUST_BACKTRACE=full to include source snippets.
55.73 s
>
55.73 s
> FAIL [ 0.096s] (593/692) gammalooprs uv::approx::local_4d::tests :: canonical_uv_signed_multiloop_carriers_preserve_factorized_numerators
55.73 s
> stdout ---
55.73 s
>
55.73 s
> running 1 test
55.73 s
> test uv::approx::local_4d::tests::canonical_uv_signed_multiloop_carriers_preserve_factorized_numerators ... FAILED
55.73 s
>
55.73 s
> failures:
55.73 s
>
55.73 s
> failures:
55.73 s
> uv::approx::local_4d::tests::canonical_uv_signed_multiloop_carriers_preserve_factorized_numerators
55.73 s
>
55.73 s
> test result: FAILED. 0 passed; 1 failed; 0 ignored; 0 measured; 742 filtered out; finished in 0.08s
55.73 s
>
55.73 s
> stderr ---
55.73 s
> The application panicked (crashed).
55.73 s
> Message: assertion `left == right` failed
55.73 s
> left: 2*(signed_multiloop::a+signed_multiloop::b)^5*gammalooprs::Q(gammalooprs::uv::class(0),spenso::cind(0))
55.73 s
> right: -2*(signed_multiloop::a+signed_multiloop::b)^5*gammalooprs::Q(gammalooprs::uv::class(0),spenso::cind(0))
55.73 s
> Location: crates/gammalooprs/src/uv/approx/local_4d.rs :1983
55.73 s
>
55.73 s
> ━━━━━━━━━━━━━━━━━━━━━━━━━━━━━━━━━━ BACKTRACE ━━━━━━━━━━━━━━━━━━━━━━━━━━━━━━━━━━━
55.73 s
> 1: <color_eyre[51793ea62743adbd]::config::PanicHook>::panic_report <unknown>
55.73 s
> at <unknown source file> :<unknown line>
55.73 s
> 2: <color_eyre[51793ea62743adbd]::config::PanicHook>::into_panic_hook::{closure#0} <unknown>
55.73 s
> at <unknown source file> :<unknown line>
55.73 s
> 3: std[bcb96dfbba0ab899]::panicking::panic_with_hook <unknown>
55.73 s
> at <unknown source file> :<unknown line>
55.73 s
> 4: std[bcb96dfbba0ab899]::panicking::panic_handler::{closure#0} <unknown>
55.73 s
> at <unknown source file> :<unknown line>
55.73 s
> 5: std[bcb96dfbba0ab899]::sys::backtrace::__rust_end_short_backtrace::<std[bcb96dfbba0ab899]::panicking::panic_handler::{closure#0}, !> <unknown>
55.73 s
> at <unknown source file> :<unknown line>
55.73 s
> 6: __rustc[6c289b9f9c454d21]::rust_begin_unwind <unknown>
55.73 s
> at <unknown source file> :<unknown line>
55.73 s
> 7: core[940e698046960fd5]::panicking::panic_fmt <unknown>
55.73 s
> at <unknown source file> :<unknown line>
55.73 s
> 8: core[940e698046960fd5]::panicking::assert_failed_inner <unknown>
55.73 s
> at <unknown source file> :<unknown line>
55.73 s
> 9: core[940e698046960fd5]::panicking::assert_failed::<symbolica[499970c26fd75ddd]::atom::Atom, symbolica[499970c26fd75ddd]::atom::Atom> <unknown>
55.73 s
> at <unknown source file> :<unknown line>
55.73 s
> 10: gammalooprs[24955f93fc9f4e0c]::uv::approx::local_4d::tests::canonical_uv_signed_multiloop_carriers_preserve_factorized_numerators <unknown>
55.73 s
> at <unknown source file> :<unknown line>
55.73 s
> 11: <gammalooprs[24955f93fc9f4e0c]::uv::approx::local_4d::tests::canonical_uv_signed_multiloop_carriers_preserve_factorized_numerators::{closure#0} as core[940e698046960fd5]::ops::function::FnOnce<()>>::call_once <unknown>
55.73 s
> at <unknown source file> :<unknown line>
55.73 s
> 12: test[75d6903177b1d7e9]::__rust_begin_short_backtrace::<core[940e698046960fd5]::result::Result<(), alloc[2ea6bcb46fca0c42]::string::String>, fn() -> core[940e698046960fd5]::result::Result<(), alloc[2ea6bcb46fca0c42]::string::String>> <unknown>
55.73 s
> at <unknown source file> :<unknown line>
55.73 s
> 13: test[75d6903177b1d7e9]::run_test::{closure#0} <unknown>
55.73 s
> at <unknown source file> :<unknown line>
55.73 s
> 14: std[bcb96dfbba0ab899]::sys::backtrace::__rust_begin_short_backtrace::<test[75d6903177b1d7e9]::run_test::{closure#1}, ()> <unknown>
55.73 s
> at <unknown source file> :<unknown line>
55.73 s
> 15: <std[bcb96dfbba0ab899]::thread::lifecycle::spawn_unchecked<test[75d6903177b1d7e9]::run_test::{closure#1}, ()>::{closure#1} as core[940e698046960fd5]::ops::function::FnOnce<()>>::call_once::{shim:vtable#0} <unknown>
55.73 s
> at <unknown source file> :<unknown line>
55.73 s
> 16: <std[bcb96dfbba0ab899]::sys::thread::unix::Thread>::new::thread_start <unknown>
55.73 s
> at <unknown source file> :<unknown line>
55.73 s
> 17: start_thread <unknown>
55.73 s
> at <unknown source file> :<unknown line>
55.73 s
> 18: __clone3 <unknown>
55.73 s
> at <unknown source file> :<unknown line>
55.73 s
>
55.73 s
> Run with COLORBT_SHOW_HIDDEN=1 environment variable to disable frame filtering.
55.73 s
> Run with RUST_BACKTRACE=full to include source snippets.
55.73 s
>
55.73 s
> FAIL [ 0.112s] (605/692) gammalooprs uv::approx::tests :: direct_nested_scalar_banana_replays_complete_cff_at_depth_three
55.73 s
> stdout ---
55.73 s
>
55.73 s
> running 1 test
55.73 s
> test uv::approx::tests::direct_nested_scalar_banana_replays_complete_cff_at_depth_three ... FAILED
55.73 s
>
55.73 s
> failures:
55.73 s
>
55.73 s
> failures:
55.73 s
> uv::approx::tests::direct_nested_scalar_banana_replays_complete_cff_at_depth_three
55.73 s
>
55.73 s
> test result: FAILED. 0 passed; 1 failed; 0 ignored; 0 measured; 742 filtered out; finished in 0.10s
55.73 s
>
55.73 s
> stderr ---
55.73 s
> Error:
55.73 s
> 0: canonical UV numerator does not reproduce its source in the component frame
55.73 s
>
55.73 s
> Location:
55.73 s
> crates/gammalooprs/src/uv/approx/local_4d.rs :354
55.73 s
>
55.73 s
> ━━━━━━━━━━━━━━━━━━━━━━━━━━━━━━━━━━ BACKTRACE ━━━━━━━━━━━━━━━━━━━━━━━━━━━━━━━━━━━
55.73 s
> 1: <color_eyre[51793ea62743adbd]::config::EyreHook>::into_eyre_hook::{closure#0} <unknown>
55.73 s
> at <unknown source file> :<unknown line>
55.73 s
> 2: eyre[cb2fd339c0c40fca]::capture_handler <unknown>
55.73 s
> at <unknown source file> :<unknown line>
55.73 s
> 3: eyre[cb2fd339c0c40fca]::private::format_err <unknown>
55.73 s
> at <unknown source file> :<unknown line>
55.73 s
> 4: <gammalooprs[24955f93fc9f4e0c]::uv::approx::local_4d::FourDSector>::canonical_projection <unknown>
55.73 s
> at <unknown source file> :<unknown line>
55.73 s
> 5: <gammalooprs[24955f93fc9f4e0c]::uv::approx::projected_4d::Projected4dApproximation>::project_local_4d <unknown>
55.73 s
> at <unknown source file> :<unknown line>
55.73 s
> 6: <gammalooprs[24955f93fc9f4e0c]::uv::approx::Approximation>::compute_3d <unknown>
55.73 s
> at <unknown source file> :<unknown line>
55.73 s
> 7: gammalooprs[24955f93fc9f4e0c]::uv::approx::tests::direct_nested_scalar_banana_replays_complete_cff_at_depth_three::{closure#0} <unknown>
55.73 s
> at <unknown source file> :<unknown line>
55.73 s
> 8: gammalooprs[24955f93fc9f4e0c]::uv::approx::tests::direct_nested_scalar_banana_replays_complete_cff_at_depth_three <unknown>
55.73 s
> at <unknown source file> :<unknown line>
55.73 s
> 9: <gammalooprs[24955f93fc9f4e0c]::uv::approx::tests::direct_nested_scalar_banana_replays_complete_cff_at_depth_three::{closure#0} as core[940e698046960fd5]::ops::function::FnOnce<()>>::call_once <unknown>
55.73 s
> at <unknown source file> :<unknown line>
55.73 s
> 10: test[75d6903177b1d7e9]::__rust_begin_short_backtrace::<core[940e698046960fd5]::result::Result<(), alloc[2ea6bcb46fca0c42]::string::String>, fn() -> core[940e698046960fd5]::result::Result<(), alloc[2ea6bcb46fca0c42]::string::String>> <unknown>
55.73 s
> at <unknown source file> :<unknown line>
55.73 s
> 11: test[75d6903177b1d7e9]::run_test::{closure#0} <unknown>
55.73 s
> at <unknown source file> :<unknown line>
55.73 s
> 12: std[bcb96dfbba0ab899]::sys::backtrace::__rust_begin_short_backtrace::<test[75d6903177b1d7e9]::run_test::{closure#1}, ()> <unknown>
55.73 s
> at <unknown source file> :<unknown line>
55.73 s
> 13: <std[bcb96dfbba0ab899]::thread::lifecycle::spawn_unchecked<test[75d6903177b1d7e9]::run_test::{closure#1}, ()>::{closure#1} as core[940e698046960fd5]::ops::function::FnOnce<()>>::call_once::{shim:vtable#0} <unknown>
55.73 s
> at <unknown source file> :<unknown line>
55.73 s
> 14: <std[bcb96dfbba0ab899]::sys::thread::unix::Thread>::new::thread_start <unknown>
55.73 s
> at <unknown source file> :<unknown line>
55.73 s
> 15: start_thread <unknown>
55.73 s
> at <unknown source file> :<unknown line>
55.73 s
> 16: __clone3 <unknown>
55.73 s
> at <unknown source file> :<unknown line>
55.73 s
>
55.73 s
> Run with COLORBT_SHOW_HIDDEN=1 environment variable to disable frame filtering.
55.73 s
> Run with RUST_BACKTRACE=full to include source snippets.
55.73 s
>
55.73 s
> error : test run failed
55.73 s
>
55.73 s
> ========== nextest test summary ==========
55.73 s
> report: target/nextest/ci_gammaloop/junit.xml
55.73 s
> tests: 692, failures: 6, errors: 0
55.73 s
>
55.73 s
> 1. gammalooprs::graph::three_d_source::tests::exact_taylor_vacuum_affine_circulation_preserves_energy_mapping
55.73 s
> failure: test failure with exit code 101
55.73 s
> system-out
55.73 s
> running 1 test
55.73 s
> test graph::three_d_source::tests::exact_taylor_vacuum_affine_circulation_preserves_energy_mapping ... FAILED
55.73 s
>
55.73 s
> failures:
55.73 s
>
55.73 s
> failures:
55.73 s
> graph::three_d_source::tests::exact_taylor_vacuum_affine_circulation_preserves_energy_mapping
55.73 s
>
55.73 s
> test result: FAILED. 0 passed; 1 failed; 0 ignored; 0 measured; 742 filtered out; finished in 0.10s
55.73 s
> system-err
55.73 s
> The application panicked (crashed).
55.73 s
> Message: assertion `left == right` failed
55.73 s
> left: (gammalooprs::mUVexp^2+(-gammalooprs::Q(1,spenso::cind(1))+gammalooprs::Q(4,spenso::cind(1)))^2+(-gammalooprs::Q(1,spenso::cind(2))+gammalooprs::Q(4,spenso::cind(2)))^2+(-gammalooprs::Q(1,spenso::cind(3))+gammalooprs::Q(4,spenso::cind(3)))^2)^(1/2)
55.73 s
> right: (gammalooprs::mUVexp^2+(gammalooprs::Q(1,spenso::cind(1))-gammalooprs::Q(4,spenso::cind(1)))^2+(gammalooprs::Q(1,spenso::cind(2))-gammalooprs::Q(4,spenso::cind(2)))^2+(gammalooprs::Q(1,spenso::cind(3))-gammalooprs::Q(4,spenso::cind(3)))^2)^(1/2)
55.73 s
> Location: crates/gammalooprs/src/graph/three_d_source.rs:7797
55.73 s
>
55.73 s
> ━━━━━━━━━━━━━━━━━━━━━━━━━━━━━━━━━━ BACKTRACE ━━━━━━━━━━━━━━━━━━━━━━━━━━━━━━━━━━━
55.73 s
> 1: <color_eyre[51793ea62743adbd]::config::PanicHook>::panic_report<unknown>
55.73 s
> at <unknown source file>:<unknown line>
55.73 s
> 2: <color_eyre[51793ea62743adbd]::config::PanicHook>::into_panic_hook::{closure#0}<unknown>
55.73 s
> at <unknown source file>:<unknown line>
55.73 s
> 3: std[bcb96dfbba0ab899]::panicking::panic_with_hook<unknown>
55.73 s
> at <unknown source file>:<unknown line>
55.73 s
> 4: std[bcb96dfbba0ab899]::panicking::panic_handler::{closure#0}<unknown>
55.73 s
> at <unknown source file>:<unknown line>
55.73 s
> 5: std[bcb96dfbba0ab899]::sys::backtrace::__rust_end_short_backtrace::<std[bcb96dfbba0ab899]::panicking::panic_handler::{closure#0}, !><unknown>
55.73 s
> at <unknown source file>:<unknown line>
55.73 s
> 6: __rustc[6c289b9f9c454d21]::rust_begin_unwind<unknown>
55.73 s
> at <unknown source file>:<unknown line>
55.73 s
> 7: core[940e698046960fd5]::panicking::panic_fmt<unknown>
55.73 s
> at <unknown source file>:<unknown line>
55.73 s
> 8: core[940e698046960fd5]::panicking::assert_failed_inner<unknown>
55.73 s
> at <unknown source file>:<unknown line>
55.73 s
> 9: core[940e698046960fd5]::panicking::assert_failed::<symbolica[499970c26fd75ddd]::atom::Atom, symbolica[499970c26fd75ddd]::atom::Atom><unknown>
55.73 s
> at <unknown source file>:<unknown line>
55.73 s
> 10: gammalooprs[24955f93fc9f4e0c]::graph::three_d_source::tests::exact_taylor_vacuum_affine_circulation_preserves_energy_mapping<unknown>
55.73 s
> at <unknown source file>:<unknown line>
55.73 s
> 11: <gammalooprs[24955f93fc9f4e0c]::graph::three_d_source::tests::exact_taylor_vacuum_affine_circulation_preserves_energy_mapping::{closure#0} as core[940e698046960fd5]::ops::function::FnOnce<()>>::call_once<unknown>
55.73 s
> at <unknown source file>:<unknown line>
55.73 s
> 12: test[75d6903177b1d7e9]::__rust_begin_short_backtrace::<core[940e698046960fd5]::result::Result<(), alloc[2ea6bcb46fca0c42]::string::String>, fn() -> core[940e698046960fd5]::result::Result<(), alloc[2ea6bcb46fca0c42]::string::String>><unknown>
55.73 s
> at <unknown source file>:<unknown line>
55.73 s
> 13: test[75d6903177b1d7e9]::run_test::{closure#0}<unknown>
55.73 s
> at <unknown source file>:<unknown line>
55.73 s
> 14: std[bcb96dfbba0ab899]::sys::backtrace::__rust_begin_short_backtrace::<test[75d6903177b1d7e9]::run_test::{closure#1}, ()><unknown>
55.73 s
> at <unknown source file>:<unknown line>
55.73 s
> 15: <std[bcb96dfbba0ab899]::thread::lifecycle::spawn_unchecked<test[75d6903177b1d7e9]::run_test::{closure#1}, ()>::{closure#1} as core[940e698046960fd5]::ops::function::FnOnce<()>>::call_once::{shim:vtable#0}<unknown>
55.73 s
> at <unknown source file>:<unknown line>
55.73 s
> 16: <std[bcb96dfbba0ab899]::sys::thread::unix::Thread>::new::thread_start<unknown>
55.73 s
> at <unknown source file>:<unknown line>
55.73 s
> 17: start_thread<unknown>
55.73 s
> at <unknown source file>:<unknown line>
55.73 s
> 18: __clone3<unknown>
55.73 s
> at <unknown source file>:<unknown line>
55.73 s
>
55.73 s
> Run with COLORBT_SHOW_HIDDEN=1 environment variable to disable frame filtering.
55.73 s
> Run with RUST_BACKTRACE=full to include source snippets.
55.73 s
>
55.73 s
> 2. gammalooprs::graph::three_d_source::tests::pinched_affine_carrier_requires_occurrence_interpolation
55.73 s
> failure: test failure with exit code 101
55.73 s
> system-out
55.73 s
> running 1 test
55.73 s
> test graph::three_d_source::tests::pinched_affine_carrier_requires_occurrence_interpolation ... FAILED
55.73 s
>
55.73 s
> failures:
55.73 s
>
55.73 s
> failures:
55.73 s
> graph::three_d_source::tests::pinched_affine_carrier_requires_occurrence_interpolation
55.73 s
>
55.73 s
> test result: FAILED. 0 passed; 1 failed; 0 ignored; 0 measured; 742 filtered out; finished in 0.11s
55.73 s
> system-err
55.73 s
> The application panicked (crashed).
55.73 s
> Message: certified affine occurrence lift must reproduce the independent double contours: actual=-(-1/16*(3+E0)*(5+E0)/((1+Q(0,cind(1))^2+Q(0,cind(2))^2+Q(0,cind(3))^2)^(3/2)*(1+Q(1,cind(1))^2+Q(1,cind(2))^2+Q(1,cind(3))^2)^(3/2))-1/16*(3+E1)*(5+E1)/((1+Q(0,cind(1))^2+Q(0,cind(2))^2+Q(0,cind(3))^2)^(3/2)*(1+Q(1,cind(1))^2+Q(1,cind(2))^2+Q(1,cind(3))^2)^(3/2))-1/16*(3-E0)*(5-E0)/((1+Q(0,cind(1))^2+Q(0,cind(2))^2+Q(0,cind(3))^2)^(3/2)*(1+Q(1,cind(1))^2+Q(1,cind(2))^2+Q(1,cind(3))^2)^(3/2))-1/16*(3-E1)*(5-E1)/((1+Q(0,cind(1))^2+Q(0,cind(2))^2+Q(0,cind(3))^2)^(3/2)*(1+Q(1,cind(1))^2+Q(1,cind(2))^2+Q(1,cind(3))^2)^(3/2))+1/64*(3+E0+E1)*(5+E0+E1)/((1+Q(0,cind(1))^2+Q(0,cind(2))^2+Q(0,cind(3))^2)^(3/2)*(1+Q(1,cind(1))^2+Q(1,cind(2))^2+Q(1,cind(3))^2)^(3/2))+1/64*(3+E0-E1)*(5+E0-E1)/((1+Q(0,cind(1))^2+Q(0,cind(2))^2+Q(0,cind(3))^2)^(3/2)*(1+Q(1,cind(1))^2+Q(1,cind(2))^2+Q(1,cind(3))^2)^(3/2))+1/64*(3-E0+E1)*(5-E0+E1)/((1+Q(0,cind(1))^2+Q(0,cind(2))^2+Q(0,cind(3))^2)^(3/2)*(1+Q(1,cind(1))^2+Q(1,cind(2))^2+Q(1,cind(3))^2)^(3/2))+1/64*(3-E0-E1)*(5-E0-E1)/((1+Q(0,cind(1))^2+Q(0,cind(2))^2+Q(0,cind(3))^2)^(3/2)*(1+Q(1,cind(1))^2+Q(1,cind(2))^2+Q(1,cind(3))^2)^(3/2))+15/4/((1+Q(0,cind(1))^2+Q(0,cind(2))^2+Q(0,cind(3))^2)^(3/2)*(1+Q(1,cind(1))^2+Q(1,cind(2))^2+Q(1,cind(3))^2)^(3/2))), expected=1/16*(15-E0^2-E1^2)/(E0^3*E1^3)
55.73 s
> Location: crates/gammalooprs/src/graph/three_d_source.rs:7619
55.73 s
>
55.73 s
> ━━━━━━━━━━━━━━━━━━━━━━━━━━━━━━━━━━ BACKTRACE ━━━━━━━━━━━━━━━━━━━━━━━━━━━━━━━━━━━
55.73 s
> 1: <color_eyre[51793ea62743adbd]::config::PanicHook>::panic_report<unknown>
55.73 s
> at <unknown source file>:<unknown line>
55.73 s
> 2: <color_eyre[51793ea62743adbd]::config::PanicHook>::into_panic_hook::{closure#0}<unknown>
55.73 s
> at <unknown source file>:<unknown line>
55.73 s
> 3: std[bcb96dfbba0ab899]::panicking::panic_with_hook<unknown>
55.73 s
> at <unknown source file>:<unknown line>
55.73 s
> 4: std[bcb96dfbba0ab899]::panicking::panic_handler::{closure#0}<unknown>
55.73 s
> at <unknown source file>:<unknown line>
55.73 s
> 5: std[bcb96dfbba0ab899]::sys::backtrace::__rust_end_short_backtrace::<std[bcb96dfbba0ab899]::panicking::panic_handler::{closure#0}, !><unknown>
55.73 s
> at <unknown source file>:<unknown line>
55.73 s
> 6: __rustc[6c289b9f9c454d21]::rust_begin_unwind<unknown>
55.73 s
> at <unknown source file>:<unknown line>
55.73 s
> 7: core[940e698046960fd5]::panicking::panic_fmt<unknown>
55.73 s
> at <unknown source file>:<unknown line>
55.73 s
> 8: <gammalooprs[24955f93fc9f4e0c]::graph::three_d_source::tests::pinched_affine_carrier_requires_occurrence_interpolation::{closure#0} as core[940e698046960fd5]::ops::function::FnOnce<()>>::call_once<unknown>
55.73 s
> at <unknown source file>:<unknown line>
55.73 s
> 9: test[75d6903177b1d7e9]::__rust_begin_short_backtrace::<core[940e698046960fd5]::result::Result<(), alloc[2ea6bcb46fca0c42]::string::String>, fn() -> core[940e698046960fd5]::result::Result<(), alloc[2ea6bcb46fca0c42]::string::String>><unknown>
55.73 s
> at <unknown source file>:<unknown line>
55.73 s
> 10: test[75d6903177b1d7e9]::run_test::{closure#0}<unknown>
55.73 s
> at <unknown source file>:<unknown line>
55.73 s
> 11: std[bcb96dfbba0ab899]::sys::backtrace::__rust_begin_short_backtrace::<test[75d6903177b1d7e9]::run_test::{closure#1}, ()><unknown>
55.73 s
> at <unknown source file>:<unknown line>
55.73 s
> 12: <std[bcb96dfbba0ab899]::thread::lifecycle::spawn_unchecked<test[75d6903177b1d7e9]::run_test::{closure#1}, ()>::{closure#1} as core[940e698046960fd5]::ops::function::FnOnce<()>>::call_once::{shim:vtable#0}<unknown>
55.73 s
> at <unknown source file>:<unknown line>
55.73 s
> 13: <std[bcb96dfbba0ab899]::sys::thread::unix::Thread>::new::thread_start<unknown>
55.73 s
> at <unknown source file>:<unknown line>
55.73 s
> 14: start_thread<unknown>
55.73 s
> at <unknown source file>:<unknown line>
55.73 s
> 15: __clone3<unknown>
55.73 s
> at <unknown source file>:<unknown line>
55.73 s
>
55.73 s
> Run with COLORBT_SHOW_HIDDEN=1 environment variable to disable frame filtering.
55.73 s
> Run with RUST_BACKTRACE=full to include source snippets.
55.73 s
>
55.73 s
> 3. gammalooprs::numerator::energy_degree::tests::canonical_class_cyclic_lifts_preserve_factorization_and_exact_bounds
55.73 s
> failure: test failure with exit code 101
55.73 s
> thread 'numerator::energy_degree::tests::canonical_class_cyclic_lifts_preserve_factorization_and_exact_bounds' (2265) panicked at crates/gammalooprs/src/numerator/energy_degree.rs:2850:13:
55.73 s
> assertion failed: (collapsed - expression).collect_factors().is_zero()
55.73 s
> stack backtrace:
55.73 s
> 0: __rustc::rust_begin_unwind
55.73 s
> 1: core::panicking::panic_fmt
55.73 s
> 2: core::panicking::panic
55.73 s
> 3: gammalooprs::numerator::energy_degree::tests::canonical_class_cyclic_lifts_preserve_factorization_and_exact_bounds
55.73 s
> 4: <gammalooprs::numerator::energy_degree::tests::canonical_class_cyclic_lifts_preserve_factorization_and_exact_bounds::{closure#0} as core::ops::function::FnOnce<()>>::call_once
55.73 s
> note: Some details are omitted, run with `RUST_BACKTRACE=full` for a verbose backtrace.
55.73 s
> system-out
55.73 s
> running 1 test
55.73 s
> test numerator::energy_degree::tests::canonical_class_cyclic_lifts_preserve_factorization_and_exact_bounds ... FAILED
55.73 s
>
55.73 s
> failures:
55.73 s
>
55.73 s
> failures:
55.73 s
> numerator::energy_degree::tests::canonical_class_cyclic_lifts_preserve_factorization_and_exact_bounds
55.73 s
>
55.73 s
> test result: FAILED. 0 passed; 1 failed; 0 ignored; 0 measured; 742 filtered out; finished in 0.01s
55.73 s
> system-err
55.73 s
> thread 'numerator::energy_degree::tests::canonical_class_cyclic_lifts_preserve_factorization_and_exact_bounds' (2265) panicked at crates/gammalooprs/src/numerator/energy_degree.rs:2850:13:
55.73 s
> assertion failed: (collapsed - expression).collect_factors().is_zero()
55.73 s
> stack backtrace:
55.73 s
> 0: __rustc::rust_begin_unwind
55.73 s
> 1: core::panicking::panic_fmt
55.73 s
> 2: core::panicking::panic
55.73 s
> 3: gammalooprs::numerator::energy_degree::tests::canonical_class_cyclic_lifts_preserve_factorization_and_exact_bounds
55.73 s
> 4: <gammalooprs::numerator::energy_degree::tests::canonical_class_cyclic_lifts_preserve_factorization_and_exact_bounds::{closure#0} as core::ops::function::FnOnce<()>>::call_once
55.73 s
> note: Some details are omitted, run with `RUST_BACKTRACE=full` for a verbose backtrace.
55.73 s
>
55.73 s
> 4. gammalooprs::uv::approx::local_4d::tests::canonical_uv_classes_certify_signed_aliases_and_preserve_raw_sectors
55.73 s
> failure: test failure with exit code 101
55.73 s
> Error:
55.73 s
> 0: merged canonical UV numerator does not reproduce its source bucket
55.73 s
>
55.73 s
> Location:
55.73 s
> crates/gammalooprs/src/uv/approx/local_4d.rs:367
55.73 s
>
55.73 s
> ━━━━━━━━━━━━━━━━━━━━━━━━━━━━━━━━━━ BACKTRACE ━━━━━━━━━━━━━━━━━━━━━━━━━━━━━━━━━━━
55.73 s
> 1: <color_eyre[51793ea62743adbd]::config::EyreHook>::into_eyre_hook::{closure#0}<unknown>
55.73 s
> at <unknown source file>:<unknown line>
55.73 s
> 2: eyre[cb2fd339c0c40fca]::capture_handler<unknown>
55.73 s
> at <unknown source file>:<unknown line>
55.73 s
> 3: eyre[cb2fd339c0c40fca]::private::format_err<unknown>
55.73 s
> at <unknown source file>:<unknown line>
55.73 s
> 4: <gammalooprs[24955f93fc9f4e0c]::uv::approx::local_4d::FourDSector>::canonical_projection<unknown>
55.73 s
> at <unknown source file>:<unknown line>
55.73 s
> 5: gammalooprs[24955f93fc9f4e0c]::uv::approx::local_4d::tests::canonical_uv_classes_certify_signed_aliases_and_preserve_raw_sectors<unknown>
55.73 s
> at <unknown source file>:<unknown line>
55.73 s
> 6: <gammalooprs[24955f93fc9f4e0c]::uv::approx::local_4d::tests::canonical_uv_classes_certify_signed_aliases_and_preserve_raw_sectors::{closure#0} as core[940e698046960fd5]::ops::function::FnOnce<()>>::call_once<unknown>
55.73 s
> at <unknown source file>:<unknown line>
55.73 s
> 7: test[75d6903177b1d7e9]::__rust_begin_short_backtrace::<core[940e698046960fd5]::result::Result<(), alloc[2ea6bcb46fca0c42]::string::String>, fn() -> core[940e698046960fd5]::result::Result<(), alloc[2ea6bcb46fca0c42]::string::String>><unknown>
55.73 s
> at <unknown source file>:<unknown line>
55.73 s
> 8: test[75d6903177b1d7e9]::run_test::{closure#0}<unknown>
55.73 s
> at <unknown source file>:<unknown line>
55.73 s
> 9: std[bcb96dfbba0ab899]::sys::backtrace::__rust_begin_short_backtrace::<test[75d6903177b1d7e9]::run_test::{closure#1}, ()><unknown>
55.73 s
> at <unknown source file>:<unknown line>
55.73 s
> 10: <std[bcb96dfbba0ab899]::thread::lifecycle::spawn_unchecked<test[75d6903177b1d7e9]::run_test::{closure#1}, ()>::{closure#1} as core[940e698046960fd5]::ops::function::FnOnce<()>>::call_once::{shim:vtable#0}<unknown>
55.73 s
> at <unknown source file>:<unknown line>
55.73 s
> 11: <std[bcb96dfbba0ab899]::sys::thread::unix::Thread>::new::thread_start<unknown>
55.73 s
> at <unknown source file>:<unknown line>
55.73 s
> 12: start_thread<unknown>
55.73 s
> at <unknown source file>:<unknown line>
55.73 s
> 13: __clone3<unknown>
55.73 s
> at <unknown source file>:<unknown line>
55.73 s
>
55.73 s
> Run with COLORBT_SHOW_HIDDEN=1 environment variable to disable frame filtering.
55.73 s
> Run with RUST_BACKTRACE=full to include source snippets.
55.73 s
> system-out
55.73 s
> running 1 test
55.73 s
> test uv::approx::local_4d::tests::canonical_uv_classes_certify_signed_aliases_and_preserve_raw_sectors ... FAILED
55.73 s
>
55.73 s
> failures:
55.73 s
>
55.73 s
> failures:
55.73 s
> uv::approx::local_4d::tests::canonical_uv_classes_certify_signed_aliases_and_preserve_raw_sectors
55.73 s
>
55.73 s
> test result: FAILED. 0 passed; 1 failed; 0 ignored; 0 measured; 742 filtered out; finished in 0.07s
55.73 s
> system-err
55.73 s
> Error:
55.73 s
> 0: merged canonical UV numerator does not reproduce its source bucket
55.73 s
>
55.73 s
> Location:
55.73 s
> crates/gammalooprs/src/uv/approx/local_4d.rs:367
55.73 s
>
55.73 s
> ━━━━━━━━━━━━━━━━━━━━━━━━━━━━━━━━━━ BACKTRACE ━━━━━━━━━━━━━━━━━━━━━━━━━━━━━━━━━━━
55.73 s
> 1: <color_eyre[51793ea62743adbd]::config::EyreHook>::into_eyre_hook::{closure#0}<unknown>
55.73 s
> at <unknown source file>:<unknown line>
55.73 s
> 2: eyre[cb2fd339c0c40fca]::capture_handler<unknown>
55.73 s
> at <unknown source file>:<unknown line>
55.73 s
> 3: eyre[cb2fd339c0c40fca]::private::format_err<unknown>
55.73 s
> at <unknown source file>:<unknown line>
55.73 s
> 4: <gammalooprs[24955f93fc9f4e0c]::uv::approx::local_4d::FourDSector>::canonical_projection<unknown>
55.73 s
> at <unknown source file>:<unknown line>
55.73 s
> 5: gammalooprs[24955f93fc9f4e0c]::uv::approx::local_4d::tests::canonical_uv_classes_certify_signed_aliases_and_preserve_raw_sectors<unknown>
55.73 s
> at <unknown source file>:<unknown line>
55.73 s
> 6: <gammalooprs[24955f93fc9f4e0c]::uv::approx::local_4d::tests::canonical_uv_classes_certify_signed_aliases_and_preserve_raw_sectors::{closure#0} as core[940e698046960fd5]::ops::function::FnOnce<()>>::call_once<unknown>
55.73 s
> at <unknown source file>:<unknown line>
55.73 s
> 7: test[75d6903177b1d7e9]::__rust_begin_short_backtrace::<core[940e698046960fd5]::result::Result<(), alloc[2ea6bcb46fca0c42]::string::String>, fn() -> core[940e698046960fd5]::result::Result<(), alloc[2ea6bcb46fca0c42]::string::String>><unknown>
55.73 s
> at <unknown source file>:<unknown line>
55.73 s
> 8: test[75d6903177b1d7e9]::run_test::{closure#0}<unknown>
55.73 s
> at <unknown source file>:<unknown line>
55.73 s
> 9: std[bcb96dfbba0ab899]::sys::backtrace::__rust_begin_short_backtrace::<test[75d6903177b1d7e9]::run_test::{closure#1}, ()><unknown>
55.73 s
> at <unknown source file>:<unknown line>
55.73 s
> 10: <std[bcb96dfbba0ab899]::thread::lifecycle::spawn_unchecked<test[75d6903177b1d7e9]::run_test::{closure#1}, ()>::{closure#1} as core[940e698046960fd5]::ops::function::FnOnce<()>>::call_once::{shim:vtable#0}<unknown>
55.73 s
> at <unknown source file>:<unknown line>
55.73 s
> 11: <std[bcb96dfbba0ab899]::sys::thread::unix::Thread>::new::thread_start<unknown>
55.73 s
> at <unknown source file>:<unknown line>
55.73 s
> 12: start_thread<unknown>
55.73 s
> at <unknown source file>:<unknown line>
55.73 s
> 13: __clone3<unknown>
55.73 s
> at <unknown source file>:<unknown line>
55.73 s
>
55.73 s
> Run with COLORBT_SHOW_HIDDEN=1 environment variable to disable frame filtering.
55.73 s
> Run with RUST_BACKTRACE=full to include source snippets.
55.73 s
>
55.73 s
> 5. gammalooprs::uv::approx::local_4d::tests::canonical_uv_signed_multiloop_carriers_preserve_factorized_numerators
55.73 s
> failure: test failure with exit code 101
55.73 s
> system-out
55.73 s
> running 1 test
55.73 s
> test uv::approx::local_4d::tests::canonical_uv_signed_multiloop_carriers_preserve_factorized_numerators ... FAILED
55.73 s
>
55.73 s
> failures:
55.73 s
>
55.73 s
> failures:
55.73 s
> uv::approx::local_4d::tests::canonical_uv_signed_multiloop_carriers_preserve_factorized_numerators
55.73 s
>
55.73 s
> test result: FAILED. 0 passed; 1 failed; 0 ignored; 0 measured; 742 filtered out; finished in 0.08s
55.73 s
> system-err
55.73 s
> The application panicked (crashed).
55.73 s
> Message: assertion `left == right` failed
55.73 s
> left: 2*(signed_multiloop::a+signed_multiloop::b)^5*gammalooprs::Q(gammalooprs::uv::class(0),spenso::cind(0))
55.73 s
> right: -2*(signed_multiloop::a+signed_multiloop::b)^5*gammalooprs::Q(gammalooprs::uv::class(0),spenso::cind(0))
55.73 s
> Location: crates/gammalooprs/src/uv/approx/local_4d.rs:1983
55.73 s
>
55.73 s
> ━━━━━━━━━━━━━━━━━━━━━━━━━━━━━━━━━━ BACKTRACE ━━━━━━━━━━━━━━━━━━━━━━━━━━━━━━━━━━━
55.73 s
> 1: <color_eyre[51793ea62743adbd]::config::PanicHook>::panic_report<unknown>
55.73 s
> at <unknown source file>:<unknown line>
55.73 s
> 2: <color_eyre[51793ea62743adbd]::config::PanicHook>::into_panic_hook::{closure#0}<unknown>
55.73 s
> at <unknown source file>:<unknown line>
55.73 s
> 3: std[bcb96dfbba0ab899]::panicking::panic_with_hook<unknown>
55.73 s
> at <unknown source file>:<unknown line>
55.73 s
> 4: std[bcb96dfbba0ab899]::panicking::panic_handler::{closure#0}<unknown>
55.73 s
> at <unknown source file>:<unknown line>
55.73 s
> 5: std[bcb96dfbba0ab899]::sys::backtrace::__rust_end_short_backtrace::<std[bcb96dfbba0ab899]::panicking::panic_handler::{closure#0}, !><unknown>
55.73 s
> at <unknown source file>:<unknown line>
55.73 s
> 6: __rustc[6c289b9f9c454d21]::rust_begin_unwind<unknown>
55.73 s
> at <unknown source file>:<unknown line>
55.73 s
> 7: core[940e698046960fd5]::panicking::panic_fmt<unknown>
55.73 s
> at <unknown source file>:<unknown line>
55.73 s
> 8: core[940e698046960fd5]::panicking::assert_failed_inner<unknown>
55.73 s
> at <unknown source file>:<unknown line>
55.73 s
> 9: core[940e698046960fd5]::panicking::assert_failed::<symbolica[499970c26fd75ddd]::atom::Atom, symbolica[499970c26fd75ddd]::atom::Atom><unknown>
55.73 s
> at <unknown source file>:<unknown line>
55.73 s
> 10: gammalooprs[24955f93fc9f4e0c]::uv::approx::local_4d::tests::canonical_uv_signed_multiloop_carriers_preserve_factorized_numerators<unknown>
55.73 s
> at <unknown source file>:<unknown line>
55.73 s
> 11: <gammalooprs[24955f93fc9f4e0c]::uv::approx::local_4d::tests::canonical_uv_signed_multiloop_carriers_preserve_factorized_numerators::{closure#0} as core[940e698046960fd5]::ops::function::FnOnce<()>>::call_once<unknown>
55.73 s
> at <unknown source file>:<unknown line>
55.73 s
> 12: test[75d6903177b1d7e9]::__rust_begin_short_backtrace::<core[940e698046960fd5]::result::Result<(), alloc[2ea6bcb46fca0c42]::string::String>, fn() -> core[940e698046960fd5]::result::Result<(), alloc[2ea6bcb46fca0c42]::string::String>><unknown>
55.73 s
> at <unknown source file>:<unknown line>
55.73 s
> 13: test[75d6903177b1d7e9]::run_test::{closure#0}<unknown>
55.73 s
> at <unknown source file>:<unknown line>
55.73 s
> 14: std[bcb96dfbba0ab899]::sys::backtrace::__rust_begin_short_backtrace::<test[75d6903177b1d7e9]::run_test::{closure#1}, ()><unknown>
55.73 s
> at <unknown source file>:<unknown line>
55.73 s
> 15: <std[bcb96dfbba0ab899]::thread::lifecycle::spawn_unchecked<test[75d6903177b1d7e9]::run_test::{closure#1}, ()>::{closure#1} as core[940e698046960fd5]::ops::function::FnOnce<()>>::call_once::{shim:vtable#0}<unknown>
55.73 s
> at <unknown source file>:<unknown line>
55.73 s
> 16: <std[bcb96dfbba0ab899]::sys::thread::unix::Thread>::new::thread_start<unknown>
55.73 s
> at <unknown source file>:<unknown line>
55.73 s
> 17: start_thread<unknown>
55.73 s
> at <unknown source file>:<unknown line>
55.73 s
> 18: __clone3<unknown>
55.73 s
> at <unknown source file>:<unknown line>
55.73 s
>
55.73 s
> Run with COLORBT_SHOW_HIDDEN=1 environment variable to disable frame filtering.
55.73 s
> Run with RUST_BACKTRACE=full to include source snippets.
55.73 s
>
55.73 s
> 6. gammalooprs::uv::approx::tests::direct_nested_scalar_banana_replays_complete_cff_at_depth_three
55.73 s
> failure: test failure with exit code 101
55.73 s
> Error:
55.73 s
> 0: canonical UV numerator does not reproduce its source in the component frame
55.73 s
>
55.73 s
> Location:
55.73 s
> crates/gammalooprs/src/uv/approx/local_4d.rs:354
55.73 s
>
55.73 s
> ━━━━━━━━━━━━━━━━━━━━━━━━━━━━━━━━━━ BACKTRACE ━━━━━━━━━━━━━━━━━━━━━━━━━━━━━━━━━━━
55.73 s
> 1: <color_eyre[51793ea62743adbd]::config::EyreHook>::into_eyre_hook::{closure#0}<unknown>
55.73 s
> at <unknown source file>:<unknown line>
55.73 s
> 2: eyre[cb2fd339c0c40fca]::capture_handler<unknown>
55.73 s
> at <unknown source file>:<unknown line>
55.73 s
> 3: eyre[cb2fd339c0c40fca]::private::format_err<unknown>
55.73 s
> at <unknown source file>:<unknown line>
55.73 s
> 4: <gammalooprs[24955f93fc9f4e0c]::uv::approx::local_4d::FourDSector>::canonical_projection<unknown>
55.73 s
> at <unknown source file>:<unknown line>
55.73 s
> 5: <gammalooprs[24955f93fc9f4e0c]::uv::approx::projected_4d::Projected4dApproximation>::project_local_4d<unknown>
55.73 s
> at <unknown source file>:<unknown line>
55.73 s
> 6: <gammalooprs[24955f93fc9f4e0c]::uv::approx::Approximation>::compute_3d<unknown>
55.73 s
> at <unknown source file>:<unknown line>
55.73 s
> 7: gammalooprs[24955f93fc9f4e0c]::uv::approx::tests::direct_nested_scalar_banana_replays_complete_cff_at_depth_three::{closure#0}<unknown>
55.73 s
> at <unknown source file>:<unknown line>
55.73 s
> 8: gammalooprs[24955f93fc9f4e0c]::uv::approx::tests::direct_nested_scalar_banana_replays_complete_cff_at_depth_three<unknown>
55.73 s
> at <unknown source file>:<unknown line>
55.73 s
> 9: <gammalooprs[24955f93fc9f4e0c]::uv::approx::tests::direct_nested_scalar_banana_replays_complete_cff_at_depth_three::{closure#0} as core[940e698046960fd5]::ops::function::FnOnce<()>>::call_once<unknown>
55.73 s
> at <unknown source file>:<unknown line>
55.73 s
> 10: test[75d6903177b1d7e9]::__rust_begin_short_backtrace::<core[940e698046960fd5]::result::Result<(), alloc[2ea6bcb46fca0c42]::string::String>, fn() -> core[940e698046960fd5]::result::Result<(), alloc[2ea6bcb46fca0c42]::string::String>><unknown>
55.73 s
> at <unknown source file>:<unknown line>
55.73 s
> 11: test[75d6903177b1d7e9]::run_test::{closure#0}<unknown>
55.73 s
> at <unknown source file>:<unknown line>
55.73 s
> 12: std[bcb96dfbba0ab899]::sys::backtrace::__rust_begin_short_backtrace::<test[75d6903177b1d7e9]::run_test::{closure#1}, ()><unknown>
55.73 s
> at <unknown source file>:<unknown line>
55.73 s
> 13: <std[bcb96dfbba0ab899]::thread::lifecycle::spawn_unchecked<test[75d6903177b1d7e9]::run_test::{closure#1}, ()>::{closure#1} as core[940e698046960fd5]::ops::function::FnOnce<()>>::call_once::{shim:vtable#0}<unknown>
55.73 s
> at <unknown source file>:<unknown line>
55.73 s
> 14: <std[bcb96dfbba0ab899]::sys::thread::unix::Thread>::new::thread_start<unknown>
55.73 s
> at <unknown source file>:<unknown line>
55.73 s
> 15: start_thread<unknown>
55.73 s
> at <unknown source file>:<unknown line>
55.73 s
> 16: __clone3<unknown>
55.73 s
> at <unknown source file>:<unknown line>
55.73 s
>
55.73 s
> Run with COLORBT_SHOW_HIDDEN=1 environment variable to disable frame filtering.
55.73 s
> Run with RUST_BACKTRACE=full to include source snippets.
55.73 s
> system-out
55.73 s
> running 1 test
55.73 s
> test uv::approx::tests::direct_nested_scalar_banana_replays_complete_cff_at_depth_three ... FAILED
55.73 s
>
55.73 s
> failures:
55.73 s
>
55.73 s
> failures:
55.73 s
> uv::approx::tests::direct_nested_scalar_banana_replays_complete_cff_at_depth_three
55.73 s
>
55.73 s
> test result: FAILED. 0 passed; 1 failed; 0 ignored; 0 measured; 742 filtered out; finished in 0.10s
55.73 s
> system-err
55.73 s
> Error:
55.73 s
> 0: canonical UV numerator does not reproduce its source in the component frame
55.73 s
>
55.73 s
> Location:
55.73 s
> crates/gammalooprs/src/uv/approx/local_4d.rs:354
55.73 s
>
55.73 s
> ━━━━━━━━━━━━━━━━━━━━━━━━━━━━━━━━━━ BACKTRACE ━━━━━━━━━━━━━━━━━━━━━━━━━━━━━━━━━━━
55.73 s
> 1: <color_eyre[51793ea62743adbd]::config::EyreHook>::into_eyre_hook::{closure#0}<unknown>
55.73 s
> at <unknown source file>:<unknown line>
55.73 s
> 2: eyre[cb2fd339c0c40fca]::capture_handler<unknown>
55.73 s
> at <unknown source file>:<unknown line>
55.73 s
> 3: eyre[cb2fd339c0c40fca]::private::format_err<unknown>
55.73 s
> at <unknown source file>:<unknown line>
55.73 s
> 4: <gammalooprs[24955f93fc9f4e0c]::uv::approx::local_4d::FourDSector>::canonical_projection<unknown>
55.73 s
> at <unknown source file>:<unknown line>
55.73 s
> 5: <gammalooprs[24955f93fc9f4e0c]::uv::approx::projected_4d::Projected4dApproximation>::project_local_4d<unknown>
55.73 s
> at <unknown source file>:<unknown line>
55.73 s
> 6: <gammalooprs[24955f93fc9f4e0c]::uv::approx::Approximation>::compute_3d<unknown>
55.73 s
> at <unknown source file>:<unknown line>
55.73 s
> 7: gammalooprs[24955f93fc9f4e0c]::uv::approx::tests::direct_nested_scalar_banana_replays_complete_cff_at_depth_three::{closure#0}<unknown>
55.73 s
> at <unknown source file>:<unknown line>
55.73 s
> 8: gammalooprs[24955f93fc9f4e0c]::uv::approx::tests::direct_nested_scalar_banana_replays_complete_cff_at_depth_three<unknown>
55.73 s
> at <unknown source file>:<unknown line>
55.73 s
> 9: <gammalooprs[24955f93fc9f4e0c]::uv::approx::tests::direct_nested_scalar_banana_replays_complete_cff_at_depth_three::{closure#0} as core[940e698046960fd5]::ops::function::FnOnce<()>>::call_once<unknown>
55.73 s
> at <unknown source file>:<unknown line>
55.73 s
> 10: test[75d6903177b1d7e9]::__rust_begin_short_backtrace::<core[940e698046960fd5]::result::Result<(), alloc[2ea6bcb46fca0c42]::string::String>, fn() -> core[940e698046960fd5]::result::Result<(), alloc[2ea6bcb46fca0c42]::string::String>><unknown>
55.73 s
> at <unknown source file>:<unknown line>
55.73 s
> 11: test[75d6903177b1d7e9]::run_test::{closure#0}<unknown>
55.73 s
> at <unknown source file>:<unknown line>
55.73 s
> 12: std[bcb96dfbba0ab899]::sys::backtrace::__rust_begin_short_backtrace::<test[75d6903177b1d7e9]::run_test::{closure#1}, ()><unknown>
55.73 s
> at <unknown source file>:<unknown line>
55.73 s
> 13: <std[bcb96dfbba0ab899]::thread::lifecycle::spawn_unchecked<test[75d6903177b1d7e9]::run_test::{closure#1}, ()>::{closure#1} as core[940e698046960fd5]::ops::function::FnOnce<()>>::call_once::{shim:vtable#0}<unknown>
55.73 s
> at <unknown source file>:<unknown line>
55.73 s
> 14: <std[bcb96dfbba0ab899]::sys::thread::unix::Thread>::new::thread_start<unknown>
55.73 s
> at <unknown source file>:<unknown line>
55.73 s
> 15: start_thread<unknown>
55.73 s
> at <unknown source file>:<unknown line>
55.73 s
> 16: __clone3<unknown>
55.73 s
> at <unknown source file>:<unknown line>
55.73 s
>
55.73 s
> Run with COLORBT_SHOW_HIDDEN=1 environment variable to disable frame filtering.
55.73 s
> Run with RUST_BACKTRACE=full to include source snippets.
55.73 s
> =========================================
55.73 s
> Extracting 1 binary, 1 build script output directory, and 1 linked path to /build/nextest-archive-oEVmZd
55.73 s
> Extracted 7 files to /build/nextest-archive-oEVmZd in 0.09s
55.73 s
> ------------
55.73 s
> Nextest run ID 3e787ab3-399d-4410-b34e-cb5136fc8045 with nextest profile: ci_gammaloop
55.73 s
> Starting 105 tests across 1 binary
55.73 s
> ------------
55.73 s
> Summary [ 17.491s] 105 tests run: 105 passed , 0 skipped
55.73 s
>
55.73 s
> ========== nextest test summary ==========
55.73 s
> report: target/nextest/ci_gammaloop/junit.xml
55.73 s
> tests: 105, failures: 0, errors: 0
55.73 s
> No failing testcases found.
55.73 s
> =========================================
55.73 s
For full logs, run:
55.73 s
nix log /nix/store/n61r02micjg0snakcv487zfdf4anp50s-gammaloop-nextest-core.drv
55.85 s
[0 built (1 failed ), 0.0 Run failed.