test packages.x86_64-linux.nix-ci-check-gammaloop-nextest-core

Reproduce this run
Original Run
  1. 0.00 s $ /nix/store/9ypz3flqsrl5xl495mm8h645gadjsxi1-coreutils-9.11/bin/timeout --kill-after=15s 7200s /nix/store/23zk8sgzamrbmj1fday15szf7f2279s8-nix-2.34.7/bin/nix --extra-experimental-features nix-command --extra-experimental-features flakes flake clone git+https://github.com/alphal00p/gammaloop --dest /tmp/nix-ci-worker/stable-pwd/repo/
  2. 0.08 s Cloning into '/tmp/nix-ci-worker/stable-pwd/repo'...
  3. 0.72 s remote: Enumerating objects: 84521, done.
  4. 0.83 s remote: Counting objects: 0% (1/8838) remote: Counting objects: 1% (89/8838) remote: Counting objects: 2% (177/8838) remote: Counting objects: 3% (266/8838) remote: Counting objects: 4% (354/8838) remote: Counting objects: 5% (442/8838) remote: Counting objects: 6% (531/8838) remote: Counting objects: 7% (619/8838) remote: Counting objects: 8% (708/8838) remote: Counting objects: 9% (796/8838) remote: Counting objects: 10% (884/8838) remote: Counting objects: 11% (973/8838) remote: Counting objects: 12% (1061/8838) remote: Counting objects: 13% (1149/8838) remote: Counting objects: 14% (1238/8838) remote: Counting objects: 15% (1326/8838) remote: Counting objects: 16% (1415/8838) remote: Counting objects: 17% (1503/8838) remote: Counting objects: 18% (1591/8838) remote: Counting objects: 19% (1680/8838) remote: Counting objects: 20% (1768/8838) remote: Counting objects: 21% (1856/8838) remote: Counting objects: 22% (1945/8838) remote: Counting objects: 23% (2033/8838) remote: Counting objects: 24% (2122/8838) remote: Counting objects: 25% (2210/8838) remote: Counting objects: 26% (2298/8838) remote: Counting objects: 27% (2387/8838) remote: Counting objects: 28% (2475/8838) remote: Counting objects: 29% (2564/8838) remote: Counting objects: 30% (2652/8838) remote: Counting objects: 31% (2740/8838) remote: Counting objects: 32% (2829/8838) remote: Counting objects: 33% (2917/8838) remote: Counting objects: 34% (3005/8838) remote: Counting objects: 35% (3094/8838) remote: Counting objects: 36% (3182/8838) remote: Counting objects: 37% (3271/8838) remote: Counting objects: 38% (3359/8838) remote: Counting objects: 39% (3447/8838) remote: Counting objects: 40% (3536/8838) remote: Counting objects: 41% (3624/8838) remote: Counting objects: 42% (3712/8838) remote: Counting objects: 43% (3801/8838) remote: Counting objects: 44% (3889/8838) remote: Counting objects: 45% (3978/8838) remote: Counting objects: 46% (4066/8838) remote: Counting objects: 47% (4154/8838) remote: Counting objects: 48% (4243/8838) remote: Counting objects: 49% (4331/8838) remote: Counting objects: 50% (4419/8838) remote: Counting objects: 51% (4508/8838) remote: Counting objects: 52% (4596/8838) remote: Counting objects: 53% (4685/8838) remote: Counting objects: 54% (4773/8838) remote: Counting objects: 55% (4861/8838) remote: Counting objects: 56% (4950/8838) remote: Counting objects: 57% (5038/8838) remote: Counting objects: 58% (5127/8838) remote: Counting objects: 59% (5215/8838) remote: Counting objects: 60% (5303/8838) remote: Counting objects: 61% (5392/8838) remote: Counting objects: 62% (5480/8838) remote: Counting objects: 63% (5568/8838) remote: Counting objects: 64% (5657/8838) remote: Counting objects: 65% (5745/8838) remote: Counting objects: 66% (5834/8838) remote: Counting objects: 67% (5922/8838) remote: Counting objects: 68% (6010/8838) remote: Counting objects: 69% (6099/8838) remote: Counting objects: 70% (6187/8838) remote: Counting objects: 71% (6275/8838) remote: Counting objects: 72% (6364/8838) remote: Counting objects: 73% (6452/8838) remote: Counting objects: 74% (6541/8838) remote: Counting objects: 75% (6629/8838) remote: Counting objects: 76% (6717/8838) remote: Counting objects: 77% (6806/8838) remote: Counting objects: 78% (6894/8838) remote: Counting objects: 79% (6983/8838) remote: Counting objects: 80% (7071/8838) remote: Counting objects: 81% (7159/8838) remote: Counting objects: 82% (7248/8838) remote: Counting objects: 83% (7336/8838) remote: Counting objects: 84% (7424/8838) remote: Counting objects: 85% (7513/8838) remote: Counting objects: 86% (7601/8838) remote: Counting objects: 87% (7690/8838) remote: Counting objects: 88% (7778/8838) remote: Counting objects: 89% (7866/8838) remote: Counting objects: 90% (7955/8838) remote: Counting objects: 91% (8043/8838) remote: Counting objects: 92% (8131/8838) remote: Counting objects: 93% (8220/8838) remote: Counting objects: 94% (8308/8838) remote: Counting objects: 95% (8397/8838) remote: Counting objects: 96% (8485/8838) remote: Counting objects: 97% (8573/8838) remote: Counting objects: 98% (8662/8838) remote: Counting objects: 99% (8750/8838) remote: Counting objects: 100% (8838/8838) remote: Counting objects: 100% (8838/8838), done.
  5. 2.69 s remote: Compressing objects: 0% (1/1883) remote: Compressing objects: 1% (19/1883) remote: Compressing objects: 2% (38/1883) remote: Compressing objects: 3% (57/1883) remote: Compressing objects: 4% (76/1883) remote: Compressing objects: 5% (95/1883) remote: Compressing objects: 6% (113/1883) remote: Compressing objects: 7% (132/1883) remote: Compressing objects: 8% (151/1883) remote: Compressing objects: 9% (170/1883) remote: Compressing objects: 10% (189/1883) remote: Compressing objects: 11% (208/1883) remote: Compressing objects: 11% (218/1883) remote: Compressing objects: 12% (226/1883) remote: Compressing objects: 13% (245/1883) remote: Compressing objects: 14% (264/1883) remote: Compressing objects: 15% (283/1883) remote: Compressing objects: 16% (302/1883) remote: Compressing objects: 17% (321/1883) remote: Compressing objects: 18% (339/1883) remote: Compressing objects: 19% (358/1883) remote: Compressing objects: 20% (377/1883) remote: Compressing objects: 21% (396/1883) remote: Compressing objects: 22% (415/1883) remote: Compressing objects: 23% (434/1883) remote: Compressing objects: 24% (452/1883) remote: Compressing objects: 25% (471/1883) remote: Compressing objects: 26% (490/1883) remote: Compressing objects: 27% (509/1883) remote: Compressing objects: 28% (528/1883) remote: Compressing objects: 29% (547/1883) remote: Compressing objects: 30% (565/1883) remote: Compressing objects: 31% (584/1883) remote: Compressing objects: 32% (603/1883) remote: Compressing objects: 33% (622/1883) remote: Compressing objects: 34% (641/1883) remote: Compressing objects: 35% (660/1883) remote: Compressing objects: 36% (678/1883) remote: Compressing objects: 37% (697/1883) remote: Compressing objects: 38% (716/1883) remote: Compressing objects: 39% (735/1883) remote: Compressing objects: 40% (754/1883) remote: Compressing objects: 41% (773/1883) remote: Compressing objects: 42% (791/1883) remote: Compressing objects: 43% (810/1883) remote: Compressing objects: 44% (829/1883) remote: Compressing objects: 45% (848/1883) remote: Compressing objects: 46% (867/1883) remote: Compressing objects: 47% (886/1883) remote: Compressing objects: 48% (904/1883) remote: Compressing objects: 49% (923/1883) remote: Compressing objects: 50% (942/1883) remote: Compressing objects: 51% (961/1883) remote: Compressing objects: 52% (980/1883) remote: Compressing objects: 53% (998/1883) remote: Compressing objects: 54% (1017/1883) remote: Compressing objects: 55% (1036/1883) remote: Compressing objects: 56% (1055/1883) remote: Compressing objects: 57% (1074/1883) remote: Compressing objects: 58% (1093/1883) remote: Compressing objects: 59% (1111/1883) remote: Compressing objects: 60% (1130/1883) remote: Compressing objects: 61% (1149/1883) remote: Compressing objects: 62% (1168/1883) remote: Compressing objects: 63% (1187/1883) remote: Compressing objects: 64% (1206/1883) remote: Compressing objects: 65% (1224/1883) remote: Compressing objects: 66% (1243/1883) remote: Compressing objects: 67% (1262/1883) remote: Compressing objects: 68% (1281/1883) remote: Compressing objects: 69% (1300/1883) remote: Compressing objects: 70% (1319/1883) remote: Compressing objects: 71% (1337/1883) remote: Compressing objects: 72% (1356/1883) remote: Compressing objects: 73% (1375/1883) remote: Compressing objects: 74% (1394/1883) remote: Compressing objects: 75% (1413/1883) remote: Compressing objects: 76% (1432/1883) remote: Compressing objects: 77% (1450/1883) remote: Compressing objects: 78% (1469/1883) remote: Compressing objects: 79% (1488/1883) remote: Compressing objects: 80% (1507/1883) remote: Compressing objects: 81% (1526/1883) remote: Compressing objects: 82% (1545/1883) remote: Compressing objects: 83% (1563/1883) remote: Compressing objects: 84% (1582/1883) remote: Compressing objects: 85% (1601/1883) remote: Compressing objects: 86% (1620/1883) remote: Compressing objects: 87% (1639/1883) remote: Compressing objects: 88% (1658/1883) remote: Compressing objects: 89% (1676/1883) remote: Compressing objects: 90% (1695/1883) remote: Compressing objects: 91% (1714/1883) remote: Compressing objects: 92% (1733/1883) remote: Compressing objects: 93% (1752/1883) remote: Compressing objects: 94% (1771/1883) remote: Compressing objects: 95% (1789/1883) remote: Compressing objects: 96% (1808/1883) remote: Compressing objects: 97% (1827/1883) remote: Compressing objects: 98% (1846/1883) remote: Compressing objects: 99% (1865/1883) remote: Compressing objects: 100% (1883/1883) remote: Compressing objects: 100% (1883/1883), done.
  6. 7.08 s Receiving objects: 0% (1/84521) Receiving objects: 1% (846/84521) Receiving objects: 2% (1691/84521) Receiving objects: 3% (2536/84521) Receiving objects: 4% (3381/84521) Receiving objects: 5% (4227/84521) Receiving objects: 6% (5072/84521) Receiving objects: 7% (5917/84521) Receiving objects: 8% (6762/84521) Receiving objects: 9% (7607/84521), 15.31 MiB | 30.60 MiB/s Receiving objects: 10% (8453/84521), 15.31 MiB | 30.60 MiB/s Receiving objects: 11% (9298/84521), 15.31 MiB | 30.60 MiB/s Receiving objects: 12% (10143/84521), 15.31 MiB | 30.60 MiB/s Receiving objects: 13% (10988/84521), 15.31 MiB | 30.60 MiB/s Receiving objects: 14% (11833/84521), 15.31 MiB | 30.60 MiB/s Receiving objects: 15% (12679/84521), 15.31 MiB | 30.60 MiB/s Receiving objects: 16% (13524/84521), 15.31 MiB | 30.60 MiB/s Receiving objects: 17% (14369/84521), 15.31 MiB | 30.60 MiB/s Receiving objects: 18% (15214/84521), 15.31 MiB | 30.60 MiB/s Receiving objects: 19% (16059/84521), 15.31 MiB | 30.60 MiB/s Receiving objects: 20% (16905/84521), 15.31 MiB | 30.60 MiB/s Receiving objects: 21% (17750/84521), 15.31 MiB | 30.60 MiB/s Receiving objects: 22% (18595/84521), 15.31 MiB | 30.60 MiB/s Receiving objects: 23% (19440/84521), 15.31 MiB | 30.60 MiB/s Receiving objects: 24% (20286/84521), 15.31 MiB | 30.60 MiB/s Receiving objects: 25% (21131/84521), 15.31 MiB | 30.60 MiB/s Receiving objects: 26% (21976/84521), 15.31 MiB | 30.60 MiB/s Receiving objects: 27% (22821/84521), 15.31 MiB | 30.60 MiB/s Receiving objects: 28% (23666/84521), 15.31 MiB | 30.60 MiB/s Receiving objects: 29% (24512/84521), 15.31 MiB | 30.60 MiB/s Receiving objects: 30% (25357/84521), 15.31 MiB | 30.60 MiB/s Receiving objects: 31% (26202/84521), 15.31 MiB | 30.60 MiB/s Receiving objects: 32% (27047/84521), 15.31 MiB | 30.60 MiB/s Receiving objects: 33% (27892/84521), 15.31 MiB | 30.60 MiB/s Receiving objects: 34% (28738/84521), 15.31 MiB | 30.60 MiB/s Receiving objects: 35% (29583/84521), 15.31 MiB | 30.60 MiB/s Receiving objects: 36% (30428/84521), 15.31 MiB | 30.60 MiB/s Receiving objects: 37% (31273/84521), 15.31 MiB | 30.60 MiB/s Receiving objects: 38% (32118/84521), 15.31 MiB | 30.60 MiB/s Receiving objects: 39% (32964/84521), 15.31 MiB | 30.60 MiB/s Receiving objects: 40% (33809/84521), 15.31 MiB | 30.60 MiB/s Receiving objects: 40% (34118/84521), 34.20 MiB | 34.20 MiB/s Receiving objects: 41% (34654/84521), 34.20 MiB | 34.20 MiB/s Receiving objects: 42% (35499/84521), 34.20 MiB | 34.20 MiB/s Receiving objects: 43% (36345/84521), 34.20 MiB | 34.20 MiB/s Receiving objects: 44% (37190/84521), 34.20 MiB | 34.20 MiB/s Receiving objects: 45% (38035/84521), 34.20 MiB | 34.20 MiB/s Receiving objects: 46% (38880/84521), 34.20 MiB | 34.20 MiB/s Receiving objects: 47% (39725/84521), 34.20 MiB | 34.20 MiB/s Receiving objects: 48% (40571/84521), 34.20 MiB | 34.20 MiB/s Receiving objects: 49% (41416/84521), 34.20 MiB | 34.20 MiB/s Receiving objects: 50% (42261/84521), 34.20 MiB | 34.20 MiB/s Receiving objects: 51% (43106/84521), 34.20 MiB | 34.20 MiB/s Receiving objects: 52% (43951/84521), 34.20 MiB | 34.20 MiB/s Receiving objects: 53% (44797/84521), 52.26 MiB | 34.13 MiB/s Receiving objects: 54% (45642/84521), 52.26 MiB | 34.13 MiB/s Receiving objects: 55% (46487/84521), 52.26 MiB | 34.13 MiB/s Receiving objects: 56% (47332/84521), 52.26 MiB | 34.13 MiB/s Receiving objects: 57% (48177/84521), 52.26 MiB | 34.13 MiB/s Receiving objects: 58% (49023/84521), 52.26 MiB | 34.13 MiB/s Receiving objects: 59% (49868/84521), 52.26 MiB | 34.13 MiB/s Receiving objects: 59% (50130/84521), 52.26 MiB | 34.13 MiB/s Receiving objects: 60% (50713/84521), 52.26 MiB | 34.13 MiB/s Receiving objects: 61% (51558/84521), 71.73 MiB | 34.51 MiB/s Receiving objects: 62% (52404/84521), 71.73 MiB | 34.51 MiB/s Receiving objects: 63% (53249/84521), 71.73 MiB | 34.51 MiB/s Receiving objects: 64% (54094/84521), 71.73 MiB | 34.51 MiB/s Receiving objects: 65% (54939/84521), 71.73 MiB | 34.51 MiB/s Receiving objects: 66% (55784/84521), 71.73 MiB | 34.51 MiB/s Receiving objects: 67% (56630/84521), 71.73 MiB | 34.51 MiB/s Receiving objects: 67% (57350/84521), 91.25 MiB | 34.74 MiB/s Receiving objects: 68% (57475/84521), 91.25 MiB | 34.74 MiB/s Receiving objects: 69% (58320/84521), 91.25 MiB | 34.74 MiB/s Receiving objects: 70% (59165/84521), 91.25 MiB | 34.74 MiB/s Receiving objects: 71% (60010/84521), 91.25 MiB | 34.74 MiB/s Receiving objects: 72% (60856/84521), 110.41 MiB | 35.32 MiB/s Receiving objects: 73% (61701/84521), 110.41 MiB | 35.32 MiB/s Receiving objects: 74% (62546/84521), 110.41 MiB | 35.32 MiB/s Receiving objects: 75% (63391/84521), 110.41 MiB | 35.32 MiB/s Receiving objects: 76% (64236/84521), 110.41 MiB | 35.32 MiB/s Receiving objects: 77% (65082/84521), 126.80 MiB | 34.97 MiB/s Receiving objects: 78% (65927/84521), 126.80 MiB | 34.97 MiB/s Receiving objects: 79% (66772/84521), 126.80 MiB | 34.97 MiB/s Receiving objects: 80% (67617/84521), 126.80 MiB | 34.97 MiB/s Receiving objects: 81% (68463/84521), 126.80 MiB | 34.97 MiB/s Receiving objects: 82% (69308/84521), 126.80 MiB | 34.97 MiB/s Receiving objects: 83% (70153/84521), 126.80 MiB | 34.97 MiB/s Receiving objects: 84% (70998/84521), 126.80 MiB | 34.97 MiB/s Receiving objects: 85% (71843/84521), 126.80 MiB | 34.97 MiB/s Receiving objects: 86% (72689/84521), 126.80 MiB | 34.97 MiB/s Receiving objects: 87% (73534/84521), 126.80 MiB | 34.97 MiB/s Receiving objects: 87% (74125/84521), 126.80 MiB | 34.97 MiB/s Receiving objects: 88% (74379/84521), 145.68 MiB | 35.02 MiB/s Receiving objects: 89% (75224/84521), 145.68 MiB | 35.02 MiB/s Receiving objects: 90% (76069/84521), 145.68 MiB | 35.02 MiB/s Receiving objects: 91% (76915/84521), 145.68 MiB | 35.02 MiB/s Receiving objects: 92% (77760/84521), 145.68 MiB | 35.02 MiB/s Receiving objects: 93% (78605/84521), 145.68 MiB | 35.02 MiB/s Receiving objects: 94% (79450/84521), 145.68 MiB | 35.02 MiB/s Receiving objects: 95% (80295/84521), 145.68 MiB | 35.02 MiB/s Receiving objects: 96% (81141/84521), 145.68 MiB | 35.02 MiB/s Receiving objects: 97% (81986/84521), 145.68 MiB | 35.02 MiB/s Receiving objects: 98% (82831/84521), 145.68 MiB | 35.02 MiB/s Receiving objects: 99% (83676/84521), 145.68 MiB | 35.02 MiB/s remote: Total 84521 (delta 7644), reused 7034 (delta 6953), pack-reused 75683 (from 2)
  7. 7.08 s Receiving objects: 100% (84521/84521), 145.68 MiB | 35.02 MiB/s Receiving objects: 100% (84521/84521), 153.92 MiB | 35.06 MiB/s, done.
  8. 8.07 s Resolving deltas: 0% (0/57185) Resolving deltas: 1% (573/57185) Resolving deltas: 2% (1144/57185) Resolving deltas: 3% (1716/57185) Resolving deltas: 4% (2288/57185) Resolving deltas: 5% (2860/57185) Resolving deltas: 6% (3432/57185) Resolving deltas: 7% (4007/57185) Resolving deltas: 8% (4576/57185) Resolving deltas: 9% (5148/57185) Resolving deltas: 10% (5719/57185) Resolving deltas: 11% (6291/57185) Resolving deltas: 12% (6863/57185) Resolving deltas: 13% (7435/57185) Resolving deltas: 14% (8006/57185) Resolving deltas: 15% (8578/57185) Resolving deltas: 16% (9150/57185) Resolving deltas: 17% (9723/57185) Resolving deltas: 18% (10295/57185) Resolving deltas: 19% (10866/57185) Resolving deltas: 20% (11439/57185) Resolving deltas: 21% (12009/57185) Resolving deltas: 22% (12581/57185) Resolving deltas: 23% (13153/57185) Resolving deltas: 24% (13725/57185) Resolving deltas: 25% (14298/57185) Resolving deltas: 26% (14869/57185) Resolving deltas: 27% (15440/57185) Resolving deltas: 28% (16012/57185) Resolving deltas: 29% (16584/57185) Resolving deltas: 30% (17158/57185) Resolving deltas: 31% (17728/57185) Resolving deltas: 32% (18300/57185) Resolving deltas: 33% (18872/57185) Resolving deltas: 34% (19443/57185) Resolving deltas: 35% (20015/57185) Resolving deltas: 36% (20588/57185) Resolving deltas: 37% (21160/57185) Resolving deltas: 38% (21731/57185) Resolving deltas: 39% (22303/57185) Resolving deltas: 40% (22874/57185) Resolving deltas: 41% (23447/57185) Resolving deltas: 42% (24018/57185) Resolving deltas: 43% (24591/57185) Resolving deltas: 44% (25162/57185) Resolving deltas: 45% (25734/57185) Resolving deltas: 46% (26306/57185) Resolving deltas: 47% (26877/57185) Resolving deltas: 48% (27449/57185) Resolving deltas: 49% (28021/57185) Resolving deltas: 50% (28594/57185) Resolving deltas: 51% (29165/57185) Resolving deltas: 52% (29737/57185) Resolving deltas: 53% (30309/57185) Resolving deltas: 54% (30882/57185) Resolving deltas: 55% (31452/57185) Resolving deltas: 56% (32024/57185) Resolving deltas: 57% (32596/57185) Resolving deltas: 58% (33168/57185) Resolving deltas: 59% (33740/57185) Resolving deltas: 60% (34312/57185) Resolving deltas: 61% (34883/57185) Resolving deltas: 62% (35455/57185) Resolving deltas: 63% (36031/57185) Resolving deltas: 64% (36599/57185) Resolving deltas: 65% (37171/57185) Resolving deltas: 66% (37743/57185) Resolving deltas: 67% (38314/57185) Resolving deltas: 68% (38886/57185) Resolving deltas: 69% (39458/57185) Resolving deltas: 70% (40030/57185) Resolving deltas: 71% (40603/57185) Resolving deltas: 72% (41175/57185) Resolving deltas: 73% (41746/57185) Resolving deltas: 74% (42318/57185) Resolving deltas: 75% (42889/57185) Resolving deltas: 76% (43461/57185) Resolving deltas: 77% (44033/57185) Resolving deltas: 78% (44605/57185) Resolving deltas: 79% (45179/57185) Resolving deltas: 80% (45748/57185) Resolving deltas: 81% (46320/57185) Resolving deltas: 82% (46893/57185) Resolving deltas: 83% (47464/57185) Resolving deltas: 84% (48036/57185) Resolving deltas: 85% (48610/57185) Resolving deltas: 86% (49180/57185) Resolving deltas: 87% (49751/57185) Resolving deltas: 88% (50323/57185) Resolving deltas: 89% (50895/57185) Resolving deltas: 90% (51467/57185) Resolving deltas: 91% (52040/57185) Resolving deltas: 92% (52611/57185) Resolving deltas: 93% (53183/57185) Resolving deltas: 94% (53754/57185) Resolving deltas: 95% (54327/57185) Resolving deltas: 96% (54898/57185) Resolving deltas: 97% (55470/57185) Resolving deltas: 98% (56042/57185) Resolving deltas: 99% (56614/57185) Resolving deltas: 100% (57185/57185) Resolving deltas: 100% (57185/57185), done.
  9. 8.51 s Fetching commit b8396f3a3080d196a947879eb877a2d842d871ef for faster_uv_from_4d ...
  10. 8.51 s $ /nix/store/bcnisk3ydfgv26v2gw3zlky24g00yww2-git-2.54.0/bin/git fetch origin b8396f3a3080d196a947879eb877a2d842d871ef
  11. 8.94 s From https://github.com/alphal00p/gammaloop
  12. 8.94 s * branch b8396f3a3080d196a947879eb877a2d842d871ef -> FETCH_HEAD
  13. 8.95 s $ /nix/store/9ypz3flqsrl5xl495mm8h645gadjsxi1-coreutils-9.11/bin/timeout --kill-after=15s 7200s /nix/store/bcnisk3ydfgv26v2gw3zlky24g00yww2-git-2.54.0/bin/git -c advice.detachedHead=false checkout b8396f3a3080d196a947879eb877a2d842d871ef
  14. 9.26 s HEAD is now at b8396f3a3 canonicalize uv classes and prepare bounded cff mappings
  15. 9.27 s $ /nix/store/9ypz3flqsrl5xl495mm8h645gadjsxi1-coreutils-9.11/bin/timeout --kill-after=15s 7200s /nix/store/23zk8sgzamrbmj1fday15szf7f2279s8-nix-2.34.7/bin/nix --extra-experimental-features nix-command --extra-experimental-features flakes --log-format internal-json run .#packages.x86_64-linux.nix-ci-check-gammaloop-nextest-core --print-build-logs
  16. 14.04 s
  17. 14.29 s Downloading cached gammaloop-nextest-binaries-core-gammaloop-api from https://cache.nix-ci.com
  18. 14.29 s Downloading cached gammaloop-nextest-binaries-core-gammalooprs from https://cache.nix-ci.com
  19. 15.43 s Downloaded cached gammaloop-nextest-binaries-core-gammalooprs (87.6 MiB) in 1.1s
  20. 15.43 s Progress: 0 of 4 built, 1 of 2 downloaded from cache (1 downloading)
  21. 15.65 s Downloaded cached gammaloop-nextest-binaries-core-gammaloop-api (120.5 MiB) in 1.3s
  22. 15.65 s Progress: 0 of 3 built, 2 of 2 downloaded from cache
  23. 15.68 s Building /nix/store/m509m4h0022wr0a7g7rmfj92lr3gjxgb-gammaloop-nextest-binaries-core.drv
  24. 15.76 s [gammaloop-nextest-binaries-core:post-build] Uploading to the NixCI cache: /nix/store/85c07rvz3lys243fhv085lgzcxqb7i4g-gammaloop-nextest-binaries-core
  25. 15.81 s [gammaloop-nextest-binaries-core:post-build] warning: 'warn-short-path-literals' is deprecated, use 'lint-short-path-literals = ignore' instead
  26. 15.81 s [gammaloop-nextest-binaries-core:post-build] copying 1 paths...
  27. 15.82 s [gammaloop-nextest-binaries-core:post-build] copying path '/nix/store/85c07rvz3lys243fhv085lgzcxqb7i4g-gammaloop-nextest-binaries-core' to 'https://cache.nix-ci.com'...
  28. 15.90 s [gammaloop-nextest-binaries-core:post-build] warning: 'warn-short-path-literals' is deprecated, use 'lint-short-path-literals = ignore' instead
  29. 16.03 s [gammaloop-nextest-binaries-core:post-build] copying 0 paths...
  30. 16.05 s Uploaded gammaloop-nextest-binaries-core in 301ms
  31. 16.05 s Progress: 1 of 3 built, 2 of 2 downloaded from cache
  32. 16.05 s Built gammaloop-nextest-binaries-core in 367ms
  33. 16.14 s Building /nix/store/qnnlbmskxs6qdw7g83l4j9lk6fljm3rg-nix-ci-check-gammaloop-nextest-core.drv
  34. 16.21 s [nix-ci-check-gammaloop-nextest-core:post-build] Uploading to the NixCI cache: /nix/store/p2blzz4i90w8lcchgkbvvfhyfi4snxcq-nix-ci-check-gammaloop-nextest-core
  35. 16.25 s [nix-ci-check-gammaloop-nextest-core:post-build] warning: 'warn-short-path-literals' is deprecated, use 'lint-short-path-literals = ignore' instead
  36. 16.27 s [nix-ci-check-gammaloop-nextest-core:post-build] copying 1 paths...
  37. 16.27 s [nix-ci-check-gammaloop-nextest-core:post-build] copying path '/nix/store/p2blzz4i90w8lcchgkbvvfhyfi4snxcq-nix-ci-check-gammaloop-nextest-core' to 'https://cache.nix-ci.com'...
  38. 16.35 s [nix-ci-check-gammaloop-nextest-core:post-build] warning: 'warn-short-path-literals' is deprecated, use 'lint-short-path-literals = ignore' instead
  39. 16.54 s [nix-ci-check-gammaloop-nextest-core:post-build] copying 0 paths...
  40. 16.57 s Uploaded nix-ci-check-gammaloop-nextest-core in 367ms
  41. 16.57 s Progress: 2 of 3 built, 2 of 2 downloaded from cache
  42. 16.57 s Built nix-ci-check-gammaloop-nextest-core in 427ms
  43. 16.57 s Progress: 3 of 3 built, 2 of 2 downloaded from cache
  44. 22.17 s evaluating derivation 'g copying '/nix/store/9a5p evaluating derivation 'g copying '/nix/store/9a5p evaluating derivation 'g copying '/nix/store/9a5p evaluating derivation 'g copying '/nix/store/9a5p evaluating derivation 'g copying '/nix/store/9a5p evaluating derivation 'g copying '/nix/store/9a5p evaluating derivation 'g copying '/nix/store/9a5p evaluating derivation 'g copying '/nix/store/9a5p evaluating derivation 'g querying gammaloop-nexte [0/1 built, 0.0 KiB DL] [1/0/1 built, 0.0 KiB DLgammaloop-nextest-core> Extracting 4 binaries (including 1 non-test binary), 1 build script output directory, and 2 linked paths to /build/nextest-archive-nIhoaY
  45. 22.89 s gammaloop-nextest-core> Extracted 20 files to /build/nextest-archive-nIhoaY in 0.72s
  46. 22.90 s gammaloop-nextest-core> ------------
  47. 22.90 s gammaloop-nextest-core> Nextest run ID c9c95688-4363-46a1-9e07-8d868b3ce035 with nextest profile: ci_gammaloop
  48. 22.90 s gammaloop-nextest-core> Starting 379 tests across 3 binaries
  49. 24.21 s gammaloop-nextest-core> ------------
  50. 24.21 s gammaloop-nextest-core> Summary [ 1.312s] 379 tests run: 379 passed, 0 skipped
  51. 24.35 s gammaloop-nextest-core>
  52. 24.35 s gammaloop-nextest-core> ========== nextest test summary ==========
  53. 24.35 s gammaloop-nextest-core> report: target/nextest/ci_gammaloop/junit.xml
  54. 24.35 s gammaloop-nextest-core> tests: 379, failures: 0, errors: 0
  55. 24.35 s gammaloop-nextest-core> No failing testcases found.
  56. 24.35 s gammaloop-nextest-core> =========================================
  57. 24.36 s gammaloop-nextest-core> Extracting 1 binary and 1 linked path to /build/nextest-archive-hgzjQi
  58. 24.43 s gammaloop-nextest-core> Extracted 7 files to /build/nextest-archive-hgzjQi in 0.07s
  59. 24.44 s gammaloop-nextest-core> ------------
  60. 24.44 s gammaloop-nextest-core> Nextest run ID 297a6a2c-a0b0-4df3-bc0c-e9d00ecc4210 with nextest profile: ci_gammaloop
  61. 24.44 s gammaloop-nextest-core> Starting 19 tests across 1 binary
  62. 24.45 s gammaloop-nextest-core> ------------
  63. 24.45 s gammaloop-nextest-core> Summary [ 0.011s] 19 tests run: 19 passed, 0 skipped
  64. 24.49 s gammaloop-nextest-core>
  65. 24.49 s gammaloop-nextest-core> ========== nextest test summary ==========
  66. 24.49 s gammaloop-nextest-core> report: target/nextest/ci_gammaloop/junit.xml
  67. 24.49 s gammaloop-nextest-core> tests: 19, failures: 0, errors: 0
  68. 24.49 s gammaloop-nextest-core> No failing testcases found.
  69. 24.49 s gammaloop-nextest-core> =========================================
  70. 24.51 s gammaloop-nextest-core> Extracting 1 binary to /build/nextest-archive-gpMHxe
  71. 24.54 s gammaloop-nextest-core> Extracted 4 files to /build/nextest-archive-gpMHxe in 0.03s
  72. 24.55 s gammaloop-nextest-core> ------------
  73. 24.55 s gammaloop-nextest-core> Nextest run ID 40b109a1-5b38-4e32-80f9-9cc74dc4e175 with nextest profile: ci_gammaloop
  74. 24.55 s gammaloop-nextest-core> Starting 0 tests across 1 binary
  75. 24.55 s gammaloop-nextest-core> ------------
  76. 24.55 s gammaloop-nextest-core> Summary [ 0.000s] 0 tests run: 0 passed, 0 skipped
  77. 24.58 s gammaloop-nextest-core>
  78. 24.58 s gammaloop-nextest-core> ========== nextest test summary ==========
  79. 24.58 s gammaloop-nextest-core> report: target/nextest/ci_gammaloop/junit.xml
  80. 24.58 s gammaloop-nextest-core> tests: 0, failures: 0, errors: 0
  81. 24.58 s gammaloop-nextest-core> No failing testcases found.
  82. 24.58 s gammaloop-nextest-core> =========================================
  83. 24.60 s gammaloop-nextest-core> Extracting 4 binaries, 1 build script output directory, and 2 linked paths to /build/nextest-archive-veI02p
  84. 25.08 s gammaloop-nextest-core> Extracted 18 files to /build/nextest-archive-veI02p in 0.48s
  85. 25.09 s gammaloop-nextest-core> ------------
  86. 25.09 s gammaloop-nextest-core> Nextest run ID 9b18db9d-669d-4429-b041-c06f56d2a531 with nextest profile: ci_gammaloop
  87. 25.09 s gammaloop-nextest-core> Starting 692 tests across 4 binaries (60 tests skipped, including 59 tests via profile.ci_gammaloop.default-filter)
  88. 26.03 s gammaloop-nextest-core> FAIL [ 0.118s] (149/692) gammalooprs graph::three_d_source::tests::exact_taylor_vacuum_affine_circulation_preserves_energy_mapping
  89. 26.03 s gammaloop-nextest-core> stdout ---
  90. 26.03 s gammaloop-nextest-core>
  91. 26.03 s gammaloop-nextest-core> running 1 test
  92. 26.03 s gammaloop-nextest-core> test graph::three_d_source::tests::exact_taylor_vacuum_affine_circulation_preserves_energy_mapping ... FAILED
  93. 26.03 s gammaloop-nextest-core>
  94. 26.03 s gammaloop-nextest-core> failures:
  95. 26.03 s gammaloop-nextest-core>
  96. 26.03 s gammaloop-nextest-core> failures:
  97. 26.03 s gammaloop-nextest-core> graph::three_d_source::tests::exact_taylor_vacuum_affine_circulation_preserves_energy_mapping
  98. 26.03 s gammaloop-nextest-core>
  99. 26.03 s gammaloop-nextest-core> test result: FAILED. 0 passed; 1 failed; 0 ignored; 0 measured; 742 filtered out; finished in 0.10s
  100. 26.03 s gammaloop-nextest-core>
  101. 26.03 s gammaloop-nextest-core> stderr ---
  102. 26.03 s gammaloop-nextest-core> The application panicked (crashed).
  103. 26.03 s gammaloop-nextest-core> Message: assertion `left == right` failed
  104. 26.03 s gammaloop-nextest-core> left: (gammalooprs::mUVexp^2+(-gammalooprs::Q(1,spenso::cind(1))+gammalooprs::Q(4,spenso::cind(1)))^2+(-gammalooprs::Q(1,spenso::cind(2))+gammalooprs::Q(4,spenso::cind(2)))^2+(-gammalooprs::Q(1,spenso::cind(3))+gammalooprs::Q(4,spenso::cind(3)))^2)^(1/2)
  105. 26.03 s gammaloop-nextest-core> right: (gammalooprs::mUVexp^2+(gammalooprs::Q(1,spenso::cind(1))-gammalooprs::Q(4,spenso::cind(1)))^2+(gammalooprs::Q(1,spenso::cind(2))-gammalooprs::Q(4,spenso::cind(2)))^2+(gammalooprs::Q(1,spenso::cind(3))-gammalooprs::Q(4,spenso::cind(3)))^2)^(1/2)
  106. 26.03 s gammaloop-nextest-core> Location: crates/gammalooprs/src/graph/three_d_source.rs:7797
  107. 26.03 s gammaloop-nextest-core>
  108. 26.03 s gammaloop-nextest-core> ━━━━━━━━━━━━━━━━━━━━━━━━━━━━━━━━━━ BACKTRACE ━━━━━━━━━━━━━━━━━━━━━━━━━━━━━━━━━━━
  109. 26.03 s gammaloop-nextest-core> 1: <color_eyre[51793ea62743adbd]::config::PanicHook>::panic_report<unknown>
  110. 26.03 s gammaloop-nextest-core> at <unknown source file>:<unknown line>
  111. 26.03 s gammaloop-nextest-core> 2: <color_eyre[51793ea62743adbd]::config::PanicHook>::into_panic_hook::{closure#0}<unknown>
  112. 26.03 s gammaloop-nextest-core> at <unknown source file>:<unknown line>
  113. 26.03 s gammaloop-nextest-core> 3: std[bcb96dfbba0ab899]::panicking::panic_with_hook<unknown>
  114. 26.03 s gammaloop-nextest-core> at <unknown source file>:<unknown line>
  115. 26.03 s gammaloop-nextest-core> 4: std[bcb96dfbba0ab899]::panicking::panic_handler::{closure#0}<unknown>
  116. 26.03 s gammaloop-nextest-core> at <unknown source file>:<unknown line>
  117. 26.03 s gammaloop-nextest-core> 5: std[bcb96dfbba0ab899]::sys::backtrace::__rust_end_short_backtrace::<std[bcb96dfbba0ab899]::panicking::panic_handler::{closure#0}, !><unknown>
  118. 26.03 s gammaloop-nextest-core> at <unknown source file>:<unknown line>
  119. 26.03 s gammaloop-nextest-core> 6: __rustc[6c289b9f9c454d21]::rust_begin_unwind<unknown>
  120. 26.03 s gammaloop-nextest-core> at <unknown source file>:<unknown line>
  121. 26.03 s gammaloop-nextest-core> 7: core[940e698046960fd5]::panicking::panic_fmt<unknown>
  122. 26.03 s gammaloop-nextest-core> at <unknown source file>:<unknown line>
  123. 26.03 s gammaloop-nextest-core> 8: core[940e698046960fd5]::panicking::assert_failed_inner<unknown>
  124. 26.03 s gammaloop-nextest-core> at <unknown source file>:<unknown line>
  125. 26.03 s gammaloop-nextest-core> 9: core[940e698046960fd5]::panicking::assert_failed::<symbolica[499970c26fd75ddd]::atom::Atom, symbolica[499970c26fd75ddd]::atom::Atom><unknown>
  126. 26.03 s gammaloop-nextest-core> at <unknown source file>:<unknown line>
  127. 26.03 s gammaloop-nextest-core> 10: gammalooprs[24955f93fc9f4e0c]::graph::three_d_source::tests::exact_taylor_vacuum_affine_circulation_preserves_energy_mapping<unknown>
  128. 26.03 s gammaloop-nextest-core> at <unknown source file>:<unknown line>
  129. 26.03 s gammaloop-nextest-core> 11: <gammalooprs[24955f93fc9f4e0c]::graph::three_d_source::tests::exact_taylor_vacuum_affine_circulation_preserves_energy_mapping::{closure#0} as core[940e698046960fd5]::ops::function::FnOnce<()>>::call_once<unknown>
  130. 26.03 s gammaloop-nextest-core> at <unknown source file>:<unknown line>
  131. 26.03 s gammaloop-nextest-core> 12: test[75d6903177b1d7e9]::__rust_begin_short_backtrace::<core[940e698046960fd5]::result::Result<(), alloc[2ea6bcb46fca0c42]::string::String>, fn() -> core[940e698046960fd5]::result::Result<(), alloc[2ea6bcb46fca0c42]::string::String>><unknown>
  132. 26.03 s gammaloop-nextest-core> at <unknown source file>:<unknown line>
  133. 26.03 s gammaloop-nextest-core> 13: test[75d6903177b1d7e9]::run_test::{closure#0}<unknown>
  134. 26.03 s gammaloop-nextest-core> at <unknown source file>:<unknown line>
  135. 26.03 s gammaloop-nextest-core> 14: std[bcb96dfbba0ab899]::sys::backtrace::__rust_begin_short_backtrace::<test[75d6903177b1d7e9]::run_test::{closure#1}, ()><unknown>
  136. 26.03 s gammaloop-nextest-core> at <unknown source file>:<unknown line>
  137. 26.03 s gammaloop-nextest-core> 15: <std[bcb96dfbba0ab899]::thread::lifecycle::spawn_unchecked<test[75d6903177b1d7e9]::run_test::{closure#1}, ()>::{closure#1} as core[940e698046960fd5]::ops::function::FnOnce<()>>::call_once::{shim:vtable#0}<unknown>
  138. 26.03 s gammaloop-nextest-core> at <unknown source file>:<unknown line>
  139. 26.03 s gammaloop-nextest-core> 16: <std[bcb96dfbba0ab899]::sys::thread::unix::Thread>::new::thread_start<unknown>
  140. 26.03 s gammaloop-nextest-core> at <unknown source file>:<unknown line>
  141. 26.03 s gammaloop-nextest-core> 17: start_thread<unknown>
  142. 26.03 s gammaloop-nextest-core> at <unknown source file>:<unknown line>
  143. 26.03 s gammaloop-nextest-core> 18: __clone3<unknown>
  144. 26.03 s gammaloop-nextest-core> at <unknown source file>:<unknown line>
  145. 26.03 s gammaloop-nextest-core>
  146. 26.03 s gammaloop-nextest-core> Run with COLORBT_SHOW_HIDDEN=1 environment variable to disable frame filtering.
  147. 26.03 s gammaloop-nextest-core> Run with RUST_BACKTRACE=full to include source snippets.
  148. 26.03 s gammaloop-nextest-core>
  149. 26.07 s gammaloop-nextest-core> FAIL [ 0.117s] (161/692) gammalooprs graph::three_d_source::tests::pinched_affine_carrier_requires_occurrence_interpolation
  150. 26.07 s gammaloop-nextest-core> stdout ---
  151. 26.07 s gammaloop-nextest-core>
  152. 26.07 s gammaloop-nextest-core> running 1 test
  153. 26.07 s gammaloop-nextest-core> test graph::three_d_source::tests::pinched_affine_carrier_requires_occurrence_interpolation ... FAILED
  154. 26.07 s gammaloop-nextest-core>
  155. 26.07 s gammaloop-nextest-core> failures:
  156. 26.07 s gammaloop-nextest-core>
  157. 26.07 s gammaloop-nextest-core> failures:
  158. 26.07 s gammaloop-nextest-core> graph::three_d_source::tests::pinched_affine_carrier_requires_occurrence_interpolation
  159. 26.07 s gammaloop-nextest-core>
  160. 26.07 s gammaloop-nextest-core> test result: FAILED. 0 passed; 1 failed; 0 ignored; 0 measured; 742 filtered out; finished in 0.11s
  161. 26.07 s gammaloop-nextest-core>
  162. 26.07 s gammaloop-nextest-core> stderr ---
  163. 26.07 s gammaloop-nextest-core> The application panicked (crashed).
  164. 26.07 s gammaloop-nextest-core> Message: certified affine occurrence lift must reproduce the independent double contours: actual=-(-1/16*(3+E0)*(5+E0)/((1+Q(0,cind(1))^2+Q(0,cind(2))^2+Q(0,cind(3))^2)^(3/2)*(1+Q(1,cind(1))^2+Q(1,cind(2))^2+Q(1,cind(3))^2)^(3/2))-1/16*(3+E1)*(5+E1)/((1+Q(0,cind(1))^2+Q(0,cind(2))^2+Q(0,cind(3))^2)^(3/2)*(1+Q(1,cind(1))^2+Q(1,cind(2))^2+Q(1,cind(3))^2)^(3/2))-1/16*(3-E0)*(5-E0)/((1+Q(0,cind(1))^2+Q(0,cind(2))^2+Q(0,cind(3))^2)^(3/2)*(1+Q(1,cind(1))^2+Q(1,cind(2))^2+Q(1,cind(3))^2)^(3/2))-1/16*(3-E1)*(5-E1)/((1+Q(0,cind(1))^2+Q(0,cind(2))^2+Q(0,cind(3))^2)^(3/2)*(1+Q(1,cind(1))^2+Q(1,cind(2))^2+Q(1,cind(3))^2)^(3/2))+1/64*(3+E0+E1)*(5+E0+E1)/((1+Q(0,cind(1))^2+Q(0,cind(2))^2+Q(0,cind(3))^2)^(3/2)*(1+Q(1,cind(1))^2+Q(1,cind(2))^2+Q(1,cind(3))^2)^(3/2))+1/64*(3+E0-E1)*(5+E0-E1)/((1+Q(0,cind(1))^2+Q(0,cind(2))^2+Q(0,cind(3))^2)^(3/2)*(1+Q(1,cind(1))^2+Q(1,cind(2))^2+Q(1,cind(3))^2)^(3/2))+1/64*(3-E0+E1)*(5-E0+E1)/((1+Q(0,cind(1))^2+Q(0,cind(2))^2+Q(0,cind(3))^2)^(3/2)*(1+Q(1,cind(1))^2+Q(1,cind(2))^2+Q(1,cind(3))^2)^(3/2))+1/64*(3-E0-E1)*(5-E0-E1)/((1+Q(0,cind(1))^2+Q(0,cind(2))^2+Q(0,cind(3))^2)^(3/2)*(1+Q(1,cind(1))^2+Q(1,cind(2))^2+Q(1,cind(3))^2)^(3/2))+15/4/((1+Q(0,cind(1))^2+Q(0,cind(2))^2+Q(0,cind(3))^2)^(3/2)*(1+Q(1,cind(1))^2+Q(1,cind(2))^2+Q(1,cind(3))^2)^(3/2))), expected=1/16*(15-E0^2-E1^2)/(E0^3*E1^3)
  165. 26.07 s gammaloop-nextest-core> Location: crates/gammalooprs/src/graph/three_d_source.rs:7619
  166. 26.07 s gammaloop-nextest-core>
  167. 26.07 s gammaloop-nextest-core> ━━━━━━━━━━━━━━━━━━━━━━━━━━━━━━━━━━ BACKTRACE ━━━━━━━━━━━━━━━━━━━━━━━━━━━━━━━━━━━
  168. 26.07 s gammaloop-nextest-core> 1: <color_eyre[51793ea62743adbd]::config::PanicHook>::panic_report<unknown>
  169. 26.07 s gammaloop-nextest-core> at <unknown source file>:<unknown line>
  170. 26.07 s gammaloop-nextest-core> 2: <color_eyre[51793ea62743adbd]::config::PanicHook>::into_panic_hook::{closure#0}<unknown>
  171. 26.07 s gammaloop-nextest-core> at <unknown source file>:<unknown line>
  172. 26.07 s gammaloop-nextest-core> 3: std[bcb96dfbba0ab899]::panicking::panic_with_hook<unknown>
  173. 26.07 s gammaloop-nextest-core> at <unknown source file>:<unknown line>
  174. 26.07 s gammaloop-nextest-core> 4: std[bcb96dfbba0ab899]::panicking::panic_handler::{closure#0}<unknown>
  175. 26.07 s gammaloop-nextest-core> at <unknown source file>:<unknown line>
  176. 26.07 s gammaloop-nextest-core> 5: std[bcb96dfbba0ab899]::sys::backtrace::__rust_end_short_backtrace::<std[bcb96dfbba0ab899]::panicking::panic_handler::{closure#0}, !><unknown>
  177. 26.07 s gammaloop-nextest-core> at <unknown source file>:<unknown line>
  178. 26.07 s gammaloop-nextest-core> 6: __rustc[6c289b9f9c454d21]::rust_begin_unwind<unknown>
  179. 26.07 s gammaloop-nextest-core> at <unknown source file>:<unknown line>
  180. 26.07 s gammaloop-nextest-core> 7: core[940e698046960fd5]::panicking::panic_fmt<unknown>
  181. 26.07 s gammaloop-nextest-core> at <unknown source file>:<unknown line>
  182. 26.07 s gammaloop-nextest-core> 8: <gammalooprs[24955f93fc9f4e0c]::graph::three_d_source::tests::pinched_affine_carrier_requires_occurrence_interpolation::{closure#0} as core[940e698046960fd5]::ops::function::FnOnce<()>>::call_once<unknown>
  183. 26.07 s gammaloop-nextest-core> at <unknown source file>:<unknown line>
  184. 26.07 s gammaloop-nextest-core> 9: test[75d6903177b1d7e9]::__rust_begin_short_backtrace::<core[940e698046960fd5]::result::Result<(), alloc[2ea6bcb46fca0c42]::string::String>, fn() -> core[940e698046960fd5]::result::Result<(), alloc[2ea6bcb46fca0c42]::string::String>><unknown>
  185. 26.07 s gammaloop-nextest-core> at <unknown source file>:<unknown line>
  186. 26.07 s gammaloop-nextest-core> 10: test[75d6903177b1d7e9]::run_test::{closure#0}<unknown>
  187. 26.07 s gammaloop-nextest-core> at <unknown source file>:<unknown line>
  188. 26.07 s gammaloop-nextest-core> 11: std[bcb96dfbba0ab899]::sys::backtrace::__rust_begin_short_backtrace::<test[75d6903177b1d7e9]::run_test::{closure#1}, ()><unknown>
  189. 26.07 s gammaloop-nextest-core> at <unknown source file>:<unknown line>
  190. 26.07 s gammaloop-nextest-core> 12: <std[bcb96dfbba0ab899]::thread::lifecycle::spawn_unchecked<test[75d6903177b1d7e9]::run_test::{closure#1}, ()>::{closure#1} as core[940e698046960fd5]::ops::function::FnOnce<()>>::call_once::{shim:vtable#0}<unknown>
  191. 26.07 s gammaloop-nextest-core> at <unknown source file>:<unknown line>
  192. 26.07 s gammaloop-nextest-core> 13: <std[bcb96dfbba0ab899]::sys::thread::unix::Thread>::new::thread_start<unknown>
  193. 26.07 s gammaloop-nextest-core> at <unknown source file>:<unknown line>
  194. 26.07 s gammaloop-nextest-core> 14: start_thread<unknown>
  195. 26.07 s gammaloop-nextest-core> at <unknown source file>:<unknown line>
  196. 26.07 s gammaloop-nextest-core> 15: __clone3<unknown>
  197. 26.07 s gammaloop-nextest-core> at <unknown source file>:<unknown line>
  198. 26.08 s gammaloop-nextest-core>
  199. 26.08 s gammaloop-nextest-core> Run with COLORBT_SHOW_HIDDEN=1 environment variable to disable frame filtering.
  200. 26.08 s gammaloop-nextest-core> Run with RUST_BACKTRACE=full to include source snippets.
  201. 26.08 s gammaloop-nextest-core>
  202. 26.33 s gammaloop-nextest-core> FAIL [ 0.014s] (286/692) gammalooprs numerator::energy_degree::tests::canonical_class_cyclic_lifts_preserve_factorization_and_exact_bounds
  203. 26.33 s gammaloop-nextest-core> stdout ---
  204. 26.33 s gammaloop-nextest-core>
  205. 26.33 s gammaloop-nextest-core> running 1 test
  206. 26.33 s gammaloop-nextest-core> test numerator::energy_degree::tests::canonical_class_cyclic_lifts_preserve_factorization_and_exact_bounds ... FAILED
  207. 26.33 s gammaloop-nextest-core>
  208. 26.33 s gammaloop-nextest-core> failures:
  209. 26.33 s gammaloop-nextest-core>
  210. 26.33 s gammaloop-nextest-core> failures:
  211. 26.33 s gammaloop-nextest-core> numerator::energy_degree::tests::canonical_class_cyclic_lifts_preserve_factorization_and_exact_bounds
  212. 26.33 s gammaloop-nextest-core>
  213. 26.33 s gammaloop-nextest-core> test result: FAILED. 0 passed; 1 failed; 0 ignored; 0 measured; 742 filtered out; finished in 0.01s
  214. 26.33 s gammaloop-nextest-core>
  215. 26.33 s gammaloop-nextest-core> stderr ---
  216. 26.33 s gammaloop-nextest-core>
  217. 26.33 s gammaloop-nextest-core> thread 'numerator::energy_degree::tests::canonical_class_cyclic_lifts_preserve_factorization_and_exact_bounds' (2265) panicked at crates/gammalooprs/src/numerator/energy_degree.rs:2850:13:
  218. 26.33 s gammaloop-nextest-core> assertion failed: (collapsed - expression).collect_factors().is_zero()
  219. 26.33 s gammaloop-nextest-core> stack backtrace:
  220. 26.33 s gammaloop-nextest-core> 0: __rustc::rust_begin_unwind
  221. 26.33 s gammaloop-nextest-core> 1: core::panicking::panic_fmt
  222. 26.33 s gammaloop-nextest-core> 2: core::panicking::panic
  223. 26.33 s gammaloop-nextest-core> 3: gammalooprs::numerator::energy_degree::tests::canonical_class_cyclic_lifts_preserve_factorization_and_exact_bounds
  224. 26.33 s gammaloop-nextest-core> 4: <gammalooprs::numerator::energy_degree::tests::canonical_class_cyclic_lifts_preserve_factorization_and_exact_bounds::{closure#0} as core::ops::function::FnOnce<()>>::call_once
  225. 26.33 s gammaloop-nextest-core> note: Some details are omitted, run with `RUST_BACKTRACE=full` for a verbose backtrace.
  226. 26.33 s gammaloop-nextest-core>
  227. 27.70 s gammaloop-nextest-core> FAIL [ 0.074s] (587/692) gammalooprs uv::approx::local_4d::tests::canonical_uv_classes_certify_signed_aliases_and_preserve_raw_sectors
  228. 27.70 s gammaloop-nextest-core> stdout ---
  229. 27.70 s gammaloop-nextest-core>
  230. 27.70 s gammaloop-nextest-core> running 1 test
  231. 27.70 s gammaloop-nextest-core> test uv::approx::local_4d::tests::canonical_uv_classes_certify_signed_aliases_and_preserve_raw_sectors ... FAILED
  232. 27.70 s gammaloop-nextest-core>
  233. 27.70 s gammaloop-nextest-core> failures:
  234. 27.70 s gammaloop-nextest-core>
  235. 27.70 s gammaloop-nextest-core> failures:
  236. 27.70 s gammaloop-nextest-core> uv::approx::local_4d::tests::canonical_uv_classes_certify_signed_aliases_and_preserve_raw_sectors
  237. 27.70 s gammaloop-nextest-core>
  238. 27.70 s gammaloop-nextest-core> test result: FAILED. 0 passed; 1 failed; 0 ignored; 0 measured; 742 filtered out; finished in 0.07s
  239. 27.70 s gammaloop-nextest-core>
  240. 27.70 s gammaloop-nextest-core> stderr ---
  241. 27.70 s gammaloop-nextest-core> Error:
  242. 27.70 s gammaloop-nextest-core> 0: merged canonical UV numerator does not reproduce its source bucket
  243. 27.70 s gammaloop-nextest-core>
  244. 27.70 s gammaloop-nextest-core> Location:
  245. 27.70 s gammaloop-nextest-core> crates/gammalooprs/src/uv/approx/local_4d.rs:367
  246. 27.70 s gammaloop-nextest-core>
  247. 27.70 s gammaloop-nextest-core> ━━━━━━━━━━━━━━━━━━━━━━━━━━━━━━━━━━ BACKTRACE ━━━━━━━━━━━━━━━━━━━━━━━━━━━━━━━━━━━
  248. 27.70 s gammaloop-nextest-core> 1: <color_eyre[51793ea62743adbd]::config::EyreHook>::into_eyre_hook::{closure#0}<unknown>
  249. 27.70 s gammaloop-nextest-core> at <unknown source file>:<unknown line>
  250. 27.70 s gammaloop-nextest-core> 2: eyre[cb2fd339c0c40fca]::capture_handler<unknown>
  251. 27.70 s gammaloop-nextest-core> at <unknown source file>:<unknown line>
  252. 27.70 s gammaloop-nextest-core> 3: eyre[cb2fd339c0c40fca]::private::format_err<unknown>
  253. 27.70 s gammaloop-nextest-core> at <unknown source file>:<unknown line>
  254. 27.70 s gammaloop-nextest-core> 4: <gammalooprs[24955f93fc9f4e0c]::uv::approx::local_4d::FourDSector>::canonical_projection<unknown>
  255. 27.70 s gammaloop-nextest-core> at <unknown source file>:<unknown line>
  256. 27.70 s gammaloop-nextest-core> 5: gammalooprs[24955f93fc9f4e0c]::uv::approx::local_4d::tests::canonical_uv_classes_certify_signed_aliases_and_preserve_raw_sectors<unknown>
  257. 27.70 s gammaloop-nextest-core> at <unknown source file>:<unknown line>
  258. 27.70 s gammaloop-nextest-core> 6: <gammalooprs[24955f93fc9f4e0c]::uv::approx::local_4d::tests::canonical_uv_classes_certify_signed_aliases_and_preserve_raw_sectors::{closure#0} as core[940e698046960fd5]::ops::function::FnOnce<()>>::call_once<unknown>
  259. 27.70 s gammaloop-nextest-core> at <unknown source file>:<unknown line>
  260. 27.70 s gammaloop-nextest-core> 7: test[75d6903177b1d7e9]::__rust_begin_short_backtrace::<core[940e698046960fd5]::result::Result<(), alloc[2ea6bcb46fca0c42]::string::String>, fn() -> core[940e698046960fd5]::result::Result<(), alloc[2ea6bcb46fca0c42]::string::String>><unknown>
  261. 27.70 s gammaloop-nextest-core> at <unknown source file>:<unknown line>
  262. 27.70 s gammaloop-nextest-core> 8: test[75d6903177b1d7e9]::run_test::{closure#0}<unknown>
  263. 27.70 s gammaloop-nextest-core> at <unknown source file>:<unknown line>
  264. 27.70 s gammaloop-nextest-core> 9: std[bcb96dfbba0ab899]::sys::backtrace::__rust_begin_short_backtrace::<test[75d6903177b1d7e9]::run_test::{closure#1}, ()><unknown>
  265. 27.70 s gammaloop-nextest-core> at <unknown source file>:<unknown line>
  266. 27.70 s gammaloop-nextest-core> 10: <std[bcb96dfbba0ab899]::thread::lifecycle::spawn_unchecked<test[75d6903177b1d7e9]::run_test::{closure#1}, ()>::{closure#1} as core[940e698046960fd5]::ops::function::FnOnce<()>>::call_once::{shim:vtable#0}<unknown>
  267. 27.70 s gammaloop-nextest-core> at <unknown source file>:<unknown line>
  268. 27.70 s gammaloop-nextest-core> 11: <std[bcb96dfbba0ab899]::sys::thread::unix::Thread>::new::thread_start<unknown>
  269. 27.70 s gammaloop-nextest-core> at <unknown source file>:<unknown line>
  270. 27.70 s gammaloop-nextest-core> 12: start_thread<unknown>
  271. 27.70 s gammaloop-nextest-core> at <unknown source file>:<unknown line>
  272. 27.70 s gammaloop-nextest-core> 13: __clone3<unknown>
  273. 27.70 s gammaloop-nextest-core> at <unknown source file>:<unknown line>
  274. 27.70 s gammaloop-nextest-core>
  275. 27.70 s gammaloop-nextest-core> Run with COLORBT_SHOW_HIDDEN=1 environment variable to disable frame filtering.
  276. 27.70 s gammaloop-nextest-core> Run with RUST_BACKTRACE=full to include source snippets.
  277. 27.70 s gammaloop-nextest-core>
  278. 27.74 s gammaloop-nextest-core> FAIL [ 0.096s] (593/692) gammalooprs uv::approx::local_4d::tests::canonical_uv_signed_multiloop_carriers_preserve_factorized_numerators
  279. 27.74 s gammaloop-nextest-core> stdout ---
  280. 27.74 s gammaloop-nextest-core>
  281. 27.74 s gammaloop-nextest-core> running 1 test
  282. 27.74 s gammaloop-nextest-core> test uv::approx::local_4d::tests::canonical_uv_signed_multiloop_carriers_preserve_factorized_numerators ... FAILED
  283. 27.74 s gammaloop-nextest-core>
  284. 27.74 s gammaloop-nextest-core> failures:
  285. 27.74 s gammaloop-nextest-core>
  286. 27.74 s gammaloop-nextest-core> failures:
  287. 27.74 s gammaloop-nextest-core> uv::approx::local_4d::tests::canonical_uv_signed_multiloop_carriers_preserve_factorized_numerators
  288. 27.74 s gammaloop-nextest-core>
  289. 27.74 s gammaloop-nextest-core> test result: FAILED. 0 passed; 1 failed; 0 ignored; 0 measured; 742 filtered out; finished in 0.08s
  290. 27.74 s gammaloop-nextest-core>
  291. 27.74 s gammaloop-nextest-core> stderr ---
  292. 27.74 s gammaloop-nextest-core> The application panicked (crashed).
  293. 27.74 s gammaloop-nextest-core> Message: assertion `left == right` failed
  294. 27.74 s gammaloop-nextest-core> left: 2*(signed_multiloop::a+signed_multiloop::b)^5*gammalooprs::Q(gammalooprs::uv::class(0),spenso::cind(0))
  295. 27.74 s gammaloop-nextest-core> right: -2*(signed_multiloop::a+signed_multiloop::b)^5*gammalooprs::Q(gammalooprs::uv::class(0),spenso::cind(0))
  296. 27.74 s gammaloop-nextest-core> Location: crates/gammalooprs/src/uv/approx/local_4d.rs:1983
  297. 27.74 s gammaloop-nextest-core>
  298. 27.74 s gammaloop-nextest-core> ━━━━━━━━━━━━━━━━━━━━━━━━━━━━━━━━━━ BACKTRACE ━━━━━━━━━━━━━━━━━━━━━━━━━━━━━━━━━━━
  299. 27.74 s gammaloop-nextest-core> 1: <color_eyre[51793ea62743adbd]::config::PanicHook>::panic_report<unknown>
  300. 27.74 s gammaloop-nextest-core> at <unknown source file>:<unknown line>
  301. 27.74 s gammaloop-nextest-core> 2: <color_eyre[51793ea62743adbd]::config::PanicHook>::into_panic_hook::{closure#0}<unknown>
  302. 27.74 s gammaloop-nextest-core> at <unknown source file>:<unknown line>
  303. 27.74 s gammaloop-nextest-core> 3: std[bcb96dfbba0ab899]::panicking::panic_with_hook<unknown>
  304. 27.74 s gammaloop-nextest-core> at <unknown source file>:<unknown line>
  305. 27.74 s gammaloop-nextest-core> 4: std[bcb96dfbba0ab899]::panicking::panic_handler::{closure#0}<unknown>
  306. 27.74 s gammaloop-nextest-core> at <unknown source file>:<unknown line>
  307. 27.74 s gammaloop-nextest-core> 5: std[bcb96dfbba0ab899]::sys::backtrace::__rust_end_short_backtrace::<std[bcb96dfbba0ab899]::panicking::panic_handler::{closure#0}, !><unknown>
  308. 27.74 s gammaloop-nextest-core> at <unknown source file>:<unknown line>
  309. 27.74 s gammaloop-nextest-core> 6: __rustc[6c289b9f9c454d21]::rust_begin_unwind<unknown>
  310. 27.74 s gammaloop-nextest-core> at <unknown source file>:<unknown line>
  311. 27.74 s gammaloop-nextest-core> 7: core[940e698046960fd5]::panicking::panic_fmt<unknown>
  312. 27.74 s gammaloop-nextest-core> at <unknown source file>:<unknown line>
  313. 27.74 s gammaloop-nextest-core> 8: core[940e698046960fd5]::panicking::assert_failed_inner<unknown>
  314. 27.74 s gammaloop-nextest-core> at <unknown source file>:<unknown line>
  315. 27.74 s gammaloop-nextest-core> 9: core[940e698046960fd5]::panicking::assert_failed::<symbolica[499970c26fd75ddd]::atom::Atom, symbolica[499970c26fd75ddd]::atom::Atom><unknown>
  316. 27.74 s gammaloop-nextest-core> at <unknown source file>:<unknown line>
  317. 27.74 s gammaloop-nextest-core> 10: gammalooprs[24955f93fc9f4e0c]::uv::approx::local_4d::tests::canonical_uv_signed_multiloop_carriers_preserve_factorized_numerators<unknown>
  318. 27.74 s gammaloop-nextest-core> at <unknown source file>:<unknown line>
  319. 27.74 s gammaloop-nextest-core> 11: <gammalooprs[24955f93fc9f4e0c]::uv::approx::local_4d::tests::canonical_uv_signed_multiloop_carriers_preserve_factorized_numerators::{closure#0} as core[940e698046960fd5]::ops::function::FnOnce<()>>::call_once<unknown>
  320. 27.74 s gammaloop-nextest-core> at <unknown source file>:<unknown line>
  321. 27.74 s gammaloop-nextest-core> 12: test[75d6903177b1d7e9]::__rust_begin_short_backtrace::<core[940e698046960fd5]::result::Result<(), alloc[2ea6bcb46fca0c42]::string::String>, fn() -> core[940e698046960fd5]::result::Result<(), alloc[2ea6bcb46fca0c42]::string::String>><unknown>
  322. 27.74 s gammaloop-nextest-core> at <unknown source file>:<unknown line>
  323. 27.74 s gammaloop-nextest-core> 13: test[75d6903177b1d7e9]::run_test::{closure#0}<unknown>
  324. 27.74 s gammaloop-nextest-core> at <unknown source file>:<unknown line>
  325. 27.74 s gammaloop-nextest-core> 14: std[bcb96dfbba0ab899]::sys::backtrace::__rust_begin_short_backtrace::<test[75d6903177b1d7e9]::run_test::{closure#1}, ()><unknown>
  326. 27.74 s gammaloop-nextest-core> at <unknown source file>:<unknown line>
  327. 27.74 s gammaloop-nextest-core> 15: <std[bcb96dfbba0ab899]::thread::lifecycle::spawn_unchecked<test[75d6903177b1d7e9]::run_test::{closure#1}, ()>::{closure#1} as core[940e698046960fd5]::ops::function::FnOnce<()>>::call_once::{shim:vtable#0}<unknown>
  328. 27.74 s gammaloop-nextest-core> at <unknown source file>:<unknown line>
  329. 27.74 s gammaloop-nextest-core> 16: <std[bcb96dfbba0ab899]::sys::thread::unix::Thread>::new::thread_start<unknown>
  330. 27.74 s gammaloop-nextest-core> at <unknown source file>:<unknown line>
  331. 27.74 s gammaloop-nextest-core> 17: start_thread<unknown>
  332. 27.74 s gammaloop-nextest-core> at <unknown source file>:<unknown line>
  333. 27.74 s gammaloop-nextest-core> 18: __clone3<unknown>
  334. 27.74 s gammaloop-nextest-core> at <unknown source file>:<unknown line>
  335. 27.74 s gammaloop-nextest-core>
  336. 27.74 s gammaloop-nextest-core> Run with COLORBT_SHOW_HIDDEN=1 environment variable to disable frame filtering.
  337. 27.74 s gammaloop-nextest-core> Run with RUST_BACKTRACE=full to include source snippets.
  338. 27.74 s gammaloop-nextest-core>
  339. 27.91 s gammaloop-nextest-core> FAIL [ 0.112s] (605/692) gammalooprs uv::approx::tests::direct_nested_scalar_banana_replays_complete_cff_at_depth_three
  340. 27.91 s gammaloop-nextest-core> stdout ---
  341. 27.91 s gammaloop-nextest-core>
  342. 27.91 s gammaloop-nextest-core> running 1 test
  343. 27.91 s gammaloop-nextest-core> test uv::approx::tests::direct_nested_scalar_banana_replays_complete_cff_at_depth_three ... FAILED
  344. 27.91 s gammaloop-nextest-core>
  345. 27.91 s gammaloop-nextest-core> failures:
  346. 27.91 s gammaloop-nextest-core>
  347. 27.91 s gammaloop-nextest-core> failures:
  348. 27.91 s gammaloop-nextest-core> uv::approx::tests::direct_nested_scalar_banana_replays_complete_cff_at_depth_three
  349. 27.91 s gammaloop-nextest-core>
  350. 27.91 s gammaloop-nextest-core> test result: FAILED. 0 passed; 1 failed; 0 ignored; 0 measured; 742 filtered out; finished in 0.10s
  351. 27.91 s gammaloop-nextest-core>
  352. 27.91 s gammaloop-nextest-core> stderr ---
  353. 27.91 s gammaloop-nextest-core> Error:
  354. 27.91 s gammaloop-nextest-core> 0: canonical UV numerator does not reproduce its source in the component frame
  355. 27.91 s gammaloop-nextest-core>
  356. 27.91 s gammaloop-nextest-core> Location:
  357. 27.91 s gammaloop-nextest-core> crates/gammalooprs/src/uv/approx/local_4d.rs:354
  358. 27.91 s gammaloop-nextest-core>
  359. 27.91 s gammaloop-nextest-core> ━━━━━━━━━━━━━━━━━━━━━━━━━━━━━━━━━━ BACKTRACE ━━━━━━━━━━━━━━━━━━━━━━━━━━━━━━━━━━━
  360. 27.91 s gammaloop-nextest-core> 1: <color_eyre[51793ea62743adbd]::config::EyreHook>::into_eyre_hook::{closure#0}<unknown>
  361. 27.91 s gammaloop-nextest-core> at <unknown source file>:<unknown line>
  362. 27.91 s gammaloop-nextest-core> 2: eyre[cb2fd339c0c40fca]::capture_handler<unknown>
  363. 27.91 s gammaloop-nextest-core> at <unknown source file>:<unknown line>
  364. 27.91 s gammaloop-nextest-core> 3: eyre[cb2fd339c0c40fca]::private::format_err<unknown>
  365. 27.91 s gammaloop-nextest-core> at <unknown source file>:<unknown line>
  366. 27.91 s gammaloop-nextest-core> 4: <gammalooprs[24955f93fc9f4e0c]::uv::approx::local_4d::FourDSector>::canonical_projection<unknown>
  367. 27.91 s gammaloop-nextest-core> at <unknown source file>:<unknown line>
  368. 27.91 s gammaloop-nextest-core> 5: <gammalooprs[24955f93fc9f4e0c]::uv::approx::projected_4d::Projected4dApproximation>::project_local_4d<unknown>
  369. 27.91 s gammaloop-nextest-core> at <unknown source file>:<unknown line>
  370. 27.91 s gammaloop-nextest-core> 6: <gammalooprs[24955f93fc9f4e0c]::uv::approx::Approximation>::compute_3d<unknown>
  371. 27.91 s gammaloop-nextest-core> at <unknown source file>:<unknown line>
  372. 27.91 s gammaloop-nextest-core> 7: gammalooprs[24955f93fc9f4e0c]::uv::approx::tests::direct_nested_scalar_banana_replays_complete_cff_at_depth_three::{closure#0}<unknown>
  373. 27.91 s gammaloop-nextest-core> at <unknown source file>:<unknown line>
  374. 27.91 s gammaloop-nextest-core> 8: gammalooprs[24955f93fc9f4e0c]::uv::approx::tests::direct_nested_scalar_banana_replays_complete_cff_at_depth_three<unknown>
  375. 27.91 s gammaloop-nextest-core> at <unknown source file>:<unknown line>
  376. 27.91 s gammaloop-nextest-core> 9: <gammalooprs[24955f93fc9f4e0c]::uv::approx::tests::direct_nested_scalar_banana_replays_complete_cff_at_depth_three::{closure#0} as core[940e698046960fd5]::ops::function::FnOnce<()>>::call_once<unknown>
  377. 27.91 s gammaloop-nextest-core> at <unknown source file>:<unknown line>
  378. 27.91 s gammaloop-nextest-core> 10: test[75d6903177b1d7e9]::__rust_begin_short_backtrace::<core[940e698046960fd5]::result::Result<(), alloc[2ea6bcb46fca0c42]::string::String>, fn() -> core[940e698046960fd5]::result::Result<(), alloc[2ea6bcb46fca0c42]::string::String>><unknown>
  379. 27.91 s gammaloop-nextest-core> at <unknown source file>:<unknown line>
  380. 27.91 s gammaloop-nextest-core> 11: test[75d6903177b1d7e9]::run_test::{closure#0}<unknown>
  381. 27.91 s gammaloop-nextest-core> at <unknown source file>:<unknown line>
  382. 27.91 s gammaloop-nextest-core> 12: std[bcb96dfbba0ab899]::sys::backtrace::__rust_begin_short_backtrace::<test[75d6903177b1d7e9]::run_test::{closure#1}, ()><unknown>
  383. 27.91 s gammaloop-nextest-core> at <unknown source file>:<unknown line>
  384. 27.91 s gammaloop-nextest-core> 13: <std[bcb96dfbba0ab899]::thread::lifecycle::spawn_unchecked<test[75d6903177b1d7e9]::run_test::{closure#1}, ()>::{closure#1} as core[940e698046960fd5]::ops::function::FnOnce<()>>::call_once::{shim:vtable#0}<unknown>
  385. 27.91 s gammaloop-nextest-core> at <unknown source file>:<unknown line>
  386. 27.91 s gammaloop-nextest-core> 14: <std[bcb96dfbba0ab899]::sys::thread::unix::Thread>::new::thread_start<unknown>
  387. 27.91 s gammaloop-nextest-core> at <unknown source file>:<unknown line>
  388. 27.91 s gammaloop-nextest-core> 15: start_thread<unknown>
  389. 27.91 s gammaloop-nextest-core> at <unknown source file>:<unknown line>
  390. 27.91 s gammaloop-nextest-core> 16: __clone3<unknown>
  391. 27.91 s gammaloop-nextest-core> at <unknown source file>:<unknown line>
  392. 27.91 s gammaloop-nextest-core>
  393. 27.91 s gammaloop-nextest-core> Run with COLORBT_SHOW_HIDDEN=1 environment variable to disable frame filtering.
  394. 27.91 s gammaloop-nextest-core> Run with RUST_BACKTRACE=full to include source snippets.
  395. 27.91 s gammaloop-nextest-core>
  396. 37.93 s gammaloop-nextest-core> ------------
  397. 37.93 s gammaloop-nextest-core> Summary [ 12.837s] 692 tests run: 686 passed, 6 failed, 60 skipped
  398. 37.93 s gammaloop-nextest-core> FAIL [ 0.118s] (149/692) gammalooprs graph::three_d_source::tests::exact_taylor_vacuum_affine_circulation_preserves_energy_mapping
  399. 37.93 s gammaloop-nextest-core> stdout ---
  400. 37.93 s gammaloop-nextest-core>
  401. 37.93 s gammaloop-nextest-core> running 1 test
  402. 37.93 s gammaloop-nextest-core> test graph::three_d_source::tests::exact_taylor_vacuum_affine_circulation_preserves_energy_mapping ... FAILED
  403. 37.93 s gammaloop-nextest-core>
  404. 37.93 s gammaloop-nextest-core> failures:
  405. 37.93 s gammaloop-nextest-core>
  406. 37.93 s gammaloop-nextest-core> failures:
  407. 37.93 s gammaloop-nextest-core> graph::three_d_source::tests::exact_taylor_vacuum_affine_circulation_preserves_energy_mapping
  408. 37.93 s gammaloop-nextest-core>
  409. 37.93 s gammaloop-nextest-core> test result: FAILED. 0 passed; 1 failed; 0 ignored; 0 measured; 742 filtered out; finished in 0.10s
  410. 37.93 s gammaloop-nextest-core>
  411. 37.93 s gammaloop-nextest-core> stderr ---
  412. 37.93 s gammaloop-nextest-core> The application panicked (crashed).
  413. 37.93 s gammaloop-nextest-core> Message: assertion `left == right` failed
  414. 37.93 s gammaloop-nextest-core> left: (gammalooprs::mUVexp^2+(-gammalooprs::Q(1,spenso::cind(1))+gammalooprs::Q(4,spenso::cind(1)))^2+(-gammalooprs::Q(1,spenso::cind(2))+gammalooprs::Q(4,spenso::cind(2)))^2+(-gammalooprs::Q(1,spenso::cind(3))+gammalooprs::Q(4,spenso::cind(3)))^2)^(1/2)
  415. 37.93 s gammaloop-nextest-core> right: (gammalooprs::mUVexp^2+(gammalooprs::Q(1,spenso::cind(1))-gammalooprs::Q(4,spenso::cind(1)))^2+(gammalooprs::Q(1,spenso::cind(2))-gammalooprs::Q(4,spenso::cind(2)))^2+(gammalooprs::Q(1,spenso::cind(3))-gammalooprs::Q(4,spenso::cind(3)))^2)^(1/2)
  416. 37.93 s gammaloop-nextest-core> Location: crates/gammalooprs/src/graph/three_d_source.rs:7797
  417. 37.93 s gammaloop-nextest-core>
  418. 37.93 s gammaloop-nextest-core> ━━━━━━━━━━━━━━━━━━━━━━━━━━━━━━━━━━ BACKTRACE ━━━━━━━━━━━━━━━━━━━━━━━━━━━━━━━━━━━
  419. 37.93 s gammaloop-nextest-core> 1: <color_eyre[51793ea62743adbd]::config::PanicHook>::panic_report<unknown>
  420. 37.93 s gammaloop-nextest-core> at <unknown source file>:<unknown line>
  421. 37.93 s gammaloop-nextest-core> 2: <color_eyre[51793ea62743adbd]::config::PanicHook>::into_panic_hook::{closure#0}<unknown>
  422. 37.93 s gammaloop-nextest-core> at <unknown source file>:<unknown line>
  423. 37.93 s gammaloop-nextest-core> 3: std[bcb96dfbba0ab899]::panicking::panic_with_hook<unknown>
  424. 37.93 s gammaloop-nextest-core> at <unknown source file>:<unknown line>
  425. 37.93 s gammaloop-nextest-core> 4: std[bcb96dfbba0ab899]::panicking::panic_handler::{closure#0}<unknown>
  426. 37.93 s gammaloop-nextest-core> at <unknown source file>:<unknown line>
  427. 37.93 s gammaloop-nextest-core> 5: std[bcb96dfbba0ab899]::sys::backtrace::__rust_end_short_backtrace::<std[bcb96dfbba0ab899]::panicking::panic_handler::{closure#0}, !><unknown>
  428. 37.93 s gammaloop-nextest-core> at <unknown source file>:<unknown line>
  429. 37.93 s gammaloop-nextest-core> 6: __rustc[6c289b9f9c454d21]::rust_begin_unwind<unknown>
  430. 37.93 s gammaloop-nextest-core> at <unknown source file>:<unknown line>
  431. 37.93 s gammaloop-nextest-core> 7: core[940e698046960fd5]::panicking::panic_fmt<unknown>
  432. 37.93 s gammaloop-nextest-core> at <unknown source file>:<unknown line>
  433. 37.93 s gammaloop-nextest-core> 8: core[940e698046960fd5]::panicking::assert_failed_inner<unknown>
  434. 37.93 s gammaloop-nextest-core> at <unknown source file>:<unknown line>
  435. 37.93 s gammaloop-nextest-core> 9: core[940e698046960fd5]::panicking::assert_failed::<symbolica[499970c26fd75ddd]::atom::Atom, symbolica[499970c26fd75ddd]::atom::Atom><unknown>
  436. 37.93 s gammaloop-nextest-core> at <unknown source file>:<unknown line>
  437. 37.93 s gammaloop-nextest-core> 10: gammalooprs[24955f93fc9f4e0c]::graph::three_d_source::tests::exact_taylor_vacuum_affine_circulation_preserves_energy_mapping<unknown>
  438. 37.93 s gammaloop-nextest-core> at <unknown source file>:<unknown line>
  439. 37.93 s gammaloop-nextest-core> 11: <gammalooprs[24955f93fc9f4e0c]::graph::three_d_source::tests::exact_taylor_vacuum_affine_circulation_preserves_energy_mapping::{closure#0} as core[940e698046960fd5]::ops::function::FnOnce<()>>::call_once<unknown>
  440. 37.93 s gammaloop-nextest-core> at <unknown source file>:<unknown line>
  441. 37.93 s gammaloop-nextest-core> 12: test[75d6903177b1d7e9]::__rust_begin_short_backtrace::<core[940e698046960fd5]::result::Result<(), alloc[2ea6bcb46fca0c42]::string::String>, fn() -> core[940e698046960fd5]::result::Result<(), alloc[2ea6bcb46fca0c42]::string::String>><unknown>
  442. 37.93 s gammaloop-nextest-core> at <unknown source file>:<unknown line>
  443. 37.93 s gammaloop-nextest-core> 13: test[75d6903177b1d7e9]::run_test::{closure#0}<unknown>
  444. 37.93 s gammaloop-nextest-core> at <unknown source file>:<unknown line>
  445. 37.93 s gammaloop-nextest-core> 14: std[bcb96dfbba0ab899]::sys::backtrace::__rust_begin_short_backtrace::<test[75d6903177b1d7e9]::run_test::{closure#1}, ()><unknown>
  446. 37.93 s gammaloop-nextest-core> at <unknown source file>:<unknown line>
  447. 37.93 s gammaloop-nextest-core> 15: <std[bcb96dfbba0ab899]::thread::lifecycle::spawn_unchecked<test[75d6903177b1d7e9]::run_test::{closure#1}, ()>::{closure#1} as core[940e698046960fd5]::ops::function::FnOnce<()>>::call_once::{shim:vtable#0}<unknown>
  448. 37.93 s gammaloop-nextest-core> at <unknown source file>:<unknown line>
  449. 37.93 s gammaloop-nextest-core> 16: <std[bcb96dfbba0ab899]::sys::thread::unix::Thread>::new::thread_start<unknown>
  450. 37.93 s gammaloop-nextest-core> at <unknown source file>:<unknown line>
  451. 37.93 s gammaloop-nextest-core> 17: start_thread<unknown>
  452. 37.93 s gammaloop-nextest-core> at <unknown source file>:<unknown line>
  453. 37.93 s gammaloop-nextest-core> 18: __clone3<unknown>
  454. 37.93 s gammaloop-nextest-core> at <unknown source file>:<unknown line>
  455. 37.93 s gammaloop-nextest-core>
  456. 37.93 s gammaloop-nextest-core> Run with COLORBT_SHOW_HIDDEN=1 environment variable to disable frame filtering.
  457. 37.93 s gammaloop-nextest-core> Run with RUST_BACKTRACE=full to include source snippets.
  458. 37.93 s gammaloop-nextest-core>
  459. 37.93 s gammaloop-nextest-core> FAIL [ 0.117s] (161/692) gammalooprs graph::three_d_source::tests::pinched_affine_carrier_requires_occurrence_interpolation
  460. 37.93 s gammaloop-nextest-core> stdout ---
  461. 37.93 s gammaloop-nextest-core>
  462. 37.93 s gammaloop-nextest-core> running 1 test
  463. 37.93 s gammaloop-nextest-core> test graph::three_d_source::tests::pinched_affine_carrier_requires_occurrence_interpolation ... FAILED
  464. 37.93 s gammaloop-nextest-core>
  465. 37.93 s gammaloop-nextest-core> failures:
  466. 37.93 s gammaloop-nextest-core>
  467. 37.93 s gammaloop-nextest-core> failures:
  468. 37.93 s gammaloop-nextest-core> graph::three_d_source::tests::pinched_affine_carrier_requires_occurrence_interpolation
  469. 37.93 s gammaloop-nextest-core>
  470. 37.93 s gammaloop-nextest-core> test result: FAILED. 0 passed; 1 failed; 0 ignored; 0 measured; 742 filtered out; finished in 0.11s
  471. 37.93 s gammaloop-nextest-core>
  472. 37.93 s gammaloop-nextest-core> stderr ---
  473. 37.93 s gammaloop-nextest-core> The application panicked (crashed).
  474. 37.93 s gammaloop-nextest-core> Message: certified affine occurrence lift must reproduce the independent double contours: actual=-(-1/16*(3+E0)*(5+E0)/((1+Q(0,cind(1))^2+Q(0,cind(2))^2+Q(0,cind(3))^2)^(3/2)*(1+Q(1,cind(1))^2+Q(1,cind(2))^2+Q(1,cind(3))^2)^(3/2))-1/16*(3+E1)*(5+E1)/((1+Q(0,cind(1))^2+Q(0,cind(2))^2+Q(0,cind(3))^2)^(3/2)*(1+Q(1,cind(1))^2+Q(1,cind(2))^2+Q(1,cind(3))^2)^(3/2))-1/16*(3-E0)*(5-E0)/((1+Q(0,cind(1))^2+Q(0,cind(2))^2+Q(0,cind(3))^2)^(3/2)*(1+Q(1,cind(1))^2+Q(1,cind(2))^2+Q(1,cind(3))^2)^(3/2))-1/16*(3-E1)*(5-E1)/((1+Q(0,cind(1))^2+Q(0,cind(2))^2+Q(0,cind(3))^2)^(3/2)*(1+Q(1,cind(1))^2+Q(1,cind(2))^2+Q(1,cind(3))^2)^(3/2))+1/64*(3+E0+E1)*(5+E0+E1)/((1+Q(0,cind(1))^2+Q(0,cind(2))^2+Q(0,cind(3))^2)^(3/2)*(1+Q(1,cind(1))^2+Q(1,cind(2))^2+Q(1,cind(3))^2)^(3/2))+1/64*(3+E0-E1)*(5+E0-E1)/((1+Q(0,cind(1))^2+Q(0,cind(2))^2+Q(0,cind(3))^2)^(3/2)*(1+Q(1,cind(1))^2+Q(1,cind(2))^2+Q(1,cind(3))^2)^(3/2))+1/64*(3-E0+E1)*(5-E0+E1)/((1+Q(0,cind(1))^2+Q(0,cind(2))^2+Q(0,cind(3))^2)^(3/2)*(1+Q(1,cind(1))^2+Q(1,cind(2))^2+Q(1,cind(3))^2)^(3/2))+1/64*(3-E0-E1)*(5-E0-E1)/((1+Q(0,cind(1))^2+Q(0,cind(2))^2+Q(0,cind(3))^2)^(3/2)*(1+Q(1,cind(1))^2+Q(1,cind(2))^2+Q(1,cind(3))^2)^(3/2))+15/4/((1+Q(0,cind(1))^2+Q(0,cind(2))^2+Q(0,cind(3))^2)^(3/2)*(1+Q(1,cind(1))^2+Q(1,cind(2))^2+Q(1,cind(3))^2)^(3/2))), expected=1/16*(15-E0^2-E1^2)/(E0^3*E1^3)
  475. 37.93 s gammaloop-nextest-core> Location: crates/gammalooprs/src/graph/three_d_source.rs:7619
  476. 37.93 s gammaloop-nextest-core>
  477. 37.93 s gammaloop-nextest-core> ━━━━━━━━━━━━━━━━━━━━━━━━━━━━━━━━━━ BACKTRACE ━━━━━━━━━━━━━━━━━━━━━━━━━━━━━━━━━━━
  478. 37.93 s gammaloop-nextest-core> 1: <color_eyre[51793ea62743adbd]::config::PanicHook>::panic_report<unknown>
  479. 37.93 s gammaloop-nextest-core> at <unknown source file>:<unknown line>
  480. 37.93 s gammaloop-nextest-core> 2: <color_eyre[51793ea62743adbd]::config::PanicHook>::into_panic_hook::{closure#0}<unknown>
  481. 37.93 s gammaloop-nextest-core> at <unknown source file>:<unknown line>
  482. 37.93 s gammaloop-nextest-core> 3: std[bcb96dfbba0ab899]::panicking::panic_with_hook<unknown>
  483. 37.93 s gammaloop-nextest-core> at <unknown source file>:<unknown line>
  484. 37.93 s gammaloop-nextest-core> 4: std[bcb96dfbba0ab899]::panicking::panic_handler::{closure#0}<unknown>
  485. 37.93 s gammaloop-nextest-core> at <unknown source file>:<unknown line>
  486. 37.93 s gammaloop-nextest-core> 5: std[bcb96dfbba0ab899]::sys::backtrace::__rust_end_short_backtrace::<std[bcb96dfbba0ab899]::panicking::panic_handler::{closure#0}, !><unknown>
  487. 37.93 s gammaloop-nextest-core> at <unknown source file>:<unknown line>
  488. 37.93 s gammaloop-nextest-core> 6: __rustc[6c289b9f9c454d21]::rust_begin_unwind<unknown>
  489. 37.93 s gammaloop-nextest-core> at <unknown source file>:<unknown line>
  490. 37.93 s gammaloop-nextest-core> 7: core[940e698046960fd5]::panicking::panic_fmt<unknown>
  491. 37.93 s gammaloop-nextest-core> at <unknown source file>:<unknown line>
  492. 37.93 s gammaloop-nextest-core> 8: <gammalooprs[24955f93fc9f4e0c]::graph::three_d_source::tests::pinched_affine_carrier_requires_occurrence_interpolation::{closure#0} as core[940e698046960fd5]::ops::function::FnOnce<()>>::call_once<unknown>
  493. 37.93 s gammaloop-nextest-core> at <unknown source file>:<unknown line>
  494. 37.93 s gammaloop-nextest-core> 9: test[75d6903177b1d7e9]::__rust_begin_short_backtrace::<core[940e698046960fd5]::result::Result<(), alloc[2ea6bcb46fca0c42]::string::String>, fn() -> core[940e698046960fd5]::result::Result<(), alloc[2ea6bcb46fca0c42]::string::String>><unknown>
  495. 37.93 s gammaloop-nextest-core> at <unknown source file>:<unknown line>
  496. 37.93 s gammaloop-nextest-core> 10: test[75d6903177b1d7e9]::run_test::{closure#0}<unknown>
  497. 37.93 s gammaloop-nextest-core> at <unknown source file>:<unknown line>
  498. 37.93 s gammaloop-nextest-core> 11: std[bcb96dfbba0ab899]::sys::backtrace::__rust_begin_short_backtrace::<test[75d6903177b1d7e9]::run_test::{closure#1}, ()><unknown>
  499. 37.93 s gammaloop-nextest-core> at <unknown source file>:<unknown line>
  500. 37.93 s gammaloop-nextest-core> 12: <std[bcb96dfbba0ab899]::thread::lifecycle::spawn_unchecked<test[75d6903177b1d7e9]::run_test::{closure#1}, ()>::{closure#1} as core[940e698046960fd5]::ops::function::FnOnce<()>>::call_once::{shim:vtable#0}<unknown>
  501. 37.93 s gammaloop-nextest-core> at <unknown source file>:<unknown line>
  502. 37.93 s gammaloop-nextest-core> 13: <std[bcb96dfbba0ab899]::sys::thread::unix::Thread>::new::thread_start<unknown>
  503. 37.93 s gammaloop-nextest-core> at <unknown source file>:<unknown line>
  504. 37.93 s gammaloop-nextest-core> 14: start_thread<unknown>
  505. 37.93 s gammaloop-nextest-core> at <unknown source file>:<unknown line>
  506. 37.93 s gammaloop-nextest-core> 15: __clone3<unknown>
  507. 37.93 s gammaloop-nextest-core> at <unknown source file>:<unknown line>
  508. 37.93 s gammaloop-nextest-core>
  509. 37.93 s gammaloop-nextest-core> Run with COLORBT_SHOW_HIDDEN=1 environment variable to disable frame filtering.
  510. 37.93 s gammaloop-nextest-core> Run with RUST_BACKTRACE=full to include source snippets.
  511. 37.93 s gammaloop-nextest-core>
  512. 37.93 s gammaloop-nextest-core> FAIL [ 0.014s] (286/692) gammalooprs numerator::energy_degree::tests::canonical_class_cyclic_lifts_preserve_factorization_and_exact_bounds
  513. 37.93 s gammaloop-nextest-core> stdout ---
  514. 37.93 s gammaloop-nextest-core>
  515. 37.93 s gammaloop-nextest-core> running 1 test
  516. 37.93 s gammaloop-nextest-core> test numerator::energy_degree::tests::canonical_class_cyclic_lifts_preserve_factorization_and_exact_bounds ... FAILED
  517. 37.93 s gammaloop-nextest-core>
  518. 37.93 s gammaloop-nextest-core> failures:
  519. 37.93 s gammaloop-nextest-core>
  520. 37.93 s gammaloop-nextest-core> failures:
  521. 37.93 s gammaloop-nextest-core> numerator::energy_degree::tests::canonical_class_cyclic_lifts_preserve_factorization_and_exact_bounds
  522. 37.93 s gammaloop-nextest-core>
  523. 37.93 s gammaloop-nextest-core> test result: FAILED. 0 passed; 1 failed; 0 ignored; 0 measured; 742 filtered out; finished in 0.01s
  524. 37.93 s gammaloop-nextest-core>
  525. 37.93 s gammaloop-nextest-core> stderr ---
  526. 37.93 s gammaloop-nextest-core>
  527. 37.93 s gammaloop-nextest-core> thread 'numerator::energy_degree::tests::canonical_class_cyclic_lifts_preserve_factorization_and_exact_bounds' (2265) panicked at crates/gammalooprs/src/numerator/energy_degree.rs:2850:13:
  528. 37.93 s gammaloop-nextest-core> assertion failed: (collapsed - expression).collect_factors().is_zero()
  529. 37.93 s gammaloop-nextest-core> stack backtrace:
  530. 37.93 s gammaloop-nextest-core> 0: __rustc::rust_begin_unwind
  531. 37.93 s gammaloop-nextest-core> 1: core::panicking::panic_fmt
  532. 37.93 s gammaloop-nextest-core> 2: core::panicking::panic
  533. 37.93 s gammaloop-nextest-core> 3: gammalooprs::numerator::energy_degree::tests::canonical_class_cyclic_lifts_preserve_factorization_and_exact_bounds
  534. 37.93 s gammaloop-nextest-core> 4: <gammalooprs::numerator::energy_degree::tests::canonical_class_cyclic_lifts_preserve_factorization_and_exact_bounds::{closure#0} as core::ops::function::FnOnce<()>>::call_once
  535. 37.93 s gammaloop-nextest-core> note: Some details are omitted, run with `RUST_BACKTRACE=full` for a verbose backtrace.
  536. 37.93 s gammaloop-nextest-core>
  537. 37.93 s gammaloop-nextest-core> FAIL [ 0.074s] (587/692) gammalooprs uv::approx::local_4d::tests::canonical_uv_classes_certify_signed_aliases_and_preserve_raw_sectors
  538. 37.93 s gammaloop-nextest-core> stdout ---
  539. 37.93 s gammaloop-nextest-core>
  540. 37.93 s gammaloop-nextest-core> running 1 test
  541. 37.93 s gammaloop-nextest-core> test uv::approx::local_4d::tests::canonical_uv_classes_certify_signed_aliases_and_preserve_raw_sectors ... FAILED
  542. 37.93 s gammaloop-nextest-core>
  543. 37.93 s gammaloop-nextest-core> failures:
  544. 37.93 s gammaloop-nextest-core>
  545. 37.93 s gammaloop-nextest-core> failures:
  546. 37.93 s gammaloop-nextest-core> uv::approx::local_4d::tests::canonical_uv_classes_certify_signed_aliases_and_preserve_raw_sectors
  547. 37.93 s gammaloop-nextest-core>
  548. 37.93 s gammaloop-nextest-core> test result: FAILED. 0 passed; 1 failed; 0 ignored; 0 measured; 742 filtered out; finished in 0.07s
  549. 37.93 s gammaloop-nextest-core>
  550. 37.93 s gammaloop-nextest-core> stderr ---
  551. 37.93 s gammaloop-nextest-core> Error:
  552. 37.93 s gammaloop-nextest-core> 0: merged canonical UV numerator does not reproduce its source bucket
  553. 37.93 s gammaloop-nextest-core>
  554. 37.93 s gammaloop-nextest-core> Location:
  555. 37.93 s gammaloop-nextest-core> crates/gammalooprs/src/uv/approx/local_4d.rs:367
  556. 37.93 s gammaloop-nextest-core>
  557. 37.93 s gammaloop-nextest-core> ━━━━━━━━━━━━━━━━━━━━━━━━━━━━━━━━━━ BACKTRACE ━━━━━━━━━━━━━━━━━━━━━━━━━━━━━━━━━━━
  558. 37.93 s gammaloop-nextest-core> 1: <color_eyre[51793ea62743adbd]::config::EyreHook>::into_eyre_hook::{closure#0}<unknown>
  559. 37.93 s gammaloop-nextest-core> at <unknown source file>:<unknown line>
  560. 37.93 s gammaloop-nextest-core> 2: eyre[cb2fd339c0c40fca]::capture_handler<unknown>
  561. 37.93 s gammaloop-nextest-core> at <unknown source file>:<unknown line>
  562. 37.93 s gammaloop-nextest-core> 3: eyre[cb2fd339c0c40fca]::private::format_err<unknown>
  563. 37.93 s gammaloop-nextest-core> at <unknown source file>:<unknown line>
  564. 37.93 s gammaloop-nextest-core> 4: <gammalooprs[24955f93fc9f4e0c]::uv::approx::local_4d::FourDSector>::canonical_projection<unknown>
  565. 37.93 s gammaloop-nextest-core> at <unknown source file>:<unknown line>
  566. 37.93 s gammaloop-nextest-core> 5: gammalooprs[24955f93fc9f4e0c]::uv::approx::local_4d::tests::canonical_uv_classes_certify_signed_aliases_and_preserve_raw_sectors<unknown>
  567. 37.93 s gammaloop-nextest-core> at <unknown source file>:<unknown line>
  568. 37.93 s gammaloop-nextest-core> 6: <gammalooprs[24955f93fc9f4e0c]::uv::approx::local_4d::tests::canonical_uv_classes_certify_signed_aliases_and_preserve_raw_sectors::{closure#0} as core[940e698046960fd5]::ops::function::FnOnce<()>>::call_once<unknown>
  569. 37.93 s gammaloop-nextest-core> at <unknown source file>:<unknown line>
  570. 37.93 s gammaloop-nextest-core> 7: test[75d6903177b1d7e9]::__rust_begin_short_backtrace::<core[940e698046960fd5]::result::Result<(), alloc[2ea6bcb46fca0c42]::string::String>, fn() -> core[940e698046960fd5]::result::Result<(), alloc[2ea6bcb46fca0c42]::string::String>><unknown>
  571. 37.93 s gammaloop-nextest-core> at <unknown source file>:<unknown line>
  572. 37.93 s gammaloop-nextest-core> 8: test[75d6903177b1d7e9]::run_test::{closure#0}<unknown>
  573. 37.93 s gammaloop-nextest-core> at <unknown source file>:<unknown line>
  574. 37.93 s gammaloop-nextest-core> 9: std[bcb96dfbba0ab899]::sys::backtrace::__rust_begin_short_backtrace::<test[75d6903177b1d7e9]::run_test::{closure#1}, ()><unknown>
  575. 37.93 s gammaloop-nextest-core> at <unknown source file>:<unknown line>
  576. 37.93 s gammaloop-nextest-core> 10: <std[bcb96dfbba0ab899]::thread::lifecycle::spawn_unchecked<test[75d6903177b1d7e9]::run_test::{closure#1}, ()>::{closure#1} as core[940e698046960fd5]::ops::function::FnOnce<()>>::call_once::{shim:vtable#0}<unknown>
  577. 37.93 s gammaloop-nextest-core> at <unknown source file>:<unknown line>
  578. 37.93 s gammaloop-nextest-core> 11: <std[bcb96dfbba0ab899]::sys::thread::unix::Thread>::new::thread_start<unknown>
  579. 37.93 s gammaloop-nextest-core> at <unknown source file>:<unknown line>
  580. 37.93 s gammaloop-nextest-core> 12: start_thread<unknown>
  581. 37.93 s gammaloop-nextest-core> at <unknown source file>:<unknown line>
  582. 37.93 s gammaloop-nextest-core> 13: __clone3<unknown>
  583. 37.93 s gammaloop-nextest-core> at <unknown source file>:<unknown line>
  584. 37.93 s gammaloop-nextest-core>
  585. 37.93 s gammaloop-nextest-core> Run with COLORBT_SHOW_HIDDEN=1 environment variable to disable frame filtering.
  586. 37.93 s gammaloop-nextest-core> Run with RUST_BACKTRACE=full to include source snippets.
  587. 37.93 s gammaloop-nextest-core>
  588. 37.93 s gammaloop-nextest-core> FAIL [ 0.096s] (593/692) gammalooprs uv::approx::local_4d::tests::canonical_uv_signed_multiloop_carriers_preserve_factorized_numerators
  589. 37.93 s gammaloop-nextest-core> stdout ---
  590. 37.93 s gammaloop-nextest-core>
  591. 37.93 s gammaloop-nextest-core> running 1 test
  592. 37.93 s gammaloop-nextest-core> test uv::approx::local_4d::tests::canonical_uv_signed_multiloop_carriers_preserve_factorized_numerators ... FAILED
  593. 37.93 s gammaloop-nextest-core>
  594. 37.93 s gammaloop-nextest-core> failures:
  595. 37.93 s gammaloop-nextest-core>
  596. 37.93 s gammaloop-nextest-core> failures:
  597. 37.93 s gammaloop-nextest-core> uv::approx::local_4d::tests::canonical_uv_signed_multiloop_carriers_preserve_factorized_numerators
  598. 37.93 s gammaloop-nextest-core>
  599. 37.93 s gammaloop-nextest-core> test result: FAILED. 0 passed; 1 failed; 0 ignored; 0 measured; 742 filtered out; finished in 0.08s
  600. 37.93 s gammaloop-nextest-core>
  601. 37.93 s gammaloop-nextest-core> stderr ---
  602. 37.93 s gammaloop-nextest-core> The application panicked (crashed).
  603. 37.93 s gammaloop-nextest-core> Message: assertion `left == right` failed
  604. 37.93 s gammaloop-nextest-core> left: 2*(signed_multiloop::a+signed_multiloop::b)^5*gammalooprs::Q(gammalooprs::uv::class(0),spenso::cind(0))
  605. 37.93 s gammaloop-nextest-core> right: -2*(signed_multiloop::a+signed_multiloop::b)^5*gammalooprs::Q(gammalooprs::uv::class(0),spenso::cind(0))
  606. 37.93 s gammaloop-nextest-core> Location: crates/gammalooprs/src/uv/approx/local_4d.rs:1983
  607. 37.93 s gammaloop-nextest-core>
  608. 37.93 s gammaloop-nextest-core> ━━━━━━━━━━━━━━━━━━━━━━━━━━━━━━━━━━ BACKTRACE ━━━━━━━━━━━━━━━━━━━━━━━━━━━━━━━━━━━
  609. 37.93 s gammaloop-nextest-core> 1: <color_eyre[51793ea62743adbd]::config::PanicHook>::panic_report<unknown>
  610. 37.93 s gammaloop-nextest-core> at <unknown source file>:<unknown line>
  611. 37.93 s gammaloop-nextest-core> 2: <color_eyre[51793ea62743adbd]::config::PanicHook>::into_panic_hook::{closure#0}<unknown>
  612. 37.93 s gammaloop-nextest-core> at <unknown source file>:<unknown line>
  613. 37.93 s gammaloop-nextest-core> 3: std[bcb96dfbba0ab899]::panicking::panic_with_hook<unknown>
  614. 37.93 s gammaloop-nextest-core> at <unknown source file>:<unknown line>
  615. 37.93 s gammaloop-nextest-core> 4: std[bcb96dfbba0ab899]::panicking::panic_handler::{closure#0}<unknown>
  616. 37.93 s gammaloop-nextest-core> at <unknown source file>:<unknown line>
  617. 37.93 s gammaloop-nextest-core> 5: std[bcb96dfbba0ab899]::sys::backtrace::__rust_end_short_backtrace::<std[bcb96dfbba0ab899]::panicking::panic_handler::{closure#0}, !><unknown>
  618. 37.93 s gammaloop-nextest-core> at <unknown source file>:<unknown line>
  619. 37.93 s gammaloop-nextest-core> 6: __rustc[6c289b9f9c454d21]::rust_begin_unwind<unknown>
  620. 37.93 s gammaloop-nextest-core> at <unknown source file>:<unknown line>
  621. 37.93 s gammaloop-nextest-core> 7: core[940e698046960fd5]::panicking::panic_fmt<unknown>
  622. 37.93 s gammaloop-nextest-core> at <unknown source file>:<unknown line>
  623. 37.93 s gammaloop-nextest-core> 8: core[940e698046960fd5]::panicking::assert_failed_inner<unknown>
  624. 37.93 s gammaloop-nextest-core> at <unknown source file>:<unknown line>
  625. 37.93 s gammaloop-nextest-core> 9: core[940e698046960fd5]::panicking::assert_failed::<symbolica[499970c26fd75ddd]::atom::Atom, symbolica[499970c26fd75ddd]::atom::Atom><unknown>
  626. 37.93 s gammaloop-nextest-core> at <unknown source file>:<unknown line>
  627. 37.93 s gammaloop-nextest-core> 10: gammalooprs[24955f93fc9f4e0c]::uv::approx::local_4d::tests::canonical_uv_signed_multiloop_carriers_preserve_factorized_numerators<unknown>
  628. 37.93 s gammaloop-nextest-core> at <unknown source file>:<unknown line>
  629. 37.93 s gammaloop-nextest-core> 11: <gammalooprs[24955f93fc9f4e0c]::uv::approx::local_4d::tests::canonical_uv_signed_multiloop_carriers_preserve_factorized_numerators::{closure#0} as core[940e698046960fd5]::ops::function::FnOnce<()>>::call_once<unknown>
  630. 37.93 s gammaloop-nextest-core> at <unknown source file>:<unknown line>
  631. 37.93 s gammaloop-nextest-core> 12: test[75d6903177b1d7e9]::__rust_begin_short_backtrace::<core[940e698046960fd5]::result::Result<(), alloc[2ea6bcb46fca0c42]::string::String>, fn() -> core[940e698046960fd5]::result::Result<(), alloc[2ea6bcb46fca0c42]::string::String>><unknown>
  632. 37.93 s gammaloop-nextest-core> at <unknown source file>:<unknown line>
  633. 37.93 s gammaloop-nextest-core> 13: test[75d6903177b1d7e9]::run_test::{closure#0}<unknown>
  634. 37.93 s gammaloop-nextest-core> at <unknown source file>:<unknown line>
  635. 37.93 s gammaloop-nextest-core> 14: std[bcb96dfbba0ab899]::sys::backtrace::__rust_begin_short_backtrace::<test[75d6903177b1d7e9]::run_test::{closure#1}, ()><unknown>
  636. 37.93 s gammaloop-nextest-core> at <unknown source file>:<unknown line>
  637. 37.93 s gammaloop-nextest-core> 15: <std[bcb96dfbba0ab899]::thread::lifecycle::spawn_unchecked<test[75d6903177b1d7e9]::run_test::{closure#1}, ()>::{closure#1} as core[940e698046960fd5]::ops::function::FnOnce<()>>::call_once::{shim:vtable#0}<unknown>
  638. 37.93 s gammaloop-nextest-core> at <unknown source file>:<unknown line>
  639. 37.93 s gammaloop-nextest-core> 16: <std[bcb96dfbba0ab899]::sys::thread::unix::Thread>::new::thread_start<unknown>
  640. 37.93 s gammaloop-nextest-core> at <unknown source file>:<unknown line>
  641. 37.93 s gammaloop-nextest-core> 17: start_thread<unknown>
  642. 37.93 s gammaloop-nextest-core> at <unknown source file>:<unknown line>
  643. 37.93 s gammaloop-nextest-core> 18: __clone3<unknown>
  644. 37.93 s gammaloop-nextest-core> at <unknown source file>:<unknown line>
  645. 37.93 s gammaloop-nextest-core>
  646. 37.93 s gammaloop-nextest-core> Run with COLORBT_SHOW_HIDDEN=1 environment variable to disable frame filtering.
  647. 37.93 s gammaloop-nextest-core> Run with RUST_BACKTRACE=full to include source snippets.
  648. 37.93 s gammaloop-nextest-core>
  649. 37.93 s gammaloop-nextest-core> FAIL [ 0.112s] (605/692) gammalooprs uv::approx::tests::direct_nested_scalar_banana_replays_complete_cff_at_depth_three
  650. 37.93 s gammaloop-nextest-core> stdout ---
  651. 37.93 s gammaloop-nextest-core>
  652. 37.93 s gammaloop-nextest-core> running 1 test
  653. 37.93 s gammaloop-nextest-core> test uv::approx::tests::direct_nested_scalar_banana_replays_complete_cff_at_depth_three ... FAILED
  654. 37.93 s gammaloop-nextest-core>
  655. 37.93 s gammaloop-nextest-core> failures:
  656. 37.93 s gammaloop-nextest-core>
  657. 37.93 s gammaloop-nextest-core> failures:
  658. 37.93 s gammaloop-nextest-core> uv::approx::tests::direct_nested_scalar_banana_replays_complete_cff_at_depth_three
  659. 37.93 s gammaloop-nextest-core>
  660. 37.93 s gammaloop-nextest-core> test result: FAILED. 0 passed; 1 failed; 0 ignored; 0 measured; 742 filtered out; finished in 0.10s
  661. 37.93 s gammaloop-nextest-core>
  662. 37.93 s gammaloop-nextest-core> stderr ---
  663. 37.93 s gammaloop-nextest-core> Error:
  664. 37.93 s gammaloop-nextest-core> 0: canonical UV numerator does not reproduce its source in the component frame
  665. 37.93 s gammaloop-nextest-core>
  666. 37.93 s gammaloop-nextest-core> Location:
  667. 37.93 s gammaloop-nextest-core> crates/gammalooprs/src/uv/approx/local_4d.rs:354
  668. 37.93 s gammaloop-nextest-core>
  669. 37.93 s gammaloop-nextest-core> ━━━━━━━━━━━━━━━━━━━━━━━━━━━━━━━━━━ BACKTRACE ━━━━━━━━━━━━━━━━━━━━━━━━━━━━━━━━━━━
  670. 37.93 s gammaloop-nextest-core> 1: <color_eyre[51793ea62743adbd]::config::EyreHook>::into_eyre_hook::{closure#0}<unknown>
  671. 37.93 s gammaloop-nextest-core> at <unknown source file>:<unknown line>
  672. 37.93 s gammaloop-nextest-core> 2: eyre[cb2fd339c0c40fca]::capture_handler<unknown>
  673. 37.93 s gammaloop-nextest-core> at <unknown source file>:<unknown line>
  674. 37.93 s gammaloop-nextest-core> 3: eyre[cb2fd339c0c40fca]::private::format_err<unknown>
  675. 37.93 s gammaloop-nextest-core> at <unknown source file>:<unknown line>
  676. 37.93 s gammaloop-nextest-core> 4: <gammalooprs[24955f93fc9f4e0c]::uv::approx::local_4d::FourDSector>::canonical_projection<unknown>
  677. 37.93 s gammaloop-nextest-core> at <unknown source file>:<unknown line>
  678. 37.93 s gammaloop-nextest-core> 5: <gammalooprs[24955f93fc9f4e0c]::uv::approx::projected_4d::Projected4dApproximation>::project_local_4d<unknown>
  679. 37.93 s gammaloop-nextest-core> at <unknown source file>:<unknown line>
  680. 37.93 s gammaloop-nextest-core> 6: <gammalooprs[24955f93fc9f4e0c]::uv::approx::Approximation>::compute_3d<unknown>
  681. 37.93 s gammaloop-nextest-core> at <unknown source file>:<unknown line>
  682. 37.93 s gammaloop-nextest-core> 7: gammalooprs[24955f93fc9f4e0c]::uv::approx::tests::direct_nested_scalar_banana_replays_complete_cff_at_depth_three::{closure#0}<unknown>
  683. 37.93 s gammaloop-nextest-core> at <unknown source file>:<unknown line>
  684. 37.93 s gammaloop-nextest-core> 8: gammalooprs[24955f93fc9f4e0c]::uv::approx::tests::direct_nested_scalar_banana_replays_complete_cff_at_depth_three<unknown>
  685. 37.93 s gammaloop-nextest-core> at <unknown source file>:<unknown line>
  686. 37.93 s gammaloop-nextest-core> 9: <gammalooprs[24955f93fc9f4e0c]::uv::approx::tests::direct_nested_scalar_banana_replays_complete_cff_at_depth_three::{closure#0} as core[940e698046960fd5]::ops::function::FnOnce<()>>::call_once<unknown>
  687. 37.93 s gammaloop-nextest-core> at <unknown source file>:<unknown line>
  688. 37.93 s gammaloop-nextest-core> 10: test[75d6903177b1d7e9]::__rust_begin_short_backtrace::<core[940e698046960fd5]::result::Result<(), alloc[2ea6bcb46fca0c42]::string::String>, fn() -> core[940e698046960fd5]::result::Result<(), alloc[2ea6bcb46fca0c42]::string::String>><unknown>
  689. 37.93 s gammaloop-nextest-core> at <unknown source file>:<unknown line>
  690. 37.93 s gammaloop-nextest-core> 11: test[75d6903177b1d7e9]::run_test::{closure#0}<unknown>
  691. 37.93 s gammaloop-nextest-core> at <unknown source file>:<unknown line>
  692. 37.93 s gammaloop-nextest-core> 12: std[bcb96dfbba0ab899]::sys::backtrace::__rust_begin_short_backtrace::<test[75d6903177b1d7e9]::run_test::{closure#1}, ()><unknown>
  693. 37.93 s gammaloop-nextest-core> at <unknown source file>:<unknown line>
  694. 37.93 s gammaloop-nextest-core> 13: <std[bcb96dfbba0ab899]::thread::lifecycle::spawn_unchecked<test[75d6903177b1d7e9]::run_test::{closure#1}, ()>::{closure#1} as core[940e698046960fd5]::ops::function::FnOnce<()>>::call_once::{shim:vtable#0}<unknown>
  695. 37.93 s gammaloop-nextest-core> at <unknown source file>:<unknown line>
  696. 37.93 s gammaloop-nextest-core> 14: <std[bcb96dfbba0ab899]::sys::thread::unix::Thread>::new::thread_start<unknown>
  697. 37.93 s gammaloop-nextest-core> at <unknown source file>:<unknown line>
  698. 37.93 s gammaloop-nextest-core> 15: start_thread<unknown>
  699. 37.93 s gammaloop-nextest-core> at <unknown source file>:<unknown line>
  700. 37.93 s gammaloop-nextest-core> 16: __clone3<unknown>
  701. 37.93 s gammaloop-nextest-core> at <unknown source file>:<unknown line>
  702. 37.93 s gammaloop-nextest-core>
  703. 37.93 s gammaloop-nextest-core> Run with COLORBT_SHOW_HIDDEN=1 environment variable to disable frame filtering.
  704. 37.93 s gammaloop-nextest-core> Run with RUST_BACKTRACE=full to include source snippets.
  705. 37.93 s gammaloop-nextest-core>
  706. 37.99 s gammaloop-nextest-core> error: test run failed
  707. 38.02 s gammaloop-nextest-core>
  708. 38.02 s gammaloop-nextest-core> ========== nextest test summary ==========
  709. 38.02 s gammaloop-nextest-core> report: target/nextest/ci_gammaloop/junit.xml
  710. 38.02 s gammaloop-nextest-core> tests: 692, failures: 6, errors: 0
  711. 38.02 s gammaloop-nextest-core>
  712. 38.02 s gammaloop-nextest-core> 1. gammalooprs::graph::three_d_source::tests::exact_taylor_vacuum_affine_circulation_preserves_energy_mapping
  713. 38.02 s gammaloop-nextest-core> failure: test failure with exit code 101
  714. 38.02 s gammaloop-nextest-core> system-out
  715. 38.02 s gammaloop-nextest-core> running 1 test
  716. 38.02 s gammaloop-nextest-core> test graph::three_d_source::tests::exact_taylor_vacuum_affine_circulation_preserves_energy_mapping ... FAILED
  717. 38.02 s gammaloop-nextest-core>
  718. 38.02 s gammaloop-nextest-core> failures:
  719. 38.02 s gammaloop-nextest-core>
  720. 38.02 s gammaloop-nextest-core> failures:
  721. 38.02 s gammaloop-nextest-core> graph::three_d_source::tests::exact_taylor_vacuum_affine_circulation_preserves_energy_mapping
  722. 38.02 s gammaloop-nextest-core>
  723. 38.02 s gammaloop-nextest-core> test result: FAILED. 0 passed; 1 failed; 0 ignored; 0 measured; 742 filtered out; finished in 0.10s
  724. 38.02 s gammaloop-nextest-core> system-err
  725. 38.02 s gammaloop-nextest-core> The application panicked (crashed).
  726. 38.02 s gammaloop-nextest-core> Message: assertion `left == right` failed
  727. 38.02 s gammaloop-nextest-core> left: (gammalooprs::mUVexp^2+(-gammalooprs::Q(1,spenso::cind(1))+gammalooprs::Q(4,spenso::cind(1)))^2+(-gammalooprs::Q(1,spenso::cind(2))+gammalooprs::Q(4,spenso::cind(2)))^2+(-gammalooprs::Q(1,spenso::cind(3))+gammalooprs::Q(4,spenso::cind(3)))^2)^(1/2)
  728. 38.02 s gammaloop-nextest-core> right: (gammalooprs::mUVexp^2+(gammalooprs::Q(1,spenso::cind(1))-gammalooprs::Q(4,spenso::cind(1)))^2+(gammalooprs::Q(1,spenso::cind(2))-gammalooprs::Q(4,spenso::cind(2)))^2+(gammalooprs::Q(1,spenso::cind(3))-gammalooprs::Q(4,spenso::cind(3)))^2)^(1/2)
  729. 38.02 s gammaloop-nextest-core> Location: crates/gammalooprs/src/graph/three_d_source.rs:7797
  730. 38.02 s gammaloop-nextest-core>
  731. 38.02 s gammaloop-nextest-core> ━━━━━━━━━━━━━━━━━━━━━━━━━━━━━━━━━━ BACKTRACE ━━━━━━━━━━━━━━━━━━━━━━━━━━━━━━━━━━━
  732. 38.02 s gammaloop-nextest-core> 1: <color_eyre[51793ea62743adbd]::config::PanicHook>::panic_report<unknown>
  733. 38.02 s gammaloop-nextest-core> at <unknown source file>:<unknown line>
  734. 38.02 s gammaloop-nextest-core> 2: <color_eyre[51793ea62743adbd]::config::PanicHook>::into_panic_hook::{closure#0}<unknown>
  735. 38.02 s gammaloop-nextest-core> at <unknown source file>:<unknown line>
  736. 38.02 s gammaloop-nextest-core> 3: std[bcb96dfbba0ab899]::panicking::panic_with_hook<unknown>
  737. 38.02 s gammaloop-nextest-core> at <unknown source file>:<unknown line>
  738. 38.02 s gammaloop-nextest-core> 4: std[bcb96dfbba0ab899]::panicking::panic_handler::{closure#0}<unknown>
  739. 38.02 s gammaloop-nextest-core> at <unknown source file>:<unknown line>
  740. 38.02 s gammaloop-nextest-core> 5: std[bcb96dfbba0ab899]::sys::backtrace::__rust_end_short_backtrace::<std[bcb96dfbba0ab899]::panicking::panic_handler::{closure#0}, !><unknown>
  741. 38.02 s gammaloop-nextest-core> at <unknown source file>:<unknown line>
  742. 38.02 s gammaloop-nextest-core> 6: __rustc[6c289b9f9c454d21]::rust_begin_unwind<unknown>
  743. 38.02 s gammaloop-nextest-core> at <unknown source file>:<unknown line>
  744. 38.02 s gammaloop-nextest-core> 7: core[940e698046960fd5]::panicking::panic_fmt<unknown>
  745. 38.02 s gammaloop-nextest-core> at <unknown source file>:<unknown line>
  746. 38.02 s gammaloop-nextest-core> 8: core[940e698046960fd5]::panicking::assert_failed_inner<unknown>
  747. 38.02 s gammaloop-nextest-core> at <unknown source file>:<unknown line>
  748. 38.02 s gammaloop-nextest-core> 9: core[940e698046960fd5]::panicking::assert_failed::<symbolica[499970c26fd75ddd]::atom::Atom, symbolica[499970c26fd75ddd]::atom::Atom><unknown>
  749. 38.02 s gammaloop-nextest-core> at <unknown source file>:<unknown line>
  750. 38.02 s gammaloop-nextest-core> 10: gammalooprs[24955f93fc9f4e0c]::graph::three_d_source::tests::exact_taylor_vacuum_affine_circulation_preserves_energy_mapping<unknown>
  751. 38.02 s gammaloop-nextest-core> at <unknown source file>:<unknown line>
  752. 38.02 s gammaloop-nextest-core> 11: <gammalooprs[24955f93fc9f4e0c]::graph::three_d_source::tests::exact_taylor_vacuum_affine_circulation_preserves_energy_mapping::{closure#0} as core[940e698046960fd5]::ops::function::FnOnce<()>>::call_once<unknown>
  753. 38.02 s gammaloop-nextest-core> at <unknown source file>:<unknown line>
  754. 38.02 s gammaloop-nextest-core> 12: test[75d6903177b1d7e9]::__rust_begin_short_backtrace::<core[940e698046960fd5]::result::Result<(), alloc[2ea6bcb46fca0c42]::string::String>, fn() -> core[940e698046960fd5]::result::Result<(), alloc[2ea6bcb46fca0c42]::string::String>><unknown>
  755. 38.02 s gammaloop-nextest-core> at <unknown source file>:<unknown line>
  756. 38.02 s gammaloop-nextest-core> 13: test[75d6903177b1d7e9]::run_test::{closure#0}<unknown>
  757. 38.02 s gammaloop-nextest-core> at <unknown source file>:<unknown line>
  758. 38.02 s gammaloop-nextest-core> 14: std[bcb96dfbba0ab899]::sys::backtrace::__rust_begin_short_backtrace::<test[75d6903177b1d7e9]::run_test::{closure#1}, ()><unknown>
  759. 38.02 s gammaloop-nextest-core> at <unknown source file>:<unknown line>
  760. 38.02 s gammaloop-nextest-core> 15: <std[bcb96dfbba0ab899]::thread::lifecycle::spawn_unchecked<test[75d6903177b1d7e9]::run_test::{closure#1}, ()>::{closure#1} as core[940e698046960fd5]::ops::function::FnOnce<()>>::call_once::{shim:vtable#0}<unknown>
  761. 38.02 s gammaloop-nextest-core> at <unknown source file>:<unknown line>
  762. 38.02 s gammaloop-nextest-core> 16: <std[bcb96dfbba0ab899]::sys::thread::unix::Thread>::new::thread_start<unknown>
  763. 38.02 s gammaloop-nextest-core> at <unknown source file>:<unknown line>
  764. 38.02 s gammaloop-nextest-core> 17: start_thread<unknown>
  765. 38.02 s gammaloop-nextest-core> at <unknown source file>:<unknown line>
  766. 38.02 s gammaloop-nextest-core> 18: __clone3<unknown>
  767. 38.02 s gammaloop-nextest-core> at <unknown source file>:<unknown line>
  768. 38.02 s gammaloop-nextest-core>
  769. 38.02 s gammaloop-nextest-core> Run with COLORBT_SHOW_HIDDEN=1 environment variable to disable frame filtering.
  770. 38.02 s gammaloop-nextest-core> Run with RUST_BACKTRACE=full to include source snippets.
  771. 38.02 s gammaloop-nextest-core>
  772. 38.02 s gammaloop-nextest-core> 2. gammalooprs::graph::three_d_source::tests::pinched_affine_carrier_requires_occurrence_interpolation
  773. 38.02 s gammaloop-nextest-core> failure: test failure with exit code 101
  774. 38.02 s gammaloop-nextest-core> system-out
  775. 38.02 s gammaloop-nextest-core> running 1 test
  776. 38.02 s gammaloop-nextest-core> test graph::three_d_source::tests::pinched_affine_carrier_requires_occurrence_interpolation ... FAILED
  777. 38.02 s gammaloop-nextest-core>
  778. 38.02 s gammaloop-nextest-core> failures:
  779. 38.02 s gammaloop-nextest-core>
  780. 38.02 s gammaloop-nextest-core> failures:
  781. 38.02 s gammaloop-nextest-core> graph::three_d_source::tests::pinched_affine_carrier_requires_occurrence_interpolation
  782. 38.02 s gammaloop-nextest-core>
  783. 38.02 s gammaloop-nextest-core> test result: FAILED. 0 passed; 1 failed; 0 ignored; 0 measured; 742 filtered out; finished in 0.11s
  784. 38.02 s gammaloop-nextest-core> system-err
  785. 38.02 s gammaloop-nextest-core> The application panicked (crashed).
  786. 38.02 s gammaloop-nextest-core> Message: certified affine occurrence lift must reproduce the independent double contours: actual=-(-1/16*(3+E0)*(5+E0)/((1+Q(0,cind(1))^2+Q(0,cind(2))^2+Q(0,cind(3))^2)^(3/2)*(1+Q(1,cind(1))^2+Q(1,cind(2))^2+Q(1,cind(3))^2)^(3/2))-1/16*(3+E1)*(5+E1)/((1+Q(0,cind(1))^2+Q(0,cind(2))^2+Q(0,cind(3))^2)^(3/2)*(1+Q(1,cind(1))^2+Q(1,cind(2))^2+Q(1,cind(3))^2)^(3/2))-1/16*(3-E0)*(5-E0)/((1+Q(0,cind(1))^2+Q(0,cind(2))^2+Q(0,cind(3))^2)^(3/2)*(1+Q(1,cind(1))^2+Q(1,cind(2))^2+Q(1,cind(3))^2)^(3/2))-1/16*(3-E1)*(5-E1)/((1+Q(0,cind(1))^2+Q(0,cind(2))^2+Q(0,cind(3))^2)^(3/2)*(1+Q(1,cind(1))^2+Q(1,cind(2))^2+Q(1,cind(3))^2)^(3/2))+1/64*(3+E0+E1)*(5+E0+E1)/((1+Q(0,cind(1))^2+Q(0,cind(2))^2+Q(0,cind(3))^2)^(3/2)*(1+Q(1,cind(1))^2+Q(1,cind(2))^2+Q(1,cind(3))^2)^(3/2))+1/64*(3+E0-E1)*(5+E0-E1)/((1+Q(0,cind(1))^2+Q(0,cind(2))^2+Q(0,cind(3))^2)^(3/2)*(1+Q(1,cind(1))^2+Q(1,cind(2))^2+Q(1,cind(3))^2)^(3/2))+1/64*(3-E0+E1)*(5-E0+E1)/((1+Q(0,cind(1))^2+Q(0,cind(2))^2+Q(0,cind(3))^2)^(3/2)*(1+Q(1,cind(1))^2+Q(1,cind(2))^2+Q(1,cind(3))^2)^(3/2))+1/64*(3-E0-E1)*(5-E0-E1)/((1+Q(0,cind(1))^2+Q(0,cind(2))^2+Q(0,cind(3))^2)^(3/2)*(1+Q(1,cind(1))^2+Q(1,cind(2))^2+Q(1,cind(3))^2)^(3/2))+15/4/((1+Q(0,cind(1))^2+Q(0,cind(2))^2+Q(0,cind(3))^2)^(3/2)*(1+Q(1,cind(1))^2+Q(1,cind(2))^2+Q(1,cind(3))^2)^(3/2))), expected=1/16*(15-E0^2-E1^2)/(E0^3*E1^3)
  787. 38.02 s gammaloop-nextest-core> Location: crates/gammalooprs/src/graph/three_d_source.rs:7619
  788. 38.02 s gammaloop-nextest-core>
  789. 38.02 s gammaloop-nextest-core> ━━━━━━━━━━━━━━━━━━━━━━━━━━━━━━━━━━ BACKTRACE ━━━━━━━━━━━━━━━━━━━━━━━━━━━━━━━━━━━
  790. 38.02 s gammaloop-nextest-core> 1: <color_eyre[51793ea62743adbd]::config::PanicHook>::panic_report<unknown>
  791. 38.02 s gammaloop-nextest-core> at <unknown source file>:<unknown line>
  792. 38.02 s gammaloop-nextest-core> 2: <color_eyre[51793ea62743adbd]::config::PanicHook>::into_panic_hook::{closure#0}<unknown>
  793. 38.02 s gammaloop-nextest-core> at <unknown source file>:<unknown line>
  794. 38.02 s gammaloop-nextest-core> 3: std[bcb96dfbba0ab899]::panicking::panic_with_hook<unknown>
  795. 38.02 s gammaloop-nextest-core> at <unknown source file>:<unknown line>
  796. 38.02 s gammaloop-nextest-core> 4: std[bcb96dfbba0ab899]::panicking::panic_handler::{closure#0}<unknown>
  797. 38.02 s gammaloop-nextest-core> at <unknown source file>:<unknown line>
  798. 38.02 s gammaloop-nextest-core> 5: std[bcb96dfbba0ab899]::sys::backtrace::__rust_end_short_backtrace::<std[bcb96dfbba0ab899]::panicking::panic_handler::{closure#0}, !><unknown>
  799. 38.02 s gammaloop-nextest-core> at <unknown source file>:<unknown line>
  800. 38.02 s gammaloop-nextest-core> 6: __rustc[6c289b9f9c454d21]::rust_begin_unwind<unknown>
  801. 38.02 s gammaloop-nextest-core> at <unknown source file>:<unknown line>
  802. 38.02 s gammaloop-nextest-core> 7: core[940e698046960fd5]::panicking::panic_fmt<unknown>
  803. 38.02 s gammaloop-nextest-core> at <unknown source file>:<unknown line>
  804. 38.02 s gammaloop-nextest-core> 8: <gammalooprs[24955f93fc9f4e0c]::graph::three_d_source::tests::pinched_affine_carrier_requires_occurrence_interpolation::{closure#0} as core[940e698046960fd5]::ops::function::FnOnce<()>>::call_once<unknown>
  805. 38.02 s gammaloop-nextest-core> at <unknown source file>:<unknown line>
  806. 38.02 s gammaloop-nextest-core> 9: test[75d6903177b1d7e9]::__rust_begin_short_backtrace::<core[940e698046960fd5]::result::Result<(), alloc[2ea6bcb46fca0c42]::string::String>, fn() -> core[940e698046960fd5]::result::Result<(), alloc[2ea6bcb46fca0c42]::string::String>><unknown>
  807. 38.02 s gammaloop-nextest-core> at <unknown source file>:<unknown line>
  808. 38.02 s gammaloop-nextest-core> 10: test[75d6903177b1d7e9]::run_test::{closure#0}<unknown>
  809. 38.02 s gammaloop-nextest-core> at <unknown source file>:<unknown line>
  810. 38.02 s gammaloop-nextest-core> 11: std[bcb96dfbba0ab899]::sys::backtrace::__rust_begin_short_backtrace::<test[75d6903177b1d7e9]::run_test::{closure#1}, ()><unknown>
  811. 38.02 s gammaloop-nextest-core> at <unknown source file>:<unknown line>
  812. 38.02 s gammaloop-nextest-core> 12: <std[bcb96dfbba0ab899]::thread::lifecycle::spawn_unchecked<test[75d6903177b1d7e9]::run_test::{closure#1}, ()>::{closure#1} as core[940e698046960fd5]::ops::function::FnOnce<()>>::call_once::{shim:vtable#0}<unknown>
  813. 38.02 s gammaloop-nextest-core> at <unknown source file>:<unknown line>
  814. 38.02 s gammaloop-nextest-core> 13: <std[bcb96dfbba0ab899]::sys::thread::unix::Thread>::new::thread_start<unknown>
  815. 38.02 s gammaloop-nextest-core> at <unknown source file>:<unknown line>
  816. 38.02 s gammaloop-nextest-core> 14: start_thread<unknown>
  817. 38.02 s gammaloop-nextest-core> at <unknown source file>:<unknown line>
  818. 38.02 s gammaloop-nextest-core> 15: __clone3<unknown>
  819. 38.02 s gammaloop-nextest-core> at <unknown source file>:<unknown line>
  820. 38.02 s gammaloop-nextest-core>
  821. 38.02 s gammaloop-nextest-core> Run with COLORBT_SHOW_HIDDEN=1 environment variable to disable frame filtering.
  822. 38.02 s gammaloop-nextest-core> Run with RUST_BACKTRACE=full to include source snippets.
  823. 38.02 s gammaloop-nextest-core>
  824. 38.02 s gammaloop-nextest-core> 3. gammalooprs::numerator::energy_degree::tests::canonical_class_cyclic_lifts_preserve_factorization_and_exact_bounds
  825. 38.02 s gammaloop-nextest-core> failure: test failure with exit code 101
  826. 38.02 s gammaloop-nextest-core> thread 'numerator::energy_degree::tests::canonical_class_cyclic_lifts_preserve_factorization_and_exact_bounds' (2265) panicked at crates/gammalooprs/src/numerator/energy_degree.rs:2850:13:
  827. 38.02 s gammaloop-nextest-core> assertion failed: (collapsed - expression).collect_factors().is_zero()
  828. 38.02 s gammaloop-nextest-core> stack backtrace:
  829. 38.02 s gammaloop-nextest-core> 0: __rustc::rust_begin_unwind
  830. 38.02 s gammaloop-nextest-core> 1: core::panicking::panic_fmt
  831. 38.02 s gammaloop-nextest-core> 2: core::panicking::panic
  832. 38.02 s gammaloop-nextest-core> 3: gammalooprs::numerator::energy_degree::tests::canonical_class_cyclic_lifts_preserve_factorization_and_exact_bounds
  833. 38.02 s gammaloop-nextest-core> 4: <gammalooprs::numerator::energy_degree::tests::canonical_class_cyclic_lifts_preserve_factorization_and_exact_bounds::{closure#0} as core::ops::function::FnOnce<()>>::call_once
  834. 38.02 s gammaloop-nextest-core> note: Some details are omitted, run with `RUST_BACKTRACE=full` for a verbose backtrace.
  835. 38.02 s gammaloop-nextest-core> system-out
  836. 38.02 s gammaloop-nextest-core> running 1 test
  837. 38.02 s gammaloop-nextest-core> test numerator::energy_degree::tests::canonical_class_cyclic_lifts_preserve_factorization_and_exact_bounds ... FAILED
  838. 38.02 s gammaloop-nextest-core>
  839. 38.02 s gammaloop-nextest-core> failures:
  840. 38.02 s gammaloop-nextest-core>
  841. 38.02 s gammaloop-nextest-core> failures:
  842. 38.02 s gammaloop-nextest-core> numerator::energy_degree::tests::canonical_class_cyclic_lifts_preserve_factorization_and_exact_bounds
  843. 38.02 s gammaloop-nextest-core>
  844. 38.02 s gammaloop-nextest-core> test result: FAILED. 0 passed; 1 failed; 0 ignored; 0 measured; 742 filtered out; finished in 0.01s
  845. 38.02 s gammaloop-nextest-core> system-err
  846. 38.02 s gammaloop-nextest-core> thread 'numerator::energy_degree::tests::canonical_class_cyclic_lifts_preserve_factorization_and_exact_bounds' (2265) panicked at crates/gammalooprs/src/numerator/energy_degree.rs:2850:13:
  847. 38.02 s gammaloop-nextest-core> assertion failed: (collapsed - expression).collect_factors().is_zero()
  848. 38.02 s gammaloop-nextest-core> stack backtrace:
  849. 38.02 s gammaloop-nextest-core> 0: __rustc::rust_begin_unwind
  850. 38.02 s gammaloop-nextest-core> 1: core::panicking::panic_fmt
  851. 38.02 s gammaloop-nextest-core> 2: core::panicking::panic
  852. 38.02 s gammaloop-nextest-core> 3: gammalooprs::numerator::energy_degree::tests::canonical_class_cyclic_lifts_preserve_factorization_and_exact_bounds
  853. 38.02 s gammaloop-nextest-core> 4: <gammalooprs::numerator::energy_degree::tests::canonical_class_cyclic_lifts_preserve_factorization_and_exact_bounds::{closure#0} as core::ops::function::FnOnce<()>>::call_once
  854. 38.02 s gammaloop-nextest-core> note: Some details are omitted, run with `RUST_BACKTRACE=full` for a verbose backtrace.
  855. 38.02 s gammaloop-nextest-core>
  856. 38.02 s gammaloop-nextest-core> 4. gammalooprs::uv::approx::local_4d::tests::canonical_uv_classes_certify_signed_aliases_and_preserve_raw_sectors
  857. 38.02 s gammaloop-nextest-core> failure: test failure with exit code 101
  858. 38.02 s gammaloop-nextest-core> Error:
  859. 38.02 s gammaloop-nextest-core> 0: merged canonical UV numerator does not reproduce its source bucket
  860. 38.02 s gammaloop-nextest-core>
  861. 38.02 s gammaloop-nextest-core> Location:
  862. 38.02 s gammaloop-nextest-core> crates/gammalooprs/src/uv/approx/local_4d.rs:367
  863. 38.02 s gammaloop-nextest-core>
  864. 38.02 s gammaloop-nextest-core> ━━━━━━━━━━━━━━━━━━━━━━━━━━━━━━━━━━ BACKTRACE ━━━━━━━━━━━━━━━━━━━━━━━━━━━━━━━━━━━
  865. 38.02 s gammaloop-nextest-core> 1: <color_eyre[51793ea62743adbd]::config::EyreHook>::into_eyre_hook::{closure#0}<unknown>
  866. 38.02 s gammaloop-nextest-core> at <unknown source file>:<unknown line>
  867. 38.02 s gammaloop-nextest-core> 2: eyre[cb2fd339c0c40fca]::capture_handler<unknown>
  868. 38.02 s gammaloop-nextest-core> at <unknown source file>:<unknown line>
  869. 38.02 s gammaloop-nextest-core> 3: eyre[cb2fd339c0c40fca]::private::format_err<unknown>
  870. 38.02 s gammaloop-nextest-core> at <unknown source file>:<unknown line>
  871. 38.02 s gammaloop-nextest-core> 4: <gammalooprs[24955f93fc9f4e0c]::uv::approx::local_4d::FourDSector>::canonical_projection<unknown>
  872. 38.02 s gammaloop-nextest-core> at <unknown source file>:<unknown line>
  873. 38.02 s gammaloop-nextest-core> 5: gammalooprs[24955f93fc9f4e0c]::uv::approx::local_4d::tests::canonical_uv_classes_certify_signed_aliases_and_preserve_raw_sectors<unknown>
  874. 38.02 s gammaloop-nextest-core> at <unknown source file>:<unknown line>
  875. 38.02 s gammaloop-nextest-core> 6: <gammalooprs[24955f93fc9f4e0c]::uv::approx::local_4d::tests::canonical_uv_classes_certify_signed_aliases_and_preserve_raw_sectors::{closure#0} as core[940e698046960fd5]::ops::function::FnOnce<()>>::call_once<unknown>
  876. 38.02 s gammaloop-nextest-core> at <unknown source file>:<unknown line>
  877. 38.02 s gammaloop-nextest-core> 7: test[75d6903177b1d7e9]::__rust_begin_short_backtrace::<core[940e698046960fd5]::result::Result<(), alloc[2ea6bcb46fca0c42]::string::String>, fn() -> core[940e698046960fd5]::result::Result<(), alloc[2ea6bcb46fca0c42]::string::String>><unknown>
  878. 38.02 s gammaloop-nextest-core> at <unknown source file>:<unknown line>
  879. 38.02 s gammaloop-nextest-core> 8: test[75d6903177b1d7e9]::run_test::{closure#0}<unknown>
  880. 38.02 s gammaloop-nextest-core> at <unknown source file>:<unknown line>
  881. 38.02 s gammaloop-nextest-core> 9: std[bcb96dfbba0ab899]::sys::backtrace::__rust_begin_short_backtrace::<test[75d6903177b1d7e9]::run_test::{closure#1}, ()><unknown>
  882. 38.02 s gammaloop-nextest-core> at <unknown source file>:<unknown line>
  883. 38.02 s gammaloop-nextest-core> 10: <std[bcb96dfbba0ab899]::thread::lifecycle::spawn_unchecked<test[75d6903177b1d7e9]::run_test::{closure#1}, ()>::{closure#1} as core[940e698046960fd5]::ops::function::FnOnce<()>>::call_once::{shim:vtable#0}<unknown>
  884. 38.02 s gammaloop-nextest-core> at <unknown source file>:<unknown line>
  885. 38.02 s gammaloop-nextest-core> 11: <std[bcb96dfbba0ab899]::sys::thread::unix::Thread>::new::thread_start<unknown>
  886. 38.02 s gammaloop-nextest-core> at <unknown source file>:<unknown line>
  887. 38.02 s gammaloop-nextest-core> 12: start_thread<unknown>
  888. 38.02 s gammaloop-nextest-core> at <unknown source file>:<unknown line>
  889. 38.02 s gammaloop-nextest-core> 13: __clone3<unknown>
  890. 38.02 s gammaloop-nextest-core> at <unknown source file>:<unknown line>
  891. 38.02 s gammaloop-nextest-core>
  892. 38.02 s gammaloop-nextest-core> Run with COLORBT_SHOW_HIDDEN=1 environment variable to disable frame filtering.
  893. 38.02 s gammaloop-nextest-core> Run with RUST_BACKTRACE=full to include source snippets.
  894. 38.02 s gammaloop-nextest-core> system-out
  895. 38.02 s gammaloop-nextest-core> running 1 test
  896. 38.02 s gammaloop-nextest-core> test uv::approx::local_4d::tests::canonical_uv_classes_certify_signed_aliases_and_preserve_raw_sectors ... FAILED
  897. 38.02 s gammaloop-nextest-core>
  898. 38.02 s gammaloop-nextest-core> failures:
  899. 38.02 s gammaloop-nextest-core>
  900. 38.02 s gammaloop-nextest-core> failures:
  901. 38.02 s gammaloop-nextest-core> uv::approx::local_4d::tests::canonical_uv_classes_certify_signed_aliases_and_preserve_raw_sectors
  902. 38.02 s gammaloop-nextest-core>
  903. 38.02 s gammaloop-nextest-core> test result: FAILED. 0 passed; 1 failed; 0 ignored; 0 measured; 742 filtered out; finished in 0.07s
  904. 38.02 s gammaloop-nextest-core> system-err
  905. 38.02 s gammaloop-nextest-core> Error:
  906. 38.02 s gammaloop-nextest-core> 0: merged canonical UV numerator does not reproduce its source bucket
  907. 38.02 s gammaloop-nextest-core>
  908. 38.02 s gammaloop-nextest-core> Location:
  909. 38.02 s gammaloop-nextest-core> crates/gammalooprs/src/uv/approx/local_4d.rs:367
  910. 38.02 s gammaloop-nextest-core>
  911. 38.02 s gammaloop-nextest-core> ━━━━━━━━━━━━━━━━━━━━━━━━━━━━━━━━━━ BACKTRACE ━━━━━━━━━━━━━━━━━━━━━━━━━━━━━━━━━━━
  912. 38.02 s gammaloop-nextest-core> 1: <color_eyre[51793ea62743adbd]::config::EyreHook>::into_eyre_hook::{closure#0}<unknown>
  913. 38.02 s gammaloop-nextest-core> at <unknown source file>:<unknown line>
  914. 38.02 s gammaloop-nextest-core> 2: eyre[cb2fd339c0c40fca]::capture_handler<unknown>
  915. 38.02 s gammaloop-nextest-core> at <unknown source file>:<unknown line>
  916. 38.02 s gammaloop-nextest-core> 3: eyre[cb2fd339c0c40fca]::private::format_err<unknown>
  917. 38.02 s gammaloop-nextest-core> at <unknown source file>:<unknown line>
  918. 38.02 s gammaloop-nextest-core> 4: <gammalooprs[24955f93fc9f4e0c]::uv::approx::local_4d::FourDSector>::canonical_projection<unknown>
  919. 38.02 s gammaloop-nextest-core> at <unknown source file>:<unknown line>
  920. 38.02 s gammaloop-nextest-core> 5: gammalooprs[24955f93fc9f4e0c]::uv::approx::local_4d::tests::canonical_uv_classes_certify_signed_aliases_and_preserve_raw_sectors<unknown>
  921. 38.02 s gammaloop-nextest-core> at <unknown source file>:<unknown line>
  922. 38.02 s gammaloop-nextest-core> 6: <gammalooprs[24955f93fc9f4e0c]::uv::approx::local_4d::tests::canonical_uv_classes_certify_signed_aliases_and_preserve_raw_sectors::{closure#0} as core[940e698046960fd5]::ops::function::FnOnce<()>>::call_once<unknown>
  923. 38.02 s gammaloop-nextest-core> at <unknown source file>:<unknown line>
  924. 38.02 s gammaloop-nextest-core> 7: test[75d6903177b1d7e9]::__rust_begin_short_backtrace::<core[940e698046960fd5]::result::Result<(), alloc[2ea6bcb46fca0c42]::string::String>, fn() -> core[940e698046960fd5]::result::Result<(), alloc[2ea6bcb46fca0c42]::string::String>><unknown>
  925. 38.02 s gammaloop-nextest-core> at <unknown source file>:<unknown line>
  926. 38.02 s gammaloop-nextest-core> 8: test[75d6903177b1d7e9]::run_test::{closure#0}<unknown>
  927. 38.02 s gammaloop-nextest-core> at <unknown source file>:<unknown line>
  928. 38.02 s gammaloop-nextest-core> 9: std[bcb96dfbba0ab899]::sys::backtrace::__rust_begin_short_backtrace::<test[75d6903177b1d7e9]::run_test::{closure#1}, ()><unknown>
  929. 38.02 s gammaloop-nextest-core> at <unknown source file>:<unknown line>
  930. 38.02 s gammaloop-nextest-core> 10: <std[bcb96dfbba0ab899]::thread::lifecycle::spawn_unchecked<test[75d6903177b1d7e9]::run_test::{closure#1}, ()>::{closure#1} as core[940e698046960fd5]::ops::function::FnOnce<()>>::call_once::{shim:vtable#0}<unknown>
  931. 38.02 s gammaloop-nextest-core> at <unknown source file>:<unknown line>
  932. 38.02 s gammaloop-nextest-core> 11: <std[bcb96dfbba0ab899]::sys::thread::unix::Thread>::new::thread_start<unknown>
  933. 38.02 s gammaloop-nextest-core> at <unknown source file>:<unknown line>
  934. 38.02 s gammaloop-nextest-core> 12: start_thread<unknown>
  935. 38.02 s gammaloop-nextest-core> at <unknown source file>:<unknown line>
  936. 38.02 s gammaloop-nextest-core> 13: __clone3<unknown>
  937. 38.02 s gammaloop-nextest-core> at <unknown source file>:<unknown line>
  938. 38.02 s gammaloop-nextest-core>
  939. 38.02 s gammaloop-nextest-core> Run with COLORBT_SHOW_HIDDEN=1 environment variable to disable frame filtering.
  940. 38.02 s gammaloop-nextest-core> Run with RUST_BACKTRACE=full to include source snippets.
  941. 38.02 s gammaloop-nextest-core>
  942. 38.02 s gammaloop-nextest-core> 5. gammalooprs::uv::approx::local_4d::tests::canonical_uv_signed_multiloop_carriers_preserve_factorized_numerators
  943. 38.02 s gammaloop-nextest-core> failure: test failure with exit code 101
  944. 38.02 s gammaloop-nextest-core> system-out
  945. 38.02 s gammaloop-nextest-core> running 1 test
  946. 38.02 s gammaloop-nextest-core> test uv::approx::local_4d::tests::canonical_uv_signed_multiloop_carriers_preserve_factorized_numerators ... FAILED
  947. 38.02 s gammaloop-nextest-core>
  948. 38.02 s gammaloop-nextest-core> failures:
  949. 38.02 s gammaloop-nextest-core>
  950. 38.02 s gammaloop-nextest-core> failures:
  951. 38.02 s gammaloop-nextest-core> uv::approx::local_4d::tests::canonical_uv_signed_multiloop_carriers_preserve_factorized_numerators
  952. 38.02 s gammaloop-nextest-core>
  953. 38.02 s gammaloop-nextest-core> test result: FAILED. 0 passed; 1 failed; 0 ignored; 0 measured; 742 filtered out; finished in 0.08s
  954. 38.02 s gammaloop-nextest-core> system-err
  955. 38.02 s gammaloop-nextest-core> The application panicked (crashed).
  956. 38.02 s gammaloop-nextest-core> Message: assertion `left == right` failed
  957. 38.02 s gammaloop-nextest-core> left: 2*(signed_multiloop::a+signed_multiloop::b)^5*gammalooprs::Q(gammalooprs::uv::class(0),spenso::cind(0))
  958. 38.02 s gammaloop-nextest-core> right: -2*(signed_multiloop::a+signed_multiloop::b)^5*gammalooprs::Q(gammalooprs::uv::class(0),spenso::cind(0))
  959. 38.02 s gammaloop-nextest-core> Location: crates/gammalooprs/src/uv/approx/local_4d.rs:1983
  960. 38.02 s gammaloop-nextest-core>
  961. 38.02 s gammaloop-nextest-core> ━━━━━━━━━━━━━━━━━━━━━━━━━━━━━━━━━━ BACKTRACE ━━━━━━━━━━━━━━━━━━━━━━━━━━━━━━━━━━━
  962. 38.02 s gammaloop-nextest-core> 1: <color_eyre[51793ea62743adbd]::config::PanicHook>::panic_report<unknown>
  963. 38.02 s gammaloop-nextest-core> at <unknown source file>:<unknown line>
  964. 38.02 s gammaloop-nextest-core> 2: <color_eyre[51793ea62743adbd]::config::PanicHook>::into_panic_hook::{closure#0}<unknown>
  965. 38.02 s gammaloop-nextest-core> at <unknown source file>:<unknown line>
  966. 38.02 s gammaloop-nextest-core> 3: std[bcb96dfbba0ab899]::panicking::panic_with_hook<unknown>
  967. 38.02 s gammaloop-nextest-core> at <unknown source file>:<unknown line>
  968. 38.02 s gammaloop-nextest-core> 4: std[bcb96dfbba0ab899]::panicking::panic_handler::{closure#0}<unknown>
  969. 38.02 s gammaloop-nextest-core> at <unknown source file>:<unknown line>
  970. 38.02 s gammaloop-nextest-core> 5: std[bcb96dfbba0ab899]::sys::backtrace::__rust_end_short_backtrace::<std[bcb96dfbba0ab899]::panicking::panic_handler::{closure#0}, !><unknown>
  971. 38.02 s gammaloop-nextest-core> at <unknown source file>:<unknown line>
  972. 38.02 s gammaloop-nextest-core> 6: __rustc[6c289b9f9c454d21]::rust_begin_unwind<unknown>
  973. 38.02 s gammaloop-nextest-core> at <unknown source file>:<unknown line>
  974. 38.02 s gammaloop-nextest-core> 7: core[940e698046960fd5]::panicking::panic_fmt<unknown>
  975. 38.02 s gammaloop-nextest-core> at <unknown source file>:<unknown line>
  976. 38.02 s gammaloop-nextest-core> 8: core[940e698046960fd5]::panicking::assert_failed_inner<unknown>
  977. 38.02 s gammaloop-nextest-core> at <unknown source file>:<unknown line>
  978. 38.02 s gammaloop-nextest-core> 9: core[940e698046960fd5]::panicking::assert_failed::<symbolica[499970c26fd75ddd]::atom::Atom, symbolica[499970c26fd75ddd]::atom::Atom><unknown>
  979. 38.02 s gammaloop-nextest-core> at <unknown source file>:<unknown line>
  980. 38.02 s gammaloop-nextest-core> 10: gammalooprs[24955f93fc9f4e0c]::uv::approx::local_4d::tests::canonical_uv_signed_multiloop_carriers_preserve_factorized_numerators<unknown>
  981. 38.02 s gammaloop-nextest-core> at <unknown source file>:<unknown line>
  982. 38.02 s gammaloop-nextest-core> 11: <gammalooprs[24955f93fc9f4e0c]::uv::approx::local_4d::tests::canonical_uv_signed_multiloop_carriers_preserve_factorized_numerators::{closure#0} as core[940e698046960fd5]::ops::function::FnOnce<()>>::call_once<unknown>
  983. 38.02 s gammaloop-nextest-core> at <unknown source file>:<unknown line>
  984. 38.02 s gammaloop-nextest-core> 12: test[75d6903177b1d7e9]::__rust_begin_short_backtrace::<core[940e698046960fd5]::result::Result<(), alloc[2ea6bcb46fca0c42]::string::String>, fn() -> core[940e698046960fd5]::result::Result<(), alloc[2ea6bcb46fca0c42]::string::String>><unknown>
  985. 38.02 s gammaloop-nextest-core> at <unknown source file>:<unknown line>
  986. 38.02 s gammaloop-nextest-core> 13: test[75d6903177b1d7e9]::run_test::{closure#0}<unknown>
  987. 38.02 s gammaloop-nextest-core> at <unknown source file>:<unknown line>
  988. 38.02 s gammaloop-nextest-core> 14: std[bcb96dfbba0ab899]::sys::backtrace::__rust_begin_short_backtrace::<test[75d6903177b1d7e9]::run_test::{closure#1}, ()><unknown>
  989. 38.02 s gammaloop-nextest-core> at <unknown source file>:<unknown line>
  990. 38.02 s gammaloop-nextest-core> 15: <std[bcb96dfbba0ab899]::thread::lifecycle::spawn_unchecked<test[75d6903177b1d7e9]::run_test::{closure#1}, ()>::{closure#1} as core[940e698046960fd5]::ops::function::FnOnce<()>>::call_once::{shim:vtable#0}<unknown>
  991. 38.02 s gammaloop-nextest-core> at <unknown source file>:<unknown line>
  992. 38.02 s gammaloop-nextest-core> 16: <std[bcb96dfbba0ab899]::sys::thread::unix::Thread>::new::thread_start<unknown>
  993. 38.02 s gammaloop-nextest-core> at <unknown source file>:<unknown line>
  994. 38.02 s gammaloop-nextest-core> 17: start_thread<unknown>
  995. 38.02 s gammaloop-nextest-core> at <unknown source file>:<unknown line>
  996. 38.02 s gammaloop-nextest-core> 18: __clone3<unknown>
  997. 38.02 s gammaloop-nextest-core> at <unknown source file>:<unknown line>
  998. 38.02 s gammaloop-nextest-core>
  999. 38.02 s gammaloop-nextest-core> Run with COLORBT_SHOW_HIDDEN=1 environment variable to disable frame filtering.
  1000. 38.02 s gammaloop-nextest-core> Run with RUST_BACKTRACE=full to include source snippets.
  1001. 38.02 s gammaloop-nextest-core>
  1002. 38.02 s gammaloop-nextest-core> 6. gammalooprs::uv::approx::tests::direct_nested_scalar_banana_replays_complete_cff_at_depth_three
  1003. 38.02 s gammaloop-nextest-core> failure: test failure with exit code 101
  1004. 38.02 s gammaloop-nextest-core> Error:
  1005. 38.02 s gammaloop-nextest-core> 0: canonical UV numerator does not reproduce its source in the component frame
  1006. 38.02 s gammaloop-nextest-core>
  1007. 38.02 s gammaloop-nextest-core> Location:
  1008. 38.02 s gammaloop-nextest-core> crates/gammalooprs/src/uv/approx/local_4d.rs:354
  1009. 38.02 s gammaloop-nextest-core>
  1010. 38.02 s gammaloop-nextest-core> ━━━━━━━━━━━━━━━━━━━━━━━━━━━━━━━━━━ BACKTRACE ━━━━━━━━━━━━━━━━━━━━━━━━━━━━━━━━━━━
  1011. 38.02 s gammaloop-nextest-core> 1: <color_eyre[51793ea62743adbd]::config::EyreHook>::into_eyre_hook::{closure#0}<unknown>
  1012. 38.02 s gammaloop-nextest-core> at <unknown source file>:<unknown line>
  1013. 38.02 s gammaloop-nextest-core> 2: eyre[cb2fd339c0c40fca]::capture_handler<unknown>
  1014. 38.02 s gammaloop-nextest-core> at <unknown source file>:<unknown line>
  1015. 38.02 s gammaloop-nextest-core> 3: eyre[cb2fd339c0c40fca]::private::format_err<unknown>
  1016. 38.02 s gammaloop-nextest-core> at <unknown source file>:<unknown line>
  1017. 38.02 s gammaloop-nextest-core> 4: <gammalooprs[24955f93fc9f4e0c]::uv::approx::local_4d::FourDSector>::canonical_projection<unknown>
  1018. 38.02 s gammaloop-nextest-core> at <unknown source file>:<unknown line>
  1019. 38.02 s gammaloop-nextest-core> 5: <gammalooprs[24955f93fc9f4e0c]::uv::approx::projected_4d::Projected4dApproximation>::project_local_4d<unknown>
  1020. 38.02 s gammaloop-nextest-core> at <unknown source file>:<unknown line>
  1021. 38.02 s gammaloop-nextest-core> 6: <gammalooprs[24955f93fc9f4e0c]::uv::approx::Approximation>::compute_3d<unknown>
  1022. 38.02 s gammaloop-nextest-core> at <unknown source file>:<unknown line>
  1023. 38.02 s gammaloop-nextest-core> 7: gammalooprs[24955f93fc9f4e0c]::uv::approx::tests::direct_nested_scalar_banana_replays_complete_cff_at_depth_three::{closure#0}<unknown>
  1024. 38.02 s gammaloop-nextest-core> at <unknown source file>:<unknown line>
  1025. 38.02 s gammaloop-nextest-core> 8: gammalooprs[24955f93fc9f4e0c]::uv::approx::tests::direct_nested_scalar_banana_replays_complete_cff_at_depth_three<unknown>
  1026. 38.02 s gammaloop-nextest-core> at <unknown source file>:<unknown line>
  1027. 38.02 s gammaloop-nextest-core> 9: <gammalooprs[24955f93fc9f4e0c]::uv::approx::tests::direct_nested_scalar_banana_replays_complete_cff_at_depth_three::{closure#0} as core[940e698046960fd5]::ops::function::FnOnce<()>>::call_once<unknown>
  1028. 38.02 s gammaloop-nextest-core> at <unknown source file>:<unknown line>
  1029. 38.02 s gammaloop-nextest-core> 10: test[75d6903177b1d7e9]::__rust_begin_short_backtrace::<core[940e698046960fd5]::result::Result<(), alloc[2ea6bcb46fca0c42]::string::String>, fn() -> core[940e698046960fd5]::result::Result<(), alloc[2ea6bcb46fca0c42]::string::String>><unknown>
  1030. 38.02 s gammaloop-nextest-core> at <unknown source file>:<unknown line>
  1031. 38.02 s gammaloop-nextest-core> 11: test[75d6903177b1d7e9]::run_test::{closure#0}<unknown>
  1032. 38.02 s gammaloop-nextest-core> at <unknown source file>:<unknown line>
  1033. 38.02 s gammaloop-nextest-core> 12: std[bcb96dfbba0ab899]::sys::backtrace::__rust_begin_short_backtrace::<test[75d6903177b1d7e9]::run_test::{closure#1}, ()><unknown>
  1034. 38.02 s gammaloop-nextest-core> at <unknown source file>:<unknown line>
  1035. 38.02 s gammaloop-nextest-core> 13: <std[bcb96dfbba0ab899]::thread::lifecycle::spawn_unchecked<test[75d6903177b1d7e9]::run_test::{closure#1}, ()>::{closure#1} as core[940e698046960fd5]::ops::function::FnOnce<()>>::call_once::{shim:vtable#0}<unknown>
  1036. 38.02 s gammaloop-nextest-core> at <unknown source file>:<unknown line>
  1037. 38.02 s gammaloop-nextest-core> 14: <std[bcb96dfbba0ab899]::sys::thread::unix::Thread>::new::thread_start<unknown>
  1038. 38.02 s gammaloop-nextest-core> at <unknown source file>:<unknown line>
  1039. 38.02 s gammaloop-nextest-core> 15: start_thread<unknown>
  1040. 38.02 s gammaloop-nextest-core> at <unknown source file>:<unknown line>
  1041. 38.02 s gammaloop-nextest-core> 16: __clone3<unknown>
  1042. 38.02 s gammaloop-nextest-core> at <unknown source file>:<unknown line>
  1043. 38.02 s gammaloop-nextest-core>
  1044. 38.02 s gammaloop-nextest-core> Run with COLORBT_SHOW_HIDDEN=1 environment variable to disable frame filtering.
  1045. 38.02 s gammaloop-nextest-core> Run with RUST_BACKTRACE=full to include source snippets.
  1046. 38.02 s gammaloop-nextest-core> system-out
  1047. 38.02 s gammaloop-nextest-core> running 1 test
  1048. 38.02 s gammaloop-nextest-core> test uv::approx::tests::direct_nested_scalar_banana_replays_complete_cff_at_depth_three ... FAILED
  1049. 38.02 s gammaloop-nextest-core>
  1050. 38.02 s gammaloop-nextest-core> failures:
  1051. 38.03 s gammaloop-nextest-core>
  1052. 38.03 s gammaloop-nextest-core> failures:
  1053. 38.03 s gammaloop-nextest-core> uv::approx::tests::direct_nested_scalar_banana_replays_complete_cff_at_depth_three
  1054. 38.03 s gammaloop-nextest-core>
  1055. 38.03 s gammaloop-nextest-core> test result: FAILED. 0 passed; 1 failed; 0 ignored; 0 measured; 742 filtered out; finished in 0.10s
  1056. 38.03 s gammaloop-nextest-core> system-err
  1057. 38.03 s gammaloop-nextest-core> Error:
  1058. 38.03 s gammaloop-nextest-core> 0: canonical UV numerator does not reproduce its source in the component frame
  1059. 38.03 s gammaloop-nextest-core>
  1060. 38.03 s gammaloop-nextest-core> Location:
  1061. 38.03 s gammaloop-nextest-core> crates/gammalooprs/src/uv/approx/local_4d.rs:354
  1062. 38.03 s gammaloop-nextest-core>
  1063. 38.03 s gammaloop-nextest-core> ━━━━━━━━━━━━━━━━━━━━━━━━━━━━━━━━━━ BACKTRACE ━━━━━━━━━━━━━━━━━━━━━━━━━━━━━━━━━━━
  1064. 38.03 s gammaloop-nextest-core> 1: <color_eyre[51793ea62743adbd]::config::EyreHook>::into_eyre_hook::{closure#0}<unknown>
  1065. 38.03 s gammaloop-nextest-core> at <unknown source file>:<unknown line>
  1066. 38.03 s gammaloop-nextest-core> 2: eyre[cb2fd339c0c40fca]::capture_handler<unknown>
  1067. 38.03 s gammaloop-nextest-core> at <unknown source file>:<unknown line>
  1068. 38.03 s gammaloop-nextest-core> 3: eyre[cb2fd339c0c40fca]::private::format_err<unknown>
  1069. 38.03 s gammaloop-nextest-core> at <unknown source file>:<unknown line>
  1070. 38.03 s gammaloop-nextest-core> 4: <gammalooprs[24955f93fc9f4e0c]::uv::approx::local_4d::FourDSector>::canonical_projection<unknown>
  1071. 38.03 s gammaloop-nextest-core> at <unknown source file>:<unknown line>
  1072. 38.03 s gammaloop-nextest-core> 5: <gammalooprs[24955f93fc9f4e0c]::uv::approx::projected_4d::Projected4dApproximation>::project_local_4d<unknown>
  1073. 38.03 s gammaloop-nextest-core> at <unknown source file>:<unknown line>
  1074. 38.03 s gammaloop-nextest-core> 6: <gammalooprs[24955f93fc9f4e0c]::uv::approx::Approximation>::compute_3d<unknown>
  1075. 38.03 s gammaloop-nextest-core> at <unknown source file>:<unknown line>
  1076. 38.03 s gammaloop-nextest-core> 7: gammalooprs[24955f93fc9f4e0c]::uv::approx::tests::direct_nested_scalar_banana_replays_complete_cff_at_depth_three::{closure#0}<unknown>
  1077. 38.03 s gammaloop-nextest-core> at <unknown source file>:<unknown line>
  1078. 38.03 s gammaloop-nextest-core> 8: gammalooprs[24955f93fc9f4e0c]::uv::approx::tests::direct_nested_scalar_banana_replays_complete_cff_at_depth_three<unknown>
  1079. 38.03 s gammaloop-nextest-core> at <unknown source file>:<unknown line>
  1080. 38.03 s gammaloop-nextest-core> 9: <gammalooprs[24955f93fc9f4e0c]::uv::approx::tests::direct_nested_scalar_banana_replays_complete_cff_at_depth_three::{closure#0} as core[940e698046960fd5]::ops::function::FnOnce<()>>::call_once<unknown>
  1081. 38.03 s gammaloop-nextest-core> at <unknown source file>:<unknown line>
  1082. 38.03 s gammaloop-nextest-core> 10: test[75d6903177b1d7e9]::__rust_begin_short_backtrace::<core[940e698046960fd5]::result::Result<(), alloc[2ea6bcb46fca0c42]::string::String>, fn() -> core[940e698046960fd5]::result::Result<(), alloc[2ea6bcb46fca0c42]::string::String>><unknown>
  1083. 38.03 s gammaloop-nextest-core> at <unknown source file>:<unknown line>
  1084. 38.03 s gammaloop-nextest-core> 11: test[75d6903177b1d7e9]::run_test::{closure#0}<unknown>
  1085. 38.03 s gammaloop-nextest-core> at <unknown source file>:<unknown line>
  1086. 38.03 s gammaloop-nextest-core> 12: std[bcb96dfbba0ab899]::sys::backtrace::__rust_begin_short_backtrace::<test[75d6903177b1d7e9]::run_test::{closure#1}, ()><unknown>
  1087. 38.03 s gammaloop-nextest-core> at <unknown source file>:<unknown line>
  1088. 38.03 s gammaloop-nextest-core> 13: <std[bcb96dfbba0ab899]::thread::lifecycle::spawn_unchecked<test[75d6903177b1d7e9]::run_test::{closure#1}, ()>::{closure#1} as core[940e698046960fd5]::ops::function::FnOnce<()>>::call_once::{shim:vtable#0}<unknown>
  1089. 38.03 s gammaloop-nextest-core> at <unknown source file>:<unknown line>
  1090. 38.03 s gammaloop-nextest-core> 14: <std[bcb96dfbba0ab899]::sys::thread::unix::Thread>::new::thread_start<unknown>
  1091. 38.03 s gammaloop-nextest-core> at <unknown source file>:<unknown line>
  1092. 38.03 s gammaloop-nextest-core> 15: start_thread<unknown>
  1093. 38.03 s gammaloop-nextest-core> at <unknown source file>:<unknown line>
  1094. 38.03 s gammaloop-nextest-core> 16: __clone3<unknown>
  1095. 38.03 s gammaloop-nextest-core> at <unknown source file>:<unknown line>
  1096. 38.03 s gammaloop-nextest-core>
  1097. 38.03 s gammaloop-nextest-core> Run with COLORBT_SHOW_HIDDEN=1 environment variable to disable frame filtering.
  1098. 38.03 s gammaloop-nextest-core> Run with RUST_BACKTRACE=full to include source snippets.
  1099. 38.03 s gammaloop-nextest-core> =========================================
  1100. 38.04 s gammaloop-nextest-core> Extracting 1 binary, 1 build script output directory, and 1 linked path to /build/nextest-archive-oEVmZd
  1101. 38.13 s gammaloop-nextest-core> Extracted 7 files to /build/nextest-archive-oEVmZd in 0.09s
  1102. 38.14 s gammaloop-nextest-core> ------------
  1103. 38.14 s gammaloop-nextest-core> Nextest run ID 3e787ab3-399d-4410-b34e-cb5136fc8045 with nextest profile: ci_gammaloop
  1104. 38.14 s gammaloop-nextest-core> Starting 105 tests across 1 binary
  1105. 55.63 s gammaloop-nextest-core> ------------
  1106. 55.63 s gammaloop-nextest-core> Summary [ 17.491s] 105 tests run: 105 passed, 0 skipped
  1107. 55.67 s gammaloop-nextest-core>
  1108. 55.67 s gammaloop-nextest-core> ========== nextest test summary ==========
  1109. 55.67 s gammaloop-nextest-core> report: target/nextest/ci_gammaloop/junit.xml
  1110. 55.67 s gammaloop-nextest-core> tests: 105, failures: 0, errors: 0
  1111. 55.67 s gammaloop-nextest-core> No failing testcases found.
  1112. 55.67 s gammaloop-nextest-core> =========================================
  1113. 55.73 s error: Cannot build '/nix/store/n61r02micjg0snakcv487zfdf4anp50s-gammaloop-nextest-core.drv'.
  1114. 55.73 s Reason: builder failed with exit code 100.
  1115. 55.73 s Output paths:
  1116. 55.73 s /nix/store/xbaygav73qg6fbyhf734mhwpzkgjgnd5-gammaloop-nextest-core
  1117. 55.73 s Last 1069 log lines:
  1118. 55.73 s > Extracting 4 binaries (including 1 non-test binary), 1 build script output directory, and 2 linked paths to /build/nextest-archive-nIhoaY
  1119. 55.73 s > Extracted 20 files to /build/nextest-archive-nIhoaY in 0.72s
  1120. 55.73 s > ------------
  1121. 55.73 s > Nextest run ID c9c95688-4363-46a1-9e07-8d868b3ce035 with nextest profile: ci_gammaloop
  1122. 55.73 s > Starting 379 tests across 3 binaries
  1123. 55.73 s > ------------
  1124. 55.73 s > Summary [ 1.312s] 379 tests run: 379 passed, 0 skipped
  1125. 55.73 s >
  1126. 55.73 s > ========== nextest test summary ==========
  1127. 55.73 s > report: target/nextest/ci_gammaloop/junit.xml
  1128. 55.73 s > tests: 379, failures: 0, errors: 0
  1129. 55.73 s > No failing testcases found.
  1130. 55.73 s > =========================================
  1131. 55.73 s > Extracting 1 binary and 1 linked path to /build/nextest-archive-hgzjQi
  1132. 55.73 s > Extracted 7 files to /build/nextest-archive-hgzjQi in 0.07s
  1133. 55.73 s > ------------
  1134. 55.73 s > Nextest run ID 297a6a2c-a0b0-4df3-bc0c-e9d00ecc4210 with nextest profile: ci_gammaloop
  1135. 55.73 s > Starting 19 tests across 1 binary
  1136. 55.73 s > ------------
  1137. 55.73 s > Summary [ 0.011s] 19 tests run: 19 passed, 0 skipped
  1138. 55.73 s >
  1139. 55.73 s > ========== nextest test summary ==========
  1140. 55.73 s > report: target/nextest/ci_gammaloop/junit.xml
  1141. 55.73 s > tests: 19, failures: 0, errors: 0
  1142. 55.73 s > No failing testcases found.
  1143. 55.73 s > =========================================
  1144. 55.73 s > Extracting 1 binary to /build/nextest-archive-gpMHxe
  1145. 55.73 s > Extracted 4 files to /build/nextest-archive-gpMHxe in 0.03s
  1146. 55.73 s > ------------
  1147. 55.73 s > Nextest run ID 40b109a1-5b38-4e32-80f9-9cc74dc4e175 with nextest profile: ci_gammaloop
  1148. 55.73 s > Starting 0 tests across 1 binary
  1149. 55.73 s > ------------
  1150. 55.73 s > Summary [ 0.000s] 0 tests run: 0 passed, 0 skipped
  1151. 55.73 s >
  1152. 55.73 s > ========== nextest test summary ==========
  1153. 55.73 s > report: target/nextest/ci_gammaloop/junit.xml
  1154. 55.73 s > tests: 0, failures: 0, errors: 0
  1155. 55.73 s > No failing testcases found.
  1156. 55.73 s > =========================================
  1157. 55.73 s > Extracting 4 binaries, 1 build script output directory, and 2 linked paths to /build/nextest-archive-veI02p
  1158. 55.73 s > Extracted 18 files to /build/nextest-archive-veI02p in 0.48s
  1159. 55.73 s > ------------
  1160. 55.73 s > Nextest run ID 9b18db9d-669d-4429-b041-c06f56d2a531 with nextest profile: ci_gammaloop
  1161. 55.73 s > Starting 692 tests across 4 binaries (60 tests skipped, including 59 tests via profile.ci_gammaloop.default-filter)
  1162. 55.73 s > FAIL [ 0.118s] (149/692) gammalooprs graph::three_d_source::tests::exact_taylor_vacuum_affine_circulation_preserves_energy_mapping
  1163. 55.73 s > stdout ---
  1164. 55.73 s >
  1165. 55.73 s > running 1 test
  1166. 55.73 s > test graph::three_d_source::tests::exact_taylor_vacuum_affine_circulation_preserves_energy_mapping ... FAILED
  1167. 55.73 s >
  1168. 55.73 s > failures:
  1169. 55.73 s >
  1170. 55.73 s > failures:
  1171. 55.73 s > graph::three_d_source::tests::exact_taylor_vacuum_affine_circulation_preserves_energy_mapping
  1172. 55.73 s >
  1173. 55.73 s > test result: FAILED. 0 passed; 1 failed; 0 ignored; 0 measured; 742 filtered out; finished in 0.10s
  1174. 55.73 s >
  1175. 55.73 s > stderr ---
  1176. 55.73 s > The application panicked (crashed).
  1177. 55.73 s > Message: assertion `left == right` failed
  1178. 55.73 s > left: (gammalooprs::mUVexp^2+(-gammalooprs::Q(1,spenso::cind(1))+gammalooprs::Q(4,spenso::cind(1)))^2+(-gammalooprs::Q(1,spenso::cind(2))+gammalooprs::Q(4,spenso::cind(2)))^2+(-gammalooprs::Q(1,spenso::cind(3))+gammalooprs::Q(4,spenso::cind(3)))^2)^(1/2)
  1179. 55.73 s > right: (gammalooprs::mUVexp^2+(gammalooprs::Q(1,spenso::cind(1))-gammalooprs::Q(4,spenso::cind(1)))^2+(gammalooprs::Q(1,spenso::cind(2))-gammalooprs::Q(4,spenso::cind(2)))^2+(gammalooprs::Q(1,spenso::cind(3))-gammalooprs::Q(4,spenso::cind(3)))^2)^(1/2)
  1180. 55.73 s > Location: crates/gammalooprs/src/graph/three_d_source.rs:7797
  1181. 55.73 s >
  1182. 55.73 s > ━━━━━━━━━━━━━━━━━━━━━━━━━━━━━━━━━━ BACKTRACE ━━━━━━━━━━━━━━━━━━━━━━━━━━━━━━━━━━━
  1183. 55.73 s > 1: <color_eyre[51793ea62743adbd]::config::PanicHook>::panic_report<unknown>
  1184. 55.73 s > at <unknown source file>:<unknown line>
  1185. 55.73 s > 2: <color_eyre[51793ea62743adbd]::config::PanicHook>::into_panic_hook::{closure#0}<unknown>
  1186. 55.73 s > at <unknown source file>:<unknown line>
  1187. 55.73 s > 3: std[bcb96dfbba0ab899]::panicking::panic_with_hook<unknown>
  1188. 55.73 s > at <unknown source file>:<unknown line>
  1189. 55.73 s > 4: std[bcb96dfbba0ab899]::panicking::panic_handler::{closure#0}<unknown>
  1190. 55.73 s > at <unknown source file>:<unknown line>
  1191. 55.73 s > 5: std[bcb96dfbba0ab899]::sys::backtrace::__rust_end_short_backtrace::<std[bcb96dfbba0ab899]::panicking::panic_handler::{closure#0}, !><unknown>
  1192. 55.73 s > at <unknown source file>:<unknown line>
  1193. 55.73 s > 6: __rustc[6c289b9f9c454d21]::rust_begin_unwind<unknown>
  1194. 55.73 s > at <unknown source file>:<unknown line>
  1195. 55.73 s > 7: core[940e698046960fd5]::panicking::panic_fmt<unknown>
  1196. 55.73 s > at <unknown source file>:<unknown line>
  1197. 55.73 s > 8: core[940e698046960fd5]::panicking::assert_failed_inner<unknown>
  1198. 55.73 s > at <unknown source file>:<unknown line>
  1199. 55.73 s > 9: core[940e698046960fd5]::panicking::assert_failed::<symbolica[499970c26fd75ddd]::atom::Atom, symbolica[499970c26fd75ddd]::atom::Atom><unknown>
  1200. 55.73 s > at <unknown source file>:<unknown line>
  1201. 55.73 s > 10: gammalooprs[24955f93fc9f4e0c]::graph::three_d_source::tests::exact_taylor_vacuum_affine_circulation_preserves_energy_mapping<unknown>
  1202. 55.73 s > at <unknown source file>:<unknown line>
  1203. 55.73 s > 11: <gammalooprs[24955f93fc9f4e0c]::graph::three_d_source::tests::exact_taylor_vacuum_affine_circulation_preserves_energy_mapping::{closure#0} as core[940e698046960fd5]::ops::function::FnOnce<()>>::call_once<unknown>
  1204. 55.73 s > at <unknown source file>:<unknown line>
  1205. 55.73 s > 12: test[75d6903177b1d7e9]::__rust_begin_short_backtrace::<core[940e698046960fd5]::result::Result<(), alloc[2ea6bcb46fca0c42]::string::String>, fn() -> core[940e698046960fd5]::result::Result<(), alloc[2ea6bcb46fca0c42]::string::String>><unknown>
  1206. 55.73 s > at <unknown source file>:<unknown line>
  1207. 55.73 s > 13: test[75d6903177b1d7e9]::run_test::{closure#0}<unknown>
  1208. 55.73 s > at <unknown source file>:<unknown line>
  1209. 55.73 s > 14: std[bcb96dfbba0ab899]::sys::backtrace::__rust_begin_short_backtrace::<test[75d6903177b1d7e9]::run_test::{closure#1}, ()><unknown>
  1210. 55.73 s > at <unknown source file>:<unknown line>
  1211. 55.73 s > 15: <std[bcb96dfbba0ab899]::thread::lifecycle::spawn_unchecked<test[75d6903177b1d7e9]::run_test::{closure#1}, ()>::{closure#1} as core[940e698046960fd5]::ops::function::FnOnce<()>>::call_once::{shim:vtable#0}<unknown>
  1212. 55.73 s > at <unknown source file>:<unknown line>
  1213. 55.73 s > 16: <std[bcb96dfbba0ab899]::sys::thread::unix::Thread>::new::thread_start<unknown>
  1214. 55.73 s > at <unknown source file>:<unknown line>
  1215. 55.73 s > 17: start_thread<unknown>
  1216. 55.73 s > at <unknown source file>:<unknown line>
  1217. 55.73 s > 18: __clone3<unknown>
  1218. 55.73 s > at <unknown source file>:<unknown line>
  1219. 55.73 s >
  1220. 55.73 s > Run with COLORBT_SHOW_HIDDEN=1 environment variable to disable frame filtering.
  1221. 55.73 s > Run with RUST_BACKTRACE=full to include source snippets.
  1222. 55.73 s >
  1223. 55.73 s > FAIL [ 0.117s] (161/692) gammalooprs graph::three_d_source::tests::pinched_affine_carrier_requires_occurrence_interpolation
  1224. 55.73 s > stdout ---
  1225. 55.73 s >
  1226. 55.73 s > running 1 test
  1227. 55.73 s > test graph::three_d_source::tests::pinched_affine_carrier_requires_occurrence_interpolation ... FAILED
  1228. 55.73 s >
  1229. 55.73 s > failures:
  1230. 55.73 s >
  1231. 55.73 s > failures:
  1232. 55.73 s > graph::three_d_source::tests::pinched_affine_carrier_requires_occurrence_interpolation
  1233. 55.73 s >
  1234. 55.73 s > test result: FAILED. 0 passed; 1 failed; 0 ignored; 0 measured; 742 filtered out; finished in 0.11s
  1235. 55.73 s >
  1236. 55.73 s > stderr ---
  1237. 55.73 s > The application panicked (crashed).
  1238. 55.73 s > Message: certified affine occurrence lift must reproduce the independent double contours: actual=-(-1/16*(3+E0)*(5+E0)/((1+Q(0,cind(1))^2+Q(0,cind(2))^2+Q(0,cind(3))^2)^(3/2)*(1+Q(1,cind(1))^2+Q(1,cind(2))^2+Q(1,cind(3))^2)^(3/2))-1/16*(3+E1)*(5+E1)/((1+Q(0,cind(1))^2+Q(0,cind(2))^2+Q(0,cind(3))^2)^(3/2)*(1+Q(1,cind(1))^2+Q(1,cind(2))^2+Q(1,cind(3))^2)^(3/2))-1/16*(3-E0)*(5-E0)/((1+Q(0,cind(1))^2+Q(0,cind(2))^2+Q(0,cind(3))^2)^(3/2)*(1+Q(1,cind(1))^2+Q(1,cind(2))^2+Q(1,cind(3))^2)^(3/2))-1/16*(3-E1)*(5-E1)/((1+Q(0,cind(1))^2+Q(0,cind(2))^2+Q(0,cind(3))^2)^(3/2)*(1+Q(1,cind(1))^2+Q(1,cind(2))^2+Q(1,cind(3))^2)^(3/2))+1/64*(3+E0+E1)*(5+E0+E1)/((1+Q(0,cind(1))^2+Q(0,cind(2))^2+Q(0,cind(3))^2)^(3/2)*(1+Q(1,cind(1))^2+Q(1,cind(2))^2+Q(1,cind(3))^2)^(3/2))+1/64*(3+E0-E1)*(5+E0-E1)/((1+Q(0,cind(1))^2+Q(0,cind(2))^2+Q(0,cind(3))^2)^(3/2)*(1+Q(1,cind(1))^2+Q(1,cind(2))^2+Q(1,cind(3))^2)^(3/2))+1/64*(3-E0+E1)*(5-E0+E1)/((1+Q(0,cind(1))^2+Q(0,cind(2))^2+Q(0,cind(3))^2)^(3/2)*(1+Q(1,cind(1))^2+Q(1,cind(2))^2+Q(1,cind(3))^2)^(3/2))+1/64*(3-E0-E1)*(5-E0-E1)/((1+Q(0,cind(1))^2+Q(0,cind(2))^2+Q(0,cind(3))^2)^(3/2)*(1+Q(1,cind(1))^2+Q(1,cind(2))^2+Q(1,cind(3))^2)^(3/2))+15/4/((1+Q(0,cind(1))^2+Q(0,cind(2))^2+Q(0,cind(3))^2)^(3/2)*(1+Q(1,cind(1))^2+Q(1,cind(2))^2+Q(1,cind(3))^2)^(3/2))), expected=1/16*(15-E0^2-E1^2)/(E0^3*E1^3)
  1239. 55.73 s > Location: crates/gammalooprs/src/graph/three_d_source.rs:7619
  1240. 55.73 s >
  1241. 55.73 s > ━━━━━━━━━━━━━━━━━━━━━━━━━━━━━━━━━━ BACKTRACE ━━━━━━━━━━━━━━━━━━━━━━━━━━━━━━━━━━━
  1242. 55.73 s > 1: <color_eyre[51793ea62743adbd]::config::PanicHook>::panic_report<unknown>
  1243. 55.73 s > at <unknown source file>:<unknown line>
  1244. 55.73 s > 2: <color_eyre[51793ea62743adbd]::config::PanicHook>::into_panic_hook::{closure#0}<unknown>
  1245. 55.73 s > at <unknown source file>:<unknown line>
  1246. 55.73 s > 3: std[bcb96dfbba0ab899]::panicking::panic_with_hook<unknown>
  1247. 55.73 s > at <unknown source file>:<unknown line>
  1248. 55.73 s > 4: std[bcb96dfbba0ab899]::panicking::panic_handler::{closure#0}<unknown>
  1249. 55.73 s > at <unknown source file>:<unknown line>
  1250. 55.73 s > 5: std[bcb96dfbba0ab899]::sys::backtrace::__rust_end_short_backtrace::<std[bcb96dfbba0ab899]::panicking::panic_handler::{closure#0}, !><unknown>
  1251. 55.73 s > at <unknown source file>:<unknown line>
  1252. 55.73 s > 6: __rustc[6c289b9f9c454d21]::rust_begin_unwind<unknown>
  1253. 55.73 s > at <unknown source file>:<unknown line>
  1254. 55.73 s > 7: core[940e698046960fd5]::panicking::panic_fmt<unknown>
  1255. 55.73 s > at <unknown source file>:<unknown line>
  1256. 55.73 s > 8: <gammalooprs[24955f93fc9f4e0c]::graph::three_d_source::tests::pinched_affine_carrier_requires_occurrence_interpolation::{closure#0} as core[940e698046960fd5]::ops::function::FnOnce<()>>::call_once<unknown>
  1257. 55.73 s > at <unknown source file>:<unknown line>
  1258. 55.73 s > 9: test[75d6903177b1d7e9]::__rust_begin_short_backtrace::<core[940e698046960fd5]::result::Result<(), alloc[2ea6bcb46fca0c42]::string::String>, fn() -> core[940e698046960fd5]::result::Result<(), alloc[2ea6bcb46fca0c42]::string::String>><unknown>
  1259. 55.73 s > at <unknown source file>:<unknown line>
  1260. 55.73 s > 10: test[75d6903177b1d7e9]::run_test::{closure#0}<unknown>
  1261. 55.73 s > at <unknown source file>:<unknown line>
  1262. 55.73 s > 11: std[bcb96dfbba0ab899]::sys::backtrace::__rust_begin_short_backtrace::<test[75d6903177b1d7e9]::run_test::{closure#1}, ()><unknown>
  1263. 55.73 s > at <unknown source file>:<unknown line>
  1264. 55.73 s > 12: <std[bcb96dfbba0ab899]::thread::lifecycle::spawn_unchecked<test[75d6903177b1d7e9]::run_test::{closure#1}, ()>::{closure#1} as core[940e698046960fd5]::ops::function::FnOnce<()>>::call_once::{shim:vtable#0}<unknown>
  1265. 55.73 s > at <unknown source file>:<unknown line>
  1266. 55.73 s > 13: <std[bcb96dfbba0ab899]::sys::thread::unix::Thread>::new::thread_start<unknown>
  1267. 55.73 s > at <unknown source file>:<unknown line>
  1268. 55.73 s > 14: start_thread<unknown>
  1269. 55.73 s > at <unknown source file>:<unknown line>
  1270. 55.73 s > 15: __clone3<unknown>
  1271. 55.73 s > at <unknown source file>:<unknown line>
  1272. 55.73 s >
  1273. 55.73 s > Run with COLORBT_SHOW_HIDDEN=1 environment variable to disable frame filtering.
  1274. 55.73 s > Run with RUST_BACKTRACE=full to include source snippets.
  1275. 55.73 s >
  1276. 55.73 s > FAIL [ 0.014s] (286/692) gammalooprs numerator::energy_degree::tests::canonical_class_cyclic_lifts_preserve_factorization_and_exact_bounds
  1277. 55.73 s > stdout ---
  1278. 55.73 s >
  1279. 55.73 s > running 1 test
  1280. 55.73 s > test numerator::energy_degree::tests::canonical_class_cyclic_lifts_preserve_factorization_and_exact_bounds ... FAILED
  1281. 55.73 s >
  1282. 55.73 s > failures:
  1283. 55.73 s >
  1284. 55.73 s > failures:
  1285. 55.73 s > numerator::energy_degree::tests::canonical_class_cyclic_lifts_preserve_factorization_and_exact_bounds
  1286. 55.73 s >
  1287. 55.73 s > test result: FAILED. 0 passed; 1 failed; 0 ignored; 0 measured; 742 filtered out; finished in 0.01s
  1288. 55.73 s >
  1289. 55.73 s > stderr ---
  1290. 55.73 s >
  1291. 55.73 s > thread 'numerator::energy_degree::tests::canonical_class_cyclic_lifts_preserve_factorization_and_exact_bounds' (2265) panicked at crates/gammalooprs/src/numerator/energy_degree.rs:2850:13:
  1292. 55.73 s > assertion failed: (collapsed - expression).collect_factors().is_zero()
  1293. 55.73 s > stack backtrace:
  1294. 55.73 s > 0: __rustc::rust_begin_unwind
  1295. 55.73 s > 1: core::panicking::panic_fmt
  1296. 55.73 s > 2: core::panicking::panic
  1297. 55.73 s > 3: gammalooprs::numerator::energy_degree::tests::canonical_class_cyclic_lifts_preserve_factorization_and_exact_bounds
  1298. 55.73 s > 4: <gammalooprs::numerator::energy_degree::tests::canonical_class_cyclic_lifts_preserve_factorization_and_exact_bounds::{closure#0} as core::ops::function::FnOnce<()>>::call_once
  1299. 55.73 s > note: Some details are omitted, run with `RUST_BACKTRACE=full` for a verbose backtrace.
  1300. 55.73 s >
  1301. 55.73 s > FAIL [ 0.074s] (587/692) gammalooprs uv::approx::local_4d::tests::canonical_uv_classes_certify_signed_aliases_and_preserve_raw_sectors
  1302. 55.73 s > stdout ---
  1303. 55.73 s >
  1304. 55.73 s > running 1 test
  1305. 55.73 s > test uv::approx::local_4d::tests::canonical_uv_classes_certify_signed_aliases_and_preserve_raw_sectors ... FAILED
  1306. 55.73 s >
  1307. 55.73 s > failures:
  1308. 55.73 s >
  1309. 55.73 s > failures:
  1310. 55.73 s > uv::approx::local_4d::tests::canonical_uv_classes_certify_signed_aliases_and_preserve_raw_sectors
  1311. 55.73 s >
  1312. 55.73 s > test result: FAILED. 0 passed; 1 failed; 0 ignored; 0 measured; 742 filtered out; finished in 0.07s
  1313. 55.73 s >
  1314. 55.73 s > stderr ---
  1315. 55.73 s > Error:
  1316. 55.73 s > 0: merged canonical UV numerator does not reproduce its source bucket
  1317. 55.73 s >
  1318. 55.73 s > Location:
  1319. 55.73 s > crates/gammalooprs/src/uv/approx/local_4d.rs:367
  1320. 55.73 s >
  1321. 55.73 s > ━━━━━━━━━━━━━━━━━━━━━━━━━━━━━━━━━━ BACKTRACE ━━━━━━━━━━━━━━━━━━━━━━━━━━━━━━━━━━━
  1322. 55.73 s > 1: <color_eyre[51793ea62743adbd]::config::EyreHook>::into_eyre_hook::{closure#0}<unknown>
  1323. 55.73 s > at <unknown source file>:<unknown line>
  1324. 55.73 s > 2: eyre[cb2fd339c0c40fca]::capture_handler<unknown>
  1325. 55.73 s > at <unknown source file>:<unknown line>
  1326. 55.73 s > 3: eyre[cb2fd339c0c40fca]::private::format_err<unknown>
  1327. 55.73 s > at <unknown source file>:<unknown line>
  1328. 55.73 s > 4: <gammalooprs[24955f93fc9f4e0c]::uv::approx::local_4d::FourDSector>::canonical_projection<unknown>
  1329. 55.73 s > at <unknown source file>:<unknown line>
  1330. 55.73 s > 5: gammalooprs[24955f93fc9f4e0c]::uv::approx::local_4d::tests::canonical_uv_classes_certify_signed_aliases_and_preserve_raw_sectors<unknown>
  1331. 55.73 s > at <unknown source file>:<unknown line>
  1332. 55.73 s > 6: <gammalooprs[24955f93fc9f4e0c]::uv::approx::local_4d::tests::canonical_uv_classes_certify_signed_aliases_and_preserve_raw_sectors::{closure#0} as core[940e698046960fd5]::ops::function::FnOnce<()>>::call_once<unknown>
  1333. 55.73 s > at <unknown source file>:<unknown line>
  1334. 55.73 s > 7: test[75d6903177b1d7e9]::__rust_begin_short_backtrace::<core[940e698046960fd5]::result::Result<(), alloc[2ea6bcb46fca0c42]::string::String>, fn() -> core[940e698046960fd5]::result::Result<(), alloc[2ea6bcb46fca0c42]::string::String>><unknown>
  1335. 55.73 s > at <unknown source file>:<unknown line>
  1336. 55.73 s > 8: test[75d6903177b1d7e9]::run_test::{closure#0}<unknown>
  1337. 55.73 s > at <unknown source file>:<unknown line>
  1338. 55.73 s > 9: std[bcb96dfbba0ab899]::sys::backtrace::__rust_begin_short_backtrace::<test[75d6903177b1d7e9]::run_test::{closure#1}, ()><unknown>
  1339. 55.73 s > at <unknown source file>:<unknown line>
  1340. 55.73 s > 10: <std[bcb96dfbba0ab899]::thread::lifecycle::spawn_unchecked<test[75d6903177b1d7e9]::run_test::{closure#1}, ()>::{closure#1} as core[940e698046960fd5]::ops::function::FnOnce<()>>::call_once::{shim:vtable#0}<unknown>
  1341. 55.73 s > at <unknown source file>:<unknown line>
  1342. 55.73 s > 11: <std[bcb96dfbba0ab899]::sys::thread::unix::Thread>::new::thread_start<unknown>
  1343. 55.73 s > at <unknown source file>:<unknown line>
  1344. 55.73 s > 12: start_thread<unknown>
  1345. 55.73 s > at <unknown source file>:<unknown line>
  1346. 55.73 s > 13: __clone3<unknown>
  1347. 55.73 s > at <unknown source file>:<unknown line>
  1348. 55.73 s >
  1349. 55.73 s > Run with COLORBT_SHOW_HIDDEN=1 environment variable to disable frame filtering.
  1350. 55.73 s > Run with RUST_BACKTRACE=full to include source snippets.
  1351. 55.73 s >
  1352. 55.73 s > FAIL [ 0.096s] (593/692) gammalooprs uv::approx::local_4d::tests::canonical_uv_signed_multiloop_carriers_preserve_factorized_numerators
  1353. 55.73 s > stdout ---
  1354. 55.73 s >
  1355. 55.73 s > running 1 test
  1356. 55.73 s > test uv::approx::local_4d::tests::canonical_uv_signed_multiloop_carriers_preserve_factorized_numerators ... FAILED
  1357. 55.73 s >
  1358. 55.73 s > failures:
  1359. 55.73 s >
  1360. 55.73 s > failures:
  1361. 55.73 s > uv::approx::local_4d::tests::canonical_uv_signed_multiloop_carriers_preserve_factorized_numerators
  1362. 55.73 s >
  1363. 55.73 s > test result: FAILED. 0 passed; 1 failed; 0 ignored; 0 measured; 742 filtered out; finished in 0.08s
  1364. 55.73 s >
  1365. 55.73 s > stderr ---
  1366. 55.73 s > The application panicked (crashed).
  1367. 55.73 s > Message: assertion `left == right` failed
  1368. 55.73 s > left: 2*(signed_multiloop::a+signed_multiloop::b)^5*gammalooprs::Q(gammalooprs::uv::class(0),spenso::cind(0))
  1369. 55.73 s > right: -2*(signed_multiloop::a+signed_multiloop::b)^5*gammalooprs::Q(gammalooprs::uv::class(0),spenso::cind(0))
  1370. 55.73 s > Location: crates/gammalooprs/src/uv/approx/local_4d.rs:1983
  1371. 55.73 s >
  1372. 55.73 s > ━━━━━━━━━━━━━━━━━━━━━━━━━━━━━━━━━━ BACKTRACE ━━━━━━━━━━━━━━━━━━━━━━━━━━━━━━━━━━━
  1373. 55.73 s > 1: <color_eyre[51793ea62743adbd]::config::PanicHook>::panic_report<unknown>
  1374. 55.73 s > at <unknown source file>:<unknown line>
  1375. 55.73 s > 2: <color_eyre[51793ea62743adbd]::config::PanicHook>::into_panic_hook::{closure#0}<unknown>
  1376. 55.73 s > at <unknown source file>:<unknown line>
  1377. 55.73 s > 3: std[bcb96dfbba0ab899]::panicking::panic_with_hook<unknown>
  1378. 55.73 s > at <unknown source file>:<unknown line>
  1379. 55.73 s > 4: std[bcb96dfbba0ab899]::panicking::panic_handler::{closure#0}<unknown>
  1380. 55.73 s > at <unknown source file>:<unknown line>
  1381. 55.73 s > 5: std[bcb96dfbba0ab899]::sys::backtrace::__rust_end_short_backtrace::<std[bcb96dfbba0ab899]::panicking::panic_handler::{closure#0}, !><unknown>
  1382. 55.73 s > at <unknown source file>:<unknown line>
  1383. 55.73 s > 6: __rustc[6c289b9f9c454d21]::rust_begin_unwind<unknown>
  1384. 55.73 s > at <unknown source file>:<unknown line>
  1385. 55.73 s > 7: core[940e698046960fd5]::panicking::panic_fmt<unknown>
  1386. 55.73 s > at <unknown source file>:<unknown line>
  1387. 55.73 s > 8: core[940e698046960fd5]::panicking::assert_failed_inner<unknown>
  1388. 55.73 s > at <unknown source file>:<unknown line>
  1389. 55.73 s > 9: core[940e698046960fd5]::panicking::assert_failed::<symbolica[499970c26fd75ddd]::atom::Atom, symbolica[499970c26fd75ddd]::atom::Atom><unknown>
  1390. 55.73 s > at <unknown source file>:<unknown line>
  1391. 55.73 s > 10: gammalooprs[24955f93fc9f4e0c]::uv::approx::local_4d::tests::canonical_uv_signed_multiloop_carriers_preserve_factorized_numerators<unknown>
  1392. 55.73 s > at <unknown source file>:<unknown line>
  1393. 55.73 s > 11: <gammalooprs[24955f93fc9f4e0c]::uv::approx::local_4d::tests::canonical_uv_signed_multiloop_carriers_preserve_factorized_numerators::{closure#0} as core[940e698046960fd5]::ops::function::FnOnce<()>>::call_once<unknown>
  1394. 55.73 s > at <unknown source file>:<unknown line>
  1395. 55.73 s > 12: test[75d6903177b1d7e9]::__rust_begin_short_backtrace::<core[940e698046960fd5]::result::Result<(), alloc[2ea6bcb46fca0c42]::string::String>, fn() -> core[940e698046960fd5]::result::Result<(), alloc[2ea6bcb46fca0c42]::string::String>><unknown>
  1396. 55.73 s > at <unknown source file>:<unknown line>
  1397. 55.73 s > 13: test[75d6903177b1d7e9]::run_test::{closure#0}<unknown>
  1398. 55.73 s > at <unknown source file>:<unknown line>
  1399. 55.73 s > 14: std[bcb96dfbba0ab899]::sys::backtrace::__rust_begin_short_backtrace::<test[75d6903177b1d7e9]::run_test::{closure#1}, ()><unknown>
  1400. 55.73 s > at <unknown source file>:<unknown line>
  1401. 55.73 s > 15: <std[bcb96dfbba0ab899]::thread::lifecycle::spawn_unchecked<test[75d6903177b1d7e9]::run_test::{closure#1}, ()>::{closure#1} as core[940e698046960fd5]::ops::function::FnOnce<()>>::call_once::{shim:vtable#0}<unknown>
  1402. 55.73 s > at <unknown source file>:<unknown line>
  1403. 55.73 s > 16: <std[bcb96dfbba0ab899]::sys::thread::unix::Thread>::new::thread_start<unknown>
  1404. 55.73 s > at <unknown source file>:<unknown line>
  1405. 55.73 s > 17: start_thread<unknown>
  1406. 55.73 s > at <unknown source file>:<unknown line>
  1407. 55.73 s > 18: __clone3<unknown>
  1408. 55.73 s > at <unknown source file>:<unknown line>
  1409. 55.73 s >
  1410. 55.73 s > Run with COLORBT_SHOW_HIDDEN=1 environment variable to disable frame filtering.
  1411. 55.73 s > Run with RUST_BACKTRACE=full to include source snippets.
  1412. 55.73 s >
  1413. 55.73 s > FAIL [ 0.112s] (605/692) gammalooprs uv::approx::tests::direct_nested_scalar_banana_replays_complete_cff_at_depth_three
  1414. 55.73 s > stdout ---
  1415. 55.73 s >
  1416. 55.73 s > running 1 test
  1417. 55.73 s > test uv::approx::tests::direct_nested_scalar_banana_replays_complete_cff_at_depth_three ... FAILED
  1418. 55.73 s >
  1419. 55.73 s > failures:
  1420. 55.73 s >
  1421. 55.73 s > failures:
  1422. 55.73 s > uv::approx::tests::direct_nested_scalar_banana_replays_complete_cff_at_depth_three
  1423. 55.73 s >
  1424. 55.73 s > test result: FAILED. 0 passed; 1 failed; 0 ignored; 0 measured; 742 filtered out; finished in 0.10s
  1425. 55.73 s >
  1426. 55.73 s > stderr ---
  1427. 55.73 s > Error:
  1428. 55.73 s > 0: canonical UV numerator does not reproduce its source in the component frame
  1429. 55.73 s >
  1430. 55.73 s > Location:
  1431. 55.73 s > crates/gammalooprs/src/uv/approx/local_4d.rs:354
  1432. 55.73 s >
  1433. 55.73 s > ━━━━━━━━━━━━━━━━━━━━━━━━━━━━━━━━━━ BACKTRACE ━━━━━━━━━━━━━━━━━━━━━━━━━━━━━━━━━━━
  1434. 55.73 s > 1: <color_eyre[51793ea62743adbd]::config::EyreHook>::into_eyre_hook::{closure#0}<unknown>
  1435. 55.73 s > at <unknown source file>:<unknown line>
  1436. 55.73 s > 2: eyre[cb2fd339c0c40fca]::capture_handler<unknown>
  1437. 55.73 s > at <unknown source file>:<unknown line>
  1438. 55.73 s > 3: eyre[cb2fd339c0c40fca]::private::format_err<unknown>
  1439. 55.73 s > at <unknown source file>:<unknown line>
  1440. 55.73 s > 4: <gammalooprs[24955f93fc9f4e0c]::uv::approx::local_4d::FourDSector>::canonical_projection<unknown>
  1441. 55.73 s > at <unknown source file>:<unknown line>
  1442. 55.73 s > 5: <gammalooprs[24955f93fc9f4e0c]::uv::approx::projected_4d::Projected4dApproximation>::project_local_4d<unknown>
  1443. 55.73 s > at <unknown source file>:<unknown line>
  1444. 55.73 s > 6: <gammalooprs[24955f93fc9f4e0c]::uv::approx::Approximation>::compute_3d<unknown>
  1445. 55.73 s > at <unknown source file>:<unknown line>
  1446. 55.73 s > 7: gammalooprs[24955f93fc9f4e0c]::uv::approx::tests::direct_nested_scalar_banana_replays_complete_cff_at_depth_three::{closure#0}<unknown>
  1447. 55.73 s > at <unknown source file>:<unknown line>
  1448. 55.73 s > 8: gammalooprs[24955f93fc9f4e0c]::uv::approx::tests::direct_nested_scalar_banana_replays_complete_cff_at_depth_three<unknown>
  1449. 55.73 s > at <unknown source file>:<unknown line>
  1450. 55.73 s > 9: <gammalooprs[24955f93fc9f4e0c]::uv::approx::tests::direct_nested_scalar_banana_replays_complete_cff_at_depth_three::{closure#0} as core[940e698046960fd5]::ops::function::FnOnce<()>>::call_once<unknown>
  1451. 55.73 s > at <unknown source file>:<unknown line>
  1452. 55.73 s > 10: test[75d6903177b1d7e9]::__rust_begin_short_backtrace::<core[940e698046960fd5]::result::Result<(), alloc[2ea6bcb46fca0c42]::string::String>, fn() -> core[940e698046960fd5]::result::Result<(), alloc[2ea6bcb46fca0c42]::string::String>><unknown>
  1453. 55.73 s > at <unknown source file>:<unknown line>
  1454. 55.73 s > 11: test[75d6903177b1d7e9]::run_test::{closure#0}<unknown>
  1455. 55.73 s > at <unknown source file>:<unknown line>
  1456. 55.73 s > 12: std[bcb96dfbba0ab899]::sys::backtrace::__rust_begin_short_backtrace::<test[75d6903177b1d7e9]::run_test::{closure#1}, ()><unknown>
  1457. 55.73 s > at <unknown source file>:<unknown line>
  1458. 55.73 s > 13: <std[bcb96dfbba0ab899]::thread::lifecycle::spawn_unchecked<test[75d6903177b1d7e9]::run_test::{closure#1}, ()>::{closure#1} as core[940e698046960fd5]::ops::function::FnOnce<()>>::call_once::{shim:vtable#0}<unknown>
  1459. 55.73 s > at <unknown source file>:<unknown line>
  1460. 55.73 s > 14: <std[bcb96dfbba0ab899]::sys::thread::unix::Thread>::new::thread_start<unknown>
  1461. 55.73 s > at <unknown source file>:<unknown line>
  1462. 55.73 s > 15: start_thread<unknown>
  1463. 55.73 s > at <unknown source file>:<unknown line>
  1464. 55.73 s > 16: __clone3<unknown>
  1465. 55.73 s > at <unknown source file>:<unknown line>
  1466. 55.73 s >
  1467. 55.73 s > Run with COLORBT_SHOW_HIDDEN=1 environment variable to disable frame filtering.
  1468. 55.73 s > Run with RUST_BACKTRACE=full to include source snippets.
  1469. 55.73 s >
  1470. 55.73 s > ------------
  1471. 55.73 s > Summary [ 12.837s] 692 tests run: 686 passed, 6 failed, 60 skipped
  1472. 55.73 s > FAIL [ 0.118s] (149/692) gammalooprs graph::three_d_source::tests::exact_taylor_vacuum_affine_circulation_preserves_energy_mapping
  1473. 55.73 s > stdout ---
  1474. 55.73 s >
  1475. 55.73 s > running 1 test
  1476. 55.73 s > test graph::three_d_source::tests::exact_taylor_vacuum_affine_circulation_preserves_energy_mapping ... FAILED
  1477. 55.73 s >
  1478. 55.73 s > failures:
  1479. 55.73 s >
  1480. 55.73 s > failures:
  1481. 55.73 s > graph::three_d_source::tests::exact_taylor_vacuum_affine_circulation_preserves_energy_mapping
  1482. 55.73 s >
  1483. 55.73 s > test result: FAILED. 0 passed; 1 failed; 0 ignored; 0 measured; 742 filtered out; finished in 0.10s
  1484. 55.73 s >
  1485. 55.73 s > stderr ---
  1486. 55.73 s > The application panicked (crashed).
  1487. 55.73 s > Message: assertion `left == right` failed
  1488. 55.73 s > left: (gammalooprs::mUVexp^2+(-gammalooprs::Q(1,spenso::cind(1))+gammalooprs::Q(4,spenso::cind(1)))^2+(-gammalooprs::Q(1,spenso::cind(2))+gammalooprs::Q(4,spenso::cind(2)))^2+(-gammalooprs::Q(1,spenso::cind(3))+gammalooprs::Q(4,spenso::cind(3)))^2)^(1/2)
  1489. 55.73 s > right: (gammalooprs::mUVexp^2+(gammalooprs::Q(1,spenso::cind(1))-gammalooprs::Q(4,spenso::cind(1)))^2+(gammalooprs::Q(1,spenso::cind(2))-gammalooprs::Q(4,spenso::cind(2)))^2+(gammalooprs::Q(1,spenso::cind(3))-gammalooprs::Q(4,spenso::cind(3)))^2)^(1/2)
  1490. 55.73 s > Location: crates/gammalooprs/src/graph/three_d_source.rs:7797
  1491. 55.73 s >
  1492. 55.73 s > ━━━━━━━━━━━━━━━━━━━━━━━━━━━━━━━━━━ BACKTRACE ━━━━━━━━━━━━━━━━━━━━━━━━━━━━━━━━━━━
  1493. 55.73 s > 1: <color_eyre[51793ea62743adbd]::config::PanicHook>::panic_report<unknown>
  1494. 55.73 s > at <unknown source file>:<unknown line>
  1495. 55.73 s > 2: <color_eyre[51793ea62743adbd]::config::PanicHook>::into_panic_hook::{closure#0}<unknown>
  1496. 55.73 s > at <unknown source file>:<unknown line>
  1497. 55.73 s > 3: std[bcb96dfbba0ab899]::panicking::panic_with_hook<unknown>
  1498. 55.73 s > at <unknown source file>:<unknown line>
  1499. 55.73 s > 4: std[bcb96dfbba0ab899]::panicking::panic_handler::{closure#0}<unknown>
  1500. 55.73 s > at <unknown source file>:<unknown line>
  1501. 55.73 s > 5: std[bcb96dfbba0ab899]::sys::backtrace::__rust_end_short_backtrace::<std[bcb96dfbba0ab899]::panicking::panic_handler::{closure#0}, !><unknown>
  1502. 55.73 s > at <unknown source file>:<unknown line>
  1503. 55.73 s > 6: __rustc[6c289b9f9c454d21]::rust_begin_unwind<unknown>
  1504. 55.73 s > at <unknown source file>:<unknown line>
  1505. 55.73 s > 7: core[940e698046960fd5]::panicking::panic_fmt<unknown>
  1506. 55.73 s > at <unknown source file>:<unknown line>
  1507. 55.73 s > 8: core[940e698046960fd5]::panicking::assert_failed_inner<unknown>
  1508. 55.73 s > at <unknown source file>:<unknown line>
  1509. 55.73 s > 9: core[940e698046960fd5]::panicking::assert_failed::<symbolica[499970c26fd75ddd]::atom::Atom, symbolica[499970c26fd75ddd]::atom::Atom><unknown>
  1510. 55.73 s > at <unknown source file>:<unknown line>
  1511. 55.73 s > 10: gammalooprs[24955f93fc9f4e0c]::graph::three_d_source::tests::exact_taylor_vacuum_affine_circulation_preserves_energy_mapping<unknown>
  1512. 55.73 s > at <unknown source file>:<unknown line>
  1513. 55.73 s > 11: <gammalooprs[24955f93fc9f4e0c]::graph::three_d_source::tests::exact_taylor_vacuum_affine_circulation_preserves_energy_mapping::{closure#0} as core[940e698046960fd5]::ops::function::FnOnce<()>>::call_once<unknown>
  1514. 55.73 s > at <unknown source file>:<unknown line>
  1515. 55.73 s > 12: test[75d6903177b1d7e9]::__rust_begin_short_backtrace::<core[940e698046960fd5]::result::Result<(), alloc[2ea6bcb46fca0c42]::string::String>, fn() -> core[940e698046960fd5]::result::Result<(), alloc[2ea6bcb46fca0c42]::string::String>><unknown>
  1516. 55.73 s > at <unknown source file>:<unknown line>
  1517. 55.73 s > 13: test[75d6903177b1d7e9]::run_test::{closure#0}<unknown>
  1518. 55.73 s > at <unknown source file>:<unknown line>
  1519. 55.73 s > 14: std[bcb96dfbba0ab899]::sys::backtrace::__rust_begin_short_backtrace::<test[75d6903177b1d7e9]::run_test::{closure#1}, ()><unknown>
  1520. 55.73 s > at <unknown source file>:<unknown line>
  1521. 55.73 s > 15: <std[bcb96dfbba0ab899]::thread::lifecycle::spawn_unchecked<test[75d6903177b1d7e9]::run_test::{closure#1}, ()>::{closure#1} as core[940e698046960fd5]::ops::function::FnOnce<()>>::call_once::{shim:vtable#0}<unknown>
  1522. 55.73 s > at <unknown source file>:<unknown line>
  1523. 55.73 s > 16: <std[bcb96dfbba0ab899]::sys::thread::unix::Thread>::new::thread_start<unknown>
  1524. 55.73 s > at <unknown source file>:<unknown line>
  1525. 55.73 s > 17: start_thread<unknown>
  1526. 55.73 s > at <unknown source file>:<unknown line>
  1527. 55.73 s > 18: __clone3<unknown>
  1528. 55.73 s > at <unknown source file>:<unknown line>
  1529. 55.73 s >
  1530. 55.73 s > Run with COLORBT_SHOW_HIDDEN=1 environment variable to disable frame filtering.
  1531. 55.73 s > Run with RUST_BACKTRACE=full to include source snippets.
  1532. 55.73 s >
  1533. 55.73 s > FAIL [ 0.117s] (161/692) gammalooprs graph::three_d_source::tests::pinched_affine_carrier_requires_occurrence_interpolation
  1534. 55.73 s > stdout ---
  1535. 55.73 s >
  1536. 55.73 s > running 1 test
  1537. 55.73 s > test graph::three_d_source::tests::pinched_affine_carrier_requires_occurrence_interpolation ... FAILED
  1538. 55.73 s >
  1539. 55.73 s > failures:
  1540. 55.73 s >
  1541. 55.73 s > failures:
  1542. 55.73 s > graph::three_d_source::tests::pinched_affine_carrier_requires_occurrence_interpolation
  1543. 55.73 s >
  1544. 55.73 s > test result: FAILED. 0 passed; 1 failed; 0 ignored; 0 measured; 742 filtered out; finished in 0.11s
  1545. 55.73 s >
  1546. 55.73 s > stderr ---
  1547. 55.73 s > The application panicked (crashed).
  1548. 55.73 s > Message: certified affine occurrence lift must reproduce the independent double contours: actual=-(-1/16*(3+E0)*(5+E0)/((1+Q(0,cind(1))^2+Q(0,cind(2))^2+Q(0,cind(3))^2)^(3/2)*(1+Q(1,cind(1))^2+Q(1,cind(2))^2+Q(1,cind(3))^2)^(3/2))-1/16*(3+E1)*(5+E1)/((1+Q(0,cind(1))^2+Q(0,cind(2))^2+Q(0,cind(3))^2)^(3/2)*(1+Q(1,cind(1))^2+Q(1,cind(2))^2+Q(1,cind(3))^2)^(3/2))-1/16*(3-E0)*(5-E0)/((1+Q(0,cind(1))^2+Q(0,cind(2))^2+Q(0,cind(3))^2)^(3/2)*(1+Q(1,cind(1))^2+Q(1,cind(2))^2+Q(1,cind(3))^2)^(3/2))-1/16*(3-E1)*(5-E1)/((1+Q(0,cind(1))^2+Q(0,cind(2))^2+Q(0,cind(3))^2)^(3/2)*(1+Q(1,cind(1))^2+Q(1,cind(2))^2+Q(1,cind(3))^2)^(3/2))+1/64*(3+E0+E1)*(5+E0+E1)/((1+Q(0,cind(1))^2+Q(0,cind(2))^2+Q(0,cind(3))^2)^(3/2)*(1+Q(1,cind(1))^2+Q(1,cind(2))^2+Q(1,cind(3))^2)^(3/2))+1/64*(3+E0-E1)*(5+E0-E1)/((1+Q(0,cind(1))^2+Q(0,cind(2))^2+Q(0,cind(3))^2)^(3/2)*(1+Q(1,cind(1))^2+Q(1,cind(2))^2+Q(1,cind(3))^2)^(3/2))+1/64*(3-E0+E1)*(5-E0+E1)/((1+Q(0,cind(1))^2+Q(0,cind(2))^2+Q(0,cind(3))^2)^(3/2)*(1+Q(1,cind(1))^2+Q(1,cind(2))^2+Q(1,cind(3))^2)^(3/2))+1/64*(3-E0-E1)*(5-E0-E1)/((1+Q(0,cind(1))^2+Q(0,cind(2))^2+Q(0,cind(3))^2)^(3/2)*(1+Q(1,cind(1))^2+Q(1,cind(2))^2+Q(1,cind(3))^2)^(3/2))+15/4/((1+Q(0,cind(1))^2+Q(0,cind(2))^2+Q(0,cind(3))^2)^(3/2)*(1+Q(1,cind(1))^2+Q(1,cind(2))^2+Q(1,cind(3))^2)^(3/2))), expected=1/16*(15-E0^2-E1^2)/(E0^3*E1^3)
  1549. 55.73 s > Location: crates/gammalooprs/src/graph/three_d_source.rs:7619
  1550. 55.73 s >
  1551. 55.73 s > ━━━━━━━━━━━━━━━━━━━━━━━━━━━━━━━━━━ BACKTRACE ━━━━━━━━━━━━━━━━━━━━━━━━━━━━━━━━━━━
  1552. 55.73 s > 1: <color_eyre[51793ea62743adbd]::config::PanicHook>::panic_report<unknown>
  1553. 55.73 s > at <unknown source file>:<unknown line>
  1554. 55.73 s > 2: <color_eyre[51793ea62743adbd]::config::PanicHook>::into_panic_hook::{closure#0}<unknown>
  1555. 55.73 s > at <unknown source file>:<unknown line>
  1556. 55.73 s > 3: std[bcb96dfbba0ab899]::panicking::panic_with_hook<unknown>
  1557. 55.73 s > at <unknown source file>:<unknown line>
  1558. 55.73 s > 4: std[bcb96dfbba0ab899]::panicking::panic_handler::{closure#0}<unknown>
  1559. 55.73 s > at <unknown source file>:<unknown line>
  1560. 55.73 s > 5: std[bcb96dfbba0ab899]::sys::backtrace::__rust_end_short_backtrace::<std[bcb96dfbba0ab899]::panicking::panic_handler::{closure#0}, !><unknown>
  1561. 55.73 s > at <unknown source file>:<unknown line>
  1562. 55.73 s > 6: __rustc[6c289b9f9c454d21]::rust_begin_unwind<unknown>
  1563. 55.73 s > at <unknown source file>:<unknown line>
  1564. 55.73 s > 7: core[940e698046960fd5]::panicking::panic_fmt<unknown>
  1565. 55.73 s > at <unknown source file>:<unknown line>
  1566. 55.73 s > 8: <gammalooprs[24955f93fc9f4e0c]::graph::three_d_source::tests::pinched_affine_carrier_requires_occurrence_interpolation::{closure#0} as core[940e698046960fd5]::ops::function::FnOnce<()>>::call_once<unknown>
  1567. 55.73 s > at <unknown source file>:<unknown line>
  1568. 55.73 s > 9: test[75d6903177b1d7e9]::__rust_begin_short_backtrace::<core[940e698046960fd5]::result::Result<(), alloc[2ea6bcb46fca0c42]::string::String>, fn() -> core[940e698046960fd5]::result::Result<(), alloc[2ea6bcb46fca0c42]::string::String>><unknown>
  1569. 55.73 s > at <unknown source file>:<unknown line>
  1570. 55.73 s > 10: test[75d6903177b1d7e9]::run_test::{closure#0}<unknown>
  1571. 55.73 s > at <unknown source file>:<unknown line>
  1572. 55.73 s > 11: std[bcb96dfbba0ab899]::sys::backtrace::__rust_begin_short_backtrace::<test[75d6903177b1d7e9]::run_test::{closure#1}, ()><unknown>
  1573. 55.73 s > at <unknown source file>:<unknown line>
  1574. 55.73 s > 12: <std[bcb96dfbba0ab899]::thread::lifecycle::spawn_unchecked<test[75d6903177b1d7e9]::run_test::{closure#1}, ()>::{closure#1} as core[940e698046960fd5]::ops::function::FnOnce<()>>::call_once::{shim:vtable#0}<unknown>
  1575. 55.73 s > at <unknown source file>:<unknown line>
  1576. 55.73 s > 13: <std[bcb96dfbba0ab899]::sys::thread::unix::Thread>::new::thread_start<unknown>
  1577. 55.73 s > at <unknown source file>:<unknown line>
  1578. 55.73 s > 14: start_thread<unknown>
  1579. 55.73 s > at <unknown source file>:<unknown line>
  1580. 55.73 s > 15: __clone3<unknown>
  1581. 55.73 s > at <unknown source file>:<unknown line>
  1582. 55.73 s >
  1583. 55.73 s > Run with COLORBT_SHOW_HIDDEN=1 environment variable to disable frame filtering.
  1584. 55.73 s > Run with RUST_BACKTRACE=full to include source snippets.
  1585. 55.73 s >
  1586. 55.73 s > FAIL [ 0.014s] (286/692) gammalooprs numerator::energy_degree::tests::canonical_class_cyclic_lifts_preserve_factorization_and_exact_bounds
  1587. 55.73 s > stdout ---
  1588. 55.73 s >
  1589. 55.73 s > running 1 test
  1590. 55.73 s > test numerator::energy_degree::tests::canonical_class_cyclic_lifts_preserve_factorization_and_exact_bounds ... FAILED
  1591. 55.73 s >
  1592. 55.73 s > failures:
  1593. 55.73 s >
  1594. 55.73 s > failures:
  1595. 55.73 s > numerator::energy_degree::tests::canonical_class_cyclic_lifts_preserve_factorization_and_exact_bounds
  1596. 55.73 s >
  1597. 55.73 s > test result: FAILED. 0 passed; 1 failed; 0 ignored; 0 measured; 742 filtered out; finished in 0.01s
  1598. 55.73 s >
  1599. 55.73 s > stderr ---
  1600. 55.73 s >
  1601. 55.73 s > thread 'numerator::energy_degree::tests::canonical_class_cyclic_lifts_preserve_factorization_and_exact_bounds' (2265) panicked at crates/gammalooprs/src/numerator/energy_degree.rs:2850:13:
  1602. 55.73 s > assertion failed: (collapsed - expression).collect_factors().is_zero()
  1603. 55.73 s > stack backtrace:
  1604. 55.73 s > 0: __rustc::rust_begin_unwind
  1605. 55.73 s > 1: core::panicking::panic_fmt
  1606. 55.73 s > 2: core::panicking::panic
  1607. 55.73 s > 3: gammalooprs::numerator::energy_degree::tests::canonical_class_cyclic_lifts_preserve_factorization_and_exact_bounds
  1608. 55.73 s > 4: <gammalooprs::numerator::energy_degree::tests::canonical_class_cyclic_lifts_preserve_factorization_and_exact_bounds::{closure#0} as core::ops::function::FnOnce<()>>::call_once
  1609. 55.73 s > note: Some details are omitted, run with `RUST_BACKTRACE=full` for a verbose backtrace.
  1610. 55.73 s >
  1611. 55.73 s > FAIL [ 0.074s] (587/692) gammalooprs uv::approx::local_4d::tests::canonical_uv_classes_certify_signed_aliases_and_preserve_raw_sectors
  1612. 55.73 s > stdout ---
  1613. 55.73 s >
  1614. 55.73 s > running 1 test
  1615. 55.73 s > test uv::approx::local_4d::tests::canonical_uv_classes_certify_signed_aliases_and_preserve_raw_sectors ... FAILED
  1616. 55.73 s >
  1617. 55.73 s > failures:
  1618. 55.73 s >
  1619. 55.73 s > failures:
  1620. 55.73 s > uv::approx::local_4d::tests::canonical_uv_classes_certify_signed_aliases_and_preserve_raw_sectors
  1621. 55.73 s >
  1622. 55.73 s > test result: FAILED. 0 passed; 1 failed; 0 ignored; 0 measured; 742 filtered out; finished in 0.07s
  1623. 55.73 s >
  1624. 55.73 s > stderr ---
  1625. 55.73 s > Error:
  1626. 55.73 s > 0: merged canonical UV numerator does not reproduce its source bucket
  1627. 55.73 s >
  1628. 55.73 s > Location:
  1629. 55.73 s > crates/gammalooprs/src/uv/approx/local_4d.rs:367
  1630. 55.73 s >
  1631. 55.73 s > ━━━━━━━━━━━━━━━━━━━━━━━━━━━━━━━━━━ BACKTRACE ━━━━━━━━━━━━━━━━━━━━━━━━━━━━━━━━━━━
  1632. 55.73 s > 1: <color_eyre[51793ea62743adbd]::config::EyreHook>::into_eyre_hook::{closure#0}<unknown>
  1633. 55.73 s > at <unknown source file>:<unknown line>
  1634. 55.73 s > 2: eyre[cb2fd339c0c40fca]::capture_handler<unknown>
  1635. 55.73 s > at <unknown source file>:<unknown line>
  1636. 55.73 s > 3: eyre[cb2fd339c0c40fca]::private::format_err<unknown>
  1637. 55.73 s > at <unknown source file>:<unknown line>
  1638. 55.73 s > 4: <gammalooprs[24955f93fc9f4e0c]::uv::approx::local_4d::FourDSector>::canonical_projection<unknown>
  1639. 55.73 s > at <unknown source file>:<unknown line>
  1640. 55.73 s > 5: gammalooprs[24955f93fc9f4e0c]::uv::approx::local_4d::tests::canonical_uv_classes_certify_signed_aliases_and_preserve_raw_sectors<unknown>
  1641. 55.73 s > at <unknown source file>:<unknown line>
  1642. 55.73 s > 6: <gammalooprs[24955f93fc9f4e0c]::uv::approx::local_4d::tests::canonical_uv_classes_certify_signed_aliases_and_preserve_raw_sectors::{closure#0} as core[940e698046960fd5]::ops::function::FnOnce<()>>::call_once<unknown>
  1643. 55.73 s > at <unknown source file>:<unknown line>
  1644. 55.73 s > 7: test[75d6903177b1d7e9]::__rust_begin_short_backtrace::<core[940e698046960fd5]::result::Result<(), alloc[2ea6bcb46fca0c42]::string::String>, fn() -> core[940e698046960fd5]::result::Result<(), alloc[2ea6bcb46fca0c42]::string::String>><unknown>
  1645. 55.73 s > at <unknown source file>:<unknown line>
  1646. 55.73 s > 8: test[75d6903177b1d7e9]::run_test::{closure#0}<unknown>
  1647. 55.73 s > at <unknown source file>:<unknown line>
  1648. 55.73 s > 9: std[bcb96dfbba0ab899]::sys::backtrace::__rust_begin_short_backtrace::<test[75d6903177b1d7e9]::run_test::{closure#1}, ()><unknown>
  1649. 55.73 s > at <unknown source file>:<unknown line>
  1650. 55.73 s > 10: <std[bcb96dfbba0ab899]::thread::lifecycle::spawn_unchecked<test[75d6903177b1d7e9]::run_test::{closure#1}, ()>::{closure#1} as core[940e698046960fd5]::ops::function::FnOnce<()>>::call_once::{shim:vtable#0}<unknown>
  1651. 55.73 s > at <unknown source file>:<unknown line>
  1652. 55.73 s > 11: <std[bcb96dfbba0ab899]::sys::thread::unix::Thread>::new::thread_start<unknown>
  1653. 55.73 s > at <unknown source file>:<unknown line>
  1654. 55.73 s > 12: start_thread<unknown>
  1655. 55.73 s > at <unknown source file>:<unknown line>
  1656. 55.73 s > 13: __clone3<unknown>
  1657. 55.73 s > at <unknown source file>:<unknown line>
  1658. 55.73 s >
  1659. 55.73 s > Run with COLORBT_SHOW_HIDDEN=1 environment variable to disable frame filtering.
  1660. 55.73 s > Run with RUST_BACKTRACE=full to include source snippets.
  1661. 55.73 s >
  1662. 55.73 s > FAIL [ 0.096s] (593/692) gammalooprs uv::approx::local_4d::tests::canonical_uv_signed_multiloop_carriers_preserve_factorized_numerators
  1663. 55.73 s > stdout ---
  1664. 55.73 s >
  1665. 55.73 s > running 1 test
  1666. 55.73 s > test uv::approx::local_4d::tests::canonical_uv_signed_multiloop_carriers_preserve_factorized_numerators ... FAILED
  1667. 55.73 s >
  1668. 55.73 s > failures:
  1669. 55.73 s >
  1670. 55.73 s > failures:
  1671. 55.73 s > uv::approx::local_4d::tests::canonical_uv_signed_multiloop_carriers_preserve_factorized_numerators
  1672. 55.73 s >
  1673. 55.73 s > test result: FAILED. 0 passed; 1 failed; 0 ignored; 0 measured; 742 filtered out; finished in 0.08s
  1674. 55.73 s >
  1675. 55.73 s > stderr ---
  1676. 55.73 s > The application panicked (crashed).
  1677. 55.73 s > Message: assertion `left == right` failed
  1678. 55.73 s > left: 2*(signed_multiloop::a+signed_multiloop::b)^5*gammalooprs::Q(gammalooprs::uv::class(0),spenso::cind(0))
  1679. 55.73 s > right: -2*(signed_multiloop::a+signed_multiloop::b)^5*gammalooprs::Q(gammalooprs::uv::class(0),spenso::cind(0))
  1680. 55.73 s > Location: crates/gammalooprs/src/uv/approx/local_4d.rs:1983
  1681. 55.73 s >
  1682. 55.73 s > ━━━━━━━━━━━━━━━━━━━━━━━━━━━━━━━━━━ BACKTRACE ━━━━━━━━━━━━━━━━━━━━━━━━━━━━━━━━━━━
  1683. 55.73 s > 1: <color_eyre[51793ea62743adbd]::config::PanicHook>::panic_report<unknown>
  1684. 55.73 s > at <unknown source file>:<unknown line>
  1685. 55.73 s > 2: <color_eyre[51793ea62743adbd]::config::PanicHook>::into_panic_hook::{closure#0}<unknown>
  1686. 55.73 s > at <unknown source file>:<unknown line>
  1687. 55.73 s > 3: std[bcb96dfbba0ab899]::panicking::panic_with_hook<unknown>
  1688. 55.73 s > at <unknown source file>:<unknown line>
  1689. 55.73 s > 4: std[bcb96dfbba0ab899]::panicking::panic_handler::{closure#0}<unknown>
  1690. 55.73 s > at <unknown source file>:<unknown line>
  1691. 55.73 s > 5: std[bcb96dfbba0ab899]::sys::backtrace::__rust_end_short_backtrace::<std[bcb96dfbba0ab899]::panicking::panic_handler::{closure#0}, !><unknown>
  1692. 55.73 s > at <unknown source file>:<unknown line>
  1693. 55.73 s > 6: __rustc[6c289b9f9c454d21]::rust_begin_unwind<unknown>
  1694. 55.73 s > at <unknown source file>:<unknown line>
  1695. 55.73 s > 7: core[940e698046960fd5]::panicking::panic_fmt<unknown>
  1696. 55.73 s > at <unknown source file>:<unknown line>
  1697. 55.73 s > 8: core[940e698046960fd5]::panicking::assert_failed_inner<unknown>
  1698. 55.73 s > at <unknown source file>:<unknown line>
  1699. 55.73 s > 9: core[940e698046960fd5]::panicking::assert_failed::<symbolica[499970c26fd75ddd]::atom::Atom, symbolica[499970c26fd75ddd]::atom::Atom><unknown>
  1700. 55.73 s > at <unknown source file>:<unknown line>
  1701. 55.73 s > 10: gammalooprs[24955f93fc9f4e0c]::uv::approx::local_4d::tests::canonical_uv_signed_multiloop_carriers_preserve_factorized_numerators<unknown>
  1702. 55.73 s > at <unknown source file>:<unknown line>
  1703. 55.73 s > 11: <gammalooprs[24955f93fc9f4e0c]::uv::approx::local_4d::tests::canonical_uv_signed_multiloop_carriers_preserve_factorized_numerators::{closure#0} as core[940e698046960fd5]::ops::function::FnOnce<()>>::call_once<unknown>
  1704. 55.73 s > at <unknown source file>:<unknown line>
  1705. 55.73 s > 12: test[75d6903177b1d7e9]::__rust_begin_short_backtrace::<core[940e698046960fd5]::result::Result<(), alloc[2ea6bcb46fca0c42]::string::String>, fn() -> core[940e698046960fd5]::result::Result<(), alloc[2ea6bcb46fca0c42]::string::String>><unknown>
  1706. 55.73 s > at <unknown source file>:<unknown line>
  1707. 55.73 s > 13: test[75d6903177b1d7e9]::run_test::{closure#0}<unknown>
  1708. 55.73 s > at <unknown source file>:<unknown line>
  1709. 55.73 s > 14: std[bcb96dfbba0ab899]::sys::backtrace::__rust_begin_short_backtrace::<test[75d6903177b1d7e9]::run_test::{closure#1}, ()><unknown>
  1710. 55.73 s > at <unknown source file>:<unknown line>
  1711. 55.73 s > 15: <std[bcb96dfbba0ab899]::thread::lifecycle::spawn_unchecked<test[75d6903177b1d7e9]::run_test::{closure#1}, ()>::{closure#1} as core[940e698046960fd5]::ops::function::FnOnce<()>>::call_once::{shim:vtable#0}<unknown>
  1712. 55.73 s > at <unknown source file>:<unknown line>
  1713. 55.73 s > 16: <std[bcb96dfbba0ab899]::sys::thread::unix::Thread>::new::thread_start<unknown>
  1714. 55.73 s > at <unknown source file>:<unknown line>
  1715. 55.73 s > 17: start_thread<unknown>
  1716. 55.73 s > at <unknown source file>:<unknown line>
  1717. 55.73 s > 18: __clone3<unknown>
  1718. 55.73 s > at <unknown source file>:<unknown line>
  1719. 55.73 s >
  1720. 55.73 s > Run with COLORBT_SHOW_HIDDEN=1 environment variable to disable frame filtering.
  1721. 55.73 s > Run with RUST_BACKTRACE=full to include source snippets.
  1722. 55.73 s >
  1723. 55.73 s > FAIL [ 0.112s] (605/692) gammalooprs uv::approx::tests::direct_nested_scalar_banana_replays_complete_cff_at_depth_three
  1724. 55.73 s > stdout ---
  1725. 55.73 s >
  1726. 55.73 s > running 1 test
  1727. 55.73 s > test uv::approx::tests::direct_nested_scalar_banana_replays_complete_cff_at_depth_three ... FAILED
  1728. 55.73 s >
  1729. 55.73 s > failures:
  1730. 55.73 s >
  1731. 55.73 s > failures:
  1732. 55.73 s > uv::approx::tests::direct_nested_scalar_banana_replays_complete_cff_at_depth_three
  1733. 55.73 s >
  1734. 55.73 s > test result: FAILED. 0 passed; 1 failed; 0 ignored; 0 measured; 742 filtered out; finished in 0.10s
  1735. 55.73 s >
  1736. 55.73 s > stderr ---
  1737. 55.73 s > Error:
  1738. 55.73 s > 0: canonical UV numerator does not reproduce its source in the component frame
  1739. 55.73 s >
  1740. 55.73 s > Location:
  1741. 55.73 s > crates/gammalooprs/src/uv/approx/local_4d.rs:354
  1742. 55.73 s >
  1743. 55.73 s > ━━━━━━━━━━━━━━━━━━━━━━━━━━━━━━━━━━ BACKTRACE ━━━━━━━━━━━━━━━━━━━━━━━━━━━━━━━━━━━
  1744. 55.73 s > 1: <color_eyre[51793ea62743adbd]::config::EyreHook>::into_eyre_hook::{closure#0}<unknown>
  1745. 55.73 s > at <unknown source file>:<unknown line>
  1746. 55.73 s > 2: eyre[cb2fd339c0c40fca]::capture_handler<unknown>
  1747. 55.73 s > at <unknown source file>:<unknown line>
  1748. 55.73 s > 3: eyre[cb2fd339c0c40fca]::private::format_err<unknown>
  1749. 55.73 s > at <unknown source file>:<unknown line>
  1750. 55.73 s > 4: <gammalooprs[24955f93fc9f4e0c]::uv::approx::local_4d::FourDSector>::canonical_projection<unknown>
  1751. 55.73 s > at <unknown source file>:<unknown line>
  1752. 55.73 s > 5: <gammalooprs[24955f93fc9f4e0c]::uv::approx::projected_4d::Projected4dApproximation>::project_local_4d<unknown>
  1753. 55.73 s > at <unknown source file>:<unknown line>
  1754. 55.73 s > 6: <gammalooprs[24955f93fc9f4e0c]::uv::approx::Approximation>::compute_3d<unknown>
  1755. 55.73 s > at <unknown source file>:<unknown line>
  1756. 55.73 s > 7: gammalooprs[24955f93fc9f4e0c]::uv::approx::tests::direct_nested_scalar_banana_replays_complete_cff_at_depth_three::{closure#0}<unknown>
  1757. 55.73 s > at <unknown source file>:<unknown line>
  1758. 55.73 s > 8: gammalooprs[24955f93fc9f4e0c]::uv::approx::tests::direct_nested_scalar_banana_replays_complete_cff_at_depth_three<unknown>
  1759. 55.73 s > at <unknown source file>:<unknown line>
  1760. 55.73 s > 9: <gammalooprs[24955f93fc9f4e0c]::uv::approx::tests::direct_nested_scalar_banana_replays_complete_cff_at_depth_three::{closure#0} as core[940e698046960fd5]::ops::function::FnOnce<()>>::call_once<unknown>
  1761. 55.73 s > at <unknown source file>:<unknown line>
  1762. 55.73 s > 10: test[75d6903177b1d7e9]::__rust_begin_short_backtrace::<core[940e698046960fd5]::result::Result<(), alloc[2ea6bcb46fca0c42]::string::String>, fn() -> core[940e698046960fd5]::result::Result<(), alloc[2ea6bcb46fca0c42]::string::String>><unknown>
  1763. 55.73 s > at <unknown source file>:<unknown line>
  1764. 55.73 s > 11: test[75d6903177b1d7e9]::run_test::{closure#0}<unknown>
  1765. 55.73 s > at <unknown source file>:<unknown line>
  1766. 55.73 s > 12: std[bcb96dfbba0ab899]::sys::backtrace::__rust_begin_short_backtrace::<test[75d6903177b1d7e9]::run_test::{closure#1}, ()><unknown>
  1767. 55.73 s > at <unknown source file>:<unknown line>
  1768. 55.73 s > 13: <std[bcb96dfbba0ab899]::thread::lifecycle::spawn_unchecked<test[75d6903177b1d7e9]::run_test::{closure#1}, ()>::{closure#1} as core[940e698046960fd5]::ops::function::FnOnce<()>>::call_once::{shim:vtable#0}<unknown>
  1769. 55.73 s > at <unknown source file>:<unknown line>
  1770. 55.73 s > 14: <std[bcb96dfbba0ab899]::sys::thread::unix::Thread>::new::thread_start<unknown>
  1771. 55.73 s > at <unknown source file>:<unknown line>
  1772. 55.73 s > 15: start_thread<unknown>
  1773. 55.73 s > at <unknown source file>:<unknown line>
  1774. 55.73 s > 16: __clone3<unknown>
  1775. 55.73 s > at <unknown source file>:<unknown line>
  1776. 55.73 s >
  1777. 55.73 s > Run with COLORBT_SHOW_HIDDEN=1 environment variable to disable frame filtering.
  1778. 55.73 s > Run with RUST_BACKTRACE=full to include source snippets.
  1779. 55.73 s >
  1780. 55.73 s > error: test run failed
  1781. 55.73 s >
  1782. 55.73 s > ========== nextest test summary ==========
  1783. 55.73 s > report: target/nextest/ci_gammaloop/junit.xml
  1784. 55.73 s > tests: 692, failures: 6, errors: 0
  1785. 55.73 s >
  1786. 55.73 s > 1. gammalooprs::graph::three_d_source::tests::exact_taylor_vacuum_affine_circulation_preserves_energy_mapping
  1787. 55.73 s > failure: test failure with exit code 101
  1788. 55.73 s > system-out
  1789. 55.73 s > running 1 test
  1790. 55.73 s > test graph::three_d_source::tests::exact_taylor_vacuum_affine_circulation_preserves_energy_mapping ... FAILED
  1791. 55.73 s >
  1792. 55.73 s > failures:
  1793. 55.73 s >
  1794. 55.73 s > failures:
  1795. 55.73 s > graph::three_d_source::tests::exact_taylor_vacuum_affine_circulation_preserves_energy_mapping
  1796. 55.73 s >
  1797. 55.73 s > test result: FAILED. 0 passed; 1 failed; 0 ignored; 0 measured; 742 filtered out; finished in 0.10s
  1798. 55.73 s > system-err
  1799. 55.73 s > The application panicked (crashed).
  1800. 55.73 s > Message: assertion `left == right` failed
  1801. 55.73 s > left: (gammalooprs::mUVexp^2+(-gammalooprs::Q(1,spenso::cind(1))+gammalooprs::Q(4,spenso::cind(1)))^2+(-gammalooprs::Q(1,spenso::cind(2))+gammalooprs::Q(4,spenso::cind(2)))^2+(-gammalooprs::Q(1,spenso::cind(3))+gammalooprs::Q(4,spenso::cind(3)))^2)^(1/2)
  1802. 55.73 s > right: (gammalooprs::mUVexp^2+(gammalooprs::Q(1,spenso::cind(1))-gammalooprs::Q(4,spenso::cind(1)))^2+(gammalooprs::Q(1,spenso::cind(2))-gammalooprs::Q(4,spenso::cind(2)))^2+(gammalooprs::Q(1,spenso::cind(3))-gammalooprs::Q(4,spenso::cind(3)))^2)^(1/2)
  1803. 55.73 s > Location: crates/gammalooprs/src/graph/three_d_source.rs:7797
  1804. 55.73 s >
  1805. 55.73 s > ━━━━━━━━━━━━━━━━━━━━━━━━━━━━━━━━━━ BACKTRACE ━━━━━━━━━━━━━━━━━━━━━━━━━━━━━━━━━━━
  1806. 55.73 s > 1: <color_eyre[51793ea62743adbd]::config::PanicHook>::panic_report<unknown>
  1807. 55.73 s > at <unknown source file>:<unknown line>
  1808. 55.73 s > 2: <color_eyre[51793ea62743adbd]::config::PanicHook>::into_panic_hook::{closure#0}<unknown>
  1809. 55.73 s > at <unknown source file>:<unknown line>
  1810. 55.73 s > 3: std[bcb96dfbba0ab899]::panicking::panic_with_hook<unknown>
  1811. 55.73 s > at <unknown source file>:<unknown line>
  1812. 55.73 s > 4: std[bcb96dfbba0ab899]::panicking::panic_handler::{closure#0}<unknown>
  1813. 55.73 s > at <unknown source file>:<unknown line>
  1814. 55.73 s > 5: std[bcb96dfbba0ab899]::sys::backtrace::__rust_end_short_backtrace::<std[bcb96dfbba0ab899]::panicking::panic_handler::{closure#0}, !><unknown>
  1815. 55.73 s > at <unknown source file>:<unknown line>
  1816. 55.73 s > 6: __rustc[6c289b9f9c454d21]::rust_begin_unwind<unknown>
  1817. 55.73 s > at <unknown source file>:<unknown line>
  1818. 55.73 s > 7: core[940e698046960fd5]::panicking::panic_fmt<unknown>
  1819. 55.73 s > at <unknown source file>:<unknown line>
  1820. 55.73 s > 8: core[940e698046960fd5]::panicking::assert_failed_inner<unknown>
  1821. 55.73 s > at <unknown source file>:<unknown line>
  1822. 55.73 s > 9: core[940e698046960fd5]::panicking::assert_failed::<symbolica[499970c26fd75ddd]::atom::Atom, symbolica[499970c26fd75ddd]::atom::Atom><unknown>
  1823. 55.73 s > at <unknown source file>:<unknown line>
  1824. 55.73 s > 10: gammalooprs[24955f93fc9f4e0c]::graph::three_d_source::tests::exact_taylor_vacuum_affine_circulation_preserves_energy_mapping<unknown>
  1825. 55.73 s > at <unknown source file>:<unknown line>
  1826. 55.73 s > 11: <gammalooprs[24955f93fc9f4e0c]::graph::three_d_source::tests::exact_taylor_vacuum_affine_circulation_preserves_energy_mapping::{closure#0} as core[940e698046960fd5]::ops::function::FnOnce<()>>::call_once<unknown>
  1827. 55.73 s > at <unknown source file>:<unknown line>
  1828. 55.73 s > 12: test[75d6903177b1d7e9]::__rust_begin_short_backtrace::<core[940e698046960fd5]::result::Result<(), alloc[2ea6bcb46fca0c42]::string::String>, fn() -> core[940e698046960fd5]::result::Result<(), alloc[2ea6bcb46fca0c42]::string::String>><unknown>
  1829. 55.73 s > at <unknown source file>:<unknown line>
  1830. 55.73 s > 13: test[75d6903177b1d7e9]::run_test::{closure#0}<unknown>
  1831. 55.73 s > at <unknown source file>:<unknown line>
  1832. 55.73 s > 14: std[bcb96dfbba0ab899]::sys::backtrace::__rust_begin_short_backtrace::<test[75d6903177b1d7e9]::run_test::{closure#1}, ()><unknown>
  1833. 55.73 s > at <unknown source file>:<unknown line>
  1834. 55.73 s > 15: <std[bcb96dfbba0ab899]::thread::lifecycle::spawn_unchecked<test[75d6903177b1d7e9]::run_test::{closure#1}, ()>::{closure#1} as core[940e698046960fd5]::ops::function::FnOnce<()>>::call_once::{shim:vtable#0}<unknown>
  1835. 55.73 s > at <unknown source file>:<unknown line>
  1836. 55.73 s > 16: <std[bcb96dfbba0ab899]::sys::thread::unix::Thread>::new::thread_start<unknown>
  1837. 55.73 s > at <unknown source file>:<unknown line>
  1838. 55.73 s > 17: start_thread<unknown>
  1839. 55.73 s > at <unknown source file>:<unknown line>
  1840. 55.73 s > 18: __clone3<unknown>
  1841. 55.73 s > at <unknown source file>:<unknown line>
  1842. 55.73 s >
  1843. 55.73 s > Run with COLORBT_SHOW_HIDDEN=1 environment variable to disable frame filtering.
  1844. 55.73 s > Run with RUST_BACKTRACE=full to include source snippets.
  1845. 55.73 s >
  1846. 55.73 s > 2. gammalooprs::graph::three_d_source::tests::pinched_affine_carrier_requires_occurrence_interpolation
  1847. 55.73 s > failure: test failure with exit code 101
  1848. 55.73 s > system-out
  1849. 55.73 s > running 1 test
  1850. 55.73 s > test graph::three_d_source::tests::pinched_affine_carrier_requires_occurrence_interpolation ... FAILED
  1851. 55.73 s >
  1852. 55.73 s > failures:
  1853. 55.73 s >
  1854. 55.73 s > failures:
  1855. 55.73 s > graph::three_d_source::tests::pinched_affine_carrier_requires_occurrence_interpolation
  1856. 55.73 s >
  1857. 55.73 s > test result: FAILED. 0 passed; 1 failed; 0 ignored; 0 measured; 742 filtered out; finished in 0.11s
  1858. 55.73 s > system-err
  1859. 55.73 s > The application panicked (crashed).
  1860. 55.73 s > Message: certified affine occurrence lift must reproduce the independent double contours: actual=-(-1/16*(3+E0)*(5+E0)/((1+Q(0,cind(1))^2+Q(0,cind(2))^2+Q(0,cind(3))^2)^(3/2)*(1+Q(1,cind(1))^2+Q(1,cind(2))^2+Q(1,cind(3))^2)^(3/2))-1/16*(3+E1)*(5+E1)/((1+Q(0,cind(1))^2+Q(0,cind(2))^2+Q(0,cind(3))^2)^(3/2)*(1+Q(1,cind(1))^2+Q(1,cind(2))^2+Q(1,cind(3))^2)^(3/2))-1/16*(3-E0)*(5-E0)/((1+Q(0,cind(1))^2+Q(0,cind(2))^2+Q(0,cind(3))^2)^(3/2)*(1+Q(1,cind(1))^2+Q(1,cind(2))^2+Q(1,cind(3))^2)^(3/2))-1/16*(3-E1)*(5-E1)/((1+Q(0,cind(1))^2+Q(0,cind(2))^2+Q(0,cind(3))^2)^(3/2)*(1+Q(1,cind(1))^2+Q(1,cind(2))^2+Q(1,cind(3))^2)^(3/2))+1/64*(3+E0+E1)*(5+E0+E1)/((1+Q(0,cind(1))^2+Q(0,cind(2))^2+Q(0,cind(3))^2)^(3/2)*(1+Q(1,cind(1))^2+Q(1,cind(2))^2+Q(1,cind(3))^2)^(3/2))+1/64*(3+E0-E1)*(5+E0-E1)/((1+Q(0,cind(1))^2+Q(0,cind(2))^2+Q(0,cind(3))^2)^(3/2)*(1+Q(1,cind(1))^2+Q(1,cind(2))^2+Q(1,cind(3))^2)^(3/2))+1/64*(3-E0+E1)*(5-E0+E1)/((1+Q(0,cind(1))^2+Q(0,cind(2))^2+Q(0,cind(3))^2)^(3/2)*(1+Q(1,cind(1))^2+Q(1,cind(2))^2+Q(1,cind(3))^2)^(3/2))+1/64*(3-E0-E1)*(5-E0-E1)/((1+Q(0,cind(1))^2+Q(0,cind(2))^2+Q(0,cind(3))^2)^(3/2)*(1+Q(1,cind(1))^2+Q(1,cind(2))^2+Q(1,cind(3))^2)^(3/2))+15/4/((1+Q(0,cind(1))^2+Q(0,cind(2))^2+Q(0,cind(3))^2)^(3/2)*(1+Q(1,cind(1))^2+Q(1,cind(2))^2+Q(1,cind(3))^2)^(3/2))), expected=1/16*(15-E0^2-E1^2)/(E0^3*E1^3)
  1861. 55.73 s > Location: crates/gammalooprs/src/graph/three_d_source.rs:7619
  1862. 55.73 s >
  1863. 55.73 s > ━━━━━━━━━━━━━━━━━━━━━━━━━━━━━━━━━━ BACKTRACE ━━━━━━━━━━━━━━━━━━━━━━━━━━━━━━━━━━━
  1864. 55.73 s > 1: <color_eyre[51793ea62743adbd]::config::PanicHook>::panic_report<unknown>
  1865. 55.73 s > at <unknown source file>:<unknown line>
  1866. 55.73 s > 2: <color_eyre[51793ea62743adbd]::config::PanicHook>::into_panic_hook::{closure#0}<unknown>
  1867. 55.73 s > at <unknown source file>:<unknown line>
  1868. 55.73 s > 3: std[bcb96dfbba0ab899]::panicking::panic_with_hook<unknown>
  1869. 55.73 s > at <unknown source file>:<unknown line>
  1870. 55.73 s > 4: std[bcb96dfbba0ab899]::panicking::panic_handler::{closure#0}<unknown>
  1871. 55.73 s > at <unknown source file>:<unknown line>
  1872. 55.73 s > 5: std[bcb96dfbba0ab899]::sys::backtrace::__rust_end_short_backtrace::<std[bcb96dfbba0ab899]::panicking::panic_handler::{closure#0}, !><unknown>
  1873. 55.73 s > at <unknown source file>:<unknown line>
  1874. 55.73 s > 6: __rustc[6c289b9f9c454d21]::rust_begin_unwind<unknown>
  1875. 55.73 s > at <unknown source file>:<unknown line>
  1876. 55.73 s > 7: core[940e698046960fd5]::panicking::panic_fmt<unknown>
  1877. 55.73 s > at <unknown source file>:<unknown line>
  1878. 55.73 s > 8: <gammalooprs[24955f93fc9f4e0c]::graph::three_d_source::tests::pinched_affine_carrier_requires_occurrence_interpolation::{closure#0} as core[940e698046960fd5]::ops::function::FnOnce<()>>::call_once<unknown>
  1879. 55.73 s > at <unknown source file>:<unknown line>
  1880. 55.73 s > 9: test[75d6903177b1d7e9]::__rust_begin_short_backtrace::<core[940e698046960fd5]::result::Result<(), alloc[2ea6bcb46fca0c42]::string::String>, fn() -> core[940e698046960fd5]::result::Result<(), alloc[2ea6bcb46fca0c42]::string::String>><unknown>
  1881. 55.73 s > at <unknown source file>:<unknown line>
  1882. 55.73 s > 10: test[75d6903177b1d7e9]::run_test::{closure#0}<unknown>
  1883. 55.73 s > at <unknown source file>:<unknown line>
  1884. 55.73 s > 11: std[bcb96dfbba0ab899]::sys::backtrace::__rust_begin_short_backtrace::<test[75d6903177b1d7e9]::run_test::{closure#1}, ()><unknown>
  1885. 55.73 s > at <unknown source file>:<unknown line>
  1886. 55.73 s > 12: <std[bcb96dfbba0ab899]::thread::lifecycle::spawn_unchecked<test[75d6903177b1d7e9]::run_test::{closure#1}, ()>::{closure#1} as core[940e698046960fd5]::ops::function::FnOnce<()>>::call_once::{shim:vtable#0}<unknown>
  1887. 55.73 s > at <unknown source file>:<unknown line>
  1888. 55.73 s > 13: <std[bcb96dfbba0ab899]::sys::thread::unix::Thread>::new::thread_start<unknown>
  1889. 55.73 s > at <unknown source file>:<unknown line>
  1890. 55.73 s > 14: start_thread<unknown>
  1891. 55.73 s > at <unknown source file>:<unknown line>
  1892. 55.73 s > 15: __clone3<unknown>
  1893. 55.73 s > at <unknown source file>:<unknown line>
  1894. 55.73 s >
  1895. 55.73 s > Run with COLORBT_SHOW_HIDDEN=1 environment variable to disable frame filtering.
  1896. 55.73 s > Run with RUST_BACKTRACE=full to include source snippets.
  1897. 55.73 s >
  1898. 55.73 s > 3. gammalooprs::numerator::energy_degree::tests::canonical_class_cyclic_lifts_preserve_factorization_and_exact_bounds
  1899. 55.73 s > failure: test failure with exit code 101
  1900. 55.73 s > thread 'numerator::energy_degree::tests::canonical_class_cyclic_lifts_preserve_factorization_and_exact_bounds' (2265) panicked at crates/gammalooprs/src/numerator/energy_degree.rs:2850:13:
  1901. 55.73 s > assertion failed: (collapsed - expression).collect_factors().is_zero()
  1902. 55.73 s > stack backtrace:
  1903. 55.73 s > 0: __rustc::rust_begin_unwind
  1904. 55.73 s > 1: core::panicking::panic_fmt
  1905. 55.73 s > 2: core::panicking::panic
  1906. 55.73 s > 3: gammalooprs::numerator::energy_degree::tests::canonical_class_cyclic_lifts_preserve_factorization_and_exact_bounds
  1907. 55.73 s > 4: <gammalooprs::numerator::energy_degree::tests::canonical_class_cyclic_lifts_preserve_factorization_and_exact_bounds::{closure#0} as core::ops::function::FnOnce<()>>::call_once
  1908. 55.73 s > note: Some details are omitted, run with `RUST_BACKTRACE=full` for a verbose backtrace.
  1909. 55.73 s > system-out
  1910. 55.73 s > running 1 test
  1911. 55.73 s > test numerator::energy_degree::tests::canonical_class_cyclic_lifts_preserve_factorization_and_exact_bounds ... FAILED
  1912. 55.73 s >
  1913. 55.73 s > failures:
  1914. 55.73 s >
  1915. 55.73 s > failures:
  1916. 55.73 s > numerator::energy_degree::tests::canonical_class_cyclic_lifts_preserve_factorization_and_exact_bounds
  1917. 55.73 s >
  1918. 55.73 s > test result: FAILED. 0 passed; 1 failed; 0 ignored; 0 measured; 742 filtered out; finished in 0.01s
  1919. 55.73 s > system-err
  1920. 55.73 s > thread 'numerator::energy_degree::tests::canonical_class_cyclic_lifts_preserve_factorization_and_exact_bounds' (2265) panicked at crates/gammalooprs/src/numerator/energy_degree.rs:2850:13:
  1921. 55.73 s > assertion failed: (collapsed - expression).collect_factors().is_zero()
  1922. 55.73 s > stack backtrace:
  1923. 55.73 s > 0: __rustc::rust_begin_unwind
  1924. 55.73 s > 1: core::panicking::panic_fmt
  1925. 55.73 s > 2: core::panicking::panic
  1926. 55.73 s > 3: gammalooprs::numerator::energy_degree::tests::canonical_class_cyclic_lifts_preserve_factorization_and_exact_bounds
  1927. 55.73 s > 4: <gammalooprs::numerator::energy_degree::tests::canonical_class_cyclic_lifts_preserve_factorization_and_exact_bounds::{closure#0} as core::ops::function::FnOnce<()>>::call_once
  1928. 55.73 s > note: Some details are omitted, run with `RUST_BACKTRACE=full` for a verbose backtrace.
  1929. 55.73 s >
  1930. 55.73 s > 4. gammalooprs::uv::approx::local_4d::tests::canonical_uv_classes_certify_signed_aliases_and_preserve_raw_sectors
  1931. 55.73 s > failure: test failure with exit code 101
  1932. 55.73 s > Error:
  1933. 55.73 s > 0: merged canonical UV numerator does not reproduce its source bucket
  1934. 55.73 s >
  1935. 55.73 s > Location:
  1936. 55.73 s > crates/gammalooprs/src/uv/approx/local_4d.rs:367
  1937. 55.73 s >
  1938. 55.73 s > ━━━━━━━━━━━━━━━━━━━━━━━━━━━━━━━━━━ BACKTRACE ━━━━━━━━━━━━━━━━━━━━━━━━━━━━━━━━━━━
  1939. 55.73 s > 1: <color_eyre[51793ea62743adbd]::config::EyreHook>::into_eyre_hook::{closure#0}<unknown>
  1940. 55.73 s > at <unknown source file>:<unknown line>
  1941. 55.73 s > 2: eyre[cb2fd339c0c40fca]::capture_handler<unknown>
  1942. 55.73 s > at <unknown source file>:<unknown line>
  1943. 55.73 s > 3: eyre[cb2fd339c0c40fca]::private::format_err<unknown>
  1944. 55.73 s > at <unknown source file>:<unknown line>
  1945. 55.73 s > 4: <gammalooprs[24955f93fc9f4e0c]::uv::approx::local_4d::FourDSector>::canonical_projection<unknown>
  1946. 55.73 s > at <unknown source file>:<unknown line>
  1947. 55.73 s > 5: gammalooprs[24955f93fc9f4e0c]::uv::approx::local_4d::tests::canonical_uv_classes_certify_signed_aliases_and_preserve_raw_sectors<unknown>
  1948. 55.73 s > at <unknown source file>:<unknown line>
  1949. 55.73 s > 6: <gammalooprs[24955f93fc9f4e0c]::uv::approx::local_4d::tests::canonical_uv_classes_certify_signed_aliases_and_preserve_raw_sectors::{closure#0} as core[940e698046960fd5]::ops::function::FnOnce<()>>::call_once<unknown>
  1950. 55.73 s > at <unknown source file>:<unknown line>
  1951. 55.73 s > 7: test[75d6903177b1d7e9]::__rust_begin_short_backtrace::<core[940e698046960fd5]::result::Result<(), alloc[2ea6bcb46fca0c42]::string::String>, fn() -> core[940e698046960fd5]::result::Result<(), alloc[2ea6bcb46fca0c42]::string::String>><unknown>
  1952. 55.73 s > at <unknown source file>:<unknown line>
  1953. 55.73 s > 8: test[75d6903177b1d7e9]::run_test::{closure#0}<unknown>
  1954. 55.73 s > at <unknown source file>:<unknown line>
  1955. 55.73 s > 9: std[bcb96dfbba0ab899]::sys::backtrace::__rust_begin_short_backtrace::<test[75d6903177b1d7e9]::run_test::{closure#1}, ()><unknown>
  1956. 55.73 s > at <unknown source file>:<unknown line>
  1957. 55.73 s > 10: <std[bcb96dfbba0ab899]::thread::lifecycle::spawn_unchecked<test[75d6903177b1d7e9]::run_test::{closure#1}, ()>::{closure#1} as core[940e698046960fd5]::ops::function::FnOnce<()>>::call_once::{shim:vtable#0}<unknown>
  1958. 55.73 s > at <unknown source file>:<unknown line>
  1959. 55.73 s > 11: <std[bcb96dfbba0ab899]::sys::thread::unix::Thread>::new::thread_start<unknown>
  1960. 55.73 s > at <unknown source file>:<unknown line>
  1961. 55.73 s > 12: start_thread<unknown>
  1962. 55.73 s > at <unknown source file>:<unknown line>
  1963. 55.73 s > 13: __clone3<unknown>
  1964. 55.73 s > at <unknown source file>:<unknown line>
  1965. 55.73 s >
  1966. 55.73 s > Run with COLORBT_SHOW_HIDDEN=1 environment variable to disable frame filtering.
  1967. 55.73 s > Run with RUST_BACKTRACE=full to include source snippets.
  1968. 55.73 s > system-out
  1969. 55.73 s > running 1 test
  1970. 55.73 s > test uv::approx::local_4d::tests::canonical_uv_classes_certify_signed_aliases_and_preserve_raw_sectors ... FAILED
  1971. 55.73 s >
  1972. 55.73 s > failures:
  1973. 55.73 s >
  1974. 55.73 s > failures:
  1975. 55.73 s > uv::approx::local_4d::tests::canonical_uv_classes_certify_signed_aliases_and_preserve_raw_sectors
  1976. 55.73 s >
  1977. 55.73 s > test result: FAILED. 0 passed; 1 failed; 0 ignored; 0 measured; 742 filtered out; finished in 0.07s
  1978. 55.73 s > system-err
  1979. 55.73 s > Error:
  1980. 55.73 s > 0: merged canonical UV numerator does not reproduce its source bucket
  1981. 55.73 s >
  1982. 55.73 s > Location:
  1983. 55.73 s > crates/gammalooprs/src/uv/approx/local_4d.rs:367
  1984. 55.73 s >
  1985. 55.73 s > ━━━━━━━━━━━━━━━━━━━━━━━━━━━━━━━━━━ BACKTRACE ━━━━━━━━━━━━━━━━━━━━━━━━━━━━━━━━━━━
  1986. 55.73 s > 1: <color_eyre[51793ea62743adbd]::config::EyreHook>::into_eyre_hook::{closure#0}<unknown>
  1987. 55.73 s > at <unknown source file>:<unknown line>
  1988. 55.73 s > 2: eyre[cb2fd339c0c40fca]::capture_handler<unknown>
  1989. 55.73 s > at <unknown source file>:<unknown line>
  1990. 55.73 s > 3: eyre[cb2fd339c0c40fca]::private::format_err<unknown>
  1991. 55.73 s > at <unknown source file>:<unknown line>
  1992. 55.73 s > 4: <gammalooprs[24955f93fc9f4e0c]::uv::approx::local_4d::FourDSector>::canonical_projection<unknown>
  1993. 55.73 s > at <unknown source file>:<unknown line>
  1994. 55.73 s > 5: gammalooprs[24955f93fc9f4e0c]::uv::approx::local_4d::tests::canonical_uv_classes_certify_signed_aliases_and_preserve_raw_sectors<unknown>
  1995. 55.73 s > at <unknown source file>:<unknown line>
  1996. 55.73 s > 6: <gammalooprs[24955f93fc9f4e0c]::uv::approx::local_4d::tests::canonical_uv_classes_certify_signed_aliases_and_preserve_raw_sectors::{closure#0} as core[940e698046960fd5]::ops::function::FnOnce<()>>::call_once<unknown>
  1997. 55.73 s > at <unknown source file>:<unknown line>
  1998. 55.73 s > 7: test[75d6903177b1d7e9]::__rust_begin_short_backtrace::<core[940e698046960fd5]::result::Result<(), alloc[2ea6bcb46fca0c42]::string::String>, fn() -> core[940e698046960fd5]::result::Result<(), alloc[2ea6bcb46fca0c42]::string::String>><unknown>
  1999. 55.73 s > at <unknown source file>:<unknown line>
  2000. 55.73 s > 8: test[75d6903177b1d7e9]::run_test::{closure#0}<unknown>
  2001. 55.73 s > at <unknown source file>:<unknown line>
  2002. 55.73 s > 9: std[bcb96dfbba0ab899]::sys::backtrace::__rust_begin_short_backtrace::<test[75d6903177b1d7e9]::run_test::{closure#1}, ()><unknown>
  2003. 55.73 s > at <unknown source file>:<unknown line>
  2004. 55.73 s > 10: <std[bcb96dfbba0ab899]::thread::lifecycle::spawn_unchecked<test[75d6903177b1d7e9]::run_test::{closure#1}, ()>::{closure#1} as core[940e698046960fd5]::ops::function::FnOnce<()>>::call_once::{shim:vtable#0}<unknown>
  2005. 55.73 s > at <unknown source file>:<unknown line>
  2006. 55.73 s > 11: <std[bcb96dfbba0ab899]::sys::thread::unix::Thread>::new::thread_start<unknown>
  2007. 55.73 s > at <unknown source file>:<unknown line>
  2008. 55.73 s > 12: start_thread<unknown>
  2009. 55.73 s > at <unknown source file>:<unknown line>
  2010. 55.73 s > 13: __clone3<unknown>
  2011. 55.73 s > at <unknown source file>:<unknown line>
  2012. 55.73 s >
  2013. 55.73 s > Run with COLORBT_SHOW_HIDDEN=1 environment variable to disable frame filtering.
  2014. 55.73 s > Run with RUST_BACKTRACE=full to include source snippets.
  2015. 55.73 s >
  2016. 55.73 s > 5. gammalooprs::uv::approx::local_4d::tests::canonical_uv_signed_multiloop_carriers_preserve_factorized_numerators
  2017. 55.73 s > failure: test failure with exit code 101
  2018. 55.73 s > system-out
  2019. 55.73 s > running 1 test
  2020. 55.73 s > test uv::approx::local_4d::tests::canonical_uv_signed_multiloop_carriers_preserve_factorized_numerators ... FAILED
  2021. 55.73 s >
  2022. 55.73 s > failures:
  2023. 55.73 s >
  2024. 55.73 s > failures:
  2025. 55.73 s > uv::approx::local_4d::tests::canonical_uv_signed_multiloop_carriers_preserve_factorized_numerators
  2026. 55.73 s >
  2027. 55.73 s > test result: FAILED. 0 passed; 1 failed; 0 ignored; 0 measured; 742 filtered out; finished in 0.08s
  2028. 55.73 s > system-err
  2029. 55.73 s > The application panicked (crashed).
  2030. 55.73 s > Message: assertion `left == right` failed
  2031. 55.73 s > left: 2*(signed_multiloop::a+signed_multiloop::b)^5*gammalooprs::Q(gammalooprs::uv::class(0),spenso::cind(0))
  2032. 55.73 s > right: -2*(signed_multiloop::a+signed_multiloop::b)^5*gammalooprs::Q(gammalooprs::uv::class(0),spenso::cind(0))
  2033. 55.73 s > Location: crates/gammalooprs/src/uv/approx/local_4d.rs:1983
  2034. 55.73 s >
  2035. 55.73 s > ━━━━━━━━━━━━━━━━━━━━━━━━━━━━━━━━━━ BACKTRACE ━━━━━━━━━━━━━━━━━━━━━━━━━━━━━━━━━━━
  2036. 55.73 s > 1: <color_eyre[51793ea62743adbd]::config::PanicHook>::panic_report<unknown>
  2037. 55.73 s > at <unknown source file>:<unknown line>
  2038. 55.73 s > 2: <color_eyre[51793ea62743adbd]::config::PanicHook>::into_panic_hook::{closure#0}<unknown>
  2039. 55.73 s > at <unknown source file>:<unknown line>
  2040. 55.73 s > 3: std[bcb96dfbba0ab899]::panicking::panic_with_hook<unknown>
  2041. 55.73 s > at <unknown source file>:<unknown line>
  2042. 55.73 s > 4: std[bcb96dfbba0ab899]::panicking::panic_handler::{closure#0}<unknown>
  2043. 55.73 s > at <unknown source file>:<unknown line>
  2044. 55.73 s > 5: std[bcb96dfbba0ab899]::sys::backtrace::__rust_end_short_backtrace::<std[bcb96dfbba0ab899]::panicking::panic_handler::{closure#0}, !><unknown>
  2045. 55.73 s > at <unknown source file>:<unknown line>
  2046. 55.73 s > 6: __rustc[6c289b9f9c454d21]::rust_begin_unwind<unknown>
  2047. 55.73 s > at <unknown source file>:<unknown line>
  2048. 55.73 s > 7: core[940e698046960fd5]::panicking::panic_fmt<unknown>
  2049. 55.73 s > at <unknown source file>:<unknown line>
  2050. 55.73 s > 8: core[940e698046960fd5]::panicking::assert_failed_inner<unknown>
  2051. 55.73 s > at <unknown source file>:<unknown line>
  2052. 55.73 s > 9: core[940e698046960fd5]::panicking::assert_failed::<symbolica[499970c26fd75ddd]::atom::Atom, symbolica[499970c26fd75ddd]::atom::Atom><unknown>
  2053. 55.73 s > at <unknown source file>:<unknown line>
  2054. 55.73 s > 10: gammalooprs[24955f93fc9f4e0c]::uv::approx::local_4d::tests::canonical_uv_signed_multiloop_carriers_preserve_factorized_numerators<unknown>
  2055. 55.73 s > at <unknown source file>:<unknown line>
  2056. 55.73 s > 11: <gammalooprs[24955f93fc9f4e0c]::uv::approx::local_4d::tests::canonical_uv_signed_multiloop_carriers_preserve_factorized_numerators::{closure#0} as core[940e698046960fd5]::ops::function::FnOnce<()>>::call_once<unknown>
  2057. 55.73 s > at <unknown source file>:<unknown line>
  2058. 55.73 s > 12: test[75d6903177b1d7e9]::__rust_begin_short_backtrace::<core[940e698046960fd5]::result::Result<(), alloc[2ea6bcb46fca0c42]::string::String>, fn() -> core[940e698046960fd5]::result::Result<(), alloc[2ea6bcb46fca0c42]::string::String>><unknown>
  2059. 55.73 s > at <unknown source file>:<unknown line>
  2060. 55.73 s > 13: test[75d6903177b1d7e9]::run_test::{closure#0}<unknown>
  2061. 55.73 s > at <unknown source file>:<unknown line>
  2062. 55.73 s > 14: std[bcb96dfbba0ab899]::sys::backtrace::__rust_begin_short_backtrace::<test[75d6903177b1d7e9]::run_test::{closure#1}, ()><unknown>
  2063. 55.73 s > at <unknown source file>:<unknown line>
  2064. 55.73 s > 15: <std[bcb96dfbba0ab899]::thread::lifecycle::spawn_unchecked<test[75d6903177b1d7e9]::run_test::{closure#1}, ()>::{closure#1} as core[940e698046960fd5]::ops::function::FnOnce<()>>::call_once::{shim:vtable#0}<unknown>
  2065. 55.73 s > at <unknown source file>:<unknown line>
  2066. 55.73 s > 16: <std[bcb96dfbba0ab899]::sys::thread::unix::Thread>::new::thread_start<unknown>
  2067. 55.73 s > at <unknown source file>:<unknown line>
  2068. 55.73 s > 17: start_thread<unknown>
  2069. 55.73 s > at <unknown source file>:<unknown line>
  2070. 55.73 s > 18: __clone3<unknown>
  2071. 55.73 s > at <unknown source file>:<unknown line>
  2072. 55.73 s >
  2073. 55.73 s > Run with COLORBT_SHOW_HIDDEN=1 environment variable to disable frame filtering.
  2074. 55.73 s > Run with RUST_BACKTRACE=full to include source snippets.
  2075. 55.73 s >
  2076. 55.73 s > 6. gammalooprs::uv::approx::tests::direct_nested_scalar_banana_replays_complete_cff_at_depth_three
  2077. 55.73 s > failure: test failure with exit code 101
  2078. 55.73 s > Error:
  2079. 55.73 s > 0: canonical UV numerator does not reproduce its source in the component frame
  2080. 55.73 s >
  2081. 55.73 s > Location:
  2082. 55.73 s > crates/gammalooprs/src/uv/approx/local_4d.rs:354
  2083. 55.73 s >
  2084. 55.73 s > ━━━━━━━━━━━━━━━━━━━━━━━━━━━━━━━━━━ BACKTRACE ━━━━━━━━━━━━━━━━━━━━━━━━━━━━━━━━━━━
  2085. 55.73 s > 1: <color_eyre[51793ea62743adbd]::config::EyreHook>::into_eyre_hook::{closure#0}<unknown>
  2086. 55.73 s > at <unknown source file>:<unknown line>
  2087. 55.73 s > 2: eyre[cb2fd339c0c40fca]::capture_handler<unknown>
  2088. 55.73 s > at <unknown source file>:<unknown line>
  2089. 55.73 s > 3: eyre[cb2fd339c0c40fca]::private::format_err<unknown>
  2090. 55.73 s > at <unknown source file>:<unknown line>
  2091. 55.73 s > 4: <gammalooprs[24955f93fc9f4e0c]::uv::approx::local_4d::FourDSector>::canonical_projection<unknown>
  2092. 55.73 s > at <unknown source file>:<unknown line>
  2093. 55.73 s > 5: <gammalooprs[24955f93fc9f4e0c]::uv::approx::projected_4d::Projected4dApproximation>::project_local_4d<unknown>
  2094. 55.73 s > at <unknown source file>:<unknown line>
  2095. 55.73 s > 6: <gammalooprs[24955f93fc9f4e0c]::uv::approx::Approximation>::compute_3d<unknown>
  2096. 55.73 s > at <unknown source file>:<unknown line>
  2097. 55.73 s > 7: gammalooprs[24955f93fc9f4e0c]::uv::approx::tests::direct_nested_scalar_banana_replays_complete_cff_at_depth_three::{closure#0}<unknown>
  2098. 55.73 s > at <unknown source file>:<unknown line>
  2099. 55.73 s > 8: gammalooprs[24955f93fc9f4e0c]::uv::approx::tests::direct_nested_scalar_banana_replays_complete_cff_at_depth_three<unknown>
  2100. 55.73 s > at <unknown source file>:<unknown line>
  2101. 55.73 s > 9: <gammalooprs[24955f93fc9f4e0c]::uv::approx::tests::direct_nested_scalar_banana_replays_complete_cff_at_depth_three::{closure#0} as core[940e698046960fd5]::ops::function::FnOnce<()>>::call_once<unknown>
  2102. 55.73 s > at <unknown source file>:<unknown line>
  2103. 55.73 s > 10: test[75d6903177b1d7e9]::__rust_begin_short_backtrace::<core[940e698046960fd5]::result::Result<(), alloc[2ea6bcb46fca0c42]::string::String>, fn() -> core[940e698046960fd5]::result::Result<(), alloc[2ea6bcb46fca0c42]::string::String>><unknown>
  2104. 55.73 s > at <unknown source file>:<unknown line>
  2105. 55.73 s > 11: test[75d6903177b1d7e9]::run_test::{closure#0}<unknown>
  2106. 55.73 s > at <unknown source file>:<unknown line>
  2107. 55.73 s > 12: std[bcb96dfbba0ab899]::sys::backtrace::__rust_begin_short_backtrace::<test[75d6903177b1d7e9]::run_test::{closure#1}, ()><unknown>
  2108. 55.73 s > at <unknown source file>:<unknown line>
  2109. 55.73 s > 13: <std[bcb96dfbba0ab899]::thread::lifecycle::spawn_unchecked<test[75d6903177b1d7e9]::run_test::{closure#1}, ()>::{closure#1} as core[940e698046960fd5]::ops::function::FnOnce<()>>::call_once::{shim:vtable#0}<unknown>
  2110. 55.73 s > at <unknown source file>:<unknown line>
  2111. 55.73 s > 14: <std[bcb96dfbba0ab899]::sys::thread::unix::Thread>::new::thread_start<unknown>
  2112. 55.73 s > at <unknown source file>:<unknown line>
  2113. 55.73 s > 15: start_thread<unknown>
  2114. 55.73 s > at <unknown source file>:<unknown line>
  2115. 55.73 s > 16: __clone3<unknown>
  2116. 55.73 s > at <unknown source file>:<unknown line>
  2117. 55.73 s >
  2118. 55.73 s > Run with COLORBT_SHOW_HIDDEN=1 environment variable to disable frame filtering.
  2119. 55.73 s > Run with RUST_BACKTRACE=full to include source snippets.
  2120. 55.73 s > system-out
  2121. 55.73 s > running 1 test
  2122. 55.73 s > test uv::approx::tests::direct_nested_scalar_banana_replays_complete_cff_at_depth_three ... FAILED
  2123. 55.73 s >
  2124. 55.73 s > failures:
  2125. 55.73 s >
  2126. 55.73 s > failures:
  2127. 55.73 s > uv::approx::tests::direct_nested_scalar_banana_replays_complete_cff_at_depth_three
  2128. 55.73 s >
  2129. 55.73 s > test result: FAILED. 0 passed; 1 failed; 0 ignored; 0 measured; 742 filtered out; finished in 0.10s
  2130. 55.73 s > system-err
  2131. 55.73 s > Error:
  2132. 55.73 s > 0: canonical UV numerator does not reproduce its source in the component frame
  2133. 55.73 s >
  2134. 55.73 s > Location:
  2135. 55.73 s > crates/gammalooprs/src/uv/approx/local_4d.rs:354
  2136. 55.73 s >
  2137. 55.73 s > ━━━━━━━━━━━━━━━━━━━━━━━━━━━━━━━━━━ BACKTRACE ━━━━━━━━━━━━━━━━━━━━━━━━━━━━━━━━━━━
  2138. 55.73 s > 1: <color_eyre[51793ea62743adbd]::config::EyreHook>::into_eyre_hook::{closure#0}<unknown>
  2139. 55.73 s > at <unknown source file>:<unknown line>
  2140. 55.73 s > 2: eyre[cb2fd339c0c40fca]::capture_handler<unknown>
  2141. 55.73 s > at <unknown source file>:<unknown line>
  2142. 55.73 s > 3: eyre[cb2fd339c0c40fca]::private::format_err<unknown>
  2143. 55.73 s > at <unknown source file>:<unknown line>
  2144. 55.73 s > 4: <gammalooprs[24955f93fc9f4e0c]::uv::approx::local_4d::FourDSector>::canonical_projection<unknown>
  2145. 55.73 s > at <unknown source file>:<unknown line>
  2146. 55.73 s > 5: <gammalooprs[24955f93fc9f4e0c]::uv::approx::projected_4d::Projected4dApproximation>::project_local_4d<unknown>
  2147. 55.73 s > at <unknown source file>:<unknown line>
  2148. 55.73 s > 6: <gammalooprs[24955f93fc9f4e0c]::uv::approx::Approximation>::compute_3d<unknown>
  2149. 55.73 s > at <unknown source file>:<unknown line>
  2150. 55.73 s > 7: gammalooprs[24955f93fc9f4e0c]::uv::approx::tests::direct_nested_scalar_banana_replays_complete_cff_at_depth_three::{closure#0}<unknown>
  2151. 55.73 s > at <unknown source file>:<unknown line>
  2152. 55.73 s > 8: gammalooprs[24955f93fc9f4e0c]::uv::approx::tests::direct_nested_scalar_banana_replays_complete_cff_at_depth_three<unknown>
  2153. 55.73 s > at <unknown source file>:<unknown line>
  2154. 55.73 s > 9: <gammalooprs[24955f93fc9f4e0c]::uv::approx::tests::direct_nested_scalar_banana_replays_complete_cff_at_depth_three::{closure#0} as core[940e698046960fd5]::ops::function::FnOnce<()>>::call_once<unknown>
  2155. 55.73 s > at <unknown source file>:<unknown line>
  2156. 55.73 s > 10: test[75d6903177b1d7e9]::__rust_begin_short_backtrace::<core[940e698046960fd5]::result::Result<(), alloc[2ea6bcb46fca0c42]::string::String>, fn() -> core[940e698046960fd5]::result::Result<(), alloc[2ea6bcb46fca0c42]::string::String>><unknown>
  2157. 55.73 s > at <unknown source file>:<unknown line>
  2158. 55.73 s > 11: test[75d6903177b1d7e9]::run_test::{closure#0}<unknown>
  2159. 55.73 s > at <unknown source file>:<unknown line>
  2160. 55.73 s > 12: std[bcb96dfbba0ab899]::sys::backtrace::__rust_begin_short_backtrace::<test[75d6903177b1d7e9]::run_test::{closure#1}, ()><unknown>
  2161. 55.73 s > at <unknown source file>:<unknown line>
  2162. 55.73 s > 13: <std[bcb96dfbba0ab899]::thread::lifecycle::spawn_unchecked<test[75d6903177b1d7e9]::run_test::{closure#1}, ()>::{closure#1} as core[940e698046960fd5]::ops::function::FnOnce<()>>::call_once::{shim:vtable#0}<unknown>
  2163. 55.73 s > at <unknown source file>:<unknown line>
  2164. 55.73 s > 14: <std[bcb96dfbba0ab899]::sys::thread::unix::Thread>::new::thread_start<unknown>
  2165. 55.73 s > at <unknown source file>:<unknown line>
  2166. 55.73 s > 15: start_thread<unknown>
  2167. 55.73 s > at <unknown source file>:<unknown line>
  2168. 55.73 s > 16: __clone3<unknown>
  2169. 55.73 s > at <unknown source file>:<unknown line>
  2170. 55.73 s >
  2171. 55.73 s > Run with COLORBT_SHOW_HIDDEN=1 environment variable to disable frame filtering.
  2172. 55.73 s > Run with RUST_BACKTRACE=full to include source snippets.
  2173. 55.73 s > =========================================
  2174. 55.73 s > Extracting 1 binary, 1 build script output directory, and 1 linked path to /build/nextest-archive-oEVmZd
  2175. 55.73 s > Extracted 7 files to /build/nextest-archive-oEVmZd in 0.09s
  2176. 55.73 s > ------------
  2177. 55.73 s > Nextest run ID 3e787ab3-399d-4410-b34e-cb5136fc8045 with nextest profile: ci_gammaloop
  2178. 55.73 s > Starting 105 tests across 1 binary
  2179. 55.73 s > ------------
  2180. 55.73 s > Summary [ 17.491s] 105 tests run: 105 passed, 0 skipped
  2181. 55.73 s >
  2182. 55.73 s > ========== nextest test summary ==========
  2183. 55.73 s > report: target/nextest/ci_gammaloop/junit.xml
  2184. 55.73 s > tests: 105, failures: 0, errors: 0
  2185. 55.73 s > No failing testcases found.
  2186. 55.73 s > =========================================
  2187. 55.73 s For full logs, run:
  2188. 55.73 s nix log /nix/store/n61r02micjg0snakcv487zfdf4anp50s-gammaloop-nextest-core.drv
  2189. 55.85 s [0 built (1 failed), 0.0Run failed.