test packages.x86_64-linux.nix-ci-check-gammaloop-nextest-core

Reproduce this run
Retry Run
  1. 0.00 s $ /nix/store/9ypz3flqsrl5xl495mm8h645gadjsxi1-coreutils-9.11/bin/timeout --kill-after=15s 7200s /nix/store/23zk8sgzamrbmj1fday15szf7f2279s8-nix-2.34.7/bin/nix --extra-experimental-features nix-command --extra-experimental-features flakes flake clone git+https://github.com/alphal00p/gammaloop --dest /tmp/nix-ci-worker/stable-pwd/repo/
  2. 0.14 s Cloning into '/tmp/nix-ci-worker/stable-pwd/repo'...
  3. 1.73 s remote: Enumerating objects: 86358, done.
  4. 1.95 s remote: Counting objects: 0% (1/8956) remote: Counting objects: 1% (90/8956) remote: Counting objects: 2% (180/8956) remote: Counting objects: 3% (269/8956) remote: Counting objects: 4% (359/8956) remote: Counting objects: 5% (448/8956) remote: Counting objects: 6% (538/8956) remote: Counting objects: 7% (627/8956) remote: Counting objects: 8% (717/8956) remote: Counting objects: 9% (807/8956) remote: Counting objects: 10% (896/8956) remote: Counting objects: 11% (986/8956) remote: Counting objects: 12% (1075/8956) remote: Counting objects: 13% (1165/8956) remote: Counting objects: 14% (1254/8956) remote: Counting objects: 15% (1344/8956) remote: Counting objects: 16% (1433/8956) remote: Counting objects: 17% (1523/8956) remote: Counting objects: 18% (1613/8956) remote: Counting objects: 19% (1702/8956) remote: Counting objects: 20% (1792/8956) remote: Counting objects: 21% (1881/8956) remote: Counting objects: 22% (1971/8956) remote: Counting objects: 23% (2060/8956) remote: Counting objects: 24% (2150/8956) remote: Counting objects: 25% (2239/8956) remote: Counting objects: 26% (2329/8956) remote: Counting objects: 27% (2419/8956) remote: Counting objects: 28% (2508/8956) remote: Counting objects: 29% (2598/8956) remote: Counting objects: 30% (2687/8956) remote: Counting objects: 31% (2777/8956) remote: Counting objects: 32% (2866/8956) remote: Counting objects: 33% (2956/8956) remote: Counting objects: 34% (3046/8956) remote: Counting objects: 35% (3135/8956) remote: Counting objects: 36% (3225/8956) remote: Counting objects: 37% (3314/8956) remote: Counting objects: 38% (3404/8956) remote: Counting objects: 39% (3493/8956) remote: Counting objects: 40% (3583/8956) remote: Counting objects: 41% (3672/8956) remote: Counting objects: 42% (3762/8956) remote: Counting objects: 43% (3852/8956) remote: Counting objects: 44% (3941/8956) remote: Counting objects: 45% (4031/8956) remote: Counting objects: 46% (4120/8956) remote: Counting objects: 47% (4210/8956) remote: Counting objects: 48% (4299/8956) remote: Counting objects: 49% (4389/8956) remote: Counting objects: 50% (4478/8956) remote: Counting objects: 51% (4568/8956) remote: Counting objects: 52% (4658/8956) remote: Counting objects: 53% (4747/8956) remote: Counting objects: 54% (4837/8956) remote: Counting objects: 55% (4926/8956) remote: Counting objects: 56% (5016/8956) remote: Counting objects: 57% (5105/8956) remote: Counting objects: 58% (5195/8956) remote: Counting objects: 59% (5285/8956) remote: Counting objects: 60% (5374/8956) remote: Counting objects: 61% (5464/8956) remote: Counting objects: 62% (5553/8956) remote: Counting objects: 63% (5643/8956) remote: Counting objects: 64% (5732/8956) remote: Counting objects: 65% (5822/8956) remote: Counting objects: 66% (5911/8956) remote: Counting objects: 67% (6001/8956) remote: Counting objects: 68% (6091/8956) remote: Counting objects: 69% (6180/8956) remote: Counting objects: 70% (6270/8956) remote: Counting objects: 71% (6359/8956) remote: Counting objects: 72% (6449/8956) remote: Counting objects: 73% (6538/8956) remote: Counting objects: 74% (6628/8956) remote: Counting objects: 75% (6717/8956) remote: Counting objects: 76% (6807/8956) remote: Counting objects: 77% (6897/8956) remote: Counting objects: 78% (6986/8956) remote: Counting objects: 79% (7076/8956) remote: Counting objects: 80% (7165/8956) remote: Counting objects: 81% (7255/8956) remote: Counting objects: 82% (7344/8956) remote: Counting objects: 83% (7434/8956) remote: Counting objects: 84% (7524/8956) remote: Counting objects: 85% (7613/8956) remote: Counting objects: 86% (7703/8956) remote: Counting objects: 87% (7792/8956) remote: Counting objects: 88% (7882/8956) remote: Counting objects: 89% (7971/8956) remote: Counting objects: 90% (8061/8956) remote: Counting objects: 91% (8150/8956) remote: Counting objects: 92% (8240/8956) remote: Counting objects: 93% (8330/8956) remote: Counting objects: 94% (8419/8956) remote: Counting objects: 95% (8509/8956) remote: Counting objects: 96% (8598/8956) remote: Counting objects: 97% (8688/8956) remote: Counting objects: 98% (8777/8956) remote: Counting objects: 99% (8867/8956) remote: Counting objects: 100% (8956/8956) remote: Counting objects: 100% (8956/8956), done.
  5. 3.89 s remote: Compressing objects: 0% (1/1953) remote: Compressing objects: 1% (20/1953) remote: Compressing objects: 2% (40/1953) remote: Compressing objects: 3% (59/1953) remote: Compressing objects: 4% (79/1953) remote: Compressing objects: 5% (98/1953) remote: Compressing objects: 6% (118/1953) remote: Compressing objects: 7% (137/1953) remote: Compressing objects: 8% (157/1953) remote: Compressing objects: 9% (176/1953) remote: Compressing objects: 10% (196/1953) remote: Compressing objects: 11% (215/1953) remote: Compressing objects: 11% (222/1953) remote: Compressing objects: 12% (235/1953) remote: Compressing objects: 13% (254/1953) remote: Compressing objects: 14% (274/1953) remote: Compressing objects: 15% (293/1953) remote: Compressing objects: 16% (313/1953) remote: Compressing objects: 17% (333/1953) remote: Compressing objects: 18% (352/1953) remote: Compressing objects: 19% (372/1953) remote: Compressing objects: 20% (391/1953) remote: Compressing objects: 21% (411/1953) remote: Compressing objects: 22% (430/1953) remote: Compressing objects: 23% (450/1953) remote: Compressing objects: 24% (469/1953) remote: Compressing objects: 25% (489/1953) remote: Compressing objects: 26% (508/1953) remote: Compressing objects: 27% (528/1953) remote: Compressing objects: 28% (547/1953) remote: Compressing objects: 29% (567/1953) remote: Compressing objects: 29% (573/1953) remote: Compressing objects: 30% (586/1953) remote: Compressing objects: 31% (606/1953) remote: Compressing objects: 32% (625/1953) remote: Compressing objects: 33% (645/1953) remote: Compressing objects: 34% (665/1953) remote: Compressing objects: 35% (684/1953) remote: Compressing objects: 36% (704/1953) remote: Compressing objects: 37% (723/1953) remote: Compressing objects: 38% (743/1953) remote: Compressing objects: 39% (762/1953) remote: Compressing objects: 40% (782/1953) remote: Compressing objects: 41% (801/1953) remote: Compressing objects: 42% (821/1953) remote: Compressing objects: 43% (840/1953) remote: Compressing objects: 44% (860/1953) remote: Compressing objects: 45% (879/1953) remote: Compressing objects: 46% (899/1953) remote: Compressing objects: 47% (918/1953) remote: Compressing objects: 48% (938/1953) remote: Compressing objects: 49% (957/1953) remote: Compressing objects: 50% (977/1953) remote: Compressing objects: 51% (997/1953) remote: Compressing objects: 52% (1016/1953) remote: Compressing objects: 53% (1036/1953) remote: Compressing objects: 54% (1055/1953) remote: Compressing objects: 55% (1075/1953) remote: Compressing objects: 56% (1094/1953) remote: Compressing objects: 57% (1114/1953) remote: Compressing objects: 58% (1133/1953) remote: Compressing objects: 59% (1153/1953) remote: Compressing objects: 60% (1172/1953) remote: Compressing objects: 61% (1192/1953) remote: Compressing objects: 62% (1211/1953) remote: Compressing objects: 63% (1231/1953) remote: Compressing objects: 64% (1250/1953) remote: Compressing objects: 65% (1270/1953) remote: Compressing objects: 66% (1289/1953) remote: Compressing objects: 67% (1309/1953) remote: Compressing objects: 68% (1329/1953) remote: Compressing objects: 69% (1348/1953) remote: Compressing objects: 70% (1368/1953) remote: Compressing objects: 71% (1387/1953) remote: Compressing objects: 72% (1407/1953) remote: Compressing objects: 73% (1426/1953) remote: Compressing objects: 74% (1446/1953) remote: Compressing objects: 75% (1465/1953) remote: Compressing objects: 76% (1485/1953) remote: Compressing objects: 77% (1504/1953) remote: Compressing objects: 78% (1524/1953) remote: Compressing objects: 79% (1543/1953) remote: Compressing objects: 80% (1563/1953) remote: Compressing objects: 81% (1582/1953) remote: Compressing objects: 82% (1602/1953) remote: Compressing objects: 83% (1621/1953) remote: Compressing objects: 84% (1641/1953) remote: Compressing objects: 85% (1661/1953) remote: Compressing objects: 86% (1680/1953) remote: Compressing objects: 87% (1700/1953) remote: Compressing objects: 88% (1719/1953) remote: Compressing objects: 89% (1739/1953) remote: Compressing objects: 90% (1758/1953) remote: Compressing objects: 91% (1778/1953) remote: Compressing objects: 92% (1797/1953) remote: Compressing objects: 93% (1817/1953) remote: Compressing objects: 94% (1836/1953) remote: Compressing objects: 95% (1856/1953) remote: Compressing objects: 96% (1875/1953) remote: Compressing objects: 97% (1895/1953) remote: Compressing objects: 98% (1914/1953) remote: Compressing objects: 99% (1934/1953) remote: Compressing objects: 100% (1953/1953) remote: Compressing objects: 100% (1953/1953), done.
  6. 9.70 s Receiving objects: 0% (1/86358) Receiving objects: 1% (864/86358) Receiving objects: 2% (1728/86358) Receiving objects: 3% (2591/86358) Receiving objects: 4% (3455/86358) Receiving objects: 5% (4318/86358) Receiving objects: 6% (5182/86358), 9.07 MiB | 18.13 MiB/s Receiving objects: 7% (6046/86358), 9.07 MiB | 18.13 MiB/s Receiving objects: 8% (6909/86358), 9.07 MiB | 18.13 MiB/s Receiving objects: 9% (7773/86358), 9.07 MiB | 18.13 MiB/s Receiving objects: 10% (8636/86358), 9.07 MiB | 18.13 MiB/s Receiving objects: 10% (8887/86358), 9.07 MiB | 18.13 MiB/s Receiving objects: 11% (9500/86358), 18.40 MiB | 18.41 MiB/s Receiving objects: 12% (10363/86358), 18.40 MiB | 18.41 MiB/s Receiving objects: 13% (11227/86358), 18.40 MiB | 18.41 MiB/s Receiving objects: 14% (12091/86358), 18.40 MiB | 18.41 MiB/s Receiving objects: 15% (12954/86358), 18.40 MiB | 18.41 MiB/s Receiving objects: 16% (13818/86358), 18.40 MiB | 18.41 MiB/s Receiving objects: 17% (14681/86358), 18.40 MiB | 18.41 MiB/s Receiving objects: 18% (15545/86358), 18.40 MiB | 18.41 MiB/s Receiving objects: 19% (16409/86358), 18.40 MiB | 18.41 MiB/s Receiving objects: 20% (17272/86358), 18.40 MiB | 18.41 MiB/s Receiving objects: 21% (18136/86358), 18.40 MiB | 18.41 MiB/s Receiving objects: 22% (18999/86358), 18.40 MiB | 18.41 MiB/s Receiving objects: 23% (19863/86358), 18.40 MiB | 18.41 MiB/s Receiving objects: 24% (20726/86358), 18.40 MiB | 18.41 MiB/s Receiving objects: 25% (21590/86358), 18.40 MiB | 18.41 MiB/s Receiving objects: 26% (22454/86358), 18.40 MiB | 18.41 MiB/s Receiving objects: 27% (23317/86358), 18.40 MiB | 18.41 MiB/s Receiving objects: 28% (24181/86358), 18.40 MiB | 18.41 MiB/s Receiving objects: 29% (25044/86358), 18.40 MiB | 18.41 MiB/s Receiving objects: 30% (25908/86358), 18.40 MiB | 18.41 MiB/s Receiving objects: 31% (26771/86358), 18.40 MiB | 18.41 MiB/s Receiving objects: 32% (27635/86358), 18.40 MiB | 18.41 MiB/s Receiving objects: 33% (28499/86358), 18.40 MiB | 18.41 MiB/s Receiving objects: 34% (29362/86358), 18.40 MiB | 18.41 MiB/s Receiving objects: 35% (30226/86358), 18.40 MiB | 18.41 MiB/s Receiving objects: 36% (31089/86358), 18.40 MiB | 18.41 MiB/s Receiving objects: 37% (31953/86358), 18.40 MiB | 18.41 MiB/s Receiving objects: 38% (32817/86358), 30.03 MiB | 20.03 MiB/s Receiving objects: 39% (33680/86358), 30.03 MiB | 20.03 MiB/s Receiving objects: 40% (34544/86358), 30.03 MiB | 20.03 MiB/s Receiving objects: 41% (35407/86358), 30.03 MiB | 20.03 MiB/s Receiving objects: 42% (36271/86358), 30.03 MiB | 20.03 MiB/s Receiving objects: 43% (37134/86358), 30.03 MiB | 20.03 MiB/s Receiving objects: 44% (37998/86358), 30.03 MiB | 20.03 MiB/s Receiving objects: 45% (38862/86358), 30.03 MiB | 20.03 MiB/s Receiving objects: 45% (39454/86358), 30.03 MiB | 20.03 MiB/s Receiving objects: 46% (39725/86358), 45.17 MiB | 22.59 MiB/s Receiving objects: 47% (40589/86358), 45.17 MiB | 22.59 MiB/s Receiving objects: 48% (41452/86358), 45.17 MiB | 22.59 MiB/s Receiving objects: 49% (42316/86358), 45.17 MiB | 22.59 MiB/s Receiving objects: 50% (43179/86358), 45.17 MiB | 22.59 MiB/s Receiving objects: 51% (44043/86358), 45.17 MiB | 22.59 MiB/s Receiving objects: 52% (44907/86358), 45.17 MiB | 22.59 MiB/s Receiving objects: 53% (45770/86358), 45.17 MiB | 22.59 MiB/s Receiving objects: 54% (46634/86358), 45.17 MiB | 22.59 MiB/s Receiving objects: 55% (47497/86358), 45.17 MiB | 22.59 MiB/s Receiving objects: 56% (48361/86358), 45.17 MiB | 22.59 MiB/s Receiving objects: 57% (49225/86358), 62.95 MiB | 25.17 MiB/s Receiving objects: 58% (50088/86358), 62.95 MiB | 25.17 MiB/s Receiving objects: 59% (50952/86358), 62.95 MiB | 25.17 MiB/s Receiving objects: 60% (51815/86358), 62.95 MiB | 25.17 MiB/s Receiving objects: 61% (52679/86358), 62.95 MiB | 25.17 MiB/s Receiving objects: 61% (52845/86358), 62.95 MiB | 25.17 MiB/s Receiving objects: 62% (53542/86358), 76.25 MiB | 25.41 MiB/s Receiving objects: 63% (54406/86358), 76.25 MiB | 25.41 MiB/s Receiving objects: 64% (55270/86358), 76.25 MiB | 25.41 MiB/s Receiving objects: 65% (56133/86358), 76.25 MiB | 25.41 MiB/s Receiving objects: 66% (56997/86358), 76.25 MiB | 25.41 MiB/s Receiving objects: 67% (57860/86358), 95.04 MiB | 27.14 MiB/s Receiving objects: 67% (58040/86358), 105.59 MiB | 26.38 MiB/s Receiving objects: 68% (58724/86358), 105.59 MiB | 26.38 MiB/s Receiving objects: 69% (59588/86358), 105.59 MiB | 26.38 MiB/s Receiving objects: 70% (60451/86358), 105.59 MiB | 26.38 MiB/s Receiving objects: 71% (61315/86358), 105.59 MiB | 26.38 MiB/s Receiving objects: 72% (62178/86358), 105.59 MiB | 26.38 MiB/s Receiving objects: 73% (63042/86358), 105.59 MiB | 26.38 MiB/s Receiving objects: 74% (63905/86358), 119.89 MiB | 26.62 MiB/s Receiving objects: 75% (64769/86358), 119.89 MiB | 26.62 MiB/s Receiving objects: 76% (65633/86358), 119.89 MiB | 26.62 MiB/s Receiving objects: 77% (66496/86358), 119.89 MiB | 26.62 MiB/s Receiving objects: 78% (67360/86358), 119.89 MiB | 26.62 MiB/s Receiving objects: 79% (68223/86358), 119.89 MiB | 26.62 MiB/s Receiving objects: 80% (69087/86358), 119.89 MiB | 26.62 MiB/s Receiving objects: 81% (69950/86358), 119.89 MiB | 26.62 MiB/s Receiving objects: 81% (70546/86358), 119.89 MiB | 26.62 MiB/s Receiving objects: 82% (70814/86358), 119.89 MiB | 26.62 MiB/s Receiving objects: 83% (71678/86358), 136.44 MiB | 28.29 MiB/s Receiving objects: 84% (72541/86358), 136.44 MiB | 28.29 MiB/s Receiving objects: 85% (73405/86358), 136.44 MiB | 28.29 MiB/s Receiving objects: 86% (74268/86358), 136.44 MiB | 28.29 MiB/s Receiving objects: 87% (75132/86358), 136.44 MiB | 28.29 MiB/s Receiving objects: 88% (75996/86358), 136.44 MiB | 28.29 MiB/s Receiving objects: 89% (76859/86358), 136.44 MiB | 28.29 MiB/s Receiving objects: 90% (77723/86358), 136.44 MiB | 28.29 MiB/s Receiving objects: 91% (78586/86358), 136.44 MiB | 28.29 MiB/s Receiving objects: 92% (79450/86358), 136.44 MiB | 28.29 MiB/s Receiving objects: 93% (80313/86358), 136.44 MiB | 28.29 MiB/s Receiving objects: 94% (81177/86358), 136.44 MiB | 28.29 MiB/s Receiving objects: 95% (82041/86358), 150.78 MiB | 29.39 MiB/s Receiving objects: 96% (82904/86358), 150.78 MiB | 29.39 MiB/s Receiving objects: 97% (83768/86358), 150.78 MiB | 29.39 MiB/s Receiving objects: 98% (84631/86358), 150.78 MiB | 29.39 MiB/s Receiving objects: 99% (85495/86358), 150.78 MiB | 29.39 MiB/s remote: Total 86358 (delta 7750), reused 7132 (delta 6997), pack-reused 77402 (from 3)
  7. 9.73 s Receiving objects: 100% (86358/86358), 150.78 MiB | 29.39 MiB/s Receiving objects: 100% (86358/86358), 156.62 MiB | 26.84 MiB/s, done.
  8. 13.65 s Resolving deltas: 0% (0/58615) Resolving deltas: 1% (587/58615) Resolving deltas: 2% (1173/58615) Resolving deltas: 3% (1759/58615) Resolving deltas: 4% (2345/58615) Resolving deltas: 5% (2931/58615) Resolving deltas: 6% (3517/58615) Resolving deltas: 7% (4104/58615) Resolving deltas: 8% (4690/58615) Resolving deltas: 9% (5276/58615) Resolving deltas: 10% (5862/58615) Resolving deltas: 11% (6448/58615) Resolving deltas: 12% (7034/58615) Resolving deltas: 13% (7620/58615) Resolving deltas: 14% (8207/58615) Resolving deltas: 15% (8793/58615) Resolving deltas: 16% (9379/58615) Resolving deltas: 17% (9965/58615) Resolving deltas: 18% (10551/58615) Resolving deltas: 19% (11137/58615) Resolving deltas: 20% (11723/58615) Resolving deltas: 21% (12310/58615) Resolving deltas: 22% (12896/58615) Resolving deltas: 23% (13482/58615) Resolving deltas: 24% (14068/58615) Resolving deltas: 25% (14654/58615) Resolving deltas: 26% (15240/58615) Resolving deltas: 27% (15827/58615) Resolving deltas: 28% (16413/58615) Resolving deltas: 29% (16999/58615) Resolving deltas: 30% (17585/58615) Resolving deltas: 31% (18171/58615) Resolving deltas: 32% (18757/58615) Resolving deltas: 33% (19343/58615) Resolving deltas: 34% (19930/58615) Resolving deltas: 35% (20516/58615) Resolving deltas: 35% (20773/58615) Resolving deltas: 36% (21102/58615) Resolving deltas: 37% (21688/58615) Resolving deltas: 38% (22274/58615) Resolving deltas: 39% (22860/58615) Resolving deltas: 40% (23446/58615) Resolving deltas: 41% (24033/58615) Resolving deltas: 42% (24619/58615) Resolving deltas: 43% (25205/58615) Resolving deltas: 44% (25791/58615) Resolving deltas: 45% (26377/58615) Resolving deltas: 46% (26963/58615) Resolving deltas: 47% (27550/58615) Resolving deltas: 48% (28136/58615) Resolving deltas: 49% (28722/58615) Resolving deltas: 50% (29308/58615) Resolving deltas: 51% (29894/58615) Resolving deltas: 52% (30480/58615) Resolving deltas: 53% (31066/58615) Resolving deltas: 54% (31653/58615) Resolving deltas: 55% (32239/58615) Resolving deltas: 56% (32825/58615) Resolving deltas: 57% (33411/58615) Resolving deltas: 57% (33743/58615) Resolving deltas: 58% (33997/58615) Resolving deltas: 59% (34583/58615) Resolving deltas: 60% (35169/58615) Resolving deltas: 61% (35756/58615) Resolving deltas: 62% (36342/58615) Resolving deltas: 63% (36928/58615) Resolving deltas: 64% (37514/58615) Resolving deltas: 65% (38100/58615) Resolving deltas: 66% (38686/58615) Resolving deltas: 67% (39273/58615) Resolving deltas: 68% (39859/58615) Resolving deltas: 69% (40445/58615) Resolving deltas: 70% (41031/58615) Resolving deltas: 71% (41617/58615) Resolving deltas: 72% (42203/58615) Resolving deltas: 73% (42789/58615) Resolving deltas: 74% (43376/58615) Resolving deltas: 75% (43962/58615) Resolving deltas: 76% (44548/58615) Resolving deltas: 77% (45134/58615) Resolving deltas: 78% (45720/58615) Resolving deltas: 78% (45807/58615) Resolving deltas: 79% (46306/58615) Resolving deltas: 80% (46892/58615) Resolving deltas: 81% (47479/58615) Resolving deltas: 82% (48065/58615) Resolving deltas: 83% (48651/58615) Resolving deltas: 84% (49237/58615) Resolving deltas: 85% (49823/58615) Resolving deltas: 86% (50409/58615) Resolving deltas: 87% (50996/58615) Resolving deltas: 88% (51582/58615) Resolving deltas: 89% (52168/58615) Resolving deltas: 90% (52754/58615) Resolving deltas: 91% (53340/58615) Resolving deltas: 92% (53927/58615) Resolving deltas: 93% (54512/58615) Resolving deltas: 94% (55099/58615) Resolving deltas: 95% (55685/58615) Resolving deltas: 96% (56271/58615) Resolving deltas: 97% (56857/58615) Resolving deltas: 98% (57443/58615) Resolving deltas: 99% (58029/58615) Resolving deltas: 100% (58615/58615) Resolving deltas: 100% (58615/58615), done.
  9. 14.78 s Fetching commit d979b335ea0af89a417744262e7419cfc6a51208 for faster_uv_from_4d ...
  10. 14.78 s $ /nix/store/bcnisk3ydfgv26v2gw3zlky24g00yww2-git-2.54.0/bin/git fetch origin d979b335ea0af89a417744262e7419cfc6a51208
  11. 15.43 s From https://github.com/alphal00p/gammaloop
  12. 15.43 s * branch d979b335ea0af89a417744262e7419cfc6a51208 -> FETCH_HEAD
  13. 15.52 s $ /nix/store/9ypz3flqsrl5xl495mm8h645gadjsxi1-coreutils-9.11/bin/timeout --kill-after=15s 7200s /nix/store/bcnisk3ydfgv26v2gw3zlky24g00yww2-git-2.54.0/bin/git -c advice.detachedHead=false checkout d979b335ea0af89a417744262e7419cfc6a51208
  14. 16.10 s HEAD is now at d979b335e prepare merge scope and enable checks for the original base
  15. 16.11 s $ /nix/store/9ypz3flqsrl5xl495mm8h645gadjsxi1-coreutils-9.11/bin/timeout --kill-after=15s 7200s /nix/store/23zk8sgzamrbmj1fday15szf7f2279s8-nix-2.34.7/bin/nix --extra-experimental-features nix-command --extra-experimental-features flakes --log-format internal-json run .#packages.x86_64-linux.nix-ci-check-gammaloop-nextest-core --print-build-logs
  16. 25.85 s
  17. 25.96 s Downloading cached gammaloop-nextest-binaries-core-gammaloop-tracing-filter from https://cache.nix-ci.com
  18. 25.96 s Downloading cached gammaloop-nextest-binaries-core-gammalooprs from https://cache.nix-ci.com
  19. 25.96 s Downloading cached gammaloop-nextest-binaries-core-gammaloop-api from https://cache.nix-ci.com
  20. 25.96 s Downloading cached gammaloop-nextest-binaries-core-gammaloop-tracing-filter-macros from https://cache.nix-ci.com
  21. 25.96 s Downloading cached gammaloop-nextest-binaries-core-three-dimensional-reps from https://cache.nix-ci.com
  22. 26.27 s Downloaded cached gammaloop-nextest-binaries-core-gammaloop-tracing-filter-macros (1.7 MiB) in 313ms
  23. 26.27 s Progress: 0 of 1 built, 1 of 7 downloaded from cache (4 downloading)
  24. 26.51 s Downloaded cached gammaloop-nextest-binaries-core-gammaloop-tracing-filter (8.1 MiB) in 554ms
  25. 26.51 s Progress: 0 of 1 built, 2 of 7 downloaded from cache (3 downloading)
  26. 26.60 s Downloaded cached gammaloop-nextest-binaries-core-three-dimensional-reps (9.5 MiB) in 640ms
  27. 26.61 s Progress: 0 of 1 built, 3 of 7 downloaded from cache (2 downloading)
  28. 28.56 s Downloaded cached gammaloop-nextest-binaries-core-gammalooprs (88.4 MiB) in 2.6s
  29. 28.56 s Progress: 0 of 1 built, 4 of 7 downloaded from cache (1 downloading)
  30. 28.97 s Downloaded cached gammaloop-nextest-binaries-core-gammaloop-api (120.8 MiB) in 3.0s
  31. 28.97 s Progress: 0 of 1 built, 5 of 7 downloaded from cache
  32. 28.97 s Downloading cached gammaloop-nextest-binaries-core from https://cache.nix-ci.com
  33. 28.98 s Downloaded cached gammaloop-nextest-binaries-core (2032 B) in 14ms
  34. 28.98 s Progress: 0 of 1 built, 6 of 7 downloaded from cache
  35. 28.98 s Downloading cached nix-ci-check-gammaloop-nextest-core from https://cache.nix-ci.com
  36. 29.01 s Downloaded cached nix-ci-check-gammaloop-nextest-core (1016 B) in 22ms
  37. 29.01 s Progress: 0 of 1 built, 7 of 7 downloaded from cache
  38. 39.44 s evaluating derivation 'g copying '/nix/store/j1sc evaluating derivation 'g copying '/nix/store/j1sc evaluating derivation 'g copying '/nix/store/j1sc evaluating derivation 'g copying '/nix/store/j1sc evaluating derivation 'g copying '/nix/store/j1sc evaluating derivation 'g copying '/nix/store/j1sc evaluating derivation 'g copying '/nix/store/j1sc evaluating derivation 'g copying '/nix/store/j1sc evaluating derivation 'g copying '/nix/store/j1sc evaluating derivation 'g copying '/nix/store/j1sc evaluating derivation 'g querying gammaloop-nexte querying info about miss querying gammaloop-nexte [0.0 KiB DL] querying in [0.0 KiB DL] querying ne [0/2 built, 0.0 KiB DL] [1/0/2 built, 0.0 KiB DLnextest-failure-summary (post)> Uploading to the NixCI cache: /nix/store/fbwdc8kf7wnq40zgnxyh4bh9jmg7dgny-nextest-failure-summary
  39. 40.19 s nextest-failure-summary (post)> warning: 'warn-short-path-literals' is deprecated, use 'lint-short-path-literals = ignore' instead
  40. 40.25 s nextest-failure-summary (post)> copying 1 paths...
  41. 40.25 s nextest-failure-summary (post)> copying path '/nix/store/fbwdc8kf7wnq40zgnxyh4bh9jmg7dgny-nextest-failure-summary' to 'https://cache.nix-ci.com'...
  42. 41.47 s nextest-failure-summary (post)> warning: 'warn-short-path-literals' is deprecated, use 'lint-short-path-literals = ignore' instead
  43. 41.97 s nextest-failure-summary (post)> copying 1 paths...
  44. 41.97 s nextest-failure-summary (post)> copying path '/nix/store/y2d8ws0v7fhx2jh6b64pyqg8lrlja7q9-nextest-failure-summary.drv' to 'https://cache.nix-ci.com'...
  45. 43.06 s [1/3 built, 0.0 KiB DL] [1/1/2 built, 0.0 KiB DLgammaloop-nextest-core> Extracting 4 binaries (including 1 non-test binary), 1 build script output directory, and 2 linked paths to /build/nextest-archive-jv9nyc
  46. 44.58 s gammaloop-nextest-core> Extracted 20 files to /build/nextest-archive-jv9nyc in 1.52s
  47. 44.67 s gammaloop-nextest-core> ------------
  48. 44.67 s gammaloop-nextest-core> Nextest run ID 7ac43482-c16d-4b28-94c9-244edd387109 with nextest profile: ci_gammaloop
  49. 44.67 s gammaloop-nextest-core> Starting 379 tests across 3 binaries
  50. 47.32 s gammaloop-nextest-core> ------------
  51. 47.32 s gammaloop-nextest-core> Summary [ 2.657s] 379 tests run: 379 passed, 0 skipped
  52. 47.50 s gammaloop-nextest-core>
  53. 47.50 s gammaloop-nextest-core> ========== nextest test summary ==========
  54. 47.50 s gammaloop-nextest-core> report: target/nextest/ci_gammaloop/junit.xml
  55. 47.50 s gammaloop-nextest-core> tests: 379, failures: 0, errors: 0
  56. 47.50 s gammaloop-nextest-core> No failing testcases found.
  57. 47.50 s gammaloop-nextest-core> =========================================
  58. 47.52 s gammaloop-nextest-core> Extracting 1 binary and 1 linked path to /build/nextest-archive-lGaoIG
  59. 47.62 s gammaloop-nextest-core> Extracted 7 files to /build/nextest-archive-lGaoIG in 0.10s
  60. 47.66 s gammaloop-nextest-core> ------------
  61. 47.66 s gammaloop-nextest-core> Nextest run ID 21c035ac-6ee1-4d9a-b7b9-999727324be3 with nextest profile: ci_gammaloop
  62. 47.66 s gammaloop-nextest-core> Starting 19 tests across 1 binary
  63. 47.71 s gammaloop-nextest-core> ------------
  64. 47.71 s gammaloop-nextest-core> Summary [ 0.055s] 19 tests run: 19 passed, 0 skipped
  65. 47.79 s gammaloop-nextest-core>
  66. 47.79 s gammaloop-nextest-core> ========== nextest test summary ==========
  67. 47.79 s gammaloop-nextest-core> report: target/nextest/ci_gammaloop/junit.xml
  68. 47.79 s gammaloop-nextest-core> tests: 19, failures: 0, errors: 0
  69. 47.79 s gammaloop-nextest-core> No failing testcases found.
  70. 47.79 s gammaloop-nextest-core> =========================================
  71. 47.83 s gammaloop-nextest-core> Extracting 1 binary to /build/nextest-archive-8mgc6d
  72. 47.87 s gammaloop-nextest-core> Extracted 4 files to /build/nextest-archive-8mgc6d in 0.05s
  73. 47.91 s gammaloop-nextest-core> ------------
  74. 47.91 s gammaloop-nextest-core> Nextest run ID a8a936b3-9ea3-4fda-b5e4-8111f5ef2876 with nextest profile: ci_gammaloop
  75. 47.91 s gammaloop-nextest-core> Starting 0 tests across 1 binary
  76. 47.91 s gammaloop-nextest-core> ------------
  77. 47.91 s gammaloop-nextest-core> Summary [ 0.000s] 0 tests run: 0 passed, 0 skipped
  78. 48.00 s gammaloop-nextest-core>
  79. 48.00 s gammaloop-nextest-core> ========== nextest test summary ==========
  80. 48.00 s gammaloop-nextest-core> report: target/nextest/ci_gammaloop/junit.xml
  81. 48.00 s gammaloop-nextest-core> tests: 0, failures: 0, errors: 0
  82. 48.00 s gammaloop-nextest-core> No failing testcases found.
  83. 48.00 s gammaloop-nextest-core> =========================================
  84. 48.05 s gammaloop-nextest-core> Extracting 4 binaries, 1 build script output directory, and 2 linked paths to /build/nextest-archive-AyqkNZ
  85. 48.85 s gammaloop-nextest-core> Extracted 18 files to /build/nextest-archive-AyqkNZ in 0.80s
  86. 48.93 s gammaloop-nextest-core> ------------
  87. 48.93 s gammaloop-nextest-core> Nextest run ID a07a499e-0ebd-4f3f-8291-5b0023b9e120 with nextest profile: ci_gammaloop
  88. 48.93 s gammaloop-nextest-core> Starting 706 tests across 4 binaries (60 tests skipped, including 59 tests via profile.ci_gammaloop.default-filter)
  89. 71.92 s gammaloop-nextest-core> FAIL [ 10.679s] (700/706) gammalooprs::test_renormalization finite_part_ghost_2loop
  90. 71.92 s gammaloop-nextest-core> stdout ---
  91. 71.92 s gammaloop-nextest-core>
  92. 71.92 s gammaloop-nextest-core> running 1 test
  93. 71.92 s gammaloop-nextest-core> test finite_part_ghost_2loop ... FAILED
  94. 71.92 s gammaloop-nextest-core>
  95. 71.92 s gammaloop-nextest-core> failures:
  96. 71.92 s gammaloop-nextest-core>
  97. 71.92 s gammaloop-nextest-core> failures:
  98. 71.92 s gammaloop-nextest-core> finite_part_ghost_2loop
  99. 71.92 s gammaloop-nextest-core>
  100. 71.92 s gammaloop-nextest-core> test result: FAILED. 0 passed; 1 failed; 0 ignored; 0 measured; 6 filtered out; finished in 10.66s
  101. 71.92 s gammaloop-nextest-core>
  102. 71.92 s gammaloop-nextest-core> stderr ---
  103. 71.92 s gammaloop-nextest-core> The application panicked (crashed).
  104. 71.92 s gammaloop-nextest-core> Message: assertion failed: (align_to_rqft(&a, &model) - expected).expand().is_zero()
  105. 71.92 s gammaloop-nextest-core> Location: crates/gammalooprs/tests/test_renormalization.rs:583
  106. 71.92 s gammaloop-nextest-core>
  107. 71.92 s gammaloop-nextest-core> ━━━━━━━━━━━━━━━━━━━━━━━━━━━━━━━━━━ BACKTRACE ━━━━━━━━━━━━━━━━━━━━━━━━━━━━━━━━━━━
  108. 71.92 s gammaloop-nextest-core> 1: <color_eyre[51793ea62743adbd]::config::PanicHook>::panic_report<unknown>
  109. 71.92 s gammaloop-nextest-core> at <unknown source file>:<unknown line>
  110. 71.92 s gammaloop-nextest-core> 2: <color_eyre[51793ea62743adbd]::config::PanicHook>::into_panic_hook::{closure#0}<unknown>
  111. 71.92 s gammaloop-nextest-core> at <unknown source file>:<unknown line>
  112. 71.92 s gammaloop-nextest-core> 3: std[bcb96dfbba0ab899]::panicking::panic_with_hook<unknown>
  113. 71.92 s gammaloop-nextest-core> at <unknown source file>:<unknown line>
  114. 71.92 s gammaloop-nextest-core> 4: std[bcb96dfbba0ab899]::panicking::panic_handler::{closure#0}<unknown>
  115. 71.92 s gammaloop-nextest-core> at <unknown source file>:<unknown line>
  116. 71.92 s gammaloop-nextest-core> 5: std[bcb96dfbba0ab899]::sys::backtrace::__rust_end_short_backtrace::<std[bcb96dfbba0ab899]::panicking::panic_handler::{closure#0}, !><unknown>
  117. 71.92 s gammaloop-nextest-core> at <unknown source file>:<unknown line>
  118. 71.92 s gammaloop-nextest-core> 6: __rustc[6c289b9f9c454d21]::rust_begin_unwind<unknown>
  119. 71.92 s gammaloop-nextest-core> at <unknown source file>:<unknown line>
  120. 71.92 s gammaloop-nextest-core> 7: core[940e698046960fd5]::panicking::panic_fmt<unknown>
  121. 71.92 s gammaloop-nextest-core> at <unknown source file>:<unknown line>
  122. 71.92 s gammaloop-nextest-core> 8: core[940e698046960fd5]::panicking::panic<unknown>
  123. 71.92 s gammaloop-nextest-core> at <unknown source file>:<unknown line>
  124. 71.92 s gammaloop-nextest-core> 9: <test_renormalization[5812939ef1a04d89]::finite_part_ghost_2loop::{closure#0} as core[940e698046960fd5]::ops::function::FnOnce<()>>::call_once<unknown>
  125. 71.92 s gammaloop-nextest-core> at <unknown source file>:<unknown line>
  126. 71.92 s gammaloop-nextest-core> 10: test[75d6903177b1d7e9]::__rust_begin_short_backtrace::<core[940e698046960fd5]::result::Result<(), alloc[2ea6bcb46fca0c42]::string::String>, fn() -> core[940e698046960fd5]::result::Result<(), alloc[2ea6bcb46fca0c42]::string::String>><unknown>
  127. 71.92 s gammaloop-nextest-core> at <unknown source file>:<unknown line>
  128. 71.92 s gammaloop-nextest-core> 11: test[75d6903177b1d7e9]::run_test::{closure#0}<unknown>
  129. 71.92 s gammaloop-nextest-core> at <unknown source file>:<unknown line>
  130. 71.92 s gammaloop-nextest-core> 12: std[bcb96dfbba0ab899]::sys::backtrace::__rust_begin_short_backtrace::<test[75d6903177b1d7e9]::run_test::{closure#1}, ()><unknown>
  131. 71.92 s gammaloop-nextest-core> at <unknown source file>:<unknown line>
  132. 71.92 s gammaloop-nextest-core> 13: <std[bcb96dfbba0ab899]::thread::lifecycle::spawn_unchecked<test[75d6903177b1d7e9]::run_test::{closure#1}, ()>::{closure#1} as core[940e698046960fd5]::ops::function::FnOnce<()>>::call_once::{shim:vtable#0}<unknown>
  133. 71.92 s gammaloop-nextest-core> at <unknown source file>:<unknown line>
  134. 71.92 s gammaloop-nextest-core> 14: <std[bcb96dfbba0ab899]::sys::thread::unix::Thread>::new::thread_start<unknown>
  135. 71.92 s gammaloop-nextest-core> at <unknown source file>:<unknown line>
  136. 71.92 s gammaloop-nextest-core> 15: start_thread<unknown>
  137. 71.92 s gammaloop-nextest-core> at <unknown source file>:<unknown line>
  138. 71.92 s gammaloop-nextest-core> 16: __clone3<unknown>
  139. 71.92 s gammaloop-nextest-core> at <unknown source file>:<unknown line>
  140. 71.92 s gammaloop-nextest-core>
  141. 71.92 s gammaloop-nextest-core> Run with COLORBT_SHOW_HIDDEN=1 environment variable to disable frame filtering.
  142. 71.92 s gammaloop-nextest-core> Run with RUST_BACKTRACE=full to include source snippets.
  143. 71.92 s gammaloop-nextest-core>
  144. 86.03 s gammaloop-nextest-core> ------------
  145. 86.03 s gammaloop-nextest-core> Summary [ 37.098s] 706 tests run: 705 passed, 1 failed, 60 skipped
  146. 86.03 s gammaloop-nextest-core> FAIL [ 10.679s] (700/706) gammalooprs::test_renormalization finite_part_ghost_2loop
  147. 86.03 s gammaloop-nextest-core> stdout ---
  148. 86.03 s gammaloop-nextest-core>
  149. 86.03 s gammaloop-nextest-core> running 1 test
  150. 86.03 s gammaloop-nextest-core> test finite_part_ghost_2loop ... FAILED
  151. 86.03 s gammaloop-nextest-core>
  152. 86.03 s gammaloop-nextest-core> failures:
  153. 86.03 s gammaloop-nextest-core>
  154. 86.03 s gammaloop-nextest-core> failures:
  155. 86.03 s gammaloop-nextest-core> finite_part_ghost_2loop
  156. 86.03 s gammaloop-nextest-core>
  157. 86.03 s gammaloop-nextest-core> test result: FAILED. 0 passed; 1 failed; 0 ignored; 0 measured; 6 filtered out; finished in 10.66s
  158. 86.03 s gammaloop-nextest-core>
  159. 86.03 s gammaloop-nextest-core> stderr ---
  160. 86.03 s gammaloop-nextest-core> The application panicked (crashed).
  161. 86.03 s gammaloop-nextest-core> Message: assertion failed: (align_to_rqft(&a, &model) - expected).expand().is_zero()
  162. 86.03 s gammaloop-nextest-core> Location: crates/gammalooprs/tests/test_renormalization.rs:583
  163. 86.03 s gammaloop-nextest-core>
  164. 86.03 s gammaloop-nextest-core> ━━━━━━━━━━━━━━━━━━━━━━━━━━━━━━━━━━ BACKTRACE ━━━━━━━━━━━━━━━━━━━━━━━━━━━━━━━━━━━
  165. 86.03 s gammaloop-nextest-core> 1: <color_eyre[51793ea62743adbd]::config::PanicHook>::panic_report<unknown>
  166. 86.03 s gammaloop-nextest-core> at <unknown source file>:<unknown line>
  167. 86.03 s gammaloop-nextest-core> 2: <color_eyre[51793ea62743adbd]::config::PanicHook>::into_panic_hook::{closure#0}<unknown>
  168. 86.03 s gammaloop-nextest-core> at <unknown source file>:<unknown line>
  169. 86.03 s gammaloop-nextest-core> 3: std[bcb96dfbba0ab899]::panicking::panic_with_hook<unknown>
  170. 86.03 s gammaloop-nextest-core> at <unknown source file>:<unknown line>
  171. 86.03 s gammaloop-nextest-core> 4: std[bcb96dfbba0ab899]::panicking::panic_handler::{closure#0}<unknown>
  172. 86.03 s gammaloop-nextest-core> at <unknown source file>:<unknown line>
  173. 86.03 s gammaloop-nextest-core> 5: std[bcb96dfbba0ab899]::sys::backtrace::__rust_end_short_backtrace::<std[bcb96dfbba0ab899]::panicking::panic_handler::{closure#0}, !><unknown>
  174. 86.03 s gammaloop-nextest-core> at <unknown source file>:<unknown line>
  175. 86.03 s gammaloop-nextest-core> 6: __rustc[6c289b9f9c454d21]::rust_begin_unwind<unknown>
  176. 86.03 s gammaloop-nextest-core> at <unknown source file>:<unknown line>
  177. 86.03 s gammaloop-nextest-core> 7: core[940e698046960fd5]::panicking::panic_fmt<unknown>
  178. 86.03 s gammaloop-nextest-core> at <unknown source file>:<unknown line>
  179. 86.03 s gammaloop-nextest-core> 8: core[940e698046960fd5]::panicking::panic<unknown>
  180. 86.03 s gammaloop-nextest-core> at <unknown source file>:<unknown line>
  181. 86.03 s gammaloop-nextest-core> 9: <test_renormalization[5812939ef1a04d89]::finite_part_ghost_2loop::{closure#0} as core[940e698046960fd5]::ops::function::FnOnce<()>>::call_once<unknown>
  182. 86.03 s gammaloop-nextest-core> at <unknown source file>:<unknown line>
  183. 86.03 s gammaloop-nextest-core> 10: test[75d6903177b1d7e9]::__rust_begin_short_backtrace::<core[940e698046960fd5]::result::Result<(), alloc[2ea6bcb46fca0c42]::string::String>, fn() -> core[940e698046960fd5]::result::Result<(), alloc[2ea6bcb46fca0c42]::string::String>><unknown>
  184. 86.03 s gammaloop-nextest-core> at <unknown source file>:<unknown line>
  185. 86.03 s gammaloop-nextest-core> 11: test[75d6903177b1d7e9]::run_test::{closure#0}<unknown>
  186. 86.03 s gammaloop-nextest-core> at <unknown source file>:<unknown line>
  187. 86.03 s gammaloop-nextest-core> 12: std[bcb96dfbba0ab899]::sys::backtrace::__rust_begin_short_backtrace::<test[75d6903177b1d7e9]::run_test::{closure#1}, ()><unknown>
  188. 86.03 s gammaloop-nextest-core> at <unknown source file>:<unknown line>
  189. 86.03 s gammaloop-nextest-core> 13: <std[bcb96dfbba0ab899]::thread::lifecycle::spawn_unchecked<test[75d6903177b1d7e9]::run_test::{closure#1}, ()>::{closure#1} as core[940e698046960fd5]::ops::function::FnOnce<()>>::call_once::{shim:vtable#0}<unknown>
  190. 86.03 s gammaloop-nextest-core> at <unknown source file>:<unknown line>
  191. 86.03 s gammaloop-nextest-core> 14: <std[bcb96dfbba0ab899]::sys::thread::unix::Thread>::new::thread_start<unknown>
  192. 86.03 s gammaloop-nextest-core> at <unknown source file>:<unknown line>
  193. 86.03 s gammaloop-nextest-core> 15: start_thread<unknown>
  194. 86.03 s gammaloop-nextest-core> at <unknown source file>:<unknown line>
  195. 86.03 s gammaloop-nextest-core> 16: __clone3<unknown>
  196. 86.03 s gammaloop-nextest-core> at <unknown source file>:<unknown line>
  197. 86.03 s gammaloop-nextest-core>
  198. 86.03 s gammaloop-nextest-core> Run with COLORBT_SHOW_HIDDEN=1 environment variable to disable frame filtering.
  199. 86.03 s gammaloop-nextest-core> Run with RUST_BACKTRACE=full to include source snippets.
  200. 86.03 s gammaloop-nextest-core>
  201. 86.14 s gammaloop-nextest-core> error: test run failed
  202. 86.19 s gammaloop-nextest-core>
  203. 86.19 s gammaloop-nextest-core> ========== nextest test summary ==========
  204. 86.19 s gammaloop-nextest-core> report: target/nextest/ci_gammaloop/junit.xml
  205. 86.19 s gammaloop-nextest-core> tests: 706, failures: 1, errors: 0
  206. 86.19 s gammaloop-nextest-core>
  207. 86.19 s gammaloop-nextest-core> 1. gammalooprs::test_renormalization::finite_part_ghost_2loop
  208. 86.19 s gammaloop-nextest-core> failure: test failure with exit code 101
  209. 86.19 s gammaloop-nextest-core> system-out
  210. 86.19 s gammaloop-nextest-core> running 1 test
  211. 86.19 s gammaloop-nextest-core> test finite_part_ghost_2loop ... FAILED
  212. 86.19 s gammaloop-nextest-core>
  213. 86.19 s gammaloop-nextest-core> failures:
  214. 86.19 s gammaloop-nextest-core>
  215. 86.19 s gammaloop-nextest-core> failures:
  216. 86.19 s gammaloop-nextest-core> finite_part_ghost_2loop
  217. 86.19 s gammaloop-nextest-core>
  218. 86.19 s gammaloop-nextest-core> test result: FAILED. 0 passed; 1 failed; 0 ignored; 0 measured; 6 filtered out; finished in 10.66s
  219. 86.19 s gammaloop-nextest-core> system-err
  220. 86.19 s gammaloop-nextest-core> The application panicked (crashed).
  221. 86.19 s gammaloop-nextest-core> Message: assertion failed: (align_to_rqft(&a, &model) - expected).expand().is_zero()
  222. 86.19 s gammaloop-nextest-core> Location: crates/gammalooprs/tests/test_renormalization.rs:583
  223. 86.19 s gammaloop-nextest-core>
  224. 86.19 s gammaloop-nextest-core> ━━━━━━━━━━━━━━━━━━━━━━━━━━━━━━━━━━ BACKTRACE ━━━━━━━━━━━━━━━━━━━━━━━━━━━━━━━━━━━
  225. 86.19 s gammaloop-nextest-core> 1: <color_eyre[51793ea62743adbd]::config::PanicHook>::panic_report<unknown>
  226. 86.19 s gammaloop-nextest-core> at <unknown source file>:<unknown line>
  227. 86.19 s gammaloop-nextest-core> 2: <color_eyre[51793ea62743adbd]::config::PanicHook>::into_panic_hook::{closure#0}<unknown>
  228. 86.19 s gammaloop-nextest-core> at <unknown source file>:<unknown line>
  229. 86.19 s gammaloop-nextest-core> 3: std[bcb96dfbba0ab899]::panicking::panic_with_hook<unknown>
  230. 86.19 s gammaloop-nextest-core> at <unknown source file>:<unknown line>
  231. 86.19 s gammaloop-nextest-core> 4: std[bcb96dfbba0ab899]::panicking::panic_handler::{closure#0}<unknown>
  232. 86.19 s gammaloop-nextest-core> at <unknown source file>:<unknown line>
  233. 86.19 s gammaloop-nextest-core> 5: std[bcb96dfbba0ab899]::sys::backtrace::__rust_end_short_backtrace::<std[bcb96dfbba0ab899]::panicking::panic_handler::{closure#0}, !><unknown>
  234. 86.19 s gammaloop-nextest-core> at <unknown source file>:<unknown line>
  235. 86.19 s gammaloop-nextest-core> 6: __rustc[6c289b9f9c454d21]::rust_begin_unwind<unknown>
  236. 86.19 s gammaloop-nextest-core> at <unknown source file>:<unknown line>
  237. 86.19 s gammaloop-nextest-core> 7: core[940e698046960fd5]::panicking::panic_fmt<unknown>
  238. 86.19 s gammaloop-nextest-core> at <unknown source file>:<unknown line>
  239. 86.19 s gammaloop-nextest-core> 8: core[940e698046960fd5]::panicking::panic<unknown>
  240. 86.19 s gammaloop-nextest-core> at <unknown source file>:<unknown line>
  241. 86.19 s gammaloop-nextest-core> 9: <test_renormalization[5812939ef1a04d89]::finite_part_ghost_2loop::{closure#0} as core[940e698046960fd5]::ops::function::FnOnce<()>>::call_once<unknown>
  242. 86.19 s gammaloop-nextest-core> at <unknown source file>:<unknown line>
  243. 86.19 s gammaloop-nextest-core> 10: test[75d6903177b1d7e9]::__rust_begin_short_backtrace::<core[940e698046960fd5]::result::Result<(), alloc[2ea6bcb46fca0c42]::string::String>, fn() -> core[940e698046960fd5]::result::Result<(), alloc[2ea6bcb46fca0c42]::string::String>><unknown>
  244. 86.19 s gammaloop-nextest-core> at <unknown source file>:<unknown line>
  245. 86.19 s gammaloop-nextest-core> 11: test[75d6903177b1d7e9]::run_test::{closure#0}<unknown>
  246. 86.19 s gammaloop-nextest-core> at <unknown source file>:<unknown line>
  247. 86.19 s gammaloop-nextest-core> 12: std[bcb96dfbba0ab899]::sys::backtrace::__rust_begin_short_backtrace::<test[75d6903177b1d7e9]::run_test::{closure#1}, ()><unknown>
  248. 86.19 s gammaloop-nextest-core> at <unknown source file>:<unknown line>
  249. 86.19 s gammaloop-nextest-core> 13: <std[bcb96dfbba0ab899]::thread::lifecycle::spawn_unchecked<test[75d6903177b1d7e9]::run_test::{closure#1}, ()>::{closure#1} as core[940e698046960fd5]::ops::function::FnOnce<()>>::call_once::{shim:vtable#0}<unknown>
  250. 86.19 s gammaloop-nextest-core> at <unknown source file>:<unknown line>
  251. 86.19 s gammaloop-nextest-core> 14: <std[bcb96dfbba0ab899]::sys::thread::unix::Thread>::new::thread_start<unknown>
  252. 86.19 s gammaloop-nextest-core> at <unknown source file>:<unknown line>
  253. 86.19 s gammaloop-nextest-core> 15: start_thread<unknown>
  254. 86.19 s gammaloop-nextest-core> at <unknown source file>:<unknown line>
  255. 86.19 s gammaloop-nextest-core> 16: __clone3<unknown>
  256. 86.19 s gammaloop-nextest-core> at <unknown source file>:<unknown line>
  257. 86.19 s gammaloop-nextest-core>
  258. 86.19 s gammaloop-nextest-core> Run with COLORBT_SHOW_HIDDEN=1 environment variable to disable frame filtering.
  259. 86.19 s gammaloop-nextest-core> Run with RUST_BACKTRACE=full to include source snippets.
  260. 86.19 s gammaloop-nextest-core> =========================================
  261. 86.22 s gammaloop-nextest-core> Extracting 1 binary, 1 build script output directory, and 1 linked path to /build/nextest-archive-13F5Fw
  262. 86.37 s gammaloop-nextest-core> Extracted 7 files to /build/nextest-archive-13F5Fw in 0.14s
  263. 86.42 s gammaloop-nextest-core> ------------
  264. 86.42 s gammaloop-nextest-core> Nextest run ID 5298e562-15d4-487c-9e49-30451d783132 with nextest profile: ci_gammaloop
  265. 86.42 s gammaloop-nextest-core> Starting 105 tests across 1 binary
  266. 122.79 s gammaloop-nextest-core> ------------
  267. 122.79 s gammaloop-nextest-core> Summary [ 36.368s] 105 tests run: 105 passed, 0 skipped
  268. 122.87 s gammaloop-nextest-core>
  269. 122.87 s gammaloop-nextest-core> ========== nextest test summary ==========
  270. 122.87 s gammaloop-nextest-core> report: target/nextest/ci_gammaloop/junit.xml
  271. 122.87 s gammaloop-nextest-core> tests: 105, failures: 0, errors: 0
  272. 122.87 s gammaloop-nextest-core> No failing testcases found.
  273. 122.87 s gammaloop-nextest-core> =========================================
  274. 122.99 s error: Cannot build '/nix/store/gfw8irsajvc73r64ijh06rb30gc2744x-gammaloop-nextest-core.drv'.
  275. 122.99 s Reason: builder failed with exit code 100.
  276. 122.99 s Output paths:
  277. 122.99 s /nix/store/p3ayrsjin2c2zsszczl860szaj7271z8-gammaloop-nextest-core
  278. 122.99 s Last 229 log lines:
  279. 122.99 s > Extracting 4 binaries (including 1 non-test binary), 1 build script output directory, and 2 linked paths to /build/nextest-archive-jv9nyc
  280. 122.99 s > Extracted 20 files to /build/nextest-archive-jv9nyc in 1.52s
  281. 122.99 s > ------------
  282. 122.99 s > Nextest run ID 7ac43482-c16d-4b28-94c9-244edd387109 with nextest profile: ci_gammaloop
  283. 122.99 s > Starting 379 tests across 3 binaries
  284. 122.99 s > ------------
  285. 122.99 s > Summary [ 2.657s] 379 tests run: 379 passed, 0 skipped
  286. 122.99 s >
  287. 122.99 s > ========== nextest test summary ==========
  288. 122.99 s > report: target/nextest/ci_gammaloop/junit.xml
  289. 122.99 s > tests: 379, failures: 0, errors: 0
  290. 122.99 s > No failing testcases found.
  291. 122.99 s > =========================================
  292. 122.99 s > Extracting 1 binary and 1 linked path to /build/nextest-archive-lGaoIG
  293. 122.99 s > Extracted 7 files to /build/nextest-archive-lGaoIG in 0.10s
  294. 122.99 s > ------------
  295. 122.99 s > Nextest run ID 21c035ac-6ee1-4d9a-b7b9-999727324be3 with nextest profile: ci_gammaloop
  296. 122.99 s > Starting 19 tests across 1 binary
  297. 122.99 s > ------------
  298. 122.99 s > Summary [ 0.055s] 19 tests run: 19 passed, 0 skipped
  299. 122.99 s >
  300. 122.99 s > ========== nextest test summary ==========
  301. 122.99 s > report: target/nextest/ci_gammaloop/junit.xml
  302. 122.99 s > tests: 19, failures: 0, errors: 0
  303. 122.99 s > No failing testcases found.
  304. 122.99 s > =========================================
  305. 122.99 s > Extracting 1 binary to /build/nextest-archive-8mgc6d
  306. 122.99 s > Extracted 4 files to /build/nextest-archive-8mgc6d in 0.05s
  307. 122.99 s > ------------
  308. 122.99 s > Nextest run ID a8a936b3-9ea3-4fda-b5e4-8111f5ef2876 with nextest profile: ci_gammaloop
  309. 122.99 s > Starting 0 tests across 1 binary
  310. 122.99 s > ------------
  311. 122.99 s > Summary [ 0.000s] 0 tests run: 0 passed, 0 skipped
  312. 122.99 s >
  313. 122.99 s > ========== nextest test summary ==========
  314. 122.99 s > report: target/nextest/ci_gammaloop/junit.xml
  315. 122.99 s > tests: 0, failures: 0, errors: 0
  316. 122.99 s > No failing testcases found.
  317. 122.99 s > =========================================
  318. 122.99 s > Extracting 4 binaries, 1 build script output directory, and 2 linked paths to /build/nextest-archive-AyqkNZ
  319. 122.99 s > Extracted 18 files to /build/nextest-archive-AyqkNZ in 0.80s
  320. 122.99 s > ------------
  321. 122.99 s > Nextest run ID a07a499e-0ebd-4f3f-8291-5b0023b9e120 with nextest profile: ci_gammaloop
  322. 122.99 s > Starting 706 tests across 4 binaries (60 tests skipped, including 59 tests via profile.ci_gammaloop.default-filter)
  323. 122.99 s > FAIL [ 10.679s] (700/706) gammalooprs::test_renormalization finite_part_ghost_2loop
  324. 122.99 s > stdout ---
  325. 122.99 s >
  326. 122.99 s > running 1 test
  327. 122.99 s > test finite_part_ghost_2loop ... FAILED
  328. 122.99 s >
  329. 122.99 s > failures:
  330. 122.99 s >
  331. 122.99 s > failures:
  332. 122.99 s > finite_part_ghost_2loop
  333. 122.99 s >
  334. 122.99 s > test result: FAILED. 0 passed; 1 failed; 0 ignored; 0 measured; 6 filtered out; finished in 10.66s
  335. 122.99 s >
  336. 122.99 s > stderr ---
  337. 122.99 s > The application panicked (crashed).
  338. 122.99 s > Message: assertion failed: (align_to_rqft(&a, &model) - expected).expand().is_zero()
  339. 122.99 s > Location: crates/gammalooprs/tests/test_renormalization.rs:583
  340. 122.99 s >
  341. 122.99 s > ━━━━━━━━━━━━━━━━━━━━━━━━━━━━━━━━━━ BACKTRACE ━━━━━━━━━━━━━━━━━━━━━━━━━━━━━━━━━━━
  342. 122.99 s > 1: <color_eyre[51793ea62743adbd]::config::PanicHook>::panic_report<unknown>
  343. 122.99 s > at <unknown source file>:<unknown line>
  344. 122.99 s > 2: <color_eyre[51793ea62743adbd]::config::PanicHook>::into_panic_hook::{closure#0}<unknown>
  345. 122.99 s > at <unknown source file>:<unknown line>
  346. 122.99 s > 3: std[bcb96dfbba0ab899]::panicking::panic_with_hook<unknown>
  347. 122.99 s > at <unknown source file>:<unknown line>
  348. 122.99 s > 4: std[bcb96dfbba0ab899]::panicking::panic_handler::{closure#0}<unknown>
  349. 122.99 s > at <unknown source file>:<unknown line>
  350. 122.99 s > 5: std[bcb96dfbba0ab899]::sys::backtrace::__rust_end_short_backtrace::<std[bcb96dfbba0ab899]::panicking::panic_handler::{closure#0}, !><unknown>
  351. 122.99 s > at <unknown source file>:<unknown line>
  352. 122.99 s > 6: __rustc[6c289b9f9c454d21]::rust_begin_unwind<unknown>
  353. 122.99 s > at <unknown source file>:<unknown line>
  354. 122.99 s > 7: core[940e698046960fd5]::panicking::panic_fmt<unknown>
  355. 122.99 s > at <unknown source file>:<unknown line>
  356. 122.99 s > 8: core[940e698046960fd5]::panicking::panic<unknown>
  357. 122.99 s > at <unknown source file>:<unknown line>
  358. 122.99 s > 9: <test_renormalization[5812939ef1a04d89]::finite_part_ghost_2loop::{closure#0} as core[940e698046960fd5]::ops::function::FnOnce<()>>::call_once<unknown>
  359. 122.99 s > at <unknown source file>:<unknown line>
  360. 122.99 s > 10: test[75d6903177b1d7e9]::__rust_begin_short_backtrace::<core[940e698046960fd5]::result::Result<(), alloc[2ea6bcb46fca0c42]::string::String>, fn() -> core[940e698046960fd5]::result::Result<(), alloc[2ea6bcb46fca0c42]::string::String>><unknown>
  361. 122.99 s > at <unknown source file>:<unknown line>
  362. 122.99 s > 11: test[75d6903177b1d7e9]::run_test::{closure#0}<unknown>
  363. 122.99 s > at <unknown source file>:<unknown line>
  364. 122.99 s > 12: std[bcb96dfbba0ab899]::sys::backtrace::__rust_begin_short_backtrace::<test[75d6903177b1d7e9]::run_test::{closure#1}, ()><unknown>
  365. 122.99 s > at <unknown source file>:<unknown line>
  366. 122.99 s > 13: <std[bcb96dfbba0ab899]::thread::lifecycle::spawn_unchecked<test[75d6903177b1d7e9]::run_test::{closure#1}, ()>::{closure#1} as core[940e698046960fd5]::ops::function::FnOnce<()>>::call_once::{shim:vtable#0}<unknown>
  367. 122.99 s > at <unknown source file>:<unknown line>
  368. 122.99 s > 14: <std[bcb96dfbba0ab899]::sys::thread::unix::Thread>::new::thread_start<unknown>
  369. 122.99 s > at <unknown source file>:<unknown line>
  370. 122.99 s > 15: start_thread<unknown>
  371. 122.99 s > at <unknown source file>:<unknown line>
  372. 122.99 s > 16: __clone3<unknown>
  373. 122.99 s > at <unknown source file>:<unknown line>
  374. 122.99 s >
  375. 122.99 s > Run with COLORBT_SHOW_HIDDEN=1 environment variable to disable frame filtering.
  376. 122.99 s > Run with RUST_BACKTRACE=full to include source snippets.
  377. 122.99 s >
  378. 122.99 s > ------------
  379. 122.99 s > Summary [ 37.098s] 706 tests run: 705 passed, 1 failed, 60 skipped
  380. 122.99 s > FAIL [ 10.679s] (700/706) gammalooprs::test_renormalization finite_part_ghost_2loop
  381. 122.99 s > stdout ---
  382. 122.99 s >
  383. 122.99 s > running 1 test
  384. 122.99 s > test finite_part_ghost_2loop ... FAILED
  385. 122.99 s >
  386. 122.99 s > failures:
  387. 122.99 s >
  388. 122.99 s > failures:
  389. 122.99 s > finite_part_ghost_2loop
  390. 122.99 s >
  391. 122.99 s > test result: FAILED. 0 passed; 1 failed; 0 ignored; 0 measured; 6 filtered out; finished in 10.66s
  392. 122.99 s >
  393. 122.99 s > stderr ---
  394. 122.99 s > The application panicked (crashed).
  395. 122.99 s > Message: assertion failed: (align_to_rqft(&a, &model) - expected).expand().is_zero()
  396. 122.99 s > Location: crates/gammalooprs/tests/test_renormalization.rs:583
  397. 122.99 s >
  398. 122.99 s > ━━━━━━━━━━━━━━━━━━━━━━━━━━━━━━━━━━ BACKTRACE ━━━━━━━━━━━━━━━━━━━━━━━━━━━━━━━━━━━
  399. 122.99 s > 1: <color_eyre[51793ea62743adbd]::config::PanicHook>::panic_report<unknown>
  400. 122.99 s > at <unknown source file>:<unknown line>
  401. 122.99 s > 2: <color_eyre[51793ea62743adbd]::config::PanicHook>::into_panic_hook::{closure#0}<unknown>
  402. 122.99 s > at <unknown source file>:<unknown line>
  403. 122.99 s > 3: std[bcb96dfbba0ab899]::panicking::panic_with_hook<unknown>
  404. 122.99 s > at <unknown source file>:<unknown line>
  405. 122.99 s > 4: std[bcb96dfbba0ab899]::panicking::panic_handler::{closure#0}<unknown>
  406. 122.99 s > at <unknown source file>:<unknown line>
  407. 122.99 s > 5: std[bcb96dfbba0ab899]::sys::backtrace::__rust_end_short_backtrace::<std[bcb96dfbba0ab899]::panicking::panic_handler::{closure#0}, !><unknown>
  408. 122.99 s > at <unknown source file>:<unknown line>
  409. 122.99 s > 6: __rustc[6c289b9f9c454d21]::rust_begin_unwind<unknown>
  410. 122.99 s > at <unknown source file>:<unknown line>
  411. 122.99 s > 7: core[940e698046960fd5]::panicking::panic_fmt<unknown>
  412. 122.99 s > at <unknown source file>:<unknown line>
  413. 122.99 s > 8: core[940e698046960fd5]::panicking::panic<unknown>
  414. 122.99 s > at <unknown source file>:<unknown line>
  415. 122.99 s > 9: <test_renormalization[5812939ef1a04d89]::finite_part_ghost_2loop::{closure#0} as core[940e698046960fd5]::ops::function::FnOnce<()>>::call_once<unknown>
  416. 122.99 s > at <unknown source file>:<unknown line>
  417. 122.99 s > 10: test[75d6903177b1d7e9]::__rust_begin_short_backtrace::<core[940e698046960fd5]::result::Result<(), alloc[2ea6bcb46fca0c42]::string::String>, fn() -> core[940e698046960fd5]::result::Result<(), alloc[2ea6bcb46fca0c42]::string::String>><unknown>
  418. 122.99 s > at <unknown source file>:<unknown line>
  419. 122.99 s > 11: test[75d6903177b1d7e9]::run_test::{closure#0}<unknown>
  420. 122.99 s > at <unknown source file>:<unknown line>
  421. 122.99 s > 12: std[bcb96dfbba0ab899]::sys::backtrace::__rust_begin_short_backtrace::<test[75d6903177b1d7e9]::run_test::{closure#1}, ()><unknown>
  422. 122.99 s > at <unknown source file>:<unknown line>
  423. 122.99 s > 13: <std[bcb96dfbba0ab899]::thread::lifecycle::spawn_unchecked<test[75d6903177b1d7e9]::run_test::{closure#1}, ()>::{closure#1} as core[940e698046960fd5]::ops::function::FnOnce<()>>::call_once::{shim:vtable#0}<unknown>
  424. 122.99 s > at <unknown source file>:<unknown line>
  425. 122.99 s > 14: <std[bcb96dfbba0ab899]::sys::thread::unix::Thread>::new::thread_start<unknown>
  426. 122.99 s > at <unknown source file>:<unknown line>
  427. 122.99 s > 15: start_thread<unknown>
  428. 122.99 s > at <unknown source file>:<unknown line>
  429. 122.99 s > 16: __clone3<unknown>
  430. 122.99 s > at <unknown source file>:<unknown line>
  431. 122.99 s >
  432. 122.99 s > Run with COLORBT_SHOW_HIDDEN=1 environment variable to disable frame filtering.
  433. 122.99 s > Run with RUST_BACKTRACE=full to include source snippets.
  434. 122.99 s >
  435. 122.99 s > error: test run failed
  436. 122.99 s >
  437. 122.99 s > ========== nextest test summary ==========
  438. 122.99 s > report: target/nextest/ci_gammaloop/junit.xml
  439. 122.99 s > tests: 706, failures: 1, errors: 0
  440. 122.99 s >
  441. 122.99 s > 1. gammalooprs::test_renormalization::finite_part_ghost_2loop
  442. 122.99 s > failure: test failure with exit code 101
  443. 122.99 s > system-out
  444. 122.99 s > running 1 test
  445. 122.99 s > test finite_part_ghost_2loop ... FAILED
  446. 122.99 s >
  447. 122.99 s > failures:
  448. 122.99 s >
  449. 122.99 s > failures:
  450. 122.99 s > finite_part_ghost_2loop
  451. 122.99 s >
  452. 122.99 s > test result: FAILED. 0 passed; 1 failed; 0 ignored; 0 measured; 6 filtered out; finished in 10.66s
  453. 122.99 s > system-err
  454. 122.99 s > The application panicked (crashed).
  455. 122.99 s > Message: assertion failed: (align_to_rqft(&a, &model) - expected).expand().is_zero()
  456. 122.99 s > Location: crates/gammalooprs/tests/test_renormalization.rs:583
  457. 122.99 s >
  458. 122.99 s > ━━━━━━━━━━━━━━━━━━━━━━━━━━━━━━━━━━ BACKTRACE ━━━━━━━━━━━━━━━━━━━━━━━━━━━━━━━━━━━
  459. 122.99 s > 1: <color_eyre[51793ea62743adbd]::config::PanicHook>::panic_report<unknown>
  460. 122.99 s > at <unknown source file>:<unknown line>
  461. 122.99 s > 2: <color_eyre[51793ea62743adbd]::config::PanicHook>::into_panic_hook::{closure#0}<unknown>
  462. 122.99 s > at <unknown source file>:<unknown line>
  463. 122.99 s > 3: std[bcb96dfbba0ab899]::panicking::panic_with_hook<unknown>
  464. 122.99 s > at <unknown source file>:<unknown line>
  465. 122.99 s > 4: std[bcb96dfbba0ab899]::panicking::panic_handler::{closure#0}<unknown>
  466. 122.99 s > at <unknown source file>:<unknown line>
  467. 122.99 s > 5: std[bcb96dfbba0ab899]::sys::backtrace::__rust_end_short_backtrace::<std[bcb96dfbba0ab899]::panicking::panic_handler::{closure#0}, !><unknown>
  468. 122.99 s > at <unknown source file>:<unknown line>
  469. 122.99 s > 6: __rustc[6c289b9f9c454d21]::rust_begin_unwind<unknown>
  470. 122.99 s > at <unknown source file>:<unknown line>
  471. 122.99 s > 7: core[940e698046960fd5]::panicking::panic_fmt<unknown>
  472. 122.99 s > at <unknown source file>:<unknown line>
  473. 122.99 s > 8: core[940e698046960fd5]::panicking::panic<unknown>
  474. 122.99 s > at <unknown source file>:<unknown line>
  475. 122.99 s > 9: <test_renormalization[5812939ef1a04d89]::finite_part_ghost_2loop::{closure#0} as core[940e698046960fd5]::ops::function::FnOnce<()>>::call_once<unknown>
  476. 122.99 s > at <unknown source file>:<unknown line>
  477. 122.99 s > 10: test[75d6903177b1d7e9]::__rust_begin_short_backtrace::<core[940e698046960fd5]::result::Result<(), alloc[2ea6bcb46fca0c42]::string::String>, fn() -> core[940e698046960fd5]::result::Result<(), alloc[2ea6bcb46fca0c42]::string::String>><unknown>
  478. 122.99 s > at <unknown source file>:<unknown line>
  479. 122.99 s > 11: test[75d6903177b1d7e9]::run_test::{closure#0}<unknown>
  480. 122.99 s > at <unknown source file>:<unknown line>
  481. 122.99 s > 12: std[bcb96dfbba0ab899]::sys::backtrace::__rust_begin_short_backtrace::<test[75d6903177b1d7e9]::run_test::{closure#1}, ()><unknown>
  482. 122.99 s > at <unknown source file>:<unknown line>
  483. 122.99 s > 13: <std[bcb96dfbba0ab899]::thread::lifecycle::spawn_unchecked<test[75d6903177b1d7e9]::run_test::{closure#1}, ()>::{closure#1} as core[940e698046960fd5]::ops::function::FnOnce<()>>::call_once::{shim:vtable#0}<unknown>
  484. 122.99 s > at <unknown source file>:<unknown line>
  485. 122.99 s > 14: <std[bcb96dfbba0ab899]::sys::thread::unix::Thread>::new::thread_start<unknown>
  486. 122.99 s > at <unknown source file>:<unknown line>
  487. 122.99 s > 15: start_thread<unknown>
  488. 122.99 s > at <unknown source file>:<unknown line>
  489. 122.99 s > 16: __clone3<unknown>
  490. 122.99 s > at <unknown source file>:<unknown line>
  491. 122.99 s >
  492. 122.99 s > Run with COLORBT_SHOW_HIDDEN=1 environment variable to disable frame filtering.
  493. 122.99 s > Run with RUST_BACKTRACE=full to include source snippets.
  494. 122.99 s > =========================================
  495. 122.99 s > Extracting 1 binary, 1 build script output directory, and 1 linked path to /build/nextest-archive-13F5Fw
  496. 122.99 s > Extracted 7 files to /build/nextest-archive-13F5Fw in 0.14s
  497. 122.99 s > ------------
  498. 122.99 s > Nextest run ID 5298e562-15d4-487c-9e49-30451d783132 with nextest profile: ci_gammaloop
  499. 122.99 s > Starting 105 tests across 1 binary
  500. 122.99 s > ------------
  501. 122.99 s > Summary [ 36.368s] 105 tests run: 105 passed, 0 skipped
  502. 122.99 s >
  503. 122.99 s > ========== nextest test summary ==========
  504. 122.99 s > report: target/nextest/ci_gammaloop/junit.xml
  505. 122.99 s > tests: 105, failures: 0, errors: 0
  506. 122.99 s > No failing testcases found.
  507. 122.99 s > =========================================
  508. 122.99 s For full logs, run:
  509. 122.99 s nix log /nix/store/gfw8irsajvc73r64ijh06rb30gc2744x-gammaloop-nextest-core.drv
  510. 123.23 s [1 built (1 failed), 0.0Run failed.