test packages.x86_64-linux.nix-ci-check-gammaloop-nextest-core

Reproduce this run
Original Run
  1. 0.01 s $ /nix/store/9ypz3flqsrl5xl495mm8h645gadjsxi1-coreutils-9.11/bin/timeout --kill-after=15s 7200s /nix/store/23zk8sgzamrbmj1fday15szf7f2279s8-nix-2.34.7/bin/nix --extra-experimental-features nix-command --extra-experimental-features flakes flake clone git+https://github.com/alphal00p/gammaloop --dest /tmp/nix-ci-worker/stable-pwd/repo/
  2. 0.50 s Cloning into '/tmp/nix-ci-worker/stable-pwd/repo'...
  3. 1.42 s remote: Enumerating objects: 86358, done.
  4. 1.65 s remote: Counting objects: 0% (1/8926) remote: Counting objects: 1% (90/8926) remote: Counting objects: 2% (179/8926) remote: Counting objects: 3% (268/8926) remote: Counting objects: 4% (358/8926) remote: Counting objects: 5% (447/8926) remote: Counting objects: 6% (536/8926) remote: Counting objects: 7% (625/8926) remote: Counting objects: 8% (715/8926) remote: Counting objects: 9% (804/8926) remote: Counting objects: 10% (893/8926) remote: Counting objects: 11% (982/8926) remote: Counting objects: 12% (1072/8926) remote: Counting objects: 13% (1161/8926) remote: Counting objects: 14% (1250/8926) remote: Counting objects: 15% (1339/8926) remote: Counting objects: 16% (1429/8926) remote: Counting objects: 17% (1518/8926) remote: Counting objects: 18% (1607/8926) remote: Counting objects: 19% (1696/8926) remote: Counting objects: 20% (1786/8926) remote: Counting objects: 21% (1875/8926) remote: Counting objects: 22% (1964/8926) remote: Counting objects: 23% (2053/8926) remote: Counting objects: 24% (2143/8926) remote: Counting objects: 25% (2232/8926) remote: Counting objects: 26% (2321/8926) remote: Counting objects: 27% (2411/8926) remote: Counting objects: 28% (2500/8926) remote: Counting objects: 29% (2589/8926) remote: Counting objects: 30% (2678/8926) remote: Counting objects: 31% (2768/8926) remote: Counting objects: 32% (2857/8926) remote: Counting objects: 33% (2946/8926) remote: Counting objects: 34% (3035/8926) remote: Counting objects: 35% (3125/8926) remote: Counting objects: 36% (3214/8926) remote: Counting objects: 37% (3303/8926) remote: Counting objects: 38% (3392/8926) remote: Counting objects: 39% (3482/8926) remote: Counting objects: 40% (3571/8926) remote: Counting objects: 41% (3660/8926) remote: Counting objects: 42% (3749/8926) remote: Counting objects: 43% (3839/8926) remote: Counting objects: 44% (3928/8926) remote: Counting objects: 45% (4017/8926) remote: Counting objects: 46% (4106/8926) remote: Counting objects: 47% (4196/8926) remote: Counting objects: 48% (4285/8926) remote: Counting objects: 49% (4374/8926) remote: Counting objects: 50% (4463/8926) remote: Counting objects: 51% (4553/8926) remote: Counting objects: 52% (4642/8926) remote: Counting objects: 53% (4731/8926) remote: Counting objects: 54% (4821/8926) remote: Counting objects: 55% (4910/8926) remote: Counting objects: 56% (4999/8926) remote: Counting objects: 57% (5088/8926) remote: Counting objects: 58% (5178/8926) remote: Counting objects: 59% (5267/8926) remote: Counting objects: 60% (5356/8926) remote: Counting objects: 61% (5445/8926) remote: Counting objects: 62% (5535/8926) remote: Counting objects: 63% (5624/8926) remote: Counting objects: 64% (5713/8926) remote: Counting objects: 65% (5802/8926) remote: Counting objects: 66% (5892/8926) remote: Counting objects: 67% (5981/8926) remote: Counting objects: 68% (6070/8926) remote: Counting objects: 69% (6159/8926) remote: Counting objects: 70% (6249/8926) remote: Counting objects: 71% (6338/8926) remote: Counting objects: 72% (6427/8926) remote: Counting objects: 73% (6516/8926) remote: Counting objects: 74% (6606/8926) remote: Counting objects: 75% (6695/8926) remote: Counting objects: 76% (6784/8926) remote: Counting objects: 77% (6874/8926) remote: Counting objects: 78% (6963/8926) remote: Counting objects: 79% (7052/8926) remote: Counting objects: 80% (7141/8926) remote: Counting objects: 81% (7231/8926) remote: Counting objects: 82% (7320/8926) remote: Counting objects: 83% (7409/8926) remote: Counting objects: 84% (7498/8926) remote: Counting objects: 85% (7588/8926) remote: Counting objects: 86% (7677/8926) remote: Counting objects: 87% (7766/8926) remote: Counting objects: 88% (7855/8926) remote: Counting objects: 89% (7945/8926) remote: Counting objects: 90% (8034/8926) remote: Counting objects: 91% (8123/8926) remote: Counting objects: 92% (8212/8926) remote: Counting objects: 93% (8302/8926) remote: Counting objects: 94% (8391/8926) remote: Counting objects: 95% (8480/8926) remote: Counting objects: 96% (8569/8926) remote: Counting objects: 97% (8659/8926) remote: Counting objects: 98% (8748/8926) remote: Counting objects: 99% (8837/8926) remote: Counting objects: 100% (8926/8926) remote: Counting objects: 100% (8926/8926), done.
  5. 3.49 s remote: Compressing objects: 0% (1/1948) remote: Compressing objects: 1% (20/1948) remote: Compressing objects: 2% (39/1948) remote: Compressing objects: 3% (59/1948) remote: Compressing objects: 4% (78/1948) remote: Compressing objects: 5% (98/1948) remote: Compressing objects: 6% (117/1948) remote: Compressing objects: 7% (137/1948) remote: Compressing objects: 8% (156/1948) remote: Compressing objects: 9% (176/1948) remote: Compressing objects: 10% (195/1948) remote: Compressing objects: 11% (215/1948) remote: Compressing objects: 11% (225/1948) remote: Compressing objects: 12% (234/1948) remote: Compressing objects: 13% (254/1948) remote: Compressing objects: 14% (273/1948) remote: Compressing objects: 15% (293/1948) remote: Compressing objects: 16% (312/1948) remote: Compressing objects: 17% (332/1948) remote: Compressing objects: 18% (351/1948) remote: Compressing objects: 19% (371/1948) remote: Compressing objects: 20% (390/1948) remote: Compressing objects: 21% (410/1948) remote: Compressing objects: 22% (429/1948) remote: Compressing objects: 23% (449/1948) remote: Compressing objects: 24% (468/1948) remote: Compressing objects: 25% (487/1948) remote: Compressing objects: 26% (507/1948) remote: Compressing objects: 27% (526/1948) remote: Compressing objects: 28% (546/1948) remote: Compressing objects: 29% (565/1948) remote: Compressing objects: 30% (585/1948) remote: Compressing objects: 31% (604/1948) remote: Compressing objects: 32% (624/1948) remote: Compressing objects: 33% (643/1948) remote: Compressing objects: 34% (663/1948) remote: Compressing objects: 35% (682/1948) remote: Compressing objects: 36% (702/1948) remote: Compressing objects: 37% (721/1948) remote: Compressing objects: 38% (741/1948) remote: Compressing objects: 39% (760/1948) remote: Compressing objects: 40% (780/1948) remote: Compressing objects: 41% (799/1948) remote: Compressing objects: 42% (819/1948) remote: Compressing objects: 43% (838/1948) remote: Compressing objects: 44% (858/1948) remote: Compressing objects: 45% (877/1948) remote: Compressing objects: 46% (897/1948) remote: Compressing objects: 47% (916/1948) remote: Compressing objects: 48% (936/1948) remote: Compressing objects: 49% (955/1948) remote: Compressing objects: 50% (974/1948) remote: Compressing objects: 51% (994/1948) remote: Compressing objects: 52% (1013/1948) remote: Compressing objects: 53% (1033/1948) remote: Compressing objects: 54% (1052/1948) remote: Compressing objects: 55% (1072/1948) remote: Compressing objects: 56% (1091/1948) remote: Compressing objects: 57% (1111/1948) remote: Compressing objects: 58% (1130/1948) remote: Compressing objects: 59% (1150/1948) remote: Compressing objects: 60% (1169/1948) remote: Compressing objects: 61% (1189/1948) remote: Compressing objects: 62% (1208/1948) remote: Compressing objects: 63% (1228/1948) remote: Compressing objects: 64% (1247/1948) remote: Compressing objects: 65% (1267/1948) remote: Compressing objects: 66% (1286/1948) remote: Compressing objects: 67% (1306/1948) remote: Compressing objects: 68% (1325/1948) remote: Compressing objects: 69% (1345/1948) remote: Compressing objects: 70% (1364/1948) remote: Compressing objects: 71% (1384/1948) remote: Compressing objects: 72% (1403/1948) remote: Compressing objects: 73% (1423/1948) remote: Compressing objects: 74% (1442/1948) remote: Compressing objects: 75% (1461/1948) remote: Compressing objects: 76% (1481/1948) remote: Compressing objects: 77% (1500/1948) remote: Compressing objects: 78% (1520/1948) remote: Compressing objects: 79% (1539/1948) remote: Compressing objects: 80% (1559/1948) remote: Compressing objects: 81% (1578/1948) remote: Compressing objects: 82% (1598/1948) remote: Compressing objects: 83% (1617/1948) remote: Compressing objects: 84% (1637/1948) remote: Compressing objects: 85% (1656/1948) remote: Compressing objects: 86% (1676/1948) remote: Compressing objects: 87% (1695/1948) remote: Compressing objects: 88% (1715/1948) remote: Compressing objects: 89% (1734/1948) remote: Compressing objects: 90% (1754/1948) remote: Compressing objects: 91% (1773/1948) remote: Compressing objects: 92% (1793/1948) remote: Compressing objects: 93% (1812/1948) remote: Compressing objects: 94% (1832/1948) remote: Compressing objects: 95% (1851/1948) remote: Compressing objects: 96% (1871/1948) remote: Compressing objects: 97% (1890/1948) remote: Compressing objects: 98% (1910/1948) remote: Compressing objects: 99% (1929/1948) remote: Compressing objects: 100% (1948/1948) remote: Compressing objects: 100% (1948/1948), done.
  6. 8.98 s Receiving objects: 0% (1/86358) Receiving objects: 1% (864/86358) Receiving objects: 2% (1728/86358) Receiving objects: 3% (2591/86358) Receiving objects: 4% (3455/86358) Receiving objects: 5% (4318/86358) Receiving objects: 6% (5182/86358), 9.18 MiB | 18.33 MiB/s Receiving objects: 7% (6046/86358), 9.18 MiB | 18.33 MiB/s Receiving objects: 8% (6909/86358), 9.18 MiB | 18.33 MiB/s Receiving objects: 9% (7773/86358), 9.18 MiB | 18.33 MiB/s Receiving objects: 10% (8636/86358), 9.18 MiB | 18.33 MiB/s Receiving objects: 11% (9500/86358), 9.18 MiB | 18.33 MiB/s Receiving objects: 12% (10363/86358), 9.18 MiB | 18.33 MiB/s Receiving objects: 13% (11227/86358), 9.18 MiB | 18.33 MiB/s Receiving objects: 14% (12091/86358), 9.18 MiB | 18.33 MiB/s Receiving objects: 15% (12954/86358), 9.18 MiB | 18.33 MiB/s Receiving objects: 16% (13818/86358), 9.18 MiB | 18.33 MiB/s Receiving objects: 17% (14681/86358), 9.18 MiB | 18.33 MiB/s Receiving objects: 18% (15545/86358), 9.18 MiB | 18.33 MiB/s Receiving objects: 19% (16409/86358), 9.18 MiB | 18.33 MiB/s Receiving objects: 20% (17272/86358), 9.18 MiB | 18.33 MiB/s Receiving objects: 21% (18136/86358), 9.18 MiB | 18.33 MiB/s Receiving objects: 22% (18999/86358), 9.18 MiB | 18.33 MiB/s Receiving objects: 23% (19863/86358), 9.18 MiB | 18.33 MiB/s Receiving objects: 23% (20638/86358), 9.18 MiB | 18.33 MiB/s Receiving objects: 24% (20726/86358), 22.39 MiB | 22.39 MiB/s Receiving objects: 25% (21590/86358), 22.39 MiB | 22.39 MiB/s Receiving objects: 26% (22454/86358), 22.39 MiB | 22.39 MiB/s Receiving objects: 27% (23317/86358), 22.39 MiB | 22.39 MiB/s Receiving objects: 28% (24181/86358), 22.39 MiB | 22.39 MiB/s Receiving objects: 29% (25044/86358), 22.39 MiB | 22.39 MiB/s Receiving objects: 30% (25908/86358), 22.39 MiB | 22.39 MiB/s Receiving objects: 31% (26771/86358), 22.39 MiB | 22.39 MiB/s Receiving objects: 32% (27635/86358), 22.39 MiB | 22.39 MiB/s Receiving objects: 33% (28499/86358), 22.39 MiB | 22.39 MiB/s Receiving objects: 34% (29362/86358), 22.39 MiB | 22.39 MiB/s Receiving objects: 35% (30226/86358), 22.39 MiB | 22.39 MiB/s Receiving objects: 36% (31089/86358), 22.39 MiB | 22.39 MiB/s Receiving objects: 37% (31953/86358), 22.39 MiB | 22.39 MiB/s Receiving objects: 38% (32817/86358), 22.39 MiB | 22.39 MiB/s Receiving objects: 39% (33680/86358), 22.39 MiB | 22.39 MiB/s Receiving objects: 40% (34544/86358), 22.39 MiB | 22.39 MiB/s Receiving objects: 41% (35407/86358), 22.39 MiB | 22.39 MiB/s Receiving objects: 42% (36271/86358), 22.39 MiB | 22.39 MiB/s Receiving objects: 43% (37134/86358), 22.39 MiB | 22.39 MiB/s Receiving objects: 44% (37998/86358), 22.39 MiB | 22.39 MiB/s Receiving objects: 45% (38862/86358), 43.48 MiB | 28.98 MiB/s Receiving objects: 46% (39725/86358), 43.48 MiB | 28.98 MiB/s Receiving objects: 47% (40589/86358), 43.48 MiB | 28.98 MiB/s Receiving objects: 48% (41452/86358), 43.48 MiB | 28.98 MiB/s Receiving objects: 49% (42316/86358), 43.48 MiB | 28.98 MiB/s Receiving objects: 50% (43179/86358), 43.48 MiB | 28.98 MiB/s Receiving objects: 51% (44043/86358), 43.48 MiB | 28.98 MiB/s Receiving objects: 52% (44907/86358), 43.48 MiB | 28.98 MiB/s Receiving objects: 53% (45770/86358), 43.48 MiB | 28.98 MiB/s Receiving objects: 54% (46634/86358), 43.48 MiB | 28.98 MiB/s Receiving objects: 54% (46673/86358), 58.79 MiB | 29.39 MiB/s Receiving objects: 55% (47497/86358), 58.79 MiB | 29.39 MiB/s Receiving objects: 56% (48361/86358), 58.79 MiB | 29.39 MiB/s Receiving objects: 57% (49225/86358), 58.79 MiB | 29.39 MiB/s Receiving objects: 58% (50088/86358), 58.79 MiB | 29.39 MiB/s Receiving objects: 59% (50952/86358), 71.46 MiB | 28.56 MiB/s Receiving objects: 60% (51815/86358), 71.46 MiB | 28.56 MiB/s Receiving objects: 61% (52679/86358), 71.46 MiB | 28.56 MiB/s Receiving objects: 62% (53542/86358), 71.46 MiB | 28.56 MiB/s Receiving objects: 63% (54406/86358), 71.46 MiB | 28.56 MiB/s Receiving objects: 64% (55270/86358), 71.46 MiB | 28.56 MiB/s Receiving objects: 65% (56133/86358), 71.46 MiB | 28.56 MiB/s Receiving objects: 66% (56997/86358), 71.46 MiB | 28.56 MiB/s Receiving objects: 66% (57370/86358), 91.80 MiB | 30.58 MiB/s Receiving objects: 67% (57860/86358), 104.78 MiB | 29.93 MiB/s Receiving objects: 68% (58724/86358), 104.78 MiB | 29.93 MiB/s Receiving objects: 69% (59588/86358), 104.78 MiB | 29.93 MiB/s Receiving objects: 70% (60451/86358), 104.78 MiB | 29.93 MiB/s Receiving objects: 71% (61315/86358), 104.78 MiB | 29.93 MiB/s Receiving objects: 72% (62178/86358), 104.78 MiB | 29.93 MiB/s Receiving objects: 72% (62259/86358), 104.78 MiB | 29.93 MiB/s Receiving objects: 73% (63042/86358), 114.83 MiB | 28.69 MiB/s Receiving objects: 74% (63905/86358), 114.83 MiB | 28.69 MiB/s Receiving objects: 75% (64769/86358), 130.02 MiB | 28.88 MiB/s Receiving objects: 76% (65633/86358), 130.02 MiB | 28.88 MiB/s Receiving objects: 77% (66496/86358), 130.02 MiB | 28.88 MiB/s Receiving objects: 78% (67360/86358), 130.02 MiB | 28.88 MiB/s Receiving objects: 79% (68223/86358), 130.02 MiB | 28.88 MiB/s Receiving objects: 80% (69087/86358), 130.02 MiB | 28.88 MiB/s Receiving objects: 81% (69950/86358), 130.02 MiB | 28.88 MiB/s Receiving objects: 82% (70814/86358), 130.02 MiB | 28.88 MiB/s Receiving objects: 83% (71678/86358), 130.02 MiB | 28.88 MiB/s Receiving objects: 84% (72541/86358), 130.02 MiB | 28.88 MiB/s Receiving objects: 85% (73405/86358), 130.02 MiB | 28.88 MiB/s Receiving objects: 85% (74151/86358), 146.33 MiB | 30.47 MiB/s Receiving objects: 86% (74268/86358), 146.33 MiB | 30.47 MiB/s Receiving objects: 87% (75132/86358), 146.33 MiB | 30.47 MiB/s Receiving objects: 88% (75996/86358), 146.33 MiB | 30.47 MiB/s Receiving objects: 89% (76859/86358), 146.33 MiB | 30.47 MiB/s Receiving objects: 90% (77723/86358), 146.33 MiB | 30.47 MiB/s Receiving objects: 91% (78586/86358), 146.33 MiB | 30.47 MiB/s Receiving objects: 92% (79450/86358), 146.33 MiB | 30.47 MiB/s Receiving objects: 93% (80313/86358), 146.33 MiB | 30.47 MiB/s Receiving objects: 94% (81177/86358), 146.33 MiB | 30.47 MiB/s Receiving objects: 95% (82041/86358), 146.33 MiB | 30.47 MiB/s Receiving objects: 96% (82904/86358), 146.33 MiB | 30.47 MiB/s Receiving objects: 97% (83768/86358), 146.33 MiB | 30.47 MiB/s Receiving objects: 98% (84631/86358), 146.33 MiB | 30.47 MiB/s Receiving objects: 99% (85495/86358), 146.33 MiB | 30.47 MiB/s remote: Total 86358 (delta 7720), reused 7107 (delta 6972), pack-reused 77432 (from 3)
  7. 8.98 s Receiving objects: 100% (86358/86358), 146.33 MiB | 30.47 MiB/s Receiving objects: 100% (86358/86358), 156.61 MiB | 28.52 MiB/s, done.
  8. 12.12 s Resolving deltas: 0% (0/58615) Resolving deltas: 1% (587/58615) Resolving deltas: 2% (1173/58615) Resolving deltas: 3% (1760/58615) Resolving deltas: 4% (2345/58615) Resolving deltas: 5% (2931/58615) Resolving deltas: 6% (3517/58615) Resolving deltas: 7% (4104/58615) Resolving deltas: 8% (4690/58615) Resolving deltas: 9% (5276/58615) Resolving deltas: 10% (5862/58615) Resolving deltas: 11% (6448/58615) Resolving deltas: 12% (7034/58615) Resolving deltas: 13% (7620/58615) Resolving deltas: 14% (8207/58615) Resolving deltas: 15% (8793/58615) Resolving deltas: 16% (9379/58615) Resolving deltas: 17% (9965/58615) Resolving deltas: 18% (10551/58615) Resolving deltas: 19% (11137/58615) Resolving deltas: 20% (11723/58615) Resolving deltas: 21% (12310/58615) Resolving deltas: 22% (12896/58615) Resolving deltas: 23% (13482/58615) Resolving deltas: 24% (14068/58615) Resolving deltas: 25% (14654/58615) Resolving deltas: 26% (15240/58615) Resolving deltas: 27% (15827/58615) Resolving deltas: 28% (16413/58615) Resolving deltas: 29% (16999/58615) Resolving deltas: 30% (17585/58615) Resolving deltas: 31% (18171/58615) Resolving deltas: 32% (18757/58615) Resolving deltas: 33% (19343/58615) Resolving deltas: 34% (19930/58615) Resolving deltas: 35% (20516/58615) Resolving deltas: 36% (21102/58615) Resolving deltas: 37% (21688/58615) Resolving deltas: 38% (22274/58615) Resolving deltas: 39% (22860/58615) Resolving deltas: 40% (23446/58615) Resolving deltas: 41% (24033/58615) Resolving deltas: 42% (24619/58615) Resolving deltas: 43% (25207/58615) Resolving deltas: 44% (25791/58615) Resolving deltas: 45% (26378/58615) Resolving deltas: 46% (26963/58615) Resolving deltas: 46% (27336/58615) Resolving deltas: 47% (27550/58615) Resolving deltas: 48% (28136/58615) Resolving deltas: 49% (28722/58615) Resolving deltas: 50% (29308/58615) Resolving deltas: 51% (29894/58615) Resolving deltas: 52% (30480/58615) Resolving deltas: 53% (31066/58615) Resolving deltas: 54% (31653/58615) Resolving deltas: 55% (32239/58615) Resolving deltas: 56% (32825/58615) Resolving deltas: 57% (33411/58615) Resolving deltas: 58% (33997/58615) Resolving deltas: 59% (34583/58615) Resolving deltas: 60% (35169/58615) Resolving deltas: 61% (35757/58615) Resolving deltas: 62% (36342/58615) Resolving deltas: 63% (36928/58615) Resolving deltas: 64% (37514/58615) Resolving deltas: 65% (38100/58615) Resolving deltas: 65% (38130/58615) Resolving deltas: 66% (38687/58615) Resolving deltas: 67% (39273/58615) Resolving deltas: 68% (39859/58615) Resolving deltas: 69% (40445/58615) Resolving deltas: 70% (41031/58615) Resolving deltas: 71% (41617/58615) Resolving deltas: 72% (42203/58615) Resolving deltas: 73% (42789/58615) Resolving deltas: 74% (43376/58615) Resolving deltas: 75% (43962/58615) Resolving deltas: 76% (44548/58615) Resolving deltas: 77% (45134/58615) Resolving deltas: 78% (45720/58615) Resolving deltas: 79% (46306/58615) Resolving deltas: 80% (46892/58615) Resolving deltas: 81% (47479/58615) Resolving deltas: 82% (48066/58615) Resolving deltas: 83% (48651/58615) Resolving deltas: 84% (49237/58615) Resolving deltas: 85% (49823/58615) Resolving deltas: 86% (50409/58615) Resolving deltas: 87% (50996/58615) Resolving deltas: 88% (51582/58615) Resolving deltas: 89% (52168/58615) Resolving deltas: 90% (52754/58615) Resolving deltas: 91% (53340/58615) Resolving deltas: 92% (53926/58615) Resolving deltas: 93% (54512/58615) Resolving deltas: 94% (55099/58615) Resolving deltas: 95% (55686/58615) Resolving deltas: 96% (56271/58615) Resolving deltas: 97% (56857/58615) Resolving deltas: 97% (56860/58615) Resolving deltas: 98% (57443/58615) Resolving deltas: 99% (58029/58615) Resolving deltas: 100% (58615/58615) Resolving deltas: 100% (58615/58615), done.
  9. 13.12 s Fetching commit d979b335ea0af89a417744262e7419cfc6a51208 for faster_uv_from_4d ...
  10. 13.12 s $ /nix/store/bcnisk3ydfgv26v2gw3zlky24g00yww2-git-2.54.0/bin/git fetch origin d979b335ea0af89a417744262e7419cfc6a51208
  11. 13.76 s From https://github.com/alphal00p/gammaloop
  12. 13.76 s * branch d979b335ea0af89a417744262e7419cfc6a51208 -> FETCH_HEAD
  13. 13.85 s $ /nix/store/9ypz3flqsrl5xl495mm8h645gadjsxi1-coreutils-9.11/bin/timeout --kill-after=15s 7200s /nix/store/bcnisk3ydfgv26v2gw3zlky24g00yww2-git-2.54.0/bin/git -c advice.detachedHead=false checkout d979b335ea0af89a417744262e7419cfc6a51208
  14. 14.40 s HEAD is now at d979b335e prepare merge scope and enable checks for the original base
  15. 14.43 s $ /nix/store/9ypz3flqsrl5xl495mm8h645gadjsxi1-coreutils-9.11/bin/timeout --kill-after=15s 7200s /nix/store/23zk8sgzamrbmj1fday15szf7f2279s8-nix-2.34.7/bin/nix --extra-experimental-features nix-command --extra-experimental-features flakes --log-format internal-json run .#packages.x86_64-linux.nix-ci-check-gammaloop-nextest-core --print-build-logs
  16. 14.96 s
  17. 24.91 s evaluating derivation 'g copying '/nix/store/j1sc evaluating derivation 'g copying '/nix/store/j1sc evaluating derivation 'g copying '/nix/store/j1sc evaluating derivation 'g copying '/nix/store/j1sc evaluating derivation 'g copying '/nix/store/j1sc evaluating derivation 'g copying '/nix/store/j1sc evaluating derivation 'g copying '/nix/store/j1sc evaluating derivation 'g copying '/nix/store/j1sc evaluating derivation 'g copying '/nix/store/j1sc evaluating derivation 'g [0/1 built] [1/0/1 built] building ggammaloop-nextest-core> Extracting 4 binaries (including 1 non-test binary), 1 build script output directory, and 2 linked paths to /build/nextest-archive-1Rm0zJ
  18. 26.08 s gammaloop-nextest-core> Extracted 20 files to /build/nextest-archive-1Rm0zJ in 1.18s
  19. 26.17 s gammaloop-nextest-core> ------------
  20. 26.17 s gammaloop-nextest-core> Nextest run ID 3669e346-b741-4ee3-9db5-1b77385089ef with nextest profile: ci_gammaloop
  21. 26.17 s gammaloop-nextest-core> Starting 379 tests across 3 binaries
  22. 29.05 s gammaloop-nextest-core> ------------
  23. 29.05 s gammaloop-nextest-core> Summary [ 2.885s] 379 tests run: 379 passed, 0 skipped
  24. 29.23 s gammaloop-nextest-core>
  25. 29.23 s gammaloop-nextest-core> ========== nextest test summary ==========
  26. 29.23 s gammaloop-nextest-core> report: target/nextest/ci_gammaloop/junit.xml
  27. 29.23 s gammaloop-nextest-core> tests: 379, failures: 0, errors: 0
  28. 29.23 s gammaloop-nextest-core> No failing testcases found.
  29. 29.23 s gammaloop-nextest-core> =========================================
  30. 29.27 s gammaloop-nextest-core> Extracting 1 binary and 1 linked path to /build/nextest-archive-Kk7NJx
  31. 29.38 s gammaloop-nextest-core> Extracted 7 files to /build/nextest-archive-Kk7NJx in 0.11s
  32. 29.42 s gammaloop-nextest-core> ------------
  33. 29.42 s gammaloop-nextest-core> Nextest run ID 6b824fec-ff14-4231-a170-cc166fe46f61 with nextest profile: ci_gammaloop
  34. 29.42 s gammaloop-nextest-core> Starting 19 tests across 1 binary
  35. 29.51 s gammaloop-nextest-core> ------------
  36. 29.51 s gammaloop-nextest-core> Summary [ 0.091s] 19 tests run: 19 passed, 0 skipped
  37. 29.61 s gammaloop-nextest-core>
  38. 29.61 s gammaloop-nextest-core> ========== nextest test summary ==========
  39. 29.61 s gammaloop-nextest-core> report: target/nextest/ci_gammaloop/junit.xml
  40. 29.61 s gammaloop-nextest-core> tests: 19, failures: 0, errors: 0
  41. 29.61 s gammaloop-nextest-core> No failing testcases found.
  42. 29.61 s gammaloop-nextest-core> =========================================
  43. 29.65 s gammaloop-nextest-core> Extracting 1 binary to /build/nextest-archive-G5SvhI
  44. 29.74 s gammaloop-nextest-core> Extracted 4 files to /build/nextest-archive-G5SvhI in 0.09s
  45. 29.80 s gammaloop-nextest-core> ------------
  46. 29.80 s gammaloop-nextest-core> Nextest run ID 07740a95-f788-4c2f-877d-db2799ca1852 with nextest profile: ci_gammaloop
  47. 29.80 s gammaloop-nextest-core> Starting 0 tests across 1 binary
  48. 29.80 s gammaloop-nextest-core> ------------
  49. 29.80 s gammaloop-nextest-core> Summary [ 0.000s] 0 tests run: 0 passed, 0 skipped
  50. 29.89 s gammaloop-nextest-core>
  51. 29.89 s gammaloop-nextest-core> ========== nextest test summary ==========
  52. 29.89 s gammaloop-nextest-core> report: target/nextest/ci_gammaloop/junit.xml
  53. 29.89 s gammaloop-nextest-core> tests: 0, failures: 0, errors: 0
  54. 29.89 s gammaloop-nextest-core> No failing testcases found.
  55. 29.89 s gammaloop-nextest-core> =========================================
  56. 29.94 s gammaloop-nextest-core> Extracting 4 binaries, 1 build script output directory, and 2 linked paths to /build/nextest-archive-qgztaq
  57. 30.76 s gammaloop-nextest-core> Extracted 18 files to /build/nextest-archive-qgztaq in 0.83s
  58. 30.88 s gammaloop-nextest-core> ------------
  59. 30.88 s gammaloop-nextest-core> Nextest run ID faa2e432-d0c4-4f74-b212-65293a8991af with nextest profile: ci_gammaloop
  60. 30.88 s gammaloop-nextest-core> Starting 706 tests across 4 binaries (60 tests skipped, including 59 tests via profile.ci_gammaloop.default-filter)
  61. 53.81 s gammaloop-nextest-core> FAIL [ 8.945s] (701/706) gammalooprs::test_renormalization finite_part_ghost_2loop
  62. 53.81 s gammaloop-nextest-core> stdout ---
  63. 53.81 s gammaloop-nextest-core>
  64. 53.81 s gammaloop-nextest-core> running 1 test
  65. 53.81 s gammaloop-nextest-core> test finite_part_ghost_2loop ... FAILED
  66. 53.81 s gammaloop-nextest-core>
  67. 53.81 s gammaloop-nextest-core> failures:
  68. 53.81 s gammaloop-nextest-core>
  69. 53.81 s gammaloop-nextest-core> failures:
  70. 53.81 s gammaloop-nextest-core> finite_part_ghost_2loop
  71. 53.81 s gammaloop-nextest-core>
  72. 53.81 s gammaloop-nextest-core> test result: FAILED. 0 passed; 1 failed; 0 ignored; 0 measured; 6 filtered out; finished in 8.93s
  73. 53.81 s gammaloop-nextest-core>
  74. 53.81 s gammaloop-nextest-core> stderr ---
  75. 53.81 s gammaloop-nextest-core> The application panicked (crashed).
  76. 53.81 s gammaloop-nextest-core> Message: assertion failed: (align_to_rqft(&a, &model) - expected).expand().is_zero()
  77. 53.81 s gammaloop-nextest-core> Location: crates/gammalooprs/tests/test_renormalization.rs:583
  78. 53.81 s gammaloop-nextest-core>
  79. 53.81 s gammaloop-nextest-core> ━━━━━━━━━━━━━━━━━━━━━━━━━━━━━━━━━━ BACKTRACE ━━━━━━━━━━━━━━━━━━━━━━━━━━━━━━━━━━━
  80. 53.81 s gammaloop-nextest-core> 1: <color_eyre[51793ea62743adbd]::config::PanicHook>::panic_report<unknown>
  81. 53.81 s gammaloop-nextest-core> at <unknown source file>:<unknown line>
  82. 53.81 s gammaloop-nextest-core> 2: <color_eyre[51793ea62743adbd]::config::PanicHook>::into_panic_hook::{closure#0}<unknown>
  83. 53.81 s gammaloop-nextest-core> at <unknown source file>:<unknown line>
  84. 53.81 s gammaloop-nextest-core> 3: std[bcb96dfbba0ab899]::panicking::panic_with_hook<unknown>
  85. 53.81 s gammaloop-nextest-core> at <unknown source file>:<unknown line>
  86. 53.81 s gammaloop-nextest-core> 4: std[bcb96dfbba0ab899]::panicking::panic_handler::{closure#0}<unknown>
  87. 53.81 s gammaloop-nextest-core> at <unknown source file>:<unknown line>
  88. 53.81 s gammaloop-nextest-core> 5: std[bcb96dfbba0ab899]::sys::backtrace::__rust_end_short_backtrace::<std[bcb96dfbba0ab899]::panicking::panic_handler::{closure#0}, !><unknown>
  89. 53.81 s gammaloop-nextest-core> at <unknown source file>:<unknown line>
  90. 53.81 s gammaloop-nextest-core> 6: __rustc[6c289b9f9c454d21]::rust_begin_unwind<unknown>
  91. 53.81 s gammaloop-nextest-core> at <unknown source file>:<unknown line>
  92. 53.81 s gammaloop-nextest-core> 7: core[940e698046960fd5]::panicking::panic_fmt<unknown>
  93. 53.81 s gammaloop-nextest-core> at <unknown source file>:<unknown line>
  94. 53.81 s gammaloop-nextest-core> 8: core[940e698046960fd5]::panicking::panic<unknown>
  95. 53.81 s gammaloop-nextest-core> at <unknown source file>:<unknown line>
  96. 53.81 s gammaloop-nextest-core> 9: <test_renormalization[5812939ef1a04d89]::finite_part_ghost_2loop::{closure#0} as core[940e698046960fd5]::ops::function::FnOnce<()>>::call_once<unknown>
  97. 53.81 s gammaloop-nextest-core> at <unknown source file>:<unknown line>
  98. 53.81 s gammaloop-nextest-core> 10: test[75d6903177b1d7e9]::__rust_begin_short_backtrace::<core[940e698046960fd5]::result::Result<(), alloc[2ea6bcb46fca0c42]::string::String>, fn() -> core[940e698046960fd5]::result::Result<(), alloc[2ea6bcb46fca0c42]::string::String>><unknown>
  99. 53.81 s gammaloop-nextest-core> at <unknown source file>:<unknown line>
  100. 53.81 s gammaloop-nextest-core> 11: test[75d6903177b1d7e9]::run_test::{closure#0}<unknown>
  101. 53.81 s gammaloop-nextest-core> at <unknown source file>:<unknown line>
  102. 53.81 s gammaloop-nextest-core> 12: std[bcb96dfbba0ab899]::sys::backtrace::__rust_begin_short_backtrace::<test[75d6903177b1d7e9]::run_test::{closure#1}, ()><unknown>
  103. 53.81 s gammaloop-nextest-core> at <unknown source file>:<unknown line>
  104. 53.81 s gammaloop-nextest-core> 13: <std[bcb96dfbba0ab899]::thread::lifecycle::spawn_unchecked<test[75d6903177b1d7e9]::run_test::{closure#1}, ()>::{closure#1} as core[940e698046960fd5]::ops::function::FnOnce<()>>::call_once::{shim:vtable#0}<unknown>
  105. 53.81 s gammaloop-nextest-core> at <unknown source file>:<unknown line>
  106. 53.81 s gammaloop-nextest-core> 14: <std[bcb96dfbba0ab899]::sys::thread::unix::Thread>::new::thread_start<unknown>
  107. 53.81 s gammaloop-nextest-core> at <unknown source file>:<unknown line>
  108. 53.81 s gammaloop-nextest-core> 15: start_thread<unknown>
  109. 53.81 s gammaloop-nextest-core> at <unknown source file>:<unknown line>
  110. 53.81 s gammaloop-nextest-core> 16: __clone3<unknown>
  111. 53.81 s gammaloop-nextest-core> at <unknown source file>:<unknown line>
  112. 53.81 s gammaloop-nextest-core>
  113. 53.81 s gammaloop-nextest-core> Run with COLORBT_SHOW_HIDDEN=1 environment variable to disable frame filtering.
  114. 53.81 s gammaloop-nextest-core> Run with RUST_BACKTRACE=full to include source snippets.
  115. 53.81 s gammaloop-nextest-core>
  116. 66.53 s gammaloop-nextest-core> ------------
  117. 66.53 s gammaloop-nextest-core> Summary [ 35.654s] 706 tests run: 705 passed, 1 failed, 60 skipped
  118. 66.53 s gammaloop-nextest-core> FAIL [ 8.945s] (701/706) gammalooprs::test_renormalization finite_part_ghost_2loop
  119. 66.53 s gammaloop-nextest-core> stdout ---
  120. 66.53 s gammaloop-nextest-core>
  121. 66.53 s gammaloop-nextest-core> running 1 test
  122. 66.53 s gammaloop-nextest-core> test finite_part_ghost_2loop ... FAILED
  123. 66.53 s gammaloop-nextest-core>
  124. 66.53 s gammaloop-nextest-core> failures:
  125. 66.53 s gammaloop-nextest-core>
  126. 66.53 s gammaloop-nextest-core> failures:
  127. 66.53 s gammaloop-nextest-core> finite_part_ghost_2loop
  128. 66.53 s gammaloop-nextest-core>
  129. 66.53 s gammaloop-nextest-core> test result: FAILED. 0 passed; 1 failed; 0 ignored; 0 measured; 6 filtered out; finished in 8.93s
  130. 66.53 s gammaloop-nextest-core>
  131. 66.53 s gammaloop-nextest-core> stderr ---
  132. 66.53 s gammaloop-nextest-core> The application panicked (crashed).
  133. 66.53 s gammaloop-nextest-core> Message: assertion failed: (align_to_rqft(&a, &model) - expected).expand().is_zero()
  134. 66.53 s gammaloop-nextest-core> Location: crates/gammalooprs/tests/test_renormalization.rs:583
  135. 66.53 s gammaloop-nextest-core>
  136. 66.53 s gammaloop-nextest-core> ━━━━━━━━━━━━━━━━━━━━━━━━━━━━━━━━━━ BACKTRACE ━━━━━━━━━━━━━━━━━━━━━━━━━━━━━━━━━━━
  137. 66.53 s gammaloop-nextest-core> 1: <color_eyre[51793ea62743adbd]::config::PanicHook>::panic_report<unknown>
  138. 66.53 s gammaloop-nextest-core> at <unknown source file>:<unknown line>
  139. 66.53 s gammaloop-nextest-core> 2: <color_eyre[51793ea62743adbd]::config::PanicHook>::into_panic_hook::{closure#0}<unknown>
  140. 66.53 s gammaloop-nextest-core> at <unknown source file>:<unknown line>
  141. 66.53 s gammaloop-nextest-core> 3: std[bcb96dfbba0ab899]::panicking::panic_with_hook<unknown>
  142. 66.53 s gammaloop-nextest-core> at <unknown source file>:<unknown line>
  143. 66.53 s gammaloop-nextest-core> 4: std[bcb96dfbba0ab899]::panicking::panic_handler::{closure#0}<unknown>
  144. 66.53 s gammaloop-nextest-core> at <unknown source file>:<unknown line>
  145. 66.53 s gammaloop-nextest-core> 5: std[bcb96dfbba0ab899]::sys::backtrace::__rust_end_short_backtrace::<std[bcb96dfbba0ab899]::panicking::panic_handler::{closure#0}, !><unknown>
  146. 66.53 s gammaloop-nextest-core> at <unknown source file>:<unknown line>
  147. 66.53 s gammaloop-nextest-core> 6: __rustc[6c289b9f9c454d21]::rust_begin_unwind<unknown>
  148. 66.53 s gammaloop-nextest-core> at <unknown source file>:<unknown line>
  149. 66.53 s gammaloop-nextest-core> 7: core[940e698046960fd5]::panicking::panic_fmt<unknown>
  150. 66.53 s gammaloop-nextest-core> at <unknown source file>:<unknown line>
  151. 66.53 s gammaloop-nextest-core> 8: core[940e698046960fd5]::panicking::panic<unknown>
  152. 66.53 s gammaloop-nextest-core> at <unknown source file>:<unknown line>
  153. 66.53 s gammaloop-nextest-core> 9: <test_renormalization[5812939ef1a04d89]::finite_part_ghost_2loop::{closure#0} as core[940e698046960fd5]::ops::function::FnOnce<()>>::call_once<unknown>
  154. 66.53 s gammaloop-nextest-core> at <unknown source file>:<unknown line>
  155. 66.53 s gammaloop-nextest-core> 10: test[75d6903177b1d7e9]::__rust_begin_short_backtrace::<core[940e698046960fd5]::result::Result<(), alloc[2ea6bcb46fca0c42]::string::String>, fn() -> core[940e698046960fd5]::result::Result<(), alloc[2ea6bcb46fca0c42]::string::String>><unknown>
  156. 66.53 s gammaloop-nextest-core> at <unknown source file>:<unknown line>
  157. 66.53 s gammaloop-nextest-core> 11: test[75d6903177b1d7e9]::run_test::{closure#0}<unknown>
  158. 66.53 s gammaloop-nextest-core> at <unknown source file>:<unknown line>
  159. 66.53 s gammaloop-nextest-core> 12: std[bcb96dfbba0ab899]::sys::backtrace::__rust_begin_short_backtrace::<test[75d6903177b1d7e9]::run_test::{closure#1}, ()><unknown>
  160. 66.53 s gammaloop-nextest-core> at <unknown source file>:<unknown line>
  161. 66.53 s gammaloop-nextest-core> 13: <std[bcb96dfbba0ab899]::thread::lifecycle::spawn_unchecked<test[75d6903177b1d7e9]::run_test::{closure#1}, ()>::{closure#1} as core[940e698046960fd5]::ops::function::FnOnce<()>>::call_once::{shim:vtable#0}<unknown>
  162. 66.53 s gammaloop-nextest-core> at <unknown source file>:<unknown line>
  163. 66.53 s gammaloop-nextest-core> 14: <std[bcb96dfbba0ab899]::sys::thread::unix::Thread>::new::thread_start<unknown>
  164. 66.53 s gammaloop-nextest-core> at <unknown source file>:<unknown line>
  165. 66.53 s gammaloop-nextest-core> 15: start_thread<unknown>
  166. 66.53 s gammaloop-nextest-core> at <unknown source file>:<unknown line>
  167. 66.53 s gammaloop-nextest-core> 16: __clone3<unknown>
  168. 66.53 s gammaloop-nextest-core> at <unknown source file>:<unknown line>
  169. 66.53 s gammaloop-nextest-core>
  170. 66.53 s gammaloop-nextest-core> Run with COLORBT_SHOW_HIDDEN=1 environment variable to disable frame filtering.
  171. 66.53 s gammaloop-nextest-core> Run with RUST_BACKTRACE=full to include source snippets.
  172. 66.53 s gammaloop-nextest-core>
  173. 66.70 s gammaloop-nextest-core> error: test run failed
  174. 66.75 s gammaloop-nextest-core>
  175. 66.75 s gammaloop-nextest-core> ========== nextest test summary ==========
  176. 66.75 s gammaloop-nextest-core> report: target/nextest/ci_gammaloop/junit.xml
  177. 66.75 s gammaloop-nextest-core> tests: 706, failures: 1, errors: 0
  178. 66.75 s gammaloop-nextest-core>
  179. 66.75 s gammaloop-nextest-core> 1. gammalooprs::test_renormalization::finite_part_ghost_2loop
  180. 66.75 s gammaloop-nextest-core> failure: test failure with exit code 101
  181. 66.75 s gammaloop-nextest-core> system-out
  182. 66.75 s gammaloop-nextest-core> running 1 test
  183. 66.75 s gammaloop-nextest-core> test finite_part_ghost_2loop ... FAILED
  184. 66.75 s gammaloop-nextest-core>
  185. 66.75 s gammaloop-nextest-core> failures:
  186. 66.75 s gammaloop-nextest-core>
  187. 66.75 s gammaloop-nextest-core> failures:
  188. 66.75 s gammaloop-nextest-core> finite_part_ghost_2loop
  189. 66.75 s gammaloop-nextest-core>
  190. 66.75 s gammaloop-nextest-core> test result: FAILED. 0 passed; 1 failed; 0 ignored; 0 measured; 6 filtered out; finished in 8.93s
  191. 66.75 s gammaloop-nextest-core> system-err
  192. 66.75 s gammaloop-nextest-core> The application panicked (crashed).
  193. 66.75 s gammaloop-nextest-core> Message: assertion failed: (align_to_rqft(&a, &model) - expected).expand().is_zero()
  194. 66.75 s gammaloop-nextest-core> Location: crates/gammalooprs/tests/test_renormalization.rs:583
  195. 66.75 s gammaloop-nextest-core>
  196. 66.75 s gammaloop-nextest-core> ━━━━━━━━━━━━━━━━━━━━━━━━━━━━━━━━━━ BACKTRACE ━━━━━━━━━━━━━━━━━━━━━━━━━━━━━━━━━━━
  197. 66.75 s gammaloop-nextest-core> 1: <color_eyre[51793ea62743adbd]::config::PanicHook>::panic_report<unknown>
  198. 66.75 s gammaloop-nextest-core> at <unknown source file>:<unknown line>
  199. 66.75 s gammaloop-nextest-core> 2: <color_eyre[51793ea62743adbd]::config::PanicHook>::into_panic_hook::{closure#0}<unknown>
  200. 66.75 s gammaloop-nextest-core> at <unknown source file>:<unknown line>
  201. 66.75 s gammaloop-nextest-core> 3: std[bcb96dfbba0ab899]::panicking::panic_with_hook<unknown>
  202. 66.75 s gammaloop-nextest-core> at <unknown source file>:<unknown line>
  203. 66.75 s gammaloop-nextest-core> 4: std[bcb96dfbba0ab899]::panicking::panic_handler::{closure#0}<unknown>
  204. 66.75 s gammaloop-nextest-core> at <unknown source file>:<unknown line>
  205. 66.75 s gammaloop-nextest-core> 5: std[bcb96dfbba0ab899]::sys::backtrace::__rust_end_short_backtrace::<std[bcb96dfbba0ab899]::panicking::panic_handler::{closure#0}, !><unknown>
  206. 66.75 s gammaloop-nextest-core> at <unknown source file>:<unknown line>
  207. 66.75 s gammaloop-nextest-core> 6: __rustc[6c289b9f9c454d21]::rust_begin_unwind<unknown>
  208. 66.75 s gammaloop-nextest-core> at <unknown source file>:<unknown line>
  209. 66.75 s gammaloop-nextest-core> 7: core[940e698046960fd5]::panicking::panic_fmt<unknown>
  210. 66.75 s gammaloop-nextest-core> at <unknown source file>:<unknown line>
  211. 66.75 s gammaloop-nextest-core> 8: core[940e698046960fd5]::panicking::panic<unknown>
  212. 66.75 s gammaloop-nextest-core> at <unknown source file>:<unknown line>
  213. 66.75 s gammaloop-nextest-core> 9: <test_renormalization[5812939ef1a04d89]::finite_part_ghost_2loop::{closure#0} as core[940e698046960fd5]::ops::function::FnOnce<()>>::call_once<unknown>
  214. 66.75 s gammaloop-nextest-core> at <unknown source file>:<unknown line>
  215. 66.75 s gammaloop-nextest-core> 10: test[75d6903177b1d7e9]::__rust_begin_short_backtrace::<core[940e698046960fd5]::result::Result<(), alloc[2ea6bcb46fca0c42]::string::String>, fn() -> core[940e698046960fd5]::result::Result<(), alloc[2ea6bcb46fca0c42]::string::String>><unknown>
  216. 66.75 s gammaloop-nextest-core> at <unknown source file>:<unknown line>
  217. 66.75 s gammaloop-nextest-core> 11: test[75d6903177b1d7e9]::run_test::{closure#0}<unknown>
  218. 66.75 s gammaloop-nextest-core> at <unknown source file>:<unknown line>
  219. 66.75 s gammaloop-nextest-core> 12: std[bcb96dfbba0ab899]::sys::backtrace::__rust_begin_short_backtrace::<test[75d6903177b1d7e9]::run_test::{closure#1}, ()><unknown>
  220. 66.75 s gammaloop-nextest-core> at <unknown source file>:<unknown line>
  221. 66.75 s gammaloop-nextest-core> 13: <std[bcb96dfbba0ab899]::thread::lifecycle::spawn_unchecked<test[75d6903177b1d7e9]::run_test::{closure#1}, ()>::{closure#1} as core[940e698046960fd5]::ops::function::FnOnce<()>>::call_once::{shim:vtable#0}<unknown>
  222. 66.75 s gammaloop-nextest-core> at <unknown source file>:<unknown line>
  223. 66.75 s gammaloop-nextest-core> 14: <std[bcb96dfbba0ab899]::sys::thread::unix::Thread>::new::thread_start<unknown>
  224. 66.75 s gammaloop-nextest-core> at <unknown source file>:<unknown line>
  225. 66.75 s gammaloop-nextest-core> 15: start_thread<unknown>
  226. 66.75 s gammaloop-nextest-core> at <unknown source file>:<unknown line>
  227. 66.75 s gammaloop-nextest-core> 16: __clone3<unknown>
  228. 66.75 s gammaloop-nextest-core> at <unknown source file>:<unknown line>
  229. 66.75 s gammaloop-nextest-core>
  230. 66.75 s gammaloop-nextest-core> Run with COLORBT_SHOW_HIDDEN=1 environment variable to disable frame filtering.
  231. 66.75 s gammaloop-nextest-core> Run with RUST_BACKTRACE=full to include source snippets.
  232. 66.75 s gammaloop-nextest-core> =========================================
  233. 66.80 s gammaloop-nextest-core> Extracting 1 binary, 1 build script output directory, and 1 linked path to /build/nextest-archive-Kinznx
  234. 66.96 s gammaloop-nextest-core> Extracted 7 files to /build/nextest-archive-Kinznx in 0.17s
  235. 66.99 s gammaloop-nextest-core> ------------
  236. 66.99 s gammaloop-nextest-core> Nextest run ID 7632e13f-e2d0-4a51-a8d8-4315553c7310 with nextest profile: ci_gammaloop
  237. 66.99 s gammaloop-nextest-core> Starting 105 tests across 1 binary
  238. 101.46 s gammaloop-nextest-core> ------------
  239. 101.46 s gammaloop-nextest-core> Summary [ 34.471s] 105 tests run: 105 passed, 0 skipped
  240. 101.54 s gammaloop-nextest-core>
  241. 101.54 s gammaloop-nextest-core> ========== nextest test summary ==========
  242. 101.54 s gammaloop-nextest-core> report: target/nextest/ci_gammaloop/junit.xml
  243. 101.54 s gammaloop-nextest-core> tests: 105, failures: 0, errors: 0
  244. 101.54 s gammaloop-nextest-core> No failing testcases found.
  245. 101.54 s gammaloop-nextest-core> =========================================
  246. 101.62 s error: Cannot build '/nix/store/gfw8irsajvc73r64ijh06rb30gc2744x-gammaloop-nextest-core.drv'.
  247. 101.62 s Reason: builder failed with exit code 100.
  248. 101.62 s Output paths:
  249. 101.62 s /nix/store/p3ayrsjin2c2zsszczl860szaj7271z8-gammaloop-nextest-core
  250. 101.62 s Last 229 log lines:
  251. 101.62 s > Extracting 4 binaries (including 1 non-test binary), 1 build script output directory, and 2 linked paths to /build/nextest-archive-1Rm0zJ
  252. 101.62 s > Extracted 20 files to /build/nextest-archive-1Rm0zJ in 1.18s
  253. 101.62 s > ------------
  254. 101.62 s > Nextest run ID 3669e346-b741-4ee3-9db5-1b77385089ef with nextest profile: ci_gammaloop
  255. 101.62 s > Starting 379 tests across 3 binaries
  256. 101.62 s > ------------
  257. 101.62 s > Summary [ 2.885s] 379 tests run: 379 passed, 0 skipped
  258. 101.62 s >
  259. 101.62 s > ========== nextest test summary ==========
  260. 101.62 s > report: target/nextest/ci_gammaloop/junit.xml
  261. 101.62 s > tests: 379, failures: 0, errors: 0
  262. 101.62 s > No failing testcases found.
  263. 101.62 s > =========================================
  264. 101.62 s > Extracting 1 binary and 1 linked path to /build/nextest-archive-Kk7NJx
  265. 101.62 s > Extracted 7 files to /build/nextest-archive-Kk7NJx in 0.11s
  266. 101.62 s > ------------
  267. 101.62 s > Nextest run ID 6b824fec-ff14-4231-a170-cc166fe46f61 with nextest profile: ci_gammaloop
  268. 101.62 s > Starting 19 tests across 1 binary
  269. 101.62 s > ------------
  270. 101.62 s > Summary [ 0.091s] 19 tests run: 19 passed, 0 skipped
  271. 101.62 s >
  272. 101.62 s > ========== nextest test summary ==========
  273. 101.62 s > report: target/nextest/ci_gammaloop/junit.xml
  274. 101.62 s > tests: 19, failures: 0, errors: 0
  275. 101.62 s > No failing testcases found.
  276. 101.62 s > =========================================
  277. 101.62 s > Extracting 1 binary to /build/nextest-archive-G5SvhI
  278. 101.62 s > Extracted 4 files to /build/nextest-archive-G5SvhI in 0.09s
  279. 101.62 s > ------------
  280. 101.62 s > Nextest run ID 07740a95-f788-4c2f-877d-db2799ca1852 with nextest profile: ci_gammaloop
  281. 101.62 s > Starting 0 tests across 1 binary
  282. 101.62 s > ------------
  283. 101.62 s > Summary [ 0.000s] 0 tests run: 0 passed, 0 skipped
  284. 101.62 s >
  285. 101.62 s > ========== nextest test summary ==========
  286. 101.62 s > report: target/nextest/ci_gammaloop/junit.xml
  287. 101.62 s > tests: 0, failures: 0, errors: 0
  288. 101.62 s > No failing testcases found.
  289. 101.62 s > =========================================
  290. 101.62 s > Extracting 4 binaries, 1 build script output directory, and 2 linked paths to /build/nextest-archive-qgztaq
  291. 101.62 s > Extracted 18 files to /build/nextest-archive-qgztaq in 0.83s
  292. 101.62 s > ------------
  293. 101.62 s > Nextest run ID faa2e432-d0c4-4f74-b212-65293a8991af with nextest profile: ci_gammaloop
  294. 101.62 s > Starting 706 tests across 4 binaries (60 tests skipped, including 59 tests via profile.ci_gammaloop.default-filter)
  295. 101.62 s > FAIL [ 8.945s] (701/706) gammalooprs::test_renormalization finite_part_ghost_2loop
  296. 101.62 s > stdout ---
  297. 101.62 s >
  298. 101.62 s > running 1 test
  299. 101.62 s > test finite_part_ghost_2loop ... FAILED
  300. 101.62 s >
  301. 101.62 s > failures:
  302. 101.62 s >
  303. 101.62 s > failures:
  304. 101.62 s > finite_part_ghost_2loop
  305. 101.62 s >
  306. 101.62 s > test result: FAILED. 0 passed; 1 failed; 0 ignored; 0 measured; 6 filtered out; finished in 8.93s
  307. 101.62 s >
  308. 101.62 s > stderr ---
  309. 101.62 s > The application panicked (crashed).
  310. 101.62 s > Message: assertion failed: (align_to_rqft(&a, &model) - expected).expand().is_zero()
  311. 101.62 s > Location: crates/gammalooprs/tests/test_renormalization.rs:583
  312. 101.62 s >
  313. 101.62 s > ━━━━━━━━━━━━━━━━━━━━━━━━━━━━━━━━━━ BACKTRACE ━━━━━━━━━━━━━━━━━━━━━━━━━━━━━━━━━━━
  314. 101.62 s > 1: <color_eyre[51793ea62743adbd]::config::PanicHook>::panic_report<unknown>
  315. 101.62 s > at <unknown source file>:<unknown line>
  316. 101.62 s > 2: <color_eyre[51793ea62743adbd]::config::PanicHook>::into_panic_hook::{closure#0}<unknown>
  317. 101.62 s > at <unknown source file>:<unknown line>
  318. 101.62 s > 3: std[bcb96dfbba0ab899]::panicking::panic_with_hook<unknown>
  319. 101.62 s > at <unknown source file>:<unknown line>
  320. 101.62 s > 4: std[bcb96dfbba0ab899]::panicking::panic_handler::{closure#0}<unknown>
  321. 101.62 s > at <unknown source file>:<unknown line>
  322. 101.62 s > 5: std[bcb96dfbba0ab899]::sys::backtrace::__rust_end_short_backtrace::<std[bcb96dfbba0ab899]::panicking::panic_handler::{closure#0}, !><unknown>
  323. 101.62 s > at <unknown source file>:<unknown line>
  324. 101.62 s > 6: __rustc[6c289b9f9c454d21]::rust_begin_unwind<unknown>
  325. 101.62 s > at <unknown source file>:<unknown line>
  326. 101.62 s > 7: core[940e698046960fd5]::panicking::panic_fmt<unknown>
  327. 101.62 s > at <unknown source file>:<unknown line>
  328. 101.62 s > 8: core[940e698046960fd5]::panicking::panic<unknown>
  329. 101.62 s > at <unknown source file>:<unknown line>
  330. 101.62 s > 9: <test_renormalization[5812939ef1a04d89]::finite_part_ghost_2loop::{closure#0} as core[940e698046960fd5]::ops::function::FnOnce<()>>::call_once<unknown>
  331. 101.62 s > at <unknown source file>:<unknown line>
  332. 101.62 s > 10: test[75d6903177b1d7e9]::__rust_begin_short_backtrace::<core[940e698046960fd5]::result::Result<(), alloc[2ea6bcb46fca0c42]::string::String>, fn() -> core[940e698046960fd5]::result::Result<(), alloc[2ea6bcb46fca0c42]::string::String>><unknown>
  333. 101.62 s > at <unknown source file>:<unknown line>
  334. 101.62 s > 11: test[75d6903177b1d7e9]::run_test::{closure#0}<unknown>
  335. 101.62 s > at <unknown source file>:<unknown line>
  336. 101.62 s > 12: std[bcb96dfbba0ab899]::sys::backtrace::__rust_begin_short_backtrace::<test[75d6903177b1d7e9]::run_test::{closure#1}, ()><unknown>
  337. 101.63 s > at <unknown source file>:<unknown line>
  338. 101.63 s > 13: <std[bcb96dfbba0ab899]::thread::lifecycle::spawn_unchecked<test[75d6903177b1d7e9]::run_test::{closure#1}, ()>::{closure#1} as core[940e698046960fd5]::ops::function::FnOnce<()>>::call_once::{shim:vtable#0}<unknown>
  339. 101.63 s > at <unknown source file>:<unknown line>
  340. 101.63 s > 14: <std[bcb96dfbba0ab899]::sys::thread::unix::Thread>::new::thread_start<unknown>
  341. 101.63 s > at <unknown source file>:<unknown line>
  342. 101.63 s > 15: start_thread<unknown>
  343. 101.63 s > at <unknown source file>:<unknown line>
  344. 101.63 s > 16: __clone3<unknown>
  345. 101.63 s > at <unknown source file>:<unknown line>
  346. 101.63 s >
  347. 101.63 s > Run with COLORBT_SHOW_HIDDEN=1 environment variable to disable frame filtering.
  348. 101.63 s > Run with RUST_BACKTRACE=full to include source snippets.
  349. 101.63 s >
  350. 101.63 s > ------------
  351. 101.63 s > Summary [ 35.654s] 706 tests run: 705 passed, 1 failed, 60 skipped
  352. 101.63 s > FAIL [ 8.945s] (701/706) gammalooprs::test_renormalization finite_part_ghost_2loop
  353. 101.63 s > stdout ---
  354. 101.63 s >
  355. 101.63 s > running 1 test
  356. 101.63 s > test finite_part_ghost_2loop ... FAILED
  357. 101.63 s >
  358. 101.63 s > failures:
  359. 101.63 s >
  360. 101.63 s > failures:
  361. 101.63 s > finite_part_ghost_2loop
  362. 101.63 s >
  363. 101.63 s > test result: FAILED. 0 passed; 1 failed; 0 ignored; 0 measured; 6 filtered out; finished in 8.93s
  364. 101.63 s >
  365. 101.63 s > stderr ---
  366. 101.63 s > The application panicked (crashed).
  367. 101.63 s > Message: assertion failed: (align_to_rqft(&a, &model) - expected).expand().is_zero()
  368. 101.63 s > Location: crates/gammalooprs/tests/test_renormalization.rs:583
  369. 101.63 s >
  370. 101.63 s > ━━━━━━━━━━━━━━━━━━━━━━━━━━━━━━━━━━ BACKTRACE ━━━━━━━━━━━━━━━━━━━━━━━━━━━━━━━━━━━
  371. 101.63 s > 1: <color_eyre[51793ea62743adbd]::config::PanicHook>::panic_report<unknown>
  372. 101.63 s > at <unknown source file>:<unknown line>
  373. 101.63 s > 2: <color_eyre[51793ea62743adbd]::config::PanicHook>::into_panic_hook::{closure#0}<unknown>
  374. 101.63 s > at <unknown source file>:<unknown line>
  375. 101.63 s > 3: std[bcb96dfbba0ab899]::panicking::panic_with_hook<unknown>
  376. 101.63 s > at <unknown source file>:<unknown line>
  377. 101.63 s > 4: std[bcb96dfbba0ab899]::panicking::panic_handler::{closure#0}<unknown>
  378. 101.63 s > at <unknown source file>:<unknown line>
  379. 101.63 s > 5: std[bcb96dfbba0ab899]::sys::backtrace::__rust_end_short_backtrace::<std[bcb96dfbba0ab899]::panicking::panic_handler::{closure#0}, !><unknown>
  380. 101.63 s > at <unknown source file>:<unknown line>
  381. 101.63 s > 6: __rustc[6c289b9f9c454d21]::rust_begin_unwind<unknown>
  382. 101.63 s > at <unknown source file>:<unknown line>
  383. 101.63 s > 7: core[940e698046960fd5]::panicking::panic_fmt<unknown>
  384. 101.63 s > at <unknown source file>:<unknown line>
  385. 101.63 s > 8: core[940e698046960fd5]::panicking::panic<unknown>
  386. 101.63 s > at <unknown source file>:<unknown line>
  387. 101.63 s > 9: <test_renormalization[5812939ef1a04d89]::finite_part_ghost_2loop::{closure#0} as core[940e698046960fd5]::ops::function::FnOnce<()>>::call_once<unknown>
  388. 101.63 s > at <unknown source file>:<unknown line>
  389. 101.63 s > 10: test[75d6903177b1d7e9]::__rust_begin_short_backtrace::<core[940e698046960fd5]::result::Result<(), alloc[2ea6bcb46fca0c42]::string::String>, fn() -> core[940e698046960fd5]::result::Result<(), alloc[2ea6bcb46fca0c42]::string::String>><unknown>
  390. 101.63 s > at <unknown source file>:<unknown line>
  391. 101.63 s > 11: test[75d6903177b1d7e9]::run_test::{closure#0}<unknown>
  392. 101.63 s > at <unknown source file>:<unknown line>
  393. 101.63 s > 12: std[bcb96dfbba0ab899]::sys::backtrace::__rust_begin_short_backtrace::<test[75d6903177b1d7e9]::run_test::{closure#1}, ()><unknown>
  394. 101.63 s > at <unknown source file>:<unknown line>
  395. 101.63 s > 13: <std[bcb96dfbba0ab899]::thread::lifecycle::spawn_unchecked<test[75d6903177b1d7e9]::run_test::{closure#1}, ()>::{closure#1} as core[940e698046960fd5]::ops::function::FnOnce<()>>::call_once::{shim:vtable#0}<unknown>
  396. 101.63 s > at <unknown source file>:<unknown line>
  397. 101.63 s > 14: <std[bcb96dfbba0ab899]::sys::thread::unix::Thread>::new::thread_start<unknown>
  398. 101.63 s > at <unknown source file>:<unknown line>
  399. 101.63 s > 15: start_thread<unknown>
  400. 101.63 s > at <unknown source file>:<unknown line>
  401. 101.63 s > 16: __clone3<unknown>
  402. 101.63 s > at <unknown source file>:<unknown line>
  403. 101.63 s >
  404. 101.63 s > Run with COLORBT_SHOW_HIDDEN=1 environment variable to disable frame filtering.
  405. 101.63 s > Run with RUST_BACKTRACE=full to include source snippets.
  406. 101.63 s >
  407. 101.63 s > error: test run failed
  408. 101.63 s >
  409. 101.63 s > ========== nextest test summary ==========
  410. 101.63 s > report: target/nextest/ci_gammaloop/junit.xml
  411. 101.63 s > tests: 706, failures: 1, errors: 0
  412. 101.63 s >
  413. 101.63 s > 1. gammalooprs::test_renormalization::finite_part_ghost_2loop
  414. 101.63 s > failure: test failure with exit code 101
  415. 101.63 s > system-out
  416. 101.63 s > running 1 test
  417. 101.63 s > test finite_part_ghost_2loop ... FAILED
  418. 101.63 s >
  419. 101.63 s > failures:
  420. 101.63 s >
  421. 101.63 s > failures:
  422. 101.63 s > finite_part_ghost_2loop
  423. 101.63 s >
  424. 101.63 s > test result: FAILED. 0 passed; 1 failed; 0 ignored; 0 measured; 6 filtered out; finished in 8.93s
  425. 101.63 s > system-err
  426. 101.63 s > The application panicked (crashed).
  427. 101.63 s > Message: assertion failed: (align_to_rqft(&a, &model) - expected).expand().is_zero()
  428. 101.63 s > Location: crates/gammalooprs/tests/test_renormalization.rs:583
  429. 101.63 s >
  430. 101.63 s > ━━━━━━━━━━━━━━━━━━━━━━━━━━━━━━━━━━ BACKTRACE ━━━━━━━━━━━━━━━━━━━━━━━━━━━━━━━━━━━
  431. 101.63 s > 1: <color_eyre[51793ea62743adbd]::config::PanicHook>::panic_report<unknown>
  432. 101.63 s > at <unknown source file>:<unknown line>
  433. 101.63 s > 2: <color_eyre[51793ea62743adbd]::config::PanicHook>::into_panic_hook::{closure#0}<unknown>
  434. 101.63 s > at <unknown source file>:<unknown line>
  435. 101.63 s > 3: std[bcb96dfbba0ab899]::panicking::panic_with_hook<unknown>
  436. 101.63 s > at <unknown source file>:<unknown line>
  437. 101.63 s > 4: std[bcb96dfbba0ab899]::panicking::panic_handler::{closure#0}<unknown>
  438. 101.63 s > at <unknown source file>:<unknown line>
  439. 101.63 s > 5: std[bcb96dfbba0ab899]::sys::backtrace::__rust_end_short_backtrace::<std[bcb96dfbba0ab899]::panicking::panic_handler::{closure#0}, !><unknown>
  440. 101.63 s > at <unknown source file>:<unknown line>
  441. 101.63 s > 6: __rustc[6c289b9f9c454d21]::rust_begin_unwind<unknown>
  442. 101.63 s > at <unknown source file>:<unknown line>
  443. 101.63 s > 7: core[940e698046960fd5]::panicking::panic_fmt<unknown>
  444. 101.63 s > at <unknown source file>:<unknown line>
  445. 101.63 s > 8: core[940e698046960fd5]::panicking::panic<unknown>
  446. 101.63 s > at <unknown source file>:<unknown line>
  447. 101.63 s > 9: <test_renormalization[5812939ef1a04d89]::finite_part_ghost_2loop::{closure#0} as core[940e698046960fd5]::ops::function::FnOnce<()>>::call_once<unknown>
  448. 101.63 s > at <unknown source file>:<unknown line>
  449. 101.63 s > 10: test[75d6903177b1d7e9]::__rust_begin_short_backtrace::<core[940e698046960fd5]::result::Result<(), alloc[2ea6bcb46fca0c42]::string::String>, fn() -> core[940e698046960fd5]::result::Result<(), alloc[2ea6bcb46fca0c42]::string::String>><unknown>
  450. 101.63 s > at <unknown source file>:<unknown line>
  451. 101.63 s > 11: test[75d6903177b1d7e9]::run_test::{closure#0}<unknown>
  452. 101.63 s > at <unknown source file>:<unknown line>
  453. 101.63 s > 12: std[bcb96dfbba0ab899]::sys::backtrace::__rust_begin_short_backtrace::<test[75d6903177b1d7e9]::run_test::{closure#1}, ()><unknown>
  454. 101.63 s > at <unknown source file>:<unknown line>
  455. 101.63 s > 13: <std[bcb96dfbba0ab899]::thread::lifecycle::spawn_unchecked<test[75d6903177b1d7e9]::run_test::{closure#1}, ()>::{closure#1} as core[940e698046960fd5]::ops::function::FnOnce<()>>::call_once::{shim:vtable#0}<unknown>
  456. 101.63 s > at <unknown source file>:<unknown line>
  457. 101.63 s > 14: <std[bcb96dfbba0ab899]::sys::thread::unix::Thread>::new::thread_start<unknown>
  458. 101.63 s > at <unknown source file>:<unknown line>
  459. 101.63 s > 15: start_thread<unknown>
  460. 101.63 s > at <unknown source file>:<unknown line>
  461. 101.63 s > 16: __clone3<unknown>
  462. 101.63 s > at <unknown source file>:<unknown line>
  463. 101.63 s >
  464. 101.63 s > Run with COLORBT_SHOW_HIDDEN=1 environment variable to disable frame filtering.
  465. 101.63 s > Run with RUST_BACKTRACE=full to include source snippets.
  466. 101.63 s > =========================================
  467. 101.63 s > Extracting 1 binary, 1 build script output directory, and 1 linked path to /build/nextest-archive-Kinznx
  468. 101.63 s > Extracted 7 files to /build/nextest-archive-Kinznx in 0.17s
  469. 101.63 s > ------------
  470. 101.63 s > Nextest run ID 7632e13f-e2d0-4a51-a8d8-4315553c7310 with nextest profile: ci_gammaloop
  471. 101.63 s > Starting 105 tests across 1 binary
  472. 101.63 s > ------------
  473. 101.63 s > Summary [ 34.471s] 105 tests run: 105 passed, 0 skipped
  474. 101.63 s >
  475. 101.63 s > ========== nextest test summary ==========
  476. 101.63 s > report: target/nextest/ci_gammaloop/junit.xml
  477. 101.63 s > tests: 105, failures: 0, errors: 0
  478. 101.63 s > No failing testcases found.
  479. 101.63 s > =========================================
  480. 101.63 s For full logs, run:
  481. 101.63 s nix log /nix/store/gfw8irsajvc73r64ijh06rb30gc2744x-gammaloop-nextest-core.drv
  482. 101.86 s [0 built (1 failed)]Run failed.