test packages.x86_64-linux.nix-ci-check-gammaloop-nextest-core

Reproduce this run
Retry Run
  1. 0.00 s $ /nix/store/9ypz3flqsrl5xl495mm8h645gadjsxi1-coreutils-9.11/bin/timeout --kill-after=15s 7200s /nix/store/23zk8sgzamrbmj1fday15szf7f2279s8-nix-2.34.7/bin/nix --extra-experimental-features nix-command --extra-experimental-features flakes flake clone git+https://github.com/alphal00p/gammaloop --dest /tmp/nix-ci-worker/stable-pwd/repo/
  2. 0.07 s Cloning into '/tmp/nix-ci-worker/stable-pwd/repo'...
  3. 0.81 s remote: Enumerating objects: 86068, done.
  4. 0.92 s remote: Counting objects: 0% (1/8522) remote: Counting objects: 1% (86/8522) remote: Counting objects: 2% (171/8522) remote: Counting objects: 3% (256/8522) remote: Counting objects: 4% (341/8522) remote: Counting objects: 5% (427/8522) remote: Counting objects: 6% (512/8522) remote: Counting objects: 7% (597/8522) remote: Counting objects: 8% (682/8522) remote: Counting objects: 9% (767/8522) remote: Counting objects: 10% (853/8522) remote: Counting objects: 11% (938/8522) remote: Counting objects: 12% (1023/8522) remote: Counting objects: 13% (1108/8522) remote: Counting objects: 14% (1194/8522) remote: Counting objects: 15% (1279/8522) remote: Counting objects: 16% (1364/8522) remote: Counting objects: 17% (1449/8522) remote: Counting objects: 18% (1534/8522) remote: Counting objects: 19% (1620/8522) remote: Counting objects: 20% (1705/8522) remote: Counting objects: 21% (1790/8522) remote: Counting objects: 22% (1875/8522) remote: Counting objects: 23% (1961/8522) remote: Counting objects: 24% (2046/8522) remote: Counting objects: 25% (2131/8522) remote: Counting objects: 26% (2216/8522) remote: Counting objects: 27% (2301/8522) remote: Counting objects: 28% (2387/8522) remote: Counting objects: 29% (2472/8522) remote: Counting objects: 30% (2557/8522) remote: Counting objects: 31% (2642/8522) remote: Counting objects: 32% (2728/8522) remote: Counting objects: 33% (2813/8522) remote: Counting objects: 34% (2898/8522) remote: Counting objects: 35% (2983/8522) remote: Counting objects: 36% (3068/8522) remote: Counting objects: 37% (3154/8522) remote: Counting objects: 38% (3239/8522) remote: Counting objects: 39% (3324/8522) remote: Counting objects: 40% (3409/8522) remote: Counting objects: 41% (3495/8522) remote: Counting objects: 42% (3580/8522) remote: Counting objects: 43% (3665/8522) remote: Counting objects: 44% (3750/8522) remote: Counting objects: 45% (3835/8522) remote: Counting objects: 46% (3921/8522) remote: Counting objects: 47% (4006/8522) remote: Counting objects: 48% (4091/8522) remote: Counting objects: 49% (4176/8522) remote: Counting objects: 50% (4261/8522) remote: Counting objects: 51% (4347/8522) remote: Counting objects: 52% (4432/8522) remote: Counting objects: 53% (4517/8522) remote: Counting objects: 54% (4602/8522) remote: Counting objects: 55% (4688/8522) remote: Counting objects: 56% (4773/8522) remote: Counting objects: 57% (4858/8522) remote: Counting objects: 58% (4943/8522) remote: Counting objects: 59% (5028/8522) remote: Counting objects: 60% (5114/8522) remote: Counting objects: 61% (5199/8522) remote: Counting objects: 62% (5284/8522) remote: Counting objects: 63% (5369/8522) remote: Counting objects: 64% (5455/8522) remote: Counting objects: 65% (5540/8522) remote: Counting objects: 66% (5625/8522) remote: Counting objects: 67% (5710/8522) remote: Counting objects: 68% (5795/8522) remote: Counting objects: 69% (5881/8522) remote: Counting objects: 70% (5966/8522) remote: Counting objects: 71% (6051/8522) remote: Counting objects: 72% (6136/8522) remote: Counting objects: 73% (6222/8522) remote: Counting objects: 74% (6307/8522) remote: Counting objects: 75% (6392/8522) remote: Counting objects: 76% (6477/8522) remote: Counting objects: 77% (6562/8522) remote: Counting objects: 78% (6648/8522) remote: Counting objects: 79% (6733/8522) remote: Counting objects: 80% (6818/8522) remote: Counting objects: 81% (6903/8522) remote: Counting objects: 82% (6989/8522) remote: Counting objects: 83% (7074/8522) remote: Counting objects: 84% (7159/8522) remote: Counting objects: 85% (7244/8522) remote: Counting objects: 86% (7329/8522) remote: Counting objects: 87% (7415/8522) remote: Counting objects: 88% (7500/8522) remote: Counting objects: 89% (7585/8522) remote: Counting objects: 90% (7670/8522) remote: Counting objects: 91% (7756/8522) remote: Counting objects: 92% (7841/8522) remote: Counting objects: 93% (7926/8522) remote: Counting objects: 94% (8011/8522) remote: Counting objects: 95% (8096/8522) remote: Counting objects: 96% (8182/8522) remote: Counting objects: 97% (8267/8522) remote: Counting objects: 98% (8352/8522) remote: Counting objects: 99% (8437/8522) remote: Counting objects: 100% (8522/8522) remote: Counting objects: 100% (8522/8522), done.
  5. 2.72 s remote: Compressing objects: 0% (1/1695) remote: Compressing objects: 1% (17/1695) remote: Compressing objects: 2% (34/1695) remote: Compressing objects: 3% (51/1695) remote: Compressing objects: 4% (68/1695) remote: Compressing objects: 5% (85/1695) remote: Compressing objects: 6% (102/1695) remote: Compressing objects: 7% (119/1695) remote: Compressing objects: 8% (136/1695) remote: Compressing objects: 9% (153/1695) remote: Compressing objects: 9% (162/1695) remote: Compressing objects: 10% (170/1695) remote: Compressing objects: 11% (187/1695) remote: Compressing objects: 12% (204/1695) remote: Compressing objects: 13% (221/1695) remote: Compressing objects: 14% (238/1695) remote: Compressing objects: 15% (255/1695) remote: Compressing objects: 16% (272/1695) remote: Compressing objects: 17% (289/1695) remote: Compressing objects: 18% (306/1695) remote: Compressing objects: 19% (323/1695) remote: Compressing objects: 20% (339/1695) remote: Compressing objects: 21% (356/1695) remote: Compressing objects: 22% (373/1695) remote: Compressing objects: 23% (390/1695) remote: Compressing objects: 24% (407/1695) remote: Compressing objects: 25% (424/1695) remote: Compressing objects: 26% (441/1695) remote: Compressing objects: 27% (458/1695) remote: Compressing objects: 28% (475/1695) remote: Compressing objects: 29% (492/1695) remote: Compressing objects: 30% (509/1695) remote: Compressing objects: 31% (526/1695) remote: Compressing objects: 32% (543/1695) remote: Compressing objects: 33% (560/1695) remote: Compressing objects: 34% (577/1695) remote: Compressing objects: 35% (594/1695) remote: Compressing objects: 36% (611/1695) remote: Compressing objects: 37% (628/1695) remote: Compressing objects: 38% (645/1695) remote: Compressing objects: 39% (662/1695) remote: Compressing objects: 40% (678/1695) remote: Compressing objects: 41% (695/1695) remote: Compressing objects: 42% (712/1695) remote: Compressing objects: 43% (729/1695) remote: Compressing objects: 44% (746/1695) remote: Compressing objects: 45% (763/1695) remote: Compressing objects: 46% (780/1695) remote: Compressing objects: 47% (797/1695) remote: Compressing objects: 48% (814/1695) remote: Compressing objects: 49% (831/1695) remote: Compressing objects: 50% (848/1695) remote: Compressing objects: 51% (865/1695) remote: Compressing objects: 52% (882/1695) remote: Compressing objects: 53% (899/1695) remote: Compressing objects: 54% (916/1695) remote: Compressing objects: 55% (933/1695) remote: Compressing objects: 56% (950/1695) remote: Compressing objects: 57% (967/1695) remote: Compressing objects: 58% (984/1695) remote: Compressing objects: 59% (1001/1695) remote: Compressing objects: 60% (1017/1695) remote: Compressing objects: 61% (1034/1695) remote: Compressing objects: 62% (1051/1695) remote: Compressing objects: 63% (1068/1695) remote: Compressing objects: 64% (1085/1695) remote: Compressing objects: 65% (1102/1695) remote: Compressing objects: 66% (1119/1695) remote: Compressing objects: 67% (1136/1695) remote: Compressing objects: 68% (1153/1695) remote: Compressing objects: 69% (1170/1695) remote: Compressing objects: 70% (1187/1695) remote: Compressing objects: 71% (1204/1695) remote: Compressing objects: 72% (1221/1695) remote: Compressing objects: 73% (1238/1695) remote: Compressing objects: 74% (1255/1695) remote: Compressing objects: 75% (1272/1695) remote: Compressing objects: 76% (1289/1695) remote: Compressing objects: 77% (1306/1695) remote: Compressing objects: 78% (1323/1695) remote: Compressing objects: 79% (1340/1695) remote: Compressing objects: 80% (1356/1695) remote: Compressing objects: 81% (1373/1695) remote: Compressing objects: 82% (1390/1695) remote: Compressing objects: 83% (1407/1695) remote: Compressing objects: 84% (1424/1695) remote: Compressing objects: 85% (1441/1695) remote: Compressing objects: 86% (1458/1695) remote: Compressing objects: 87% (1475/1695) remote: Compressing objects: 88% (1492/1695) remote: Compressing objects: 89% (1509/1695) remote: Compressing objects: 90% (1526/1695) remote: Compressing objects: 91% (1543/1695) remote: Compressing objects: 92% (1560/1695) remote: Compressing objects: 93% (1577/1695) remote: Compressing objects: 94% (1594/1695) remote: Compressing objects: 95% (1611/1695) remote: Compressing objects: 96% (1628/1695) remote: Compressing objects: 97% (1645/1695) remote: Compressing objects: 98% (1662/1695) remote: Compressing objects: 99% (1679/1695) remote: Compressing objects: 100% (1695/1695) remote: Compressing objects: 100% (1695/1695), done.
  6. 7.15 s Receiving objects: 0% (1/86068) Receiving objects: 1% (861/86068) Receiving objects: 2% (1722/86068) Receiving objects: 3% (2583/86068) Receiving objects: 4% (3443/86068) Receiving objects: 5% (4304/86068) Receiving objects: 6% (5165/86068) Receiving objects: 7% (6025/86068) Receiving objects: 8% (6886/86068) Receiving objects: 9% (7747/86068), 16.69 MiB | 33.36 MiB/s Receiving objects: 10% (8607/86068), 16.69 MiB | 33.36 MiB/s Receiving objects: 11% (9468/86068), 16.69 MiB | 33.36 MiB/s Receiving objects: 12% (10329/86068), 16.69 MiB | 33.36 MiB/s Receiving objects: 13% (11189/86068), 16.69 MiB | 33.36 MiB/s Receiving objects: 14% (12050/86068), 16.69 MiB | 33.36 MiB/s Receiving objects: 15% (12911/86068), 16.69 MiB | 33.36 MiB/s Receiving objects: 16% (13771/86068), 16.69 MiB | 33.36 MiB/s Receiving objects: 17% (14632/86068), 16.69 MiB | 33.36 MiB/s Receiving objects: 18% (15493/86068), 16.69 MiB | 33.36 MiB/s Receiving objects: 19% (16353/86068), 16.69 MiB | 33.36 MiB/s Receiving objects: 20% (17214/86068), 16.69 MiB | 33.36 MiB/s Receiving objects: 21% (18075/86068), 16.69 MiB | 33.36 MiB/s Receiving objects: 22% (18935/86068), 16.69 MiB | 33.36 MiB/s Receiving objects: 23% (19796/86068), 16.69 MiB | 33.36 MiB/s Receiving objects: 24% (20657/86068), 16.69 MiB | 33.36 MiB/s Receiving objects: 25% (21517/86068), 16.69 MiB | 33.36 MiB/s Receiving objects: 26% (22378/86068), 16.69 MiB | 33.36 MiB/s Receiving objects: 27% (23239/86068), 16.69 MiB | 33.36 MiB/s Receiving objects: 28% (24100/86068), 16.69 MiB | 33.36 MiB/s Receiving objects: 29% (24960/86068), 16.69 MiB | 33.36 MiB/s Receiving objects: 30% (25821/86068), 16.69 MiB | 33.36 MiB/s Receiving objects: 31% (26682/86068), 16.69 MiB | 33.36 MiB/s Receiving objects: 32% (27542/86068), 16.69 MiB | 33.36 MiB/s Receiving objects: 33% (28403/86068), 16.69 MiB | 33.36 MiB/s Receiving objects: 34% (29264/86068), 16.69 MiB | 33.36 MiB/s Receiving objects: 35% (30124/86068), 16.69 MiB | 33.36 MiB/s Receiving objects: 36% (30985/86068), 16.69 MiB | 33.36 MiB/s Receiving objects: 37% (31846/86068), 16.69 MiB | 33.36 MiB/s Receiving objects: 38% (32706/86068), 16.69 MiB | 33.36 MiB/s Receiving objects: 39% (33567/86068), 16.69 MiB | 33.36 MiB/s Receiving objects: 40% (34428/86068), 16.69 MiB | 33.36 MiB/s Receiving objects: 40% (34914/86068), 34.70 MiB | 34.69 MiB/s Receiving objects: 41% (35288/86068), 34.70 MiB | 34.69 MiB/s Receiving objects: 42% (36149/86068), 34.70 MiB | 34.69 MiB/s Receiving objects: 43% (37010/86068), 34.70 MiB | 34.69 MiB/s Receiving objects: 44% (37870/86068), 34.70 MiB | 34.69 MiB/s Receiving objects: 45% (38731/86068), 34.70 MiB | 34.69 MiB/s Receiving objects: 46% (39592/86068), 34.70 MiB | 34.69 MiB/s Receiving objects: 47% (40452/86068), 34.70 MiB | 34.69 MiB/s Receiving objects: 48% (41313/86068), 34.70 MiB | 34.69 MiB/s Receiving objects: 49% (42174/86068), 34.70 MiB | 34.69 MiB/s Receiving objects: 50% (43034/86068), 34.70 MiB | 34.69 MiB/s Receiving objects: 51% (43895/86068), 34.70 MiB | 34.69 MiB/s Receiving objects: 52% (44756/86068), 52.51 MiB | 35.00 MiB/s Receiving objects: 53% (45617/86068), 52.51 MiB | 35.00 MiB/s Receiving objects: 54% (46477/86068), 52.51 MiB | 35.00 MiB/s Receiving objects: 55% (47338/86068), 52.51 MiB | 35.00 MiB/s Receiving objects: 56% (48199/86068), 52.51 MiB | 35.00 MiB/s Receiving objects: 57% (49059/86068), 52.51 MiB | 35.00 MiB/s Receiving objects: 58% (49920/86068), 52.51 MiB | 35.00 MiB/s Receiving objects: 58% (50301/86068), 70.76 MiB | 35.37 MiB/s Receiving objects: 59% (50781/86068), 70.76 MiB | 35.37 MiB/s Receiving objects: 60% (51641/86068), 70.76 MiB | 35.37 MiB/s Receiving objects: 61% (52502/86068), 70.76 MiB | 35.37 MiB/s Receiving objects: 62% (53363/86068), 70.76 MiB | 35.37 MiB/s Receiving objects: 63% (54223/86068), 70.76 MiB | 35.37 MiB/s Receiving objects: 64% (55084/86068), 70.76 MiB | 35.37 MiB/s Receiving objects: 65% (55945/86068), 70.76 MiB | 35.37 MiB/s Receiving objects: 66% (56805/86068), 70.76 MiB | 35.37 MiB/s Receiving objects: 66% (57383/86068), 87.74 MiB | 34.97 MiB/s Receiving objects: 67% (57666/86068), 104.25 MiB | 34.64 MiB/s Receiving objects: 68% (58527/86068), 104.25 MiB | 34.64 MiB/s Receiving objects: 69% (59387/86068), 104.25 MiB | 34.64 MiB/s Receiving objects: 70% (60248/86068), 104.25 MiB | 34.64 MiB/s Receiving objects: 71% (61109/86068), 104.25 MiB | 34.64 MiB/s Receiving objects: 72% (61969/86068), 104.25 MiB | 34.64 MiB/s Receiving objects: 73% (62830/86068), 104.25 MiB | 34.64 MiB/s Receiving objects: 74% (63691/86068), 104.25 MiB | 34.64 MiB/s Receiving objects: 75% (64551/86068), 122.14 MiB | 34.81 MiB/s Receiving objects: 76% (65412/86068), 122.14 MiB | 34.81 MiB/s Receiving objects: 77% (66273/86068), 122.14 MiB | 34.81 MiB/s Receiving objects: 78% (67134/86068), 122.14 MiB | 34.81 MiB/s Receiving objects: 79% (67994/86068), 122.14 MiB | 34.81 MiB/s Receiving objects: 80% (68855/86068), 122.14 MiB | 34.81 MiB/s Receiving objects: 81% (69716/86068), 122.14 MiB | 34.81 MiB/s Receiving objects: 82% (70576/86068), 122.14 MiB | 34.81 MiB/s Receiving objects: 83% (71437/86068), 122.14 MiB | 34.81 MiB/s Receiving objects: 84% (72298/86068), 122.14 MiB | 34.81 MiB/s Receiving objects: 85% (73158/86068), 122.14 MiB | 34.81 MiB/s Receiving objects: 86% (74019/86068), 122.14 MiB | 34.81 MiB/s Receiving objects: 86% (74152/86068), 140.72 MiB | 35.09 MiB/s Receiving objects: 87% (74880/86068), 140.72 MiB | 35.09 MiB/s Receiving objects: 88% (75740/86068), 140.72 MiB | 35.09 MiB/s Receiving objects: 89% (76601/86068), 140.72 MiB | 35.09 MiB/s Receiving objects: 90% (77462/86068), 140.72 MiB | 35.09 MiB/s Receiving objects: 91% (78322/86068), 140.72 MiB | 35.09 MiB/s Receiving objects: 92% (79183/86068), 140.72 MiB | 35.09 MiB/s Receiving objects: 93% (80044/86068), 140.72 MiB | 35.09 MiB/s Receiving objects: 94% (80904/86068), 140.72 MiB | 35.09 MiB/s Receiving objects: 95% (81765/86068), 140.72 MiB | 35.09 MiB/s Receiving objects: 96% (82626/86068), 140.72 MiB | 35.09 MiB/s Receiving objects: 97% (83486/86068), 140.72 MiB | 35.09 MiB/s Receiving objects: 98% (84347/86068), 140.72 MiB | 35.09 MiB/s Receiving objects: 99% (85208/86068), 140.72 MiB | 35.09 MiB/s remote: Total 86068 (delta 7439), reused 6836 (delta 6826), pack-reused 77546 (from 3)
  7. 7.15 s Receiving objects: 100% (86068/86068), 140.72 MiB | 35.09 MiB/s Receiving objects: 100% (86068/86068), 155.78 MiB | 35.16 MiB/s, done.
  8. 8.02 s Resolving deltas: 0% (0/58424) Resolving deltas: 1% (585/58424) Resolving deltas: 2% (1170/58424) Resolving deltas: 3% (1753/58424) Resolving deltas: 4% (2337/58424) Resolving deltas: 5% (2922/58424) Resolving deltas: 6% (3509/58424) Resolving deltas: 7% (4091/58424) Resolving deltas: 8% (4674/58424) Resolving deltas: 9% (5260/58424) Resolving deltas: 10% (5845/58424) Resolving deltas: 11% (6427/58424) Resolving deltas: 12% (7011/58424) Resolving deltas: 13% (7596/58424) Resolving deltas: 14% (8180/58424) Resolving deltas: 15% (8764/58424) Resolving deltas: 16% (9348/58424) Resolving deltas: 17% (9933/58424) Resolving deltas: 18% (10517/58424) Resolving deltas: 19% (11101/58424) Resolving deltas: 20% (11685/58424) Resolving deltas: 21% (12271/58424) Resolving deltas: 22% (12854/58424) Resolving deltas: 23% (13438/58424) Resolving deltas: 24% (14023/58424) Resolving deltas: 25% (14606/58424) Resolving deltas: 26% (15191/58424) Resolving deltas: 27% (15775/58424) Resolving deltas: 28% (16361/58424) Resolving deltas: 29% (16943/58424) Resolving deltas: 30% (17528/58424) Resolving deltas: 31% (18113/58424) Resolving deltas: 32% (18696/58424) Resolving deltas: 33% (19280/58424) Resolving deltas: 34% (19865/58424) Resolving deltas: 35% (20453/58424) Resolving deltas: 36% (21034/58424) Resolving deltas: 37% (21617/58424) Resolving deltas: 38% (22203/58424) Resolving deltas: 39% (22786/58424) Resolving deltas: 40% (23370/58424) Resolving deltas: 41% (23954/58424) Resolving deltas: 42% (24539/58424) Resolving deltas: 43% (25123/58424) Resolving deltas: 44% (25709/58424) Resolving deltas: 45% (26291/58424) Resolving deltas: 46% (26879/58424) Resolving deltas: 47% (27460/58424) Resolving deltas: 48% (28044/58424) Resolving deltas: 49% (28629/58424) Resolving deltas: 50% (29212/58424) Resolving deltas: 51% (29797/58424) Resolving deltas: 52% (30381/58424) Resolving deltas: 53% (30965/58424) Resolving deltas: 54% (31549/58424) Resolving deltas: 55% (32134/58424) Resolving deltas: 56% (32718/58424) Resolving deltas: 57% (33302/58424) Resolving deltas: 58% (33886/58424) Resolving deltas: 59% (34471/58424) Resolving deltas: 60% (35055/58424) Resolving deltas: 61% (35639/58424) Resolving deltas: 62% (36223/58424) Resolving deltas: 63% (36808/58424) Resolving deltas: 64% (37392/58424) Resolving deltas: 65% (37976/58424) Resolving deltas: 66% (38563/58424) Resolving deltas: 67% (39145/58424) Resolving deltas: 68% (39729/58424) Resolving deltas: 69% (40313/58424) Resolving deltas: 70% (40897/58424) Resolving deltas: 71% (41483/58424) Resolving deltas: 72% (42066/58424) Resolving deltas: 73% (42650/58424) Resolving deltas: 74% (43234/58424) Resolving deltas: 75% (43818/58424) Resolving deltas: 76% (44403/58424) Resolving deltas: 77% (44987/58424) Resolving deltas: 78% (45571/58424) Resolving deltas: 79% (46157/58424) Resolving deltas: 80% (46741/58424) Resolving deltas: 81% (47324/58424) Resolving deltas: 82% (47908/58424) Resolving deltas: 83% (48492/58424) Resolving deltas: 84% (49077/58424) Resolving deltas: 85% (49661/58424) Resolving deltas: 86% (50245/58424) Resolving deltas: 87% (50829/58424) Resolving deltas: 88% (51414/58424) Resolving deltas: 89% (51998/58424) Resolving deltas: 90% (52582/58424) Resolving deltas: 91% (53166/58424) Resolving deltas: 92% (53751/58424) Resolving deltas: 93% (54336/58424) Resolving deltas: 94% (54919/58424) Resolving deltas: 95% (55503/58424) Resolving deltas: 96% (56088/58424) Resolving deltas: 97% (56675/58424) Resolving deltas: 98% (57256/58424) Resolving deltas: 99% (57841/58424) Resolving deltas: 100% (58424/58424) Resolving deltas: 100% (58424/58424), done.
  9. 8.42 s Fetching commit f938f9c1386eb2670a0a7f603f5eb0878086352a for faster_uv_from_4d ...
  10. 8.42 s $ /nix/store/bcnisk3ydfgv26v2gw3zlky24g00yww2-git-2.54.0/bin/git fetch origin f938f9c1386eb2670a0a7f603f5eb0878086352a
  11. 8.83 s From https://github.com/alphal00p/gammaloop
  12. 8.83 s * branch f938f9c1386eb2670a0a7f603f5eb0878086352a -> FETCH_HEAD
  13. 8.83 s $ /nix/store/9ypz3flqsrl5xl495mm8h645gadjsxi1-coreutils-9.11/bin/timeout --kill-after=15s 7200s /nix/store/bcnisk3ydfgv26v2gw3zlky24g00yww2-git-2.54.0/bin/git -c advice.detachedHead=false checkout f938f9c1386eb2670a0a7f603f5eb0878086352a
  14. 9.10 s HEAD is now at f938f9c13 borrow sparse contraction-estimate coordinates
  15. 9.11 s $ /nix/store/9ypz3flqsrl5xl495mm8h645gadjsxi1-coreutils-9.11/bin/timeout --kill-after=15s 7200s /nix/store/23zk8sgzamrbmj1fday15szf7f2279s8-nix-2.34.7/bin/nix --extra-experimental-features nix-command --extra-experimental-features flakes --log-format internal-json run .#packages.x86_64-linux.nix-ci-check-gammaloop-nextest-core --print-build-logs
  16. 13.54 s
  17. 13.65 s Downloading cached nix-ci-check-gammaloop-nextest-core from https://cache.nix-ci.com
  18. 13.74 s Downloaded cached nix-ci-check-gammaloop-nextest-core (1016 B) in 87ms
  19. 13.74 s Progress: 0 of 1 built, 1 of 1 downloaded from cache
  20. 18.97 s evaluating derivation 'g copying '/nix/store/7yd7 evaluating derivation 'g copying '/nix/store/7yd7 evaluating derivation 'g copying '/nix/store/7yd7 evaluating derivation 'g copying '/nix/store/7yd7 evaluating derivation 'g copying '/nix/store/7yd7 evaluating derivation 'g copying '/nix/store/7yd7 evaluating derivation 'g copying '/nix/store/7yd7 evaluating derivation 'g copying '/nix/store/7yd7 evaluating derivation 'g querying gammaloop-nexte [0/1 built, 0.0 KiB DL] [1/0/1 built, 0.0 KiB DLgammaloop-nextest-core> Extracting 4 binaries (including 1 non-test binary), 1 build script output directory, and 2 linked paths to /build/nextest-archive-zo3sDk
  21. 19.66 s gammaloop-nextest-core> Extracted 20 files to /build/nextest-archive-zo3sDk in 0.69s
  22. 19.67 s gammaloop-nextest-core> ------------
  23. 19.67 s gammaloop-nextest-core> Nextest run ID 48a3f842-1487-47f0-8a00-c4400c0c8c26 with nextest profile: ci_gammaloop
  24. 19.67 s gammaloop-nextest-core> Starting 379 tests across 3 binaries
  25. 20.94 s gammaloop-nextest-core> ------------
  26. 20.94 s gammaloop-nextest-core> Summary [ 1.274s] 379 tests run: 379 passed, 0 skipped
  27. 21.08 s gammaloop-nextest-core>
  28. 21.08 s gammaloop-nextest-core> ========== nextest test summary ==========
  29. 21.08 s gammaloop-nextest-core> report: target/nextest/ci_gammaloop/junit.xml
  30. 21.08 s gammaloop-nextest-core> tests: 379, failures: 0, errors: 0
  31. 21.08 s gammaloop-nextest-core> No failing testcases found.
  32. 21.08 s gammaloop-nextest-core> =========================================
  33. 21.09 s gammaloop-nextest-core> Extracting 1 binary and 1 linked path to /build/nextest-archive-aPOjwM
  34. 21.16 s gammaloop-nextest-core> Extracted 7 files to /build/nextest-archive-aPOjwM in 0.07s
  35. 21.17 s gammaloop-nextest-core> ------------
  36. 21.17 s gammaloop-nextest-core> Nextest run ID f887a319-f384-4595-8704-5d2c8567ec81 with nextest profile: ci_gammaloop
  37. 21.17 s gammaloop-nextest-core> Starting 19 tests across 1 binary
  38. 21.18 s gammaloop-nextest-core> ------------
  39. 21.18 s gammaloop-nextest-core> Summary [ 0.012s] 19 tests run: 19 passed, 0 skipped
  40. 21.22 s gammaloop-nextest-core>
  41. 21.22 s gammaloop-nextest-core> ========== nextest test summary ==========
  42. 21.22 s gammaloop-nextest-core> report: target/nextest/ci_gammaloop/junit.xml
  43. 21.22 s gammaloop-nextest-core> tests: 19, failures: 0, errors: 0
  44. 21.22 s gammaloop-nextest-core> No failing testcases found.
  45. 21.22 s gammaloop-nextest-core> =========================================
  46. 21.23 s gammaloop-nextest-core> Extracting 1 binary to /build/nextest-archive-mo9ryb
  47. 21.26 s gammaloop-nextest-core> Extracted 4 files to /build/nextest-archive-mo9ryb in 0.03s
  48. 21.27 s gammaloop-nextest-core> ------------
  49. 21.27 s gammaloop-nextest-core> Nextest run ID c7aaef38-4f49-4b5f-b3a3-4792939e1e67 with nextest profile: ci_gammaloop
  50. 21.27 s gammaloop-nextest-core> Starting 0 tests across 1 binary
  51. 21.27 s gammaloop-nextest-core> ------------
  52. 21.27 s gammaloop-nextest-core> Summary [ 0.000s] 0 tests run: 0 passed, 0 skipped
  53. 21.30 s gammaloop-nextest-core>
  54. 21.30 s gammaloop-nextest-core> ========== nextest test summary ==========
  55. 21.30 s gammaloop-nextest-core> report: target/nextest/ci_gammaloop/junit.xml
  56. 21.30 s gammaloop-nextest-core> tests: 0, failures: 0, errors: 0
  57. 21.30 s gammaloop-nextest-core> No failing testcases found.
  58. 21.30 s gammaloop-nextest-core> =========================================
  59. 21.31 s gammaloop-nextest-core> Extracting 4 binaries, 1 build script output directory, and 2 linked paths to /build/nextest-archive-pE31SX
  60. 21.79 s gammaloop-nextest-core> Extracted 18 files to /build/nextest-archive-pE31SX in 0.47s
  61. 21.80 s gammaloop-nextest-core> ------------
  62. 21.80 s gammaloop-nextest-core> Nextest run ID 2a2237c2-1b07-47da-aeb5-193edae9ac2b with nextest profile: ci_gammaloop
  63. 21.80 s gammaloop-nextest-core> Starting 706 tests across 4 binaries (60 tests skipped, including 59 tests via profile.ci_gammaloop.default-filter)
  64. 27.95 s gammaloop-nextest-core> FAIL [ 3.000s] (701/706) gammalooprs::test_renormalization finite_part_ghost_2loop
  65. 27.95 s gammaloop-nextest-core> stdout ---
  66. 27.95 s gammaloop-nextest-core>
  67. 27.95 s gammaloop-nextest-core> running 1 test
  68. 27.95 s gammaloop-nextest-core> test finite_part_ghost_2loop ... FAILED
  69. 27.95 s gammaloop-nextest-core>
  70. 27.95 s gammaloop-nextest-core> failures:
  71. 27.95 s gammaloop-nextest-core>
  72. 27.95 s gammaloop-nextest-core> failures:
  73. 27.95 s gammaloop-nextest-core> finite_part_ghost_2loop
  74. 27.95 s gammaloop-nextest-core>
  75. 27.95 s gammaloop-nextest-core> test result: FAILED. 0 passed; 1 failed; 0 ignored; 0 measured; 6 filtered out; finished in 2.99s
  76. 27.95 s gammaloop-nextest-core>
  77. 27.95 s gammaloop-nextest-core> stderr ---
  78. 27.95 s gammaloop-nextest-core> The application panicked (crashed).
  79. 27.95 s gammaloop-nextest-core> Message: assertion failed: (align_to_rqft(&a, &model) - expected).expand().is_zero()
  80. 27.95 s gammaloop-nextest-core> Location: crates/gammalooprs/tests/test_renormalization.rs:583
  81. 27.95 s gammaloop-nextest-core>
  82. 27.95 s gammaloop-nextest-core> ━━━━━━━━━━━━━━━━━━━━━━━━━━━━━━━━━━ BACKTRACE ━━━━━━━━━━━━━━━━━━━━━━━━━━━━━━━━━━━
  83. 27.95 s gammaloop-nextest-core> 1: <color_eyre[51793ea62743adbd]::config::PanicHook>::panic_report<unknown>
  84. 27.95 s gammaloop-nextest-core> at <unknown source file>:<unknown line>
  85. 27.95 s gammaloop-nextest-core> 2: <color_eyre[51793ea62743adbd]::config::PanicHook>::into_panic_hook::{closure#0}<unknown>
  86. 27.95 s gammaloop-nextest-core> at <unknown source file>:<unknown line>
  87. 27.95 s gammaloop-nextest-core> 3: std[bcb96dfbba0ab899]::panicking::panic_with_hook<unknown>
  88. 27.95 s gammaloop-nextest-core> at <unknown source file>:<unknown line>
  89. 27.95 s gammaloop-nextest-core> 4: std[bcb96dfbba0ab899]::panicking::panic_handler::{closure#0}<unknown>
  90. 27.95 s gammaloop-nextest-core> at <unknown source file>:<unknown line>
  91. 27.95 s gammaloop-nextest-core> 5: std[bcb96dfbba0ab899]::sys::backtrace::__rust_end_short_backtrace::<std[bcb96dfbba0ab899]::panicking::panic_handler::{closure#0}, !><unknown>
  92. 27.95 s gammaloop-nextest-core> at <unknown source file>:<unknown line>
  93. 27.95 s gammaloop-nextest-core> 6: __rustc[6c289b9f9c454d21]::rust_begin_unwind<unknown>
  94. 27.95 s gammaloop-nextest-core> at <unknown source file>:<unknown line>
  95. 27.95 s gammaloop-nextest-core> 7: core[940e698046960fd5]::panicking::panic_fmt<unknown>
  96. 27.95 s gammaloop-nextest-core> at <unknown source file>:<unknown line>
  97. 27.95 s gammaloop-nextest-core> 8: core[940e698046960fd5]::panicking::panic<unknown>
  98. 27.95 s gammaloop-nextest-core> at <unknown source file>:<unknown line>
  99. 27.95 s gammaloop-nextest-core> 9: <test_renormalization[5812939ef1a04d89]::finite_part_ghost_2loop::{closure#0} as core[940e698046960fd5]::ops::function::FnOnce<()>>::call_once<unknown>
  100. 27.95 s gammaloop-nextest-core> at <unknown source file>:<unknown line>
  101. 27.95 s gammaloop-nextest-core> 10: test[75d6903177b1d7e9]::__rust_begin_short_backtrace::<core[940e698046960fd5]::result::Result<(), alloc[2ea6bcb46fca0c42]::string::String>, fn() -> core[940e698046960fd5]::result::Result<(), alloc[2ea6bcb46fca0c42]::string::String>><unknown>
  102. 27.95 s gammaloop-nextest-core> at <unknown source file>:<unknown line>
  103. 27.95 s gammaloop-nextest-core> 11: test[75d6903177b1d7e9]::run_test::{closure#0}<unknown>
  104. 27.95 s gammaloop-nextest-core> at <unknown source file>:<unknown line>
  105. 27.95 s gammaloop-nextest-core> 12: std[bcb96dfbba0ab899]::sys::backtrace::__rust_begin_short_backtrace::<test[75d6903177b1d7e9]::run_test::{closure#1}, ()><unknown>
  106. 27.95 s gammaloop-nextest-core> at <unknown source file>:<unknown line>
  107. 27.95 s gammaloop-nextest-core> 13: <std[bcb96dfbba0ab899]::thread::lifecycle::spawn_unchecked<test[75d6903177b1d7e9]::run_test::{closure#1}, ()>::{closure#1} as core[940e698046960fd5]::ops::function::FnOnce<()>>::call_once::{shim:vtable#0}<unknown>
  108. 27.95 s gammaloop-nextest-core> at <unknown source file>:<unknown line>
  109. 27.95 s gammaloop-nextest-core> 14: <std[bcb96dfbba0ab899]::sys::thread::unix::Thread>::new::thread_start<unknown>
  110. 27.95 s gammaloop-nextest-core> at <unknown source file>:<unknown line>
  111. 27.95 s gammaloop-nextest-core> 15: start_thread<unknown>
  112. 27.95 s gammaloop-nextest-core> at <unknown source file>:<unknown line>
  113. 27.95 s gammaloop-nextest-core> 16: __clone3<unknown>
  114. 27.95 s gammaloop-nextest-core> at <unknown source file>:<unknown line>
  115. 27.95 s gammaloop-nextest-core>
  116. 27.95 s gammaloop-nextest-core> Run with COLORBT_SHOW_HIDDEN=1 environment variable to disable frame filtering.
  117. 27.95 s gammaloop-nextest-core> Run with RUST_BACKTRACE=full to include source snippets.
  118. 27.95 s gammaloop-nextest-core>
  119. 32.60 s gammaloop-nextest-core> ------------
  120. 32.60 s gammaloop-nextest-core> Summary [ 10.802s] 706 tests run: 705 passed, 1 failed, 60 skipped
  121. 32.60 s gammaloop-nextest-core> FAIL [ 3.000s] (701/706) gammalooprs::test_renormalization finite_part_ghost_2loop
  122. 32.60 s gammaloop-nextest-core> stdout ---
  123. 32.60 s gammaloop-nextest-core>
  124. 32.60 s gammaloop-nextest-core> running 1 test
  125. 32.60 s gammaloop-nextest-core> test finite_part_ghost_2loop ... FAILED
  126. 32.60 s gammaloop-nextest-core>
  127. 32.60 s gammaloop-nextest-core> failures:
  128. 32.60 s gammaloop-nextest-core>
  129. 32.60 s gammaloop-nextest-core> failures:
  130. 32.60 s gammaloop-nextest-core> finite_part_ghost_2loop
  131. 32.60 s gammaloop-nextest-core>
  132. 32.60 s gammaloop-nextest-core> test result: FAILED. 0 passed; 1 failed; 0 ignored; 0 measured; 6 filtered out; finished in 2.99s
  133. 32.60 s gammaloop-nextest-core>
  134. 32.60 s gammaloop-nextest-core> stderr ---
  135. 32.60 s gammaloop-nextest-core> The application panicked (crashed).
  136. 32.60 s gammaloop-nextest-core> Message: assertion failed: (align_to_rqft(&a, &model) - expected).expand().is_zero()
  137. 32.60 s gammaloop-nextest-core> Location: crates/gammalooprs/tests/test_renormalization.rs:583
  138. 32.60 s gammaloop-nextest-core>
  139. 32.60 s gammaloop-nextest-core> ━━━━━━━━━━━━━━━━━━━━━━━━━━━━━━━━━━ BACKTRACE ━━━━━━━━━━━━━━━━━━━━━━━━━━━━━━━━━━━
  140. 32.60 s gammaloop-nextest-core> 1: <color_eyre[51793ea62743adbd]::config::PanicHook>::panic_report<unknown>
  141. 32.60 s gammaloop-nextest-core> at <unknown source file>:<unknown line>
  142. 32.60 s gammaloop-nextest-core> 2: <color_eyre[51793ea62743adbd]::config::PanicHook>::into_panic_hook::{closure#0}<unknown>
  143. 32.60 s gammaloop-nextest-core> at <unknown source file>:<unknown line>
  144. 32.60 s gammaloop-nextest-core> 3: std[bcb96dfbba0ab899]::panicking::panic_with_hook<unknown>
  145. 32.60 s gammaloop-nextest-core> at <unknown source file>:<unknown line>
  146. 32.60 s gammaloop-nextest-core> 4: std[bcb96dfbba0ab899]::panicking::panic_handler::{closure#0}<unknown>
  147. 32.60 s gammaloop-nextest-core> at <unknown source file>:<unknown line>
  148. 32.60 s gammaloop-nextest-core> 5: std[bcb96dfbba0ab899]::sys::backtrace::__rust_end_short_backtrace::<std[bcb96dfbba0ab899]::panicking::panic_handler::{closure#0}, !><unknown>
  149. 32.60 s gammaloop-nextest-core> at <unknown source file>:<unknown line>
  150. 32.60 s gammaloop-nextest-core> 6: __rustc[6c289b9f9c454d21]::rust_begin_unwind<unknown>
  151. 32.60 s gammaloop-nextest-core> at <unknown source file>:<unknown line>
  152. 32.60 s gammaloop-nextest-core> 7: core[940e698046960fd5]::panicking::panic_fmt<unknown>
  153. 32.60 s gammaloop-nextest-core> at <unknown source file>:<unknown line>
  154. 32.60 s gammaloop-nextest-core> 8: core[940e698046960fd5]::panicking::panic<unknown>
  155. 32.60 s gammaloop-nextest-core> at <unknown source file>:<unknown line>
  156. 32.60 s gammaloop-nextest-core> 9: <test_renormalization[5812939ef1a04d89]::finite_part_ghost_2loop::{closure#0} as core[940e698046960fd5]::ops::function::FnOnce<()>>::call_once<unknown>
  157. 32.60 s gammaloop-nextest-core> at <unknown source file>:<unknown line>
  158. 32.60 s gammaloop-nextest-core> 10: test[75d6903177b1d7e9]::__rust_begin_short_backtrace::<core[940e698046960fd5]::result::Result<(), alloc[2ea6bcb46fca0c42]::string::String>, fn() -> core[940e698046960fd5]::result::Result<(), alloc[2ea6bcb46fca0c42]::string::String>><unknown>
  159. 32.60 s gammaloop-nextest-core> at <unknown source file>:<unknown line>
  160. 32.60 s gammaloop-nextest-core> 11: test[75d6903177b1d7e9]::run_test::{closure#0}<unknown>
  161. 32.60 s gammaloop-nextest-core> at <unknown source file>:<unknown line>
  162. 32.60 s gammaloop-nextest-core> 12: std[bcb96dfbba0ab899]::sys::backtrace::__rust_begin_short_backtrace::<test[75d6903177b1d7e9]::run_test::{closure#1}, ()><unknown>
  163. 32.60 s gammaloop-nextest-core> at <unknown source file>:<unknown line>
  164. 32.60 s gammaloop-nextest-core> 13: <std[bcb96dfbba0ab899]::thread::lifecycle::spawn_unchecked<test[75d6903177b1d7e9]::run_test::{closure#1}, ()>::{closure#1} as core[940e698046960fd5]::ops::function::FnOnce<()>>::call_once::{shim:vtable#0}<unknown>
  165. 32.60 s gammaloop-nextest-core> at <unknown source file>:<unknown line>
  166. 32.60 s gammaloop-nextest-core> 14: <std[bcb96dfbba0ab899]::sys::thread::unix::Thread>::new::thread_start<unknown>
  167. 32.60 s gammaloop-nextest-core> at <unknown source file>:<unknown line>
  168. 32.60 s gammaloop-nextest-core> 15: start_thread<unknown>
  169. 32.60 s gammaloop-nextest-core> at <unknown source file>:<unknown line>
  170. 32.60 s gammaloop-nextest-core> 16: __clone3<unknown>
  171. 32.60 s gammaloop-nextest-core> at <unknown source file>:<unknown line>
  172. 32.60 s gammaloop-nextest-core>
  173. 32.60 s gammaloop-nextest-core> Run with COLORBT_SHOW_HIDDEN=1 environment variable to disable frame filtering.
  174. 32.60 s gammaloop-nextest-core> Run with RUST_BACKTRACE=full to include source snippets.
  175. 32.60 s gammaloop-nextest-core>
  176. 32.68 s gammaloop-nextest-core> error: test run failed
  177. 32.71 s gammaloop-nextest-core>
  178. 32.71 s gammaloop-nextest-core> ========== nextest test summary ==========
  179. 32.71 s gammaloop-nextest-core> report: target/nextest/ci_gammaloop/junit.xml
  180. 32.71 s gammaloop-nextest-core> tests: 706, failures: 1, errors: 0
  181. 32.71 s gammaloop-nextest-core>
  182. 32.71 s gammaloop-nextest-core> 1. gammalooprs::test_renormalization::finite_part_ghost_2loop
  183. 32.71 s gammaloop-nextest-core> failure: test failure with exit code 101
  184. 32.71 s gammaloop-nextest-core> system-out
  185. 32.71 s gammaloop-nextest-core> running 1 test
  186. 32.71 s gammaloop-nextest-core> test finite_part_ghost_2loop ... FAILED
  187. 32.71 s gammaloop-nextest-core>
  188. 32.71 s gammaloop-nextest-core> failures:
  189. 32.71 s gammaloop-nextest-core>
  190. 32.71 s gammaloop-nextest-core> failures:
  191. 32.71 s gammaloop-nextest-core> finite_part_ghost_2loop
  192. 32.71 s gammaloop-nextest-core>
  193. 32.71 s gammaloop-nextest-core> test result: FAILED. 0 passed; 1 failed; 0 ignored; 0 measured; 6 filtered out; finished in 2.99s
  194. 32.71 s gammaloop-nextest-core> system-err
  195. 32.71 s gammaloop-nextest-core> The application panicked (crashed).
  196. 32.71 s gammaloop-nextest-core> Message: assertion failed: (align_to_rqft(&a, &model) - expected).expand().is_zero()
  197. 32.71 s gammaloop-nextest-core> Location: crates/gammalooprs/tests/test_renormalization.rs:583
  198. 32.71 s gammaloop-nextest-core>
  199. 32.71 s gammaloop-nextest-core> ━━━━━━━━━━━━━━━━━━━━━━━━━━━━━━━━━━ BACKTRACE ━━━━━━━━━━━━━━━━━━━━━━━━━━━━━━━━━━━
  200. 32.71 s gammaloop-nextest-core> 1: <color_eyre[51793ea62743adbd]::config::PanicHook>::panic_report<unknown>
  201. 32.71 s gammaloop-nextest-core> at <unknown source file>:<unknown line>
  202. 32.71 s gammaloop-nextest-core> 2: <color_eyre[51793ea62743adbd]::config::PanicHook>::into_panic_hook::{closure#0}<unknown>
  203. 32.71 s gammaloop-nextest-core> at <unknown source file>:<unknown line>
  204. 32.71 s gammaloop-nextest-core> 3: std[bcb96dfbba0ab899]::panicking::panic_with_hook<unknown>
  205. 32.71 s gammaloop-nextest-core> at <unknown source file>:<unknown line>
  206. 32.71 s gammaloop-nextest-core> 4: std[bcb96dfbba0ab899]::panicking::panic_handler::{closure#0}<unknown>
  207. 32.71 s gammaloop-nextest-core> at <unknown source file>:<unknown line>
  208. 32.71 s gammaloop-nextest-core> 5: std[bcb96dfbba0ab899]::sys::backtrace::__rust_end_short_backtrace::<std[bcb96dfbba0ab899]::panicking::panic_handler::{closure#0}, !><unknown>
  209. 32.71 s gammaloop-nextest-core> at <unknown source file>:<unknown line>
  210. 32.71 s gammaloop-nextest-core> 6: __rustc[6c289b9f9c454d21]::rust_begin_unwind<unknown>
  211. 32.71 s gammaloop-nextest-core> at <unknown source file>:<unknown line>
  212. 32.71 s gammaloop-nextest-core> 7: core[940e698046960fd5]::panicking::panic_fmt<unknown>
  213. 32.71 s gammaloop-nextest-core> at <unknown source file>:<unknown line>
  214. 32.71 s gammaloop-nextest-core> 8: core[940e698046960fd5]::panicking::panic<unknown>
  215. 32.71 s gammaloop-nextest-core> at <unknown source file>:<unknown line>
  216. 32.71 s gammaloop-nextest-core> 9: <test_renormalization[5812939ef1a04d89]::finite_part_ghost_2loop::{closure#0} as core[940e698046960fd5]::ops::function::FnOnce<()>>::call_once<unknown>
  217. 32.71 s gammaloop-nextest-core> at <unknown source file>:<unknown line>
  218. 32.71 s gammaloop-nextest-core> 10: test[75d6903177b1d7e9]::__rust_begin_short_backtrace::<core[940e698046960fd5]::result::Result<(), alloc[2ea6bcb46fca0c42]::string::String>, fn() -> core[940e698046960fd5]::result::Result<(), alloc[2ea6bcb46fca0c42]::string::String>><unknown>
  219. 32.71 s gammaloop-nextest-core> at <unknown source file>:<unknown line>
  220. 32.71 s gammaloop-nextest-core> 11: test[75d6903177b1d7e9]::run_test::{closure#0}<unknown>
  221. 32.71 s gammaloop-nextest-core> at <unknown source file>:<unknown line>
  222. 32.71 s gammaloop-nextest-core> 12: std[bcb96dfbba0ab899]::sys::backtrace::__rust_begin_short_backtrace::<test[75d6903177b1d7e9]::run_test::{closure#1}, ()><unknown>
  223. 32.71 s gammaloop-nextest-core> at <unknown source file>:<unknown line>
  224. 32.71 s gammaloop-nextest-core> 13: <std[bcb96dfbba0ab899]::thread::lifecycle::spawn_unchecked<test[75d6903177b1d7e9]::run_test::{closure#1}, ()>::{closure#1} as core[940e698046960fd5]::ops::function::FnOnce<()>>::call_once::{shim:vtable#0}<unknown>
  225. 32.71 s gammaloop-nextest-core> at <unknown source file>:<unknown line>
  226. 32.71 s gammaloop-nextest-core> 14: <std[bcb96dfbba0ab899]::sys::thread::unix::Thread>::new::thread_start<unknown>
  227. 32.71 s gammaloop-nextest-core> at <unknown source file>:<unknown line>
  228. 32.71 s gammaloop-nextest-core> 15: start_thread<unknown>
  229. 32.71 s gammaloop-nextest-core> at <unknown source file>:<unknown line>
  230. 32.71 s gammaloop-nextest-core> 16: __clone3<unknown>
  231. 32.71 s gammaloop-nextest-core> at <unknown source file>:<unknown line>
  232. 32.71 s gammaloop-nextest-core>
  233. 32.71 s gammaloop-nextest-core> Run with COLORBT_SHOW_HIDDEN=1 environment variable to disable frame filtering.
  234. 32.71 s gammaloop-nextest-core> Run with RUST_BACKTRACE=full to include source snippets.
  235. 32.71 s gammaloop-nextest-core> =========================================
  236. 32.72 s gammaloop-nextest-core> Extracting 1 binary, 1 build script output directory, and 1 linked path to /build/nextest-archive-Yt4ZlH
  237. 32.79 s gammaloop-nextest-core> Extracted 7 files to /build/nextest-archive-Yt4ZlH in 0.08s
  238. 32.80 s gammaloop-nextest-core> ------------
  239. 32.81 s gammaloop-nextest-core> Nextest run ID 8d5acf1d-8a0f-4d5e-8e19-736bbfbed18c with nextest profile: ci_gammaloop
  240. 32.81 s gammaloop-nextest-core> Starting 105 tests across 1 binary
  241. 49.51 s gammaloop-nextest-core> ------------
  242. 49.51 s gammaloop-nextest-core> Summary [ 16.705s] 105 tests run: 105 passed, 0 skipped
  243. 49.55 s gammaloop-nextest-core>
  244. 49.55 s gammaloop-nextest-core> ========== nextest test summary ==========
  245. 49.55 s gammaloop-nextest-core> report: target/nextest/ci_gammaloop/junit.xml
  246. 49.55 s gammaloop-nextest-core> tests: 105, failures: 0, errors: 0
  247. 49.55 s gammaloop-nextest-core> No failing testcases found.
  248. 49.55 s gammaloop-nextest-core> =========================================
  249. 49.59 s error: Cannot build '/nix/store/gfw8irsajvc73r64ijh06rb30gc2744x-gammaloop-nextest-core.drv'.
  250. 49.59 s Reason: builder failed with exit code 100.
  251. 49.59 s Output paths:
  252. 49.59 s /nix/store/p3ayrsjin2c2zsszczl860szaj7271z8-gammaloop-nextest-core
  253. 49.59 s Last 229 log lines:
  254. 49.59 s > Extracting 4 binaries (including 1 non-test binary), 1 build script output directory, and 2 linked paths to /build/nextest-archive-zo3sDk
  255. 49.59 s > Extracted 20 files to /build/nextest-archive-zo3sDk in 0.69s
  256. 49.59 s > ------------
  257. 49.59 s > Nextest run ID 48a3f842-1487-47f0-8a00-c4400c0c8c26 with nextest profile: ci_gammaloop
  258. 49.59 s > Starting 379 tests across 3 binaries
  259. 49.59 s > ------------
  260. 49.59 s > Summary [ 1.274s] 379 tests run: 379 passed, 0 skipped
  261. 49.59 s >
  262. 49.59 s > ========== nextest test summary ==========
  263. 49.59 s > report: target/nextest/ci_gammaloop/junit.xml
  264. 49.59 s > tests: 379, failures: 0, errors: 0
  265. 49.59 s > No failing testcases found.
  266. 49.59 s > =========================================
  267. 49.59 s > Extracting 1 binary and 1 linked path to /build/nextest-archive-aPOjwM
  268. 49.59 s > Extracted 7 files to /build/nextest-archive-aPOjwM in 0.07s
  269. 49.59 s > ------------
  270. 49.59 s > Nextest run ID f887a319-f384-4595-8704-5d2c8567ec81 with nextest profile: ci_gammaloop
  271. 49.59 s > Starting 19 tests across 1 binary
  272. 49.59 s > ------------
  273. 49.59 s > Summary [ 0.012s] 19 tests run: 19 passed, 0 skipped
  274. 49.59 s >
  275. 49.59 s > ========== nextest test summary ==========
  276. 49.59 s > report: target/nextest/ci_gammaloop/junit.xml
  277. 49.59 s > tests: 19, failures: 0, errors: 0
  278. 49.59 s > No failing testcases found.
  279. 49.59 s > =========================================
  280. 49.59 s > Extracting 1 binary to /build/nextest-archive-mo9ryb
  281. 49.59 s > Extracted 4 files to /build/nextest-archive-mo9ryb in 0.03s
  282. 49.59 s > ------------
  283. 49.59 s > Nextest run ID c7aaef38-4f49-4b5f-b3a3-4792939e1e67 with nextest profile: ci_gammaloop
  284. 49.59 s > Starting 0 tests across 1 binary
  285. 49.59 s > ------------
  286. 49.59 s > Summary [ 0.000s] 0 tests run: 0 passed, 0 skipped
  287. 49.59 s >
  288. 49.59 s > ========== nextest test summary ==========
  289. 49.59 s > report: target/nextest/ci_gammaloop/junit.xml
  290. 49.59 s > tests: 0, failures: 0, errors: 0
  291. 49.59 s > No failing testcases found.
  292. 49.59 s > =========================================
  293. 49.59 s > Extracting 4 binaries, 1 build script output directory, and 2 linked paths to /build/nextest-archive-pE31SX
  294. 49.59 s > Extracted 18 files to /build/nextest-archive-pE31SX in 0.47s
  295. 49.59 s > ------------
  296. 49.59 s > Nextest run ID 2a2237c2-1b07-47da-aeb5-193edae9ac2b with nextest profile: ci_gammaloop
  297. 49.59 s > Starting 706 tests across 4 binaries (60 tests skipped, including 59 tests via profile.ci_gammaloop.default-filter)
  298. 49.59 s > FAIL [ 3.000s] (701/706) gammalooprs::test_renormalization finite_part_ghost_2loop
  299. 49.59 s > stdout ---
  300. 49.59 s >
  301. 49.59 s > running 1 test
  302. 49.59 s > test finite_part_ghost_2loop ... FAILED
  303. 49.59 s >
  304. 49.59 s > failures:
  305. 49.59 s >
  306. 49.59 s > failures:
  307. 49.59 s > finite_part_ghost_2loop
  308. 49.59 s >
  309. 49.59 s > test result: FAILED. 0 passed; 1 failed; 0 ignored; 0 measured; 6 filtered out; finished in 2.99s
  310. 49.59 s >
  311. 49.59 s > stderr ---
  312. 49.59 s > The application panicked (crashed).
  313. 49.59 s > Message: assertion failed: (align_to_rqft(&a, &model) - expected).expand().is_zero()
  314. 49.59 s > Location: crates/gammalooprs/tests/test_renormalization.rs:583
  315. 49.59 s >
  316. 49.59 s > ━━━━━━━━━━━━━━━━━━━━━━━━━━━━━━━━━━ BACKTRACE ━━━━━━━━━━━━━━━━━━━━━━━━━━━━━━━━━━━
  317. 49.59 s > 1: <color_eyre[51793ea62743adbd]::config::PanicHook>::panic_report<unknown>
  318. 49.59 s > at <unknown source file>:<unknown line>
  319. 49.59 s > 2: <color_eyre[51793ea62743adbd]::config::PanicHook>::into_panic_hook::{closure#0}<unknown>
  320. 49.59 s > at <unknown source file>:<unknown line>
  321. 49.59 s > 3: std[bcb96dfbba0ab899]::panicking::panic_with_hook<unknown>
  322. 49.59 s > at <unknown source file>:<unknown line>
  323. 49.59 s > 4: std[bcb96dfbba0ab899]::panicking::panic_handler::{closure#0}<unknown>
  324. 49.59 s > at <unknown source file>:<unknown line>
  325. 49.59 s > 5: std[bcb96dfbba0ab899]::sys::backtrace::__rust_end_short_backtrace::<std[bcb96dfbba0ab899]::panicking::panic_handler::{closure#0}, !><unknown>
  326. 49.59 s > at <unknown source file>:<unknown line>
  327. 49.59 s > 6: __rustc[6c289b9f9c454d21]::rust_begin_unwind<unknown>
  328. 49.59 s > at <unknown source file>:<unknown line>
  329. 49.59 s > 7: core[940e698046960fd5]::panicking::panic_fmt<unknown>
  330. 49.59 s > at <unknown source file>:<unknown line>
  331. 49.59 s > 8: core[940e698046960fd5]::panicking::panic<unknown>
  332. 49.59 s > at <unknown source file>:<unknown line>
  333. 49.59 s > 9: <test_renormalization[5812939ef1a04d89]::finite_part_ghost_2loop::{closure#0} as core[940e698046960fd5]::ops::function::FnOnce<()>>::call_once<unknown>
  334. 49.59 s > at <unknown source file>:<unknown line>
  335. 49.59 s > 10: test[75d6903177b1d7e9]::__rust_begin_short_backtrace::<core[940e698046960fd5]::result::Result<(), alloc[2ea6bcb46fca0c42]::string::String>, fn() -> core[940e698046960fd5]::result::Result<(), alloc[2ea6bcb46fca0c42]::string::String>><unknown>
  336. 49.59 s > at <unknown source file>:<unknown line>
  337. 49.59 s > 11: test[75d6903177b1d7e9]::run_test::{closure#0}<unknown>
  338. 49.59 s > at <unknown source file>:<unknown line>
  339. 49.59 s > 12: std[bcb96dfbba0ab899]::sys::backtrace::__rust_begin_short_backtrace::<test[75d6903177b1d7e9]::run_test::{closure#1}, ()><unknown>
  340. 49.59 s > at <unknown source file>:<unknown line>
  341. 49.59 s > 13: <std[bcb96dfbba0ab899]::thread::lifecycle::spawn_unchecked<test[75d6903177b1d7e9]::run_test::{closure#1}, ()>::{closure#1} as core[940e698046960fd5]::ops::function::FnOnce<()>>::call_once::{shim:vtable#0}<unknown>
  342. 49.59 s > at <unknown source file>:<unknown line>
  343. 49.59 s > 14: <std[bcb96dfbba0ab899]::sys::thread::unix::Thread>::new::thread_start<unknown>
  344. 49.59 s > at <unknown source file>:<unknown line>
  345. 49.59 s > 15: start_thread<unknown>
  346. 49.59 s > at <unknown source file>:<unknown line>
  347. 49.59 s > 16: __clone3<unknown>
  348. 49.59 s > at <unknown source file>:<unknown line>
  349. 49.59 s >
  350. 49.59 s > Run with COLORBT_SHOW_HIDDEN=1 environment variable to disable frame filtering.
  351. 49.59 s > Run with RUST_BACKTRACE=full to include source snippets.
  352. 49.59 s >
  353. 49.59 s > ------------
  354. 49.59 s > Summary [ 10.802s] 706 tests run: 705 passed, 1 failed, 60 skipped
  355. 49.59 s > FAIL [ 3.000s] (701/706) gammalooprs::test_renormalization finite_part_ghost_2loop
  356. 49.59 s > stdout ---
  357. 49.59 s >
  358. 49.59 s > running 1 test
  359. 49.59 s > test finite_part_ghost_2loop ... FAILED
  360. 49.59 s >
  361. 49.59 s > failures:
  362. 49.59 s >
  363. 49.59 s > failures:
  364. 49.59 s > finite_part_ghost_2loop
  365. 49.59 s >
  366. 49.59 s > test result: FAILED. 0 passed; 1 failed; 0 ignored; 0 measured; 6 filtered out; finished in 2.99s
  367. 49.59 s >
  368. 49.59 s > stderr ---
  369. 49.59 s > The application panicked (crashed).
  370. 49.59 s > Message: assertion failed: (align_to_rqft(&a, &model) - expected).expand().is_zero()
  371. 49.59 s > Location: crates/gammalooprs/tests/test_renormalization.rs:583
  372. 49.59 s >
  373. 49.59 s > ━━━━━━━━━━━━━━━━━━━━━━━━━━━━━━━━━━ BACKTRACE ━━━━━━━━━━━━━━━━━━━━━━━━━━━━━━━━━━━
  374. 49.59 s > 1: <color_eyre[51793ea62743adbd]::config::PanicHook>::panic_report<unknown>
  375. 49.59 s > at <unknown source file>:<unknown line>
  376. 49.59 s > 2: <color_eyre[51793ea62743adbd]::config::PanicHook>::into_panic_hook::{closure#0}<unknown>
  377. 49.59 s > at <unknown source file>:<unknown line>
  378. 49.59 s > 3: std[bcb96dfbba0ab899]::panicking::panic_with_hook<unknown>
  379. 49.59 s > at <unknown source file>:<unknown line>
  380. 49.59 s > 4: std[bcb96dfbba0ab899]::panicking::panic_handler::{closure#0}<unknown>
  381. 49.59 s > at <unknown source file>:<unknown line>
  382. 49.59 s > 5: std[bcb96dfbba0ab899]::sys::backtrace::__rust_end_short_backtrace::<std[bcb96dfbba0ab899]::panicking::panic_handler::{closure#0}, !><unknown>
  383. 49.59 s > at <unknown source file>:<unknown line>
  384. 49.59 s > 6: __rustc[6c289b9f9c454d21]::rust_begin_unwind<unknown>
  385. 49.59 s > at <unknown source file>:<unknown line>
  386. 49.59 s > 7: core[940e698046960fd5]::panicking::panic_fmt<unknown>
  387. 49.59 s > at <unknown source file>:<unknown line>
  388. 49.59 s > 8: core[940e698046960fd5]::panicking::panic<unknown>
  389. 49.59 s > at <unknown source file>:<unknown line>
  390. 49.59 s > 9: <test_renormalization[5812939ef1a04d89]::finite_part_ghost_2loop::{closure#0} as core[940e698046960fd5]::ops::function::FnOnce<()>>::call_once<unknown>
  391. 49.59 s > at <unknown source file>:<unknown line>
  392. 49.59 s > 10: test[75d6903177b1d7e9]::__rust_begin_short_backtrace::<core[940e698046960fd5]::result::Result<(), alloc[2ea6bcb46fca0c42]::string::String>, fn() -> core[940e698046960fd5]::result::Result<(), alloc[2ea6bcb46fca0c42]::string::String>><unknown>
  393. 49.59 s > at <unknown source file>:<unknown line>
  394. 49.59 s > 11: test[75d6903177b1d7e9]::run_test::{closure#0}<unknown>
  395. 49.59 s > at <unknown source file>:<unknown line>
  396. 49.59 s > 12: std[bcb96dfbba0ab899]::sys::backtrace::__rust_begin_short_backtrace::<test[75d6903177b1d7e9]::run_test::{closure#1}, ()><unknown>
  397. 49.59 s > at <unknown source file>:<unknown line>
  398. 49.59 s > 13: <std[bcb96dfbba0ab899]::thread::lifecycle::spawn_unchecked<test[75d6903177b1d7e9]::run_test::{closure#1}, ()>::{closure#1} as core[940e698046960fd5]::ops::function::FnOnce<()>>::call_once::{shim:vtable#0}<unknown>
  399. 49.59 s > at <unknown source file>:<unknown line>
  400. 49.59 s > 14: <std[bcb96dfbba0ab899]::sys::thread::unix::Thread>::new::thread_start<unknown>
  401. 49.59 s > at <unknown source file>:<unknown line>
  402. 49.59 s > 15: start_thread<unknown>
  403. 49.59 s > at <unknown source file>:<unknown line>
  404. 49.59 s > 16: __clone3<unknown>
  405. 49.59 s > at <unknown source file>:<unknown line>
  406. 49.59 s >
  407. 49.59 s > Run with COLORBT_SHOW_HIDDEN=1 environment variable to disable frame filtering.
  408. 49.59 s > Run with RUST_BACKTRACE=full to include source snippets.
  409. 49.59 s >
  410. 49.59 s > error: test run failed
  411. 49.59 s >
  412. 49.59 s > ========== nextest test summary ==========
  413. 49.59 s > report: target/nextest/ci_gammaloop/junit.xml
  414. 49.59 s > tests: 706, failures: 1, errors: 0
  415. 49.59 s >
  416. 49.59 s > 1. gammalooprs::test_renormalization::finite_part_ghost_2loop
  417. 49.59 s > failure: test failure with exit code 101
  418. 49.59 s > system-out
  419. 49.59 s > running 1 test
  420. 49.59 s > test finite_part_ghost_2loop ... FAILED
  421. 49.59 s >
  422. 49.59 s > failures:
  423. 49.59 s >
  424. 49.59 s > failures:
  425. 49.59 s > finite_part_ghost_2loop
  426. 49.59 s >
  427. 49.59 s > test result: FAILED. 0 passed; 1 failed; 0 ignored; 0 measured; 6 filtered out; finished in 2.99s
  428. 49.59 s > system-err
  429. 49.59 s > The application panicked (crashed).
  430. 49.59 s > Message: assertion failed: (align_to_rqft(&a, &model) - expected).expand().is_zero()
  431. 49.59 s > Location: crates/gammalooprs/tests/test_renormalization.rs:583
  432. 49.59 s >
  433. 49.59 s > ━━━━━━━━━━━━━━━━━━━━━━━━━━━━━━━━━━ BACKTRACE ━━━━━━━━━━━━━━━━━━━━━━━━━━━━━━━━━━━
  434. 49.59 s > 1: <color_eyre[51793ea62743adbd]::config::PanicHook>::panic_report<unknown>
  435. 49.59 s > at <unknown source file>:<unknown line>
  436. 49.59 s > 2: <color_eyre[51793ea62743adbd]::config::PanicHook>::into_panic_hook::{closure#0}<unknown>
  437. 49.59 s > at <unknown source file>:<unknown line>
  438. 49.59 s > 3: std[bcb96dfbba0ab899]::panicking::panic_with_hook<unknown>
  439. 49.59 s > at <unknown source file>:<unknown line>
  440. 49.59 s > 4: std[bcb96dfbba0ab899]::panicking::panic_handler::{closure#0}<unknown>
  441. 49.59 s > at <unknown source file>:<unknown line>
  442. 49.59 s > 5: std[bcb96dfbba0ab899]::sys::backtrace::__rust_end_short_backtrace::<std[bcb96dfbba0ab899]::panicking::panic_handler::{closure#0}, !><unknown>
  443. 49.59 s > at <unknown source file>:<unknown line>
  444. 49.59 s > 6: __rustc[6c289b9f9c454d21]::rust_begin_unwind<unknown>
  445. 49.59 s > at <unknown source file>:<unknown line>
  446. 49.59 s > 7: core[940e698046960fd5]::panicking::panic_fmt<unknown>
  447. 49.59 s > at <unknown source file>:<unknown line>
  448. 49.59 s > 8: core[940e698046960fd5]::panicking::panic<unknown>
  449. 49.59 s > at <unknown source file>:<unknown line>
  450. 49.59 s > 9: <test_renormalization[5812939ef1a04d89]::finite_part_ghost_2loop::{closure#0} as core[940e698046960fd5]::ops::function::FnOnce<()>>::call_once<unknown>
  451. 49.59 s > at <unknown source file>:<unknown line>
  452. 49.59 s > 10: test[75d6903177b1d7e9]::__rust_begin_short_backtrace::<core[940e698046960fd5]::result::Result<(), alloc[2ea6bcb46fca0c42]::string::String>, fn() -> core[940e698046960fd5]::result::Result<(), alloc[2ea6bcb46fca0c42]::string::String>><unknown>
  453. 49.59 s > at <unknown source file>:<unknown line>
  454. 49.59 s > 11: test[75d6903177b1d7e9]::run_test::{closure#0}<unknown>
  455. 49.59 s > at <unknown source file>:<unknown line>
  456. 49.59 s > 12: std[bcb96dfbba0ab899]::sys::backtrace::__rust_begin_short_backtrace::<test[75d6903177b1d7e9]::run_test::{closure#1}, ()><unknown>
  457. 49.59 s > at <unknown source file>:<unknown line>
  458. 49.59 s > 13: <std[bcb96dfbba0ab899]::thread::lifecycle::spawn_unchecked<test[75d6903177b1d7e9]::run_test::{closure#1}, ()>::{closure#1} as core[940e698046960fd5]::ops::function::FnOnce<()>>::call_once::{shim:vtable#0}<unknown>
  459. 49.59 s > at <unknown source file>:<unknown line>
  460. 49.59 s > 14: <std[bcb96dfbba0ab899]::sys::thread::unix::Thread>::new::thread_start<unknown>
  461. 49.59 s > at <unknown source file>:<unknown line>
  462. 49.59 s > 15: start_thread<unknown>
  463. 49.59 s > at <unknown source file>:<unknown line>
  464. 49.59 s > 16: __clone3<unknown>
  465. 49.59 s > at <unknown source file>:<unknown line>
  466. 49.59 s >
  467. 49.59 s > Run with COLORBT_SHOW_HIDDEN=1 environment variable to disable frame filtering.
  468. 49.59 s > Run with RUST_BACKTRACE=full to include source snippets.
  469. 49.59 s > =========================================
  470. 49.59 s > Extracting 1 binary, 1 build script output directory, and 1 linked path to /build/nextest-archive-Yt4ZlH
  471. 49.59 s > Extracted 7 files to /build/nextest-archive-Yt4ZlH in 0.08s
  472. 49.59 s > ------------
  473. 49.59 s > Nextest run ID 8d5acf1d-8a0f-4d5e-8e19-736bbfbed18c with nextest profile: ci_gammaloop
  474. 49.59 s > Starting 105 tests across 1 binary
  475. 49.59 s > ------------
  476. 49.59 s > Summary [ 16.705s] 105 tests run: 105 passed, 0 skipped
  477. 49.59 s >
  478. 49.59 s > ========== nextest test summary ==========
  479. 49.59 s > report: target/nextest/ci_gammaloop/junit.xml
  480. 49.59 s > tests: 105, failures: 0, errors: 0
  481. 49.59 s > No failing testcases found.
  482. 49.59 s > =========================================
  483. 49.59 s For full logs, run:
  484. 49.59 s nix log /nix/store/gfw8irsajvc73r64ijh06rb30gc2744x-gammaloop-nextest-core.drv
  485. 49.74 s [0 built (1 failed), 0.0Run failed.