0.00 s
$ /nix/store/9ypz3flqsrl5xl495mm8h645gadjsxi1-coreutils-9.11/bin/timeout --kill-after=15s 7200s /nix/store/23zk8sgzamrbmj1fday15szf7f2279s8-nix-2.34.7/bin/nix --extra-experimental-features nix-command --extra-experimental-features flakes flake clone git+https://github.com/alphal00p/gammaloop --dest /tmp/nix-ci-worker/stable-pwd/repo/
0.07 s
Cloning into '/tmp/nix-ci-worker/stable-pwd/repo'...
0.81 s
remote: Enumerating objects: 86068, done.
0.92 s
remote: Counting objects: 0% (1/8522)
remote: Counting objects: 1% (86/8522)
remote: Counting objects: 2% (171/8522)
remote: Counting objects: 3% (256/8522)
remote: Counting objects: 4% (341/8522)
remote: Counting objects: 5% (427/8522)
remote: Counting objects: 6% (512/8522)
remote: Counting objects: 7% (597/8522)
remote: Counting objects: 8% (682/8522)
remote: Counting objects: 9% (767/8522)
remote: Counting objects: 10% (853/8522)
remote: Counting objects: 11% (938/8522)
remote: Counting objects: 12% (1023/8522)
remote: Counting objects: 13% (1108/8522)
remote: Counting objects: 14% (1194/8522)
remote: Counting objects: 15% (1279/8522)
remote: Counting objects: 16% (1364/8522)
remote: Counting objects: 17% (1449/8522)
remote: Counting objects: 18% (1534/8522)
remote: Counting objects: 19% (1620/8522)
remote: Counting objects: 20% (1705/8522)
remote: Counting objects: 21% (1790/8522)
remote: Counting objects: 22% (1875/8522)
remote: Counting objects: 23% (1961/8522)
remote: Counting objects: 24% (2046/8522)
remote: Counting objects: 25% (2131/8522)
remote: Counting objects: 26% (2216/8522)
remote: Counting objects: 27% (2301/8522)
remote: Counting objects: 28% (2387/8522)
remote: Counting objects: 29% (2472/8522)
remote: Counting objects: 30% (2557/8522)
remote: Counting objects: 31% (2642/8522)
remote: Counting objects: 32% (2728/8522)
remote: Counting objects: 33% (2813/8522)
remote: Counting objects: 34% (2898/8522)
remote: Counting objects: 35% (2983/8522)
remote: Counting objects: 36% (3068/8522)
remote: Counting objects: 37% (3154/8522)
remote: Counting objects: 38% (3239/8522)
remote: Counting objects: 39% (3324/8522)
remote: Counting objects: 40% (3409/8522)
remote: Counting objects: 41% (3495/8522)
remote: Counting objects: 42% (3580/8522)
remote: Counting objects: 43% (3665/8522)
remote: Counting objects: 44% (3750/8522)
remote: Counting objects: 45% (3835/8522)
remote: Counting objects: 46% (3921/8522)
remote: Counting objects: 47% (4006/8522)
remote: Counting objects: 48% (4091/8522)
remote: Counting objects: 49% (4176/8522)
remote: Counting objects: 50% (4261/8522)
remote: Counting objects: 51% (4347/8522)
remote: Counting objects: 52% (4432/8522)
remote: Counting objects: 53% (4517/8522)
remote: Counting objects: 54% (4602/8522)
remote: Counting objects: 55% (4688/8522)
remote: Counting objects: 56% (4773/8522)
remote: Counting objects: 57% (4858/8522)
remote: Counting objects: 58% (4943/8522)
remote: Counting objects: 59% (5028/8522)
remote: Counting objects: 60% (5114/8522)
remote: Counting objects: 61% (5199/8522)
remote: Counting objects: 62% (5284/8522)
remote: Counting objects: 63% (5369/8522)
remote: Counting objects: 64% (5455/8522)
remote: Counting objects: 65% (5540/8522)
remote: Counting objects: 66% (5625/8522)
remote: Counting objects: 67% (5710/8522)
remote: Counting objects: 68% (5795/8522)
remote: Counting objects: 69% (5881/8522)
remote: Counting objects: 70% (5966/8522)
remote: Counting objects: 71% (6051/8522)
remote: Counting objects: 72% (6136/8522)
remote: Counting objects: 73% (6222/8522)
remote: Counting objects: 74% (6307/8522)
remote: Counting objects: 75% (6392/8522)
remote: Counting objects: 76% (6477/8522)
remote: Counting objects: 77% (6562/8522)
remote: Counting objects: 78% (6648/8522)
remote: Counting objects: 79% (6733/8522)
remote: Counting objects: 80% (6818/8522)
remote: Counting objects: 81% (6903/8522)
remote: Counting objects: 82% (6989/8522)
remote: Counting objects: 83% (7074/8522)
remote: Counting objects: 84% (7159/8522)
remote: Counting objects: 85% (7244/8522)
remote: Counting objects: 86% (7329/8522)
remote: Counting objects: 87% (7415/8522)
remote: Counting objects: 88% (7500/8522)
remote: Counting objects: 89% (7585/8522)
remote: Counting objects: 90% (7670/8522)
remote: Counting objects: 91% (7756/8522)
remote: Counting objects: 92% (7841/8522)
remote: Counting objects: 93% (7926/8522)
remote: Counting objects: 94% (8011/8522)
remote: Counting objects: 95% (8096/8522)
remote: Counting objects: 96% (8182/8522)
remote: Counting objects: 97% (8267/8522)
remote: Counting objects: 98% (8352/8522)
remote: Counting objects: 99% (8437/8522)
remote: Counting objects: 100% (8522/8522)
remote: Counting objects: 100% (8522/8522), done.
2.72 s
remote: Compressing objects: 0% (1/1695)
remote: Compressing objects: 1% (17/1695)
remote: Compressing objects: 2% (34/1695)
remote: Compressing objects: 3% (51/1695)
remote: Compressing objects: 4% (68/1695)
remote: Compressing objects: 5% (85/1695)
remote: Compressing objects: 6% (102/1695)
remote: Compressing objects: 7% (119/1695)
remote: Compressing objects: 8% (136/1695)
remote: Compressing objects: 9% (153/1695)
remote: Compressing objects: 9% (162/1695)
remote: Compressing objects: 10% (170/1695)
remote: Compressing objects: 11% (187/1695)
remote: Compressing objects: 12% (204/1695)
remote: Compressing objects: 13% (221/1695)
remote: Compressing objects: 14% (238/1695)
remote: Compressing objects: 15% (255/1695)
remote: Compressing objects: 16% (272/1695)
remote: Compressing objects: 17% (289/1695)
remote: Compressing objects: 18% (306/1695)
remote: Compressing objects: 19% (323/1695)
remote: Compressing objects: 20% (339/1695)
remote: Compressing objects: 21% (356/1695)
remote: Compressing objects: 22% (373/1695)
remote: Compressing objects: 23% (390/1695)
remote: Compressing objects: 24% (407/1695)
remote: Compressing objects: 25% (424/1695)
remote: Compressing objects: 26% (441/1695)
remote: Compressing objects: 27% (458/1695)
remote: Compressing objects: 28% (475/1695)
remote: Compressing objects: 29% (492/1695)
remote: Compressing objects: 30% (509/1695)
remote: Compressing objects: 31% (526/1695)
remote: Compressing objects: 32% (543/1695)
remote: Compressing objects: 33% (560/1695)
remote: Compressing objects: 34% (577/1695)
remote: Compressing objects: 35% (594/1695)
remote: Compressing objects: 36% (611/1695)
remote: Compressing objects: 37% (628/1695)
remote: Compressing objects: 38% (645/1695)
remote: Compressing objects: 39% (662/1695)
remote: Compressing objects: 40% (678/1695)
remote: Compressing objects: 41% (695/1695)
remote: Compressing objects: 42% (712/1695)
remote: Compressing objects: 43% (729/1695)
remote: Compressing objects: 44% (746/1695)
remote: Compressing objects: 45% (763/1695)
remote: Compressing objects: 46% (780/1695)
remote: Compressing objects: 47% (797/1695)
remote: Compressing objects: 48% (814/1695)
remote: Compressing objects: 49% (831/1695)
remote: Compressing objects: 50% (848/1695)
remote: Compressing objects: 51% (865/1695)
remote: Compressing objects: 52% (882/1695)
remote: Compressing objects: 53% (899/1695)
remote: Compressing objects: 54% (916/1695)
remote: Compressing objects: 55% (933/1695)
remote: Compressing objects: 56% (950/1695)
remote: Compressing objects: 57% (967/1695)
remote: Compressing objects: 58% (984/1695)
remote: Compressing objects: 59% (1001/1695)
remote: Compressing objects: 60% (1017/1695)
remote: Compressing objects: 61% (1034/1695)
remote: Compressing objects: 62% (1051/1695)
remote: Compressing objects: 63% (1068/1695)
remote: Compressing objects: 64% (1085/1695)
remote: Compressing objects: 65% (1102/1695)
remote: Compressing objects: 66% (1119/1695)
remote: Compressing objects: 67% (1136/1695)
remote: Compressing objects: 68% (1153/1695)
remote: Compressing objects: 69% (1170/1695)
remote: Compressing objects: 70% (1187/1695)
remote: Compressing objects: 71% (1204/1695)
remote: Compressing objects: 72% (1221/1695)
remote: Compressing objects: 73% (1238/1695)
remote: Compressing objects: 74% (1255/1695)
remote: Compressing objects: 75% (1272/1695)
remote: Compressing objects: 76% (1289/1695)
remote: Compressing objects: 77% (1306/1695)
remote: Compressing objects: 78% (1323/1695)
remote: Compressing objects: 79% (1340/1695)
remote: Compressing objects: 80% (1356/1695)
remote: Compressing objects: 81% (1373/1695)
remote: Compressing objects: 82% (1390/1695)
remote: Compressing objects: 83% (1407/1695)
remote: Compressing objects: 84% (1424/1695)
remote: Compressing objects: 85% (1441/1695)
remote: Compressing objects: 86% (1458/1695)
remote: Compressing objects: 87% (1475/1695)
remote: Compressing objects: 88% (1492/1695)
remote: Compressing objects: 89% (1509/1695)
remote: Compressing objects: 90% (1526/1695)
remote: Compressing objects: 91% (1543/1695)
remote: Compressing objects: 92% (1560/1695)
remote: Compressing objects: 93% (1577/1695)
remote: Compressing objects: 94% (1594/1695)
remote: Compressing objects: 95% (1611/1695)
remote: Compressing objects: 96% (1628/1695)
remote: Compressing objects: 97% (1645/1695)
remote: Compressing objects: 98% (1662/1695)
remote: Compressing objects: 99% (1679/1695)
remote: Compressing objects: 100% (1695/1695)
remote: Compressing objects: 100% (1695/1695), done.
7.15 s
Receiving objects: 0% (1/86068)
Receiving objects: 1% (861/86068)
Receiving objects: 2% (1722/86068)
Receiving objects: 3% (2583/86068)
Receiving objects: 4% (3443/86068)
Receiving objects: 5% (4304/86068)
Receiving objects: 6% (5165/86068)
Receiving objects: 7% (6025/86068)
Receiving objects: 8% (6886/86068)
Receiving objects: 9% (7747/86068), 16.69 MiB | 33.36 MiB/s
Receiving objects: 10% (8607/86068), 16.69 MiB | 33.36 MiB/s
Receiving objects: 11% (9468/86068), 16.69 MiB | 33.36 MiB/s
Receiving objects: 12% (10329/86068), 16.69 MiB | 33.36 MiB/s
Receiving objects: 13% (11189/86068), 16.69 MiB | 33.36 MiB/s
Receiving objects: 14% (12050/86068), 16.69 MiB | 33.36 MiB/s
Receiving objects: 15% (12911/86068), 16.69 MiB | 33.36 MiB/s
Receiving objects: 16% (13771/86068), 16.69 MiB | 33.36 MiB/s
Receiving objects: 17% (14632/86068), 16.69 MiB | 33.36 MiB/s
Receiving objects: 18% (15493/86068), 16.69 MiB | 33.36 MiB/s
Receiving objects: 19% (16353/86068), 16.69 MiB | 33.36 MiB/s
Receiving objects: 20% (17214/86068), 16.69 MiB | 33.36 MiB/s
Receiving objects: 21% (18075/86068), 16.69 MiB | 33.36 MiB/s
Receiving objects: 22% (18935/86068), 16.69 MiB | 33.36 MiB/s
Receiving objects: 23% (19796/86068), 16.69 MiB | 33.36 MiB/s
Receiving objects: 24% (20657/86068), 16.69 MiB | 33.36 MiB/s
Receiving objects: 25% (21517/86068), 16.69 MiB | 33.36 MiB/s
Receiving objects: 26% (22378/86068), 16.69 MiB | 33.36 MiB/s
Receiving objects: 27% (23239/86068), 16.69 MiB | 33.36 MiB/s
Receiving objects: 28% (24100/86068), 16.69 MiB | 33.36 MiB/s
Receiving objects: 29% (24960/86068), 16.69 MiB | 33.36 MiB/s
Receiving objects: 30% (25821/86068), 16.69 MiB | 33.36 MiB/s
Receiving objects: 31% (26682/86068), 16.69 MiB | 33.36 MiB/s
Receiving objects: 32% (27542/86068), 16.69 MiB | 33.36 MiB/s
Receiving objects: 33% (28403/86068), 16.69 MiB | 33.36 MiB/s
Receiving objects: 34% (29264/86068), 16.69 MiB | 33.36 MiB/s
Receiving objects: 35% (30124/86068), 16.69 MiB | 33.36 MiB/s
Receiving objects: 36% (30985/86068), 16.69 MiB | 33.36 MiB/s
Receiving objects: 37% (31846/86068), 16.69 MiB | 33.36 MiB/s
Receiving objects: 38% (32706/86068), 16.69 MiB | 33.36 MiB/s
Receiving objects: 39% (33567/86068), 16.69 MiB | 33.36 MiB/s
Receiving objects: 40% (34428/86068), 16.69 MiB | 33.36 MiB/s
Receiving objects: 40% (34914/86068), 34.70 MiB | 34.69 MiB/s
Receiving objects: 41% (35288/86068), 34.70 MiB | 34.69 MiB/s
Receiving objects: 42% (36149/86068), 34.70 MiB | 34.69 MiB/s
Receiving objects: 43% (37010/86068), 34.70 MiB | 34.69 MiB/s
Receiving objects: 44% (37870/86068), 34.70 MiB | 34.69 MiB/s
Receiving objects: 45% (38731/86068), 34.70 MiB | 34.69 MiB/s
Receiving objects: 46% (39592/86068), 34.70 MiB | 34.69 MiB/s
Receiving objects: 47% (40452/86068), 34.70 MiB | 34.69 MiB/s
Receiving objects: 48% (41313/86068), 34.70 MiB | 34.69 MiB/s
Receiving objects: 49% (42174/86068), 34.70 MiB | 34.69 MiB/s
Receiving objects: 50% (43034/86068), 34.70 MiB | 34.69 MiB/s
Receiving objects: 51% (43895/86068), 34.70 MiB | 34.69 MiB/s
Receiving objects: 52% (44756/86068), 52.51 MiB | 35.00 MiB/s
Receiving objects: 53% (45617/86068), 52.51 MiB | 35.00 MiB/s
Receiving objects: 54% (46477/86068), 52.51 MiB | 35.00 MiB/s
Receiving objects: 55% (47338/86068), 52.51 MiB | 35.00 MiB/s
Receiving objects: 56% (48199/86068), 52.51 MiB | 35.00 MiB/s
Receiving objects: 57% (49059/86068), 52.51 MiB | 35.00 MiB/s
Receiving objects: 58% (49920/86068), 52.51 MiB | 35.00 MiB/s
Receiving objects: 58% (50301/86068), 70.76 MiB | 35.37 MiB/s
Receiving objects: 59% (50781/86068), 70.76 MiB | 35.37 MiB/s
Receiving objects: 60% (51641/86068), 70.76 MiB | 35.37 MiB/s
Receiving objects: 61% (52502/86068), 70.76 MiB | 35.37 MiB/s
Receiving objects: 62% (53363/86068), 70.76 MiB | 35.37 MiB/s
Receiving objects: 63% (54223/86068), 70.76 MiB | 35.37 MiB/s
Receiving objects: 64% (55084/86068), 70.76 MiB | 35.37 MiB/s
Receiving objects: 65% (55945/86068), 70.76 MiB | 35.37 MiB/s
Receiving objects: 66% (56805/86068), 70.76 MiB | 35.37 MiB/s
Receiving objects: 66% (57383/86068), 87.74 MiB | 34.97 MiB/s
Receiving objects: 67% (57666/86068), 104.25 MiB | 34.64 MiB/s
Receiving objects: 68% (58527/86068), 104.25 MiB | 34.64 MiB/s
Receiving objects: 69% (59387/86068), 104.25 MiB | 34.64 MiB/s
Receiving objects: 70% (60248/86068), 104.25 MiB | 34.64 MiB/s
Receiving objects: 71% (61109/86068), 104.25 MiB | 34.64 MiB/s
Receiving objects: 72% (61969/86068), 104.25 MiB | 34.64 MiB/s
Receiving objects: 73% (62830/86068), 104.25 MiB | 34.64 MiB/s
Receiving objects: 74% (63691/86068), 104.25 MiB | 34.64 MiB/s
Receiving objects: 75% (64551/86068), 122.14 MiB | 34.81 MiB/s
Receiving objects: 76% (65412/86068), 122.14 MiB | 34.81 MiB/s
Receiving objects: 77% (66273/86068), 122.14 MiB | 34.81 MiB/s
Receiving objects: 78% (67134/86068), 122.14 MiB | 34.81 MiB/s
Receiving objects: 79% (67994/86068), 122.14 MiB | 34.81 MiB/s
Receiving objects: 80% (68855/86068), 122.14 MiB | 34.81 MiB/s
Receiving objects: 81% (69716/86068), 122.14 MiB | 34.81 MiB/s
Receiving objects: 82% (70576/86068), 122.14 MiB | 34.81 MiB/s
Receiving objects: 83% (71437/86068), 122.14 MiB | 34.81 MiB/s
Receiving objects: 84% (72298/86068), 122.14 MiB | 34.81 MiB/s
Receiving objects: 85% (73158/86068), 122.14 MiB | 34.81 MiB/s
Receiving objects: 86% (74019/86068), 122.14 MiB | 34.81 MiB/s
Receiving objects: 86% (74152/86068), 140.72 MiB | 35.09 MiB/s
Receiving objects: 87% (74880/86068), 140.72 MiB | 35.09 MiB/s
Receiving objects: 88% (75740/86068), 140.72 MiB | 35.09 MiB/s
Receiving objects: 89% (76601/86068), 140.72 MiB | 35.09 MiB/s
Receiving objects: 90% (77462/86068), 140.72 MiB | 35.09 MiB/s
Receiving objects: 91% (78322/86068), 140.72 MiB | 35.09 MiB/s
Receiving objects: 92% (79183/86068), 140.72 MiB | 35.09 MiB/s
Receiving objects: 93% (80044/86068), 140.72 MiB | 35.09 MiB/s
Receiving objects: 94% (80904/86068), 140.72 MiB | 35.09 MiB/s
Receiving objects: 95% (81765/86068), 140.72 MiB | 35.09 MiB/s
Receiving objects: 96% (82626/86068), 140.72 MiB | 35.09 MiB/s
Receiving objects: 97% (83486/86068), 140.72 MiB | 35.09 MiB/s
Receiving objects: 98% (84347/86068), 140.72 MiB | 35.09 MiB/s
Receiving objects: 99% (85208/86068), 140.72 MiB | 35.09 MiB/s
remote: Total 86068 (delta 7439), reused 6836 (delta 6826), pack-reused 77546 (from 3)
7.15 s
Receiving objects: 100% (86068/86068), 140.72 MiB | 35.09 MiB/s
Receiving objects: 100% (86068/86068), 155.78 MiB | 35.16 MiB/s, done.
8.02 s
Resolving deltas: 0% (0/58424)
Resolving deltas: 1% (585/58424)
Resolving deltas: 2% (1170/58424)
Resolving deltas: 3% (1753/58424)
Resolving deltas: 4% (2337/58424)
Resolving deltas: 5% (2922/58424)
Resolving deltas: 6% (3509/58424)
Resolving deltas: 7% (4091/58424)
Resolving deltas: 8% (4674/58424)
Resolving deltas: 9% (5260/58424)
Resolving deltas: 10% (5845/58424)
Resolving deltas: 11% (6427/58424)
Resolving deltas: 12% (7011/58424)
Resolving deltas: 13% (7596/58424)
Resolving deltas: 14% (8180/58424)
Resolving deltas: 15% (8764/58424)
Resolving deltas: 16% (9348/58424)
Resolving deltas: 17% (9933/58424)
Resolving deltas: 18% (10517/58424)
Resolving deltas: 19% (11101/58424)
Resolving deltas: 20% (11685/58424)
Resolving deltas: 21% (12271/58424)
Resolving deltas: 22% (12854/58424)
Resolving deltas: 23% (13438/58424)
Resolving deltas: 24% (14023/58424)
Resolving deltas: 25% (14606/58424)
Resolving deltas: 26% (15191/58424)
Resolving deltas: 27% (15775/58424)
Resolving deltas: 28% (16361/58424)
Resolving deltas: 29% (16943/58424)
Resolving deltas: 30% (17528/58424)
Resolving deltas: 31% (18113/58424)
Resolving deltas: 32% (18696/58424)
Resolving deltas: 33% (19280/58424)
Resolving deltas: 34% (19865/58424)
Resolving deltas: 35% (20453/58424)
Resolving deltas: 36% (21034/58424)
Resolving deltas: 37% (21617/58424)
Resolving deltas: 38% (22203/58424)
Resolving deltas: 39% (22786/58424)
Resolving deltas: 40% (23370/58424)
Resolving deltas: 41% (23954/58424)
Resolving deltas: 42% (24539/58424)
Resolving deltas: 43% (25123/58424)
Resolving deltas: 44% (25709/58424)
Resolving deltas: 45% (26291/58424)
Resolving deltas: 46% (26879/58424)
Resolving deltas: 47% (27460/58424)
Resolving deltas: 48% (28044/58424)
Resolving deltas: 49% (28629/58424)
Resolving deltas: 50% (29212/58424)
Resolving deltas: 51% (29797/58424)
Resolving deltas: 52% (30381/58424)
Resolving deltas: 53% (30965/58424)
Resolving deltas: 54% (31549/58424)
Resolving deltas: 55% (32134/58424)
Resolving deltas: 56% (32718/58424)
Resolving deltas: 57% (33302/58424)
Resolving deltas: 58% (33886/58424)
Resolving deltas: 59% (34471/58424)
Resolving deltas: 60% (35055/58424)
Resolving deltas: 61% (35639/58424)
Resolving deltas: 62% (36223/58424)
Resolving deltas: 63% (36808/58424)
Resolving deltas: 64% (37392/58424)
Resolving deltas: 65% (37976/58424)
Resolving deltas: 66% (38563/58424)
Resolving deltas: 67% (39145/58424)
Resolving deltas: 68% (39729/58424)
Resolving deltas: 69% (40313/58424)
Resolving deltas: 70% (40897/58424)
Resolving deltas: 71% (41483/58424)
Resolving deltas: 72% (42066/58424)
Resolving deltas: 73% (42650/58424)
Resolving deltas: 74% (43234/58424)
Resolving deltas: 75% (43818/58424)
Resolving deltas: 76% (44403/58424)
Resolving deltas: 77% (44987/58424)
Resolving deltas: 78% (45571/58424)
Resolving deltas: 79% (46157/58424)
Resolving deltas: 80% (46741/58424)
Resolving deltas: 81% (47324/58424)
Resolving deltas: 82% (47908/58424)
Resolving deltas: 83% (48492/58424)
Resolving deltas: 84% (49077/58424)
Resolving deltas: 85% (49661/58424)
Resolving deltas: 86% (50245/58424)
Resolving deltas: 87% (50829/58424)
Resolving deltas: 88% (51414/58424)
Resolving deltas: 89% (51998/58424)
Resolving deltas: 90% (52582/58424)
Resolving deltas: 91% (53166/58424)
Resolving deltas: 92% (53751/58424)
Resolving deltas: 93% (54336/58424)
Resolving deltas: 94% (54919/58424)
Resolving deltas: 95% (55503/58424)
Resolving deltas: 96% (56088/58424)
Resolving deltas: 97% (56675/58424)
Resolving deltas: 98% (57256/58424)
Resolving deltas: 99% (57841/58424)
Resolving deltas: 100% (58424/58424)
Resolving deltas: 100% (58424/58424), done.
8.42 s
Fetching commit f938f9c1386eb2670a0a7f603f5eb0878086352a for faster_uv_from_4d ...
8.42 s
$ /nix/store/bcnisk3ydfgv26v2gw3zlky24g00yww2-git-2.54.0/bin/git fetch origin f938f9c1386eb2670a0a7f603f5eb0878086352a
8.83 s
From https://github.com/alphal00p/gammaloop
8.83 s
* branch f938f9c1386eb2670a0a7f603f5eb0878086352a -> FETCH_HEAD
8.83 s
$ /nix/store/9ypz3flqsrl5xl495mm8h645gadjsxi1-coreutils-9.11/bin/timeout --kill-after=15s 7200s /nix/store/bcnisk3ydfgv26v2gw3zlky24g00yww2-git-2.54.0/bin/git -c advice.detachedHead=false checkout f938f9c1386eb2670a0a7f603f5eb0878086352a
9.10 s
HEAD is now at f938f9c13 borrow sparse contraction-estimate coordinates
9.11 s
$ /nix/store/9ypz3flqsrl5xl495mm8h645gadjsxi1-coreutils-9.11/bin/timeout --kill-after=15s 7200s /nix/store/23zk8sgzamrbmj1fday15szf7f2279s8-nix-2.34.7/bin/nix --extra-experimental-features nix-command --extra-experimental-features flakes --log-format internal-json run .#packages.x86_64-linux.nix-ci-check-gammaloop-nextest-core --print-build-logs
13.54 s
13.65 s
Downloading cached nix-ci-check-gammaloop-nextest-core from https://cache.nix-ci.com
13.74 s
Downloaded cached nix-ci-check-gammaloop-nextest-core (1016 B) in 87ms
13.74 s
Progress: 0 of 1 built, 1 of 1 downloaded from cache
18.97 s
evaluating derivation 'g
copying '/nix/store/7yd7
evaluating derivation 'g
copying '/nix/store/7yd7
evaluating derivation 'g
copying '/nix/store/7yd7
evaluating derivation 'g
copying '/nix/store/7yd7
evaluating derivation 'g
copying '/nix/store/7yd7
evaluating derivation 'g
copying '/nix/store/7yd7
evaluating derivation 'g
copying '/nix/store/7yd7
evaluating derivation 'g
copying '/nix/store/7yd7
evaluating derivation 'g
querying gammaloop-nexte
[0 /1 built, 0.0 KiB DL]
[1 /0 /1 built, 0.0 KiB DLgammaloop-nextest-core> Extracting 4 binaries (including 1 non-test binary), 1 build script output directory, and 2 linked paths to /build/nextest-archive-zo3sDk
19.66 s
gammaloop-nextest-core> Extracted 20 files to /build/nextest-archive-zo3sDk in 0.69s
19.67 s
gammaloop-nextest-core> ------------
19.67 s
gammaloop-nextest-core> Nextest run ID 48a3f842-1487-47f0-8a00-c4400c0c8c26 with nextest profile: ci_gammaloop
19.67 s
gammaloop-nextest-core> Starting 379 tests across 3 binaries
20.94 s
gammaloop-nextest-core> ------------
20.94 s
gammaloop-nextest-core> Summary [ 1.274s] 379 tests run: 379 passed , 0 skipped
21.08 s
gammaloop-nextest-core>
21.08 s
gammaloop-nextest-core> ========== nextest test summary ==========
21.08 s
gammaloop-nextest-core> report: target/nextest/ci_gammaloop/junit.xml
21.08 s
gammaloop-nextest-core> tests: 379, failures: 0, errors: 0
21.08 s
gammaloop-nextest-core> No failing testcases found.
21.08 s
gammaloop-nextest-core> =========================================
21.09 s
gammaloop-nextest-core> Extracting 1 binary and 1 linked path to /build/nextest-archive-aPOjwM
21.16 s
gammaloop-nextest-core> Extracted 7 files to /build/nextest-archive-aPOjwM in 0.07s
21.17 s
gammaloop-nextest-core> ------------
21.17 s
gammaloop-nextest-core> Nextest run ID f887a319-f384-4595-8704-5d2c8567ec81 with nextest profile: ci_gammaloop
21.17 s
gammaloop-nextest-core> Starting 19 tests across 1 binary
21.18 s
gammaloop-nextest-core> ------------
21.18 s
gammaloop-nextest-core> Summary [ 0.012s] 19 tests run: 19 passed , 0 skipped
21.22 s
gammaloop-nextest-core>
21.22 s
gammaloop-nextest-core> ========== nextest test summary ==========
21.22 s
gammaloop-nextest-core> report: target/nextest/ci_gammaloop/junit.xml
21.22 s
gammaloop-nextest-core> tests: 19, failures: 0, errors: 0
21.22 s
gammaloop-nextest-core> No failing testcases found.
21.22 s
gammaloop-nextest-core> =========================================
21.23 s
gammaloop-nextest-core> Extracting 1 binary to /build/nextest-archive-mo9ryb
21.26 s
gammaloop-nextest-core> Extracted 4 files to /build/nextest-archive-mo9ryb in 0.03s
21.27 s
gammaloop-nextest-core> ------------
21.27 s
gammaloop-nextest-core> Nextest run ID c7aaef38-4f49-4b5f-b3a3-4792939e1e67 with nextest profile: ci_gammaloop
21.27 s
gammaloop-nextest-core> Starting 0 tests across 1 binary
21.27 s
gammaloop-nextest-core> ------------
21.27 s
gammaloop-nextest-core> Summary [ 0.000s] 0 tests run: 0 passed , 0 skipped
21.30 s
gammaloop-nextest-core>
21.30 s
gammaloop-nextest-core> ========== nextest test summary ==========
21.30 s
gammaloop-nextest-core> report: target/nextest/ci_gammaloop/junit.xml
21.30 s
gammaloop-nextest-core> tests: 0, failures: 0, errors: 0
21.30 s
gammaloop-nextest-core> No failing testcases found.
21.30 s
gammaloop-nextest-core> =========================================
21.31 s
gammaloop-nextest-core> Extracting 4 binaries, 1 build script output directory, and 2 linked paths to /build/nextest-archive-pE31SX
21.79 s
gammaloop-nextest-core> Extracted 18 files to /build/nextest-archive-pE31SX in 0.47s
21.80 s
gammaloop-nextest-core> ------------
21.80 s
gammaloop-nextest-core> Nextest run ID 2a2237c2-1b07-47da-aeb5-193edae9ac2b with nextest profile: ci_gammaloop
21.80 s
gammaloop-nextest-core> Starting 706 tests across 4 binaries (60 tests skipped , including 59 tests via profile.ci_gammaloop.default-filter )
27.95 s
gammaloop-nextest-core> FAIL [ 3.000s] (701/706) gammalooprs::test_renormalization finite_part_ghost_2loop
27.95 s
gammaloop-nextest-core> stdout ---
27.95 s
gammaloop-nextest-core>
27.95 s
gammaloop-nextest-core> running 1 test
27.95 s
gammaloop-nextest-core> test finite_part_ghost_2loop ... FAILED
27.95 s
gammaloop-nextest-core>
27.95 s
gammaloop-nextest-core> failures:
27.95 s
gammaloop-nextest-core>
27.95 s
gammaloop-nextest-core> failures:
27.95 s
gammaloop-nextest-core> finite_part_ghost_2loop
27.95 s
gammaloop-nextest-core>
27.95 s
gammaloop-nextest-core> test result: FAILED. 0 passed; 1 failed; 0 ignored; 0 measured; 6 filtered out; finished in 2.99s
27.95 s
gammaloop-nextest-core>
27.95 s
gammaloop-nextest-core> stderr ---
27.95 s
gammaloop-nextest-core> The application panicked (crashed).
27.95 s
gammaloop-nextest-core> Message: assertion failed: (align_to_rqft(&a, &model) - expected).expand().is_zero()
27.95 s
gammaloop-nextest-core> Location: crates/gammalooprs/tests/test_renormalization.rs :583
27.95 s
gammaloop-nextest-core>
27.95 s
gammaloop-nextest-core> ━━━━━━━━━━━━━━━━━━━━━━━━━━━━━━━━━━ BACKTRACE ━━━━━━━━━━━━━━━━━━━━━━━━━━━━━━━━━━━
27.95 s
gammaloop-nextest-core> 1: <color_eyre[51793ea62743adbd]::config::PanicHook>::panic_report <unknown>
27.95 s
gammaloop-nextest-core> at <unknown source file> :<unknown line>
27.95 s
gammaloop-nextest-core> 2: <color_eyre[51793ea62743adbd]::config::PanicHook>::into_panic_hook::{closure#0} <unknown>
27.95 s
gammaloop-nextest-core> at <unknown source file> :<unknown line>
27.95 s
gammaloop-nextest-core> 3: std[bcb96dfbba0ab899]::panicking::panic_with_hook <unknown>
27.95 s
gammaloop-nextest-core> at <unknown source file> :<unknown line>
27.95 s
gammaloop-nextest-core> 4: std[bcb96dfbba0ab899]::panicking::panic_handler::{closure#0} <unknown>
27.95 s
gammaloop-nextest-core> at <unknown source file> :<unknown line>
27.95 s
gammaloop-nextest-core> 5: std[bcb96dfbba0ab899]::sys::backtrace::__rust_end_short_backtrace::<std[bcb96dfbba0ab899]::panicking::panic_handler::{closure#0}, !> <unknown>
27.95 s
gammaloop-nextest-core> at <unknown source file> :<unknown line>
27.95 s
gammaloop-nextest-core> 6: __rustc[6c289b9f9c454d21]::rust_begin_unwind <unknown>
27.95 s
gammaloop-nextest-core> at <unknown source file> :<unknown line>
27.95 s
gammaloop-nextest-core> 7: core[940e698046960fd5]::panicking::panic_fmt <unknown>
27.95 s
gammaloop-nextest-core> at <unknown source file> :<unknown line>
27.95 s
gammaloop-nextest-core> 8: core[940e698046960fd5]::panicking::panic <unknown>
27.95 s
gammaloop-nextest-core> at <unknown source file> :<unknown line>
27.95 s
gammaloop-nextest-core> 9: <test_renormalization[5812939ef1a04d89]::finite_part_ghost_2loop::{closure#0} as core[940e698046960fd5]::ops::function::FnOnce<()>>::call_once <unknown>
27.95 s
gammaloop-nextest-core> at <unknown source file> :<unknown line>
27.95 s
gammaloop-nextest-core> 10: test[75d6903177b1d7e9]::__rust_begin_short_backtrace::<core[940e698046960fd5]::result::Result<(), alloc[2ea6bcb46fca0c42]::string::String>, fn() -> core[940e698046960fd5]::result::Result<(), alloc[2ea6bcb46fca0c42]::string::String>> <unknown>
27.95 s
gammaloop-nextest-core> at <unknown source file> :<unknown line>
27.95 s
gammaloop-nextest-core> 11: test[75d6903177b1d7e9]::run_test::{closure#0} <unknown>
27.95 s
gammaloop-nextest-core> at <unknown source file> :<unknown line>
27.95 s
gammaloop-nextest-core> 12: std[bcb96dfbba0ab899]::sys::backtrace::__rust_begin_short_backtrace::<test[75d6903177b1d7e9]::run_test::{closure#1}, ()> <unknown>
27.95 s
gammaloop-nextest-core> at <unknown source file> :<unknown line>
27.95 s
gammaloop-nextest-core> 13: <std[bcb96dfbba0ab899]::thread::lifecycle::spawn_unchecked<test[75d6903177b1d7e9]::run_test::{closure#1}, ()>::{closure#1} as core[940e698046960fd5]::ops::function::FnOnce<()>>::call_once::{shim:vtable#0} <unknown>
27.95 s
gammaloop-nextest-core> at <unknown source file> :<unknown line>
27.95 s
gammaloop-nextest-core> 14: <std[bcb96dfbba0ab899]::sys::thread::unix::Thread>::new::thread_start <unknown>
27.95 s
gammaloop-nextest-core> at <unknown source file> :<unknown line>
27.95 s
gammaloop-nextest-core> 15: start_thread <unknown>
27.95 s
gammaloop-nextest-core> at <unknown source file> :<unknown line>
27.95 s
gammaloop-nextest-core> 16: __clone3 <unknown>
27.95 s
gammaloop-nextest-core> at <unknown source file> :<unknown line>
27.95 s
gammaloop-nextest-core>
27.95 s
gammaloop-nextest-core> Run with COLORBT_SHOW_HIDDEN=1 environment variable to disable frame filtering.
27.95 s
gammaloop-nextest-core> Run with RUST_BACKTRACE=full to include source snippets.
27.95 s
gammaloop-nextest-core>
32.60 s
gammaloop-nextest-core> ------------
32.60 s
gammaloop-nextest-core> Summary [ 10.802s] 706 tests run: 705 passed , 1 failed , 60 skipped
32.60 s
gammaloop-nextest-core> FAIL [ 3.000s] (701/706) gammalooprs::test_renormalization finite_part_ghost_2loop
32.60 s
gammaloop-nextest-core> stdout ---
32.60 s
gammaloop-nextest-core>
32.60 s
gammaloop-nextest-core> running 1 test
32.60 s
gammaloop-nextest-core> test finite_part_ghost_2loop ... FAILED
32.60 s
gammaloop-nextest-core>
32.60 s
gammaloop-nextest-core> failures:
32.60 s
gammaloop-nextest-core>
32.60 s
gammaloop-nextest-core> failures:
32.60 s
gammaloop-nextest-core> finite_part_ghost_2loop
32.60 s
gammaloop-nextest-core>
32.60 s
gammaloop-nextest-core> test result: FAILED. 0 passed; 1 failed; 0 ignored; 0 measured; 6 filtered out; finished in 2.99s
32.60 s
gammaloop-nextest-core>
32.60 s
gammaloop-nextest-core> stderr ---
32.60 s
gammaloop-nextest-core> The application panicked (crashed).
32.60 s
gammaloop-nextest-core> Message: assertion failed: (align_to_rqft(&a, &model) - expected).expand().is_zero()
32.60 s
gammaloop-nextest-core> Location: crates/gammalooprs/tests/test_renormalization.rs :583
32.60 s
gammaloop-nextest-core>
32.60 s
gammaloop-nextest-core> ━━━━━━━━━━━━━━━━━━━━━━━━━━━━━━━━━━ BACKTRACE ━━━━━━━━━━━━━━━━━━━━━━━━━━━━━━━━━━━
32.60 s
gammaloop-nextest-core> 1: <color_eyre[51793ea62743adbd]::config::PanicHook>::panic_report <unknown>
32.60 s
gammaloop-nextest-core> at <unknown source file> :<unknown line>
32.60 s
gammaloop-nextest-core> 2: <color_eyre[51793ea62743adbd]::config::PanicHook>::into_panic_hook::{closure#0} <unknown>
32.60 s
gammaloop-nextest-core> at <unknown source file> :<unknown line>
32.60 s
gammaloop-nextest-core> 3: std[bcb96dfbba0ab899]::panicking::panic_with_hook <unknown>
32.60 s
gammaloop-nextest-core> at <unknown source file> :<unknown line>
32.60 s
gammaloop-nextest-core> 4: std[bcb96dfbba0ab899]::panicking::panic_handler::{closure#0} <unknown>
32.60 s
gammaloop-nextest-core> at <unknown source file> :<unknown line>
32.60 s
gammaloop-nextest-core> 5: std[bcb96dfbba0ab899]::sys::backtrace::__rust_end_short_backtrace::<std[bcb96dfbba0ab899]::panicking::panic_handler::{closure#0}, !> <unknown>
32.60 s
gammaloop-nextest-core> at <unknown source file> :<unknown line>
32.60 s
gammaloop-nextest-core> 6: __rustc[6c289b9f9c454d21]::rust_begin_unwind <unknown>
32.60 s
gammaloop-nextest-core> at <unknown source file> :<unknown line>
32.60 s
gammaloop-nextest-core> 7: core[940e698046960fd5]::panicking::panic_fmt <unknown>
32.60 s
gammaloop-nextest-core> at <unknown source file> :<unknown line>
32.60 s
gammaloop-nextest-core> 8: core[940e698046960fd5]::panicking::panic <unknown>
32.60 s
gammaloop-nextest-core> at <unknown source file> :<unknown line>
32.60 s
gammaloop-nextest-core> 9: <test_renormalization[5812939ef1a04d89]::finite_part_ghost_2loop::{closure#0} as core[940e698046960fd5]::ops::function::FnOnce<()>>::call_once <unknown>
32.60 s
gammaloop-nextest-core> at <unknown source file> :<unknown line>
32.60 s
gammaloop-nextest-core> 10: test[75d6903177b1d7e9]::__rust_begin_short_backtrace::<core[940e698046960fd5]::result::Result<(), alloc[2ea6bcb46fca0c42]::string::String>, fn() -> core[940e698046960fd5]::result::Result<(), alloc[2ea6bcb46fca0c42]::string::String>> <unknown>
32.60 s
gammaloop-nextest-core> at <unknown source file> :<unknown line>
32.60 s
gammaloop-nextest-core> 11: test[75d6903177b1d7e9]::run_test::{closure#0} <unknown>
32.60 s
gammaloop-nextest-core> at <unknown source file> :<unknown line>
32.60 s
gammaloop-nextest-core> 12: std[bcb96dfbba0ab899]::sys::backtrace::__rust_begin_short_backtrace::<test[75d6903177b1d7e9]::run_test::{closure#1}, ()> <unknown>
32.60 s
gammaloop-nextest-core> at <unknown source file> :<unknown line>
32.60 s
gammaloop-nextest-core> 13: <std[bcb96dfbba0ab899]::thread::lifecycle::spawn_unchecked<test[75d6903177b1d7e9]::run_test::{closure#1}, ()>::{closure#1} as core[940e698046960fd5]::ops::function::FnOnce<()>>::call_once::{shim:vtable#0} <unknown>
32.60 s
gammaloop-nextest-core> at <unknown source file> :<unknown line>
32.60 s
gammaloop-nextest-core> 14: <std[bcb96dfbba0ab899]::sys::thread::unix::Thread>::new::thread_start <unknown>
32.60 s
gammaloop-nextest-core> at <unknown source file> :<unknown line>
32.60 s
gammaloop-nextest-core> 15: start_thread <unknown>
32.60 s
gammaloop-nextest-core> at <unknown source file> :<unknown line>
32.60 s
gammaloop-nextest-core> 16: __clone3 <unknown>
32.60 s
gammaloop-nextest-core> at <unknown source file> :<unknown line>
32.60 s
gammaloop-nextest-core>
32.60 s
gammaloop-nextest-core> Run with COLORBT_SHOW_HIDDEN=1 environment variable to disable frame filtering.
32.60 s
gammaloop-nextest-core> Run with RUST_BACKTRACE=full to include source snippets.
32.60 s
gammaloop-nextest-core>
32.68 s
gammaloop-nextest-core> error : test run failed
32.71 s
gammaloop-nextest-core>
32.71 s
gammaloop-nextest-core> ========== nextest test summary ==========
32.71 s
gammaloop-nextest-core> report: target/nextest/ci_gammaloop/junit.xml
32.71 s
gammaloop-nextest-core> tests: 706, failures: 1, errors: 0
32.71 s
gammaloop-nextest-core>
32.71 s
gammaloop-nextest-core> 1. gammalooprs::test_renormalization::finite_part_ghost_2loop
32.71 s
gammaloop-nextest-core> failure: test failure with exit code 101
32.71 s
gammaloop-nextest-core> system-out
32.71 s
gammaloop-nextest-core> running 1 test
32.71 s
gammaloop-nextest-core> test finite_part_ghost_2loop ... FAILED
32.71 s
gammaloop-nextest-core>
32.71 s
gammaloop-nextest-core> failures:
32.71 s
gammaloop-nextest-core>
32.71 s
gammaloop-nextest-core> failures:
32.71 s
gammaloop-nextest-core> finite_part_ghost_2loop
32.71 s
gammaloop-nextest-core>
32.71 s
gammaloop-nextest-core> test result: FAILED. 0 passed; 1 failed; 0 ignored; 0 measured; 6 filtered out; finished in 2.99s
32.71 s
gammaloop-nextest-core> system-err
32.71 s
gammaloop-nextest-core> The application panicked (crashed).
32.71 s
gammaloop-nextest-core> Message: assertion failed: (align_to_rqft(&a, &model) - expected).expand().is_zero()
32.71 s
gammaloop-nextest-core> Location: crates/gammalooprs/tests/test_renormalization.rs:583
32.71 s
gammaloop-nextest-core>
32.71 s
gammaloop-nextest-core> ━━━━━━━━━━━━━━━━━━━━━━━━━━━━━━━━━━ BACKTRACE ━━━━━━━━━━━━━━━━━━━━━━━━━━━━━━━━━━━
32.71 s
gammaloop-nextest-core> 1: <color_eyre[51793ea62743adbd]::config::PanicHook>::panic_report<unknown>
32.71 s
gammaloop-nextest-core> at <unknown source file>:<unknown line>
32.71 s
gammaloop-nextest-core> 2: <color_eyre[51793ea62743adbd]::config::PanicHook>::into_panic_hook::{closure#0}<unknown>
32.71 s
gammaloop-nextest-core> at <unknown source file>:<unknown line>
32.71 s
gammaloop-nextest-core> 3: std[bcb96dfbba0ab899]::panicking::panic_with_hook<unknown>
32.71 s
gammaloop-nextest-core> at <unknown source file>:<unknown line>
32.71 s
gammaloop-nextest-core> 4: std[bcb96dfbba0ab899]::panicking::panic_handler::{closure#0}<unknown>
32.71 s
gammaloop-nextest-core> at <unknown source file>:<unknown line>
32.71 s
gammaloop-nextest-core> 5: std[bcb96dfbba0ab899]::sys::backtrace::__rust_end_short_backtrace::<std[bcb96dfbba0ab899]::panicking::panic_handler::{closure#0}, !><unknown>
32.71 s
gammaloop-nextest-core> at <unknown source file>:<unknown line>
32.71 s
gammaloop-nextest-core> 6: __rustc[6c289b9f9c454d21]::rust_begin_unwind<unknown>
32.71 s
gammaloop-nextest-core> at <unknown source file>:<unknown line>
32.71 s
gammaloop-nextest-core> 7: core[940e698046960fd5]::panicking::panic_fmt<unknown>
32.71 s
gammaloop-nextest-core> at <unknown source file>:<unknown line>
32.71 s
gammaloop-nextest-core> 8: core[940e698046960fd5]::panicking::panic<unknown>
32.71 s
gammaloop-nextest-core> at <unknown source file>:<unknown line>
32.71 s
gammaloop-nextest-core> 9: <test_renormalization[5812939ef1a04d89]::finite_part_ghost_2loop::{closure#0} as core[940e698046960fd5]::ops::function::FnOnce<()>>::call_once<unknown>
32.71 s
gammaloop-nextest-core> at <unknown source file>:<unknown line>
32.71 s
gammaloop-nextest-core> 10: test[75d6903177b1d7e9]::__rust_begin_short_backtrace::<core[940e698046960fd5]::result::Result<(), alloc[2ea6bcb46fca0c42]::string::String>, fn() -> core[940e698046960fd5]::result::Result<(), alloc[2ea6bcb46fca0c42]::string::String>><unknown>
32.71 s
gammaloop-nextest-core> at <unknown source file>:<unknown line>
32.71 s
gammaloop-nextest-core> 11: test[75d6903177b1d7e9]::run_test::{closure#0}<unknown>
32.71 s
gammaloop-nextest-core> at <unknown source file>:<unknown line>
32.71 s
gammaloop-nextest-core> 12: std[bcb96dfbba0ab899]::sys::backtrace::__rust_begin_short_backtrace::<test[75d6903177b1d7e9]::run_test::{closure#1}, ()><unknown>
32.71 s
gammaloop-nextest-core> at <unknown source file>:<unknown line>
32.71 s
gammaloop-nextest-core> 13: <std[bcb96dfbba0ab899]::thread::lifecycle::spawn_unchecked<test[75d6903177b1d7e9]::run_test::{closure#1}, ()>::{closure#1} as core[940e698046960fd5]::ops::function::FnOnce<()>>::call_once::{shim:vtable#0}<unknown>
32.71 s
gammaloop-nextest-core> at <unknown source file>:<unknown line>
32.71 s
gammaloop-nextest-core> 14: <std[bcb96dfbba0ab899]::sys::thread::unix::Thread>::new::thread_start<unknown>
32.71 s
gammaloop-nextest-core> at <unknown source file>:<unknown line>
32.71 s
gammaloop-nextest-core> 15: start_thread<unknown>
32.71 s
gammaloop-nextest-core> at <unknown source file>:<unknown line>
32.71 s
gammaloop-nextest-core> 16: __clone3<unknown>
32.71 s
gammaloop-nextest-core> at <unknown source file>:<unknown line>
32.71 s
gammaloop-nextest-core>
32.71 s
gammaloop-nextest-core> Run with COLORBT_SHOW_HIDDEN=1 environment variable to disable frame filtering.
32.71 s
gammaloop-nextest-core> Run with RUST_BACKTRACE=full to include source snippets.
32.71 s
gammaloop-nextest-core> =========================================
32.72 s
gammaloop-nextest-core> Extracting 1 binary, 1 build script output directory, and 1 linked path to /build/nextest-archive-Yt4ZlH
32.79 s
gammaloop-nextest-core> Extracted 7 files to /build/nextest-archive-Yt4ZlH in 0.08s
32.80 s
gammaloop-nextest-core> ------------
32.81 s
gammaloop-nextest-core> Nextest run ID 8d5acf1d-8a0f-4d5e-8e19-736bbfbed18c with nextest profile: ci_gammaloop
32.81 s
gammaloop-nextest-core> Starting 105 tests across 1 binary
49.51 s
gammaloop-nextest-core> ------------
49.51 s
gammaloop-nextest-core> Summary [ 16.705s] 105 tests run: 105 passed , 0 skipped
49.55 s
gammaloop-nextest-core>
49.55 s
gammaloop-nextest-core> ========== nextest test summary ==========
49.55 s
gammaloop-nextest-core> report: target/nextest/ci_gammaloop/junit.xml
49.55 s
gammaloop-nextest-core> tests: 105, failures: 0, errors: 0
49.55 s
gammaloop-nextest-core> No failing testcases found.
49.55 s
gammaloop-nextest-core> =========================================
49.59 s
error: Cannot build '/nix/store/gfw8irsajvc73r64ijh06rb30gc2744x-gammaloop-nextest-core.drv '.
49.59 s
Reason: builder failed with exit code 100 .
49.59 s
Output paths:
49.59 s
/nix/store/p3ayrsjin2c2zsszczl860szaj7271z8-gammaloop-nextest-core
49.59 s
Last 229 log lines:
49.59 s
> Extracting 4 binaries (including 1 non-test binary), 1 build script output directory, and 2 linked paths to /build/nextest-archive-zo3sDk
49.59 s
> Extracted 20 files to /build/nextest-archive-zo3sDk in 0.69s
49.59 s
> ------------
49.59 s
> Nextest run ID 48a3f842-1487-47f0-8a00-c4400c0c8c26 with nextest profile: ci_gammaloop
49.59 s
> Starting 379 tests across 3 binaries
49.59 s
> ------------
49.59 s
> Summary [ 1.274s] 379 tests run: 379 passed , 0 skipped
49.59 s
>
49.59 s
> ========== nextest test summary ==========
49.59 s
> report: target/nextest/ci_gammaloop/junit.xml
49.59 s
> tests: 379, failures: 0, errors: 0
49.59 s
> No failing testcases found.
49.59 s
> =========================================
49.59 s
> Extracting 1 binary and 1 linked path to /build/nextest-archive-aPOjwM
49.59 s
> Extracted 7 files to /build/nextest-archive-aPOjwM in 0.07s
49.59 s
> ------------
49.59 s
> Nextest run ID f887a319-f384-4595-8704-5d2c8567ec81 with nextest profile: ci_gammaloop
49.59 s
> Starting 19 tests across 1 binary
49.59 s
> ------------
49.59 s
> Summary [ 0.012s] 19 tests run: 19 passed , 0 skipped
49.59 s
>
49.59 s
> ========== nextest test summary ==========
49.59 s
> report: target/nextest/ci_gammaloop/junit.xml
49.59 s
> tests: 19, failures: 0, errors: 0
49.59 s
> No failing testcases found.
49.59 s
> =========================================
49.59 s
> Extracting 1 binary to /build/nextest-archive-mo9ryb
49.59 s
> Extracted 4 files to /build/nextest-archive-mo9ryb in 0.03s
49.59 s
> ------------
49.59 s
> Nextest run ID c7aaef38-4f49-4b5f-b3a3-4792939e1e67 with nextest profile: ci_gammaloop
49.59 s
> Starting 0 tests across 1 binary
49.59 s
> ------------
49.59 s
> Summary [ 0.000s] 0 tests run: 0 passed , 0 skipped
49.59 s
>
49.59 s
> ========== nextest test summary ==========
49.59 s
> report: target/nextest/ci_gammaloop/junit.xml
49.59 s
> tests: 0, failures: 0, errors: 0
49.59 s
> No failing testcases found.
49.59 s
> =========================================
49.59 s
> Extracting 4 binaries, 1 build script output directory, and 2 linked paths to /build/nextest-archive-pE31SX
49.59 s
> Extracted 18 files to /build/nextest-archive-pE31SX in 0.47s
49.59 s
> ------------
49.59 s
> Nextest run ID 2a2237c2-1b07-47da-aeb5-193edae9ac2b with nextest profile: ci_gammaloop
49.59 s
> Starting 706 tests across 4 binaries (60 tests skipped , including 59 tests via profile.ci_gammaloop.default-filter )
49.59 s
> FAIL [ 3.000s] (701/706) gammalooprs::test_renormalization finite_part_ghost_2loop
49.59 s
> stdout ---
49.59 s
>
49.59 s
> running 1 test
49.59 s
> test finite_part_ghost_2loop ... FAILED
49.59 s
>
49.59 s
> failures:
49.59 s
>
49.59 s
> failures:
49.59 s
> finite_part_ghost_2loop
49.59 s
>
49.59 s
> test result: FAILED. 0 passed; 1 failed; 0 ignored; 0 measured; 6 filtered out; finished in 2.99s
49.59 s
>
49.59 s
> stderr ---
49.59 s
> The application panicked (crashed).
49.59 s
> Message: assertion failed: (align_to_rqft(&a, &model) - expected).expand().is_zero()
49.59 s
> Location: crates/gammalooprs/tests/test_renormalization.rs :583
49.59 s
>
49.59 s
> ━━━━━━━━━━━━━━━━━━━━━━━━━━━━━━━━━━ BACKTRACE ━━━━━━━━━━━━━━━━━━━━━━━━━━━━━━━━━━━
49.59 s
> 1: <color_eyre[51793ea62743adbd]::config::PanicHook>::panic_report <unknown>
49.59 s
> at <unknown source file> :<unknown line>
49.59 s
> 2: <color_eyre[51793ea62743adbd]::config::PanicHook>::into_panic_hook::{closure#0} <unknown>
49.59 s
> at <unknown source file> :<unknown line>
49.59 s
> 3: std[bcb96dfbba0ab899]::panicking::panic_with_hook <unknown>
49.59 s
> at <unknown source file> :<unknown line>
49.59 s
> 4: std[bcb96dfbba0ab899]::panicking::panic_handler::{closure#0} <unknown>
49.59 s
> at <unknown source file> :<unknown line>
49.59 s
> 5: std[bcb96dfbba0ab899]::sys::backtrace::__rust_end_short_backtrace::<std[bcb96dfbba0ab899]::panicking::panic_handler::{closure#0}, !> <unknown>
49.59 s
> at <unknown source file> :<unknown line>
49.59 s
> 6: __rustc[6c289b9f9c454d21]::rust_begin_unwind <unknown>
49.59 s
> at <unknown source file> :<unknown line>
49.59 s
> 7: core[940e698046960fd5]::panicking::panic_fmt <unknown>
49.59 s
> at <unknown source file> :<unknown line>
49.59 s
> 8: core[940e698046960fd5]::panicking::panic <unknown>
49.59 s
> at <unknown source file> :<unknown line>
49.59 s
> 9: <test_renormalization[5812939ef1a04d89]::finite_part_ghost_2loop::{closure#0} as core[940e698046960fd5]::ops::function::FnOnce<()>>::call_once <unknown>
49.59 s
> at <unknown source file> :<unknown line>
49.59 s
> 10: test[75d6903177b1d7e9]::__rust_begin_short_backtrace::<core[940e698046960fd5]::result::Result<(), alloc[2ea6bcb46fca0c42]::string::String>, fn() -> core[940e698046960fd5]::result::Result<(), alloc[2ea6bcb46fca0c42]::string::String>> <unknown>
49.59 s
> at <unknown source file> :<unknown line>
49.59 s
> 11: test[75d6903177b1d7e9]::run_test::{closure#0} <unknown>
49.59 s
> at <unknown source file> :<unknown line>
49.59 s
> 12: std[bcb96dfbba0ab899]::sys::backtrace::__rust_begin_short_backtrace::<test[75d6903177b1d7e9]::run_test::{closure#1}, ()> <unknown>
49.59 s
> at <unknown source file> :<unknown line>
49.59 s
> 13: <std[bcb96dfbba0ab899]::thread::lifecycle::spawn_unchecked<test[75d6903177b1d7e9]::run_test::{closure#1}, ()>::{closure#1} as core[940e698046960fd5]::ops::function::FnOnce<()>>::call_once::{shim:vtable#0} <unknown>
49.59 s
> at <unknown source file> :<unknown line>
49.59 s
> 14: <std[bcb96dfbba0ab899]::sys::thread::unix::Thread>::new::thread_start <unknown>
49.59 s
> at <unknown source file> :<unknown line>
49.59 s
> 15: start_thread <unknown>
49.59 s
> at <unknown source file> :<unknown line>
49.59 s
> 16: __clone3 <unknown>
49.59 s
> at <unknown source file> :<unknown line>
49.59 s
>
49.59 s
> Run with COLORBT_SHOW_HIDDEN=1 environment variable to disable frame filtering.
49.59 s
> Run with RUST_BACKTRACE=full to include source snippets.
49.59 s
>
49.59 s
> ------------
49.59 s
> Summary [ 10.802s] 706 tests run: 705 passed , 1 failed , 60 skipped
49.59 s
> FAIL [ 3.000s] (701/706) gammalooprs::test_renormalization finite_part_ghost_2loop
49.59 s
> stdout ---
49.59 s
>
49.59 s
> running 1 test
49.59 s
> test finite_part_ghost_2loop ... FAILED
49.59 s
>
49.59 s
> failures:
49.59 s
>
49.59 s
> failures:
49.59 s
> finite_part_ghost_2loop
49.59 s
>
49.59 s
> test result: FAILED. 0 passed; 1 failed; 0 ignored; 0 measured; 6 filtered out; finished in 2.99s
49.59 s
>
49.59 s
> stderr ---
49.59 s
> The application panicked (crashed).
49.59 s
> Message: assertion failed: (align_to_rqft(&a, &model) - expected).expand().is_zero()
49.59 s
> Location: crates/gammalooprs/tests/test_renormalization.rs :583
49.59 s
>
49.59 s
> ━━━━━━━━━━━━━━━━━━━━━━━━━━━━━━━━━━ BACKTRACE ━━━━━━━━━━━━━━━━━━━━━━━━━━━━━━━━━━━
49.59 s
> 1: <color_eyre[51793ea62743adbd]::config::PanicHook>::panic_report <unknown>
49.59 s
> at <unknown source file> :<unknown line>
49.59 s
> 2: <color_eyre[51793ea62743adbd]::config::PanicHook>::into_panic_hook::{closure#0} <unknown>
49.59 s
> at <unknown source file> :<unknown line>
49.59 s
> 3: std[bcb96dfbba0ab899]::panicking::panic_with_hook <unknown>
49.59 s
> at <unknown source file> :<unknown line>
49.59 s
> 4: std[bcb96dfbba0ab899]::panicking::panic_handler::{closure#0} <unknown>
49.59 s
> at <unknown source file> :<unknown line>
49.59 s
> 5: std[bcb96dfbba0ab899]::sys::backtrace::__rust_end_short_backtrace::<std[bcb96dfbba0ab899]::panicking::panic_handler::{closure#0}, !> <unknown>
49.59 s
> at <unknown source file> :<unknown line>
49.59 s
> 6: __rustc[6c289b9f9c454d21]::rust_begin_unwind <unknown>
49.59 s
> at <unknown source file> :<unknown line>
49.59 s
> 7: core[940e698046960fd5]::panicking::panic_fmt <unknown>
49.59 s
> at <unknown source file> :<unknown line>
49.59 s
> 8: core[940e698046960fd5]::panicking::panic <unknown>
49.59 s
> at <unknown source file> :<unknown line>
49.59 s
> 9: <test_renormalization[5812939ef1a04d89]::finite_part_ghost_2loop::{closure#0} as core[940e698046960fd5]::ops::function::FnOnce<()>>::call_once <unknown>
49.59 s
> at <unknown source file> :<unknown line>
49.59 s
> 10: test[75d6903177b1d7e9]::__rust_begin_short_backtrace::<core[940e698046960fd5]::result::Result<(), alloc[2ea6bcb46fca0c42]::string::String>, fn() -> core[940e698046960fd5]::result::Result<(), alloc[2ea6bcb46fca0c42]::string::String>> <unknown>
49.59 s
> at <unknown source file> :<unknown line>
49.59 s
> 11: test[75d6903177b1d7e9]::run_test::{closure#0} <unknown>
49.59 s
> at <unknown source file> :<unknown line>
49.59 s
> 12: std[bcb96dfbba0ab899]::sys::backtrace::__rust_begin_short_backtrace::<test[75d6903177b1d7e9]::run_test::{closure#1}, ()> <unknown>
49.59 s
> at <unknown source file> :<unknown line>
49.59 s
> 13: <std[bcb96dfbba0ab899]::thread::lifecycle::spawn_unchecked<test[75d6903177b1d7e9]::run_test::{closure#1}, ()>::{closure#1} as core[940e698046960fd5]::ops::function::FnOnce<()>>::call_once::{shim:vtable#0} <unknown>
49.59 s
> at <unknown source file> :<unknown line>
49.59 s
> 14: <std[bcb96dfbba0ab899]::sys::thread::unix::Thread>::new::thread_start <unknown>
49.59 s
> at <unknown source file> :<unknown line>
49.59 s
> 15: start_thread <unknown>
49.59 s
> at <unknown source file> :<unknown line>
49.59 s
> 16: __clone3 <unknown>
49.59 s
> at <unknown source file> :<unknown line>
49.59 s
>
49.59 s
> Run with COLORBT_SHOW_HIDDEN=1 environment variable to disable frame filtering.
49.59 s
> Run with RUST_BACKTRACE=full to include source snippets.
49.59 s
>
49.59 s
> error : test run failed
49.59 s
>
49.59 s
> ========== nextest test summary ==========
49.59 s
> report: target/nextest/ci_gammaloop/junit.xml
49.59 s
> tests: 706, failures: 1, errors: 0
49.59 s
>
49.59 s
> 1. gammalooprs::test_renormalization::finite_part_ghost_2loop
49.59 s
> failure: test failure with exit code 101
49.59 s
> system-out
49.59 s
> running 1 test
49.59 s
> test finite_part_ghost_2loop ... FAILED
49.59 s
>
49.59 s
> failures:
49.59 s
>
49.59 s
> failures:
49.59 s
> finite_part_ghost_2loop
49.59 s
>
49.59 s
> test result: FAILED. 0 passed; 1 failed; 0 ignored; 0 measured; 6 filtered out; finished in 2.99s
49.59 s
> system-err
49.59 s
> The application panicked (crashed).
49.59 s
> Message: assertion failed: (align_to_rqft(&a, &model) - expected).expand().is_zero()
49.59 s
> Location: crates/gammalooprs/tests/test_renormalization.rs:583
49.59 s
>
49.59 s
> ━━━━━━━━━━━━━━━━━━━━━━━━━━━━━━━━━━ BACKTRACE ━━━━━━━━━━━━━━━━━━━━━━━━━━━━━━━━━━━
49.59 s
> 1: <color_eyre[51793ea62743adbd]::config::PanicHook>::panic_report<unknown>
49.59 s
> at <unknown source file>:<unknown line>
49.59 s
> 2: <color_eyre[51793ea62743adbd]::config::PanicHook>::into_panic_hook::{closure#0}<unknown>
49.59 s
> at <unknown source file>:<unknown line>
49.59 s
> 3: std[bcb96dfbba0ab899]::panicking::panic_with_hook<unknown>
49.59 s
> at <unknown source file>:<unknown line>
49.59 s
> 4: std[bcb96dfbba0ab899]::panicking::panic_handler::{closure#0}<unknown>
49.59 s
> at <unknown source file>:<unknown line>
49.59 s
> 5: std[bcb96dfbba0ab899]::sys::backtrace::__rust_end_short_backtrace::<std[bcb96dfbba0ab899]::panicking::panic_handler::{closure#0}, !><unknown>
49.59 s
> at <unknown source file>:<unknown line>
49.59 s
> 6: __rustc[6c289b9f9c454d21]::rust_begin_unwind<unknown>
49.59 s
> at <unknown source file>:<unknown line>
49.59 s
> 7: core[940e698046960fd5]::panicking::panic_fmt<unknown>
49.59 s
> at <unknown source file>:<unknown line>
49.59 s
> 8: core[940e698046960fd5]::panicking::panic<unknown>
49.59 s
> at <unknown source file>:<unknown line>
49.59 s
> 9: <test_renormalization[5812939ef1a04d89]::finite_part_ghost_2loop::{closure#0} as core[940e698046960fd5]::ops::function::FnOnce<()>>::call_once<unknown>
49.59 s
> at <unknown source file>:<unknown line>
49.59 s
> 10: test[75d6903177b1d7e9]::__rust_begin_short_backtrace::<core[940e698046960fd5]::result::Result<(), alloc[2ea6bcb46fca0c42]::string::String>, fn() -> core[940e698046960fd5]::result::Result<(), alloc[2ea6bcb46fca0c42]::string::String>><unknown>
49.59 s
> at <unknown source file>:<unknown line>
49.59 s
> 11: test[75d6903177b1d7e9]::run_test::{closure#0}<unknown>
49.59 s
> at <unknown source file>:<unknown line>
49.59 s
> 12: std[bcb96dfbba0ab899]::sys::backtrace::__rust_begin_short_backtrace::<test[75d6903177b1d7e9]::run_test::{closure#1}, ()><unknown>
49.59 s
> at <unknown source file>:<unknown line>
49.59 s
> 13: <std[bcb96dfbba0ab899]::thread::lifecycle::spawn_unchecked<test[75d6903177b1d7e9]::run_test::{closure#1}, ()>::{closure#1} as core[940e698046960fd5]::ops::function::FnOnce<()>>::call_once::{shim:vtable#0}<unknown>
49.59 s
> at <unknown source file>:<unknown line>
49.59 s
> 14: <std[bcb96dfbba0ab899]::sys::thread::unix::Thread>::new::thread_start<unknown>
49.59 s
> at <unknown source file>:<unknown line>
49.59 s
> 15: start_thread<unknown>
49.59 s
> at <unknown source file>:<unknown line>
49.59 s
> 16: __clone3<unknown>
49.59 s
> at <unknown source file>:<unknown line>
49.59 s
>
49.59 s
> Run with COLORBT_SHOW_HIDDEN=1 environment variable to disable frame filtering.
49.59 s
> Run with RUST_BACKTRACE=full to include source snippets.
49.59 s
> =========================================
49.59 s
> Extracting 1 binary, 1 build script output directory, and 1 linked path to /build/nextest-archive-Yt4ZlH
49.59 s
> Extracted 7 files to /build/nextest-archive-Yt4ZlH in 0.08s
49.59 s
> ------------
49.59 s
> Nextest run ID 8d5acf1d-8a0f-4d5e-8e19-736bbfbed18c with nextest profile: ci_gammaloop
49.59 s
> Starting 105 tests across 1 binary
49.59 s
> ------------
49.59 s
> Summary [ 16.705s] 105 tests run: 105 passed , 0 skipped
49.59 s
>
49.59 s
> ========== nextest test summary ==========
49.59 s
> report: target/nextest/ci_gammaloop/junit.xml
49.59 s
> tests: 105, failures: 0, errors: 0
49.59 s
> No failing testcases found.
49.59 s
> =========================================
49.59 s
For full logs, run:
49.59 s
nix log /nix/store/gfw8irsajvc73r64ijh06rb30gc2744x-gammaloop-nextest-core.drv
49.74 s
[0 built (1 failed ), 0.0 Run failed.