test packages.x86_64-linux.nix-ci-check-gammaloop-nextest-feynkit

Reproduce this run
Original Run
  1. 0.01 s $ /nix/store/61685rbaxmpigwi3z23i33sv3jyfl70q-coreutils-9.11/bin/timeout --kill-after=15s 7200s /nix/store/wknkybkzrc16r11vk5vrykh4wmw7a353-nix-2.34.8/bin/nix --extra-experimental-features nix-command --extra-experimental-features flakes flake clone git+https://github.com/alphal00p/gammaloop --dest /tmp/nix-ci-worker/stable-pwd/repo/
  2. 0.19 s Cloning into '/tmp/nix-ci-worker/stable-pwd/repo'...
  3. 1.08 s remote: Enumerating objects: 102985, done.
  4. 1.30 s remote: Counting objects: 0% (1/9378) remote: Counting objects: 1% (94/9378) remote: Counting objects: 2% (188/9378) remote: Counting objects: 3% (282/9378) remote: Counting objects: 4% (376/9378) remote: Counting objects: 5% (469/9378) remote: Counting objects: 6% (563/9378) remote: Counting objects: 7% (657/9378) remote: Counting objects: 8% (751/9378) remote: Counting objects: 9% (845/9378) remote: Counting objects: 10% (938/9378) remote: Counting objects: 11% (1032/9378) remote: Counting objects: 12% (1126/9378) remote: Counting objects: 13% (1220/9378) remote: Counting objects: 14% (1313/9378) remote: Counting objects: 15% (1407/9378) remote: Counting objects: 16% (1501/9378) remote: Counting objects: 17% (1595/9378) remote: Counting objects: 18% (1689/9378) remote: Counting objects: 19% (1782/9378) remote: Counting objects: 20% (1876/9378) remote: Counting objects: 21% (1970/9378) remote: Counting objects: 22% (2064/9378) remote: Counting objects: 23% (2157/9378) remote: Counting objects: 24% (2251/9378) remote: Counting objects: 25% (2345/9378) remote: Counting objects: 26% (2439/9378) remote: Counting objects: 27% (2533/9378) remote: Counting objects: 28% (2626/9378) remote: Counting objects: 29% (2720/9378) remote: Counting objects: 30% (2814/9378) remote: Counting objects: 31% (2908/9378) remote: Counting objects: 32% (3001/9378) remote: Counting objects: 33% (3095/9378) remote: Counting objects: 34% (3189/9378) remote: Counting objects: 35% (3283/9378) remote: Counting objects: 36% (3377/9378) remote: Counting objects: 37% (3470/9378) remote: Counting objects: 38% (3564/9378) remote: Counting objects: 39% (3658/9378) remote: Counting objects: 40% (3752/9378) remote: Counting objects: 41% (3845/9378) remote: Counting objects: 42% (3939/9378) remote: Counting objects: 43% (4033/9378) remote: Counting objects: 44% (4127/9378) remote: Counting objects: 45% (4221/9378) remote: Counting objects: 46% (4314/9378) remote: Counting objects: 47% (4408/9378) remote: Counting objects: 48% (4502/9378) remote: Counting objects: 49% (4596/9378) remote: Counting objects: 50% (4689/9378) remote: Counting objects: 51% (4783/9378) remote: Counting objects: 52% (4877/9378) remote: Counting objects: 53% (4971/9378) remote: Counting objects: 54% (5065/9378) remote: Counting objects: 55% (5158/9378) remote: Counting objects: 56% (5252/9378) remote: Counting objects: 57% (5346/9378) remote: Counting objects: 58% (5440/9378) remote: Counting objects: 59% (5534/9378) remote: Counting objects: 60% (5627/9378) remote: Counting objects: 61% (5721/9378) remote: Counting objects: 62% (5815/9378) remote: Counting objects: 63% (5909/9378) remote: Counting objects: 64% (6002/9378) remote: Counting objects: 65% (6096/9378) remote: Counting objects: 66% (6190/9378) remote: Counting objects: 67% (6284/9378) remote: Counting objects: 68% (6378/9378) remote: Counting objects: 69% (6471/9378) remote: Counting objects: 70% (6565/9378) remote: Counting objects: 71% (6659/9378) remote: Counting objects: 72% (6753/9378) remote: Counting objects: 73% (6846/9378) remote: Counting objects: 74% (6940/9378) remote: Counting objects: 75% (7034/9378) remote: Counting objects: 76% (7128/9378) remote: Counting objects: 77% (7222/9378) remote: Counting objects: 78% (7315/9378) remote: Counting objects: 79% (7409/9378) remote: Counting objects: 80% (7503/9378) remote: Counting objects: 81% (7597/9378) remote: Counting objects: 82% (7690/9378) remote: Counting objects: 83% (7784/9378) remote: Counting objects: 84% (7878/9378) remote: Counting objects: 85% (7972/9378) remote: Counting objects: 86% (8066/9378) remote: Counting objects: 87% (8159/9378) remote: Counting objects: 88% (8253/9378) remote: Counting objects: 89% (8347/9378) remote: Counting objects: 90% (8441/9378) remote: Counting objects: 91% (8534/9378) remote: Counting objects: 92% (8628/9378) remote: Counting objects: 93% (8722/9378) remote: Counting objects: 94% (8816/9378) remote: Counting objects: 95% (8910/9378) remote: Counting objects: 96% (9003/9378) remote: Counting objects: 97% (9097/9378) remote: Counting objects: 98% (9191/9378) remote: Counting objects: 99% (9285/9378) remote: Counting objects: 100% (9378/9378) remote: Counting objects: 100% (9378/9378), done.
  5. 3.64 s remote: Compressing objects: 0% (1/2006) remote: Compressing objects: 1% (21/2006) remote: Compressing objects: 2% (41/2006) remote: Compressing objects: 3% (61/2006) remote: Compressing objects: 4% (81/2006) remote: Compressing objects: 5% (101/2006) remote: Compressing objects: 6% (121/2006) remote: Compressing objects: 7% (141/2006) remote: Compressing objects: 7% (157/2006) remote: Compressing objects: 8% (161/2006) remote: Compressing objects: 9% (181/2006) remote: Compressing objects: 10% (201/2006) remote: Compressing objects: 11% (221/2006) remote: Compressing objects: 12% (241/2006) remote: Compressing objects: 13% (261/2006) remote: Compressing objects: 14% (281/2006) remote: Compressing objects: 15% (301/2006) remote: Compressing objects: 16% (321/2006) remote: Compressing objects: 17% (342/2006) remote: Compressing objects: 17% (348/2006) remote: Compressing objects: 18% (362/2006) remote: Compressing objects: 19% (382/2006) remote: Compressing objects: 20% (402/2006) remote: Compressing objects: 21% (422/2006) remote: Compressing objects: 22% (442/2006) remote: Compressing objects: 23% (462/2006) remote: Compressing objects: 24% (482/2006) remote: Compressing objects: 25% (502/2006) remote: Compressing objects: 26% (522/2006) remote: Compressing objects: 27% (542/2006) remote: Compressing objects: 28% (562/2006) remote: Compressing objects: 29% (582/2006) remote: Compressing objects: 30% (602/2006) remote: Compressing objects: 31% (622/2006) remote: Compressing objects: 32% (642/2006) remote: Compressing objects: 33% (662/2006) remote: Compressing objects: 34% (683/2006) remote: Compressing objects: 35% (703/2006) remote: Compressing objects: 36% (723/2006) remote: Compressing objects: 37% (743/2006) remote: Compressing objects: 38% (763/2006) remote: Compressing objects: 39% (783/2006) remote: Compressing objects: 40% (803/2006) remote: Compressing objects: 41% (823/2006) remote: Compressing objects: 42% (843/2006) remote: Compressing objects: 43% (863/2006) remote: Compressing objects: 44% (883/2006) remote: Compressing objects: 45% (903/2006) remote: Compressing objects: 46% (923/2006) remote: Compressing objects: 47% (943/2006) remote: Compressing objects: 48% (963/2006) remote: Compressing objects: 49% (983/2006) remote: Compressing objects: 50% (1003/2006) remote: Compressing objects: 51% (1024/2006) remote: Compressing objects: 52% (1044/2006) remote: Compressing objects: 53% (1064/2006) remote: Compressing objects: 54% (1084/2006) remote: Compressing objects: 55% (1104/2006) remote: Compressing objects: 56% (1124/2006) remote: Compressing objects: 57% (1144/2006) remote: Compressing objects: 58% (1164/2006) remote: Compressing objects: 59% (1184/2006) remote: Compressing objects: 60% (1204/2006) remote: Compressing objects: 61% (1224/2006) remote: Compressing objects: 62% (1244/2006) remote: Compressing objects: 63% (1264/2006) remote: Compressing objects: 64% (1284/2006) remote: Compressing objects: 65% (1304/2006) remote: Compressing objects: 66% (1324/2006) remote: Compressing objects: 67% (1345/2006) remote: Compressing objects: 68% (1365/2006) remote: Compressing objects: 69% (1385/2006) remote: Compressing objects: 70% (1405/2006) remote: Compressing objects: 71% (1425/2006) remote: Compressing objects: 72% (1445/2006) remote: Compressing objects: 73% (1465/2006) remote: Compressing objects: 74% (1485/2006) remote: Compressing objects: 75% (1505/2006) remote: Compressing objects: 76% (1525/2006) remote: Compressing objects: 77% (1545/2006) remote: Compressing objects: 78% (1565/2006) remote: Compressing objects: 79% (1585/2006) remote: Compressing objects: 80% (1605/2006) remote: Compressing objects: 81% (1625/2006) remote: Compressing objects: 82% (1645/2006) remote: Compressing objects: 83% (1665/2006) remote: Compressing objects: 84% (1686/2006) remote: Compressing objects: 85% (1706/2006) remote: Compressing objects: 86% (1726/2006) remote: Compressing objects: 87% (1746/2006) remote: Compressing objects: 88% (1766/2006) remote: Compressing objects: 89% (1786/2006) remote: Compressing objects: 90% (1806/2006) remote: Compressing objects: 91% (1826/2006) remote: Compressing objects: 92% (1846/2006) remote: Compressing objects: 93% (1866/2006) remote: Compressing objects: 94% (1886/2006) remote: Compressing objects: 95% (1906/2006) remote: Compressing objects: 96% (1926/2006) remote: Compressing objects: 97% (1946/2006) remote: Compressing objects: 98% (1966/2006) remote: Compressing objects: 99% (1986/2006) remote: Compressing objects: 100% (2006/2006) remote: Compressing objects: 100% (2006/2006), done.
  6. 15.64 s Receiving objects: 0% (1/102985) Receiving objects: 1% (1030/102985) Receiving objects: 2% (2060/102985), 4.96 MiB | 9.91 MiB/s Receiving objects: 3% (3090/102985), 4.96 MiB | 9.91 MiB/s Receiving objects: 4% (4120/102985), 4.96 MiB | 9.91 MiB/s Receiving objects: 5% (5150/102985), 4.96 MiB | 9.91 MiB/s Receiving objects: 6% (6180/102985), 4.96 MiB | 9.91 MiB/s Receiving objects: 6% (7135/102985), 12.00 MiB | 11.99 MiB/s Receiving objects: 7% (7209/102985), 12.00 MiB | 11.99 MiB/s Receiving objects: 8% (8239/102985), 12.00 MiB | 11.99 MiB/s Receiving objects: 9% (9269/102985), 12.00 MiB | 11.99 MiB/s Receiving objects: 10% (10299/102985), 12.00 MiB | 11.99 MiB/s Receiving objects: 11% (11329/102985), 12.00 MiB | 11.99 MiB/s Receiving objects: 12% (12359/102985), 12.00 MiB | 11.99 MiB/s Receiving objects: 13% (13389/102985), 12.00 MiB | 11.99 MiB/s Receiving objects: 14% (14418/102985), 12.00 MiB | 11.99 MiB/s Receiving objects: 15% (15448/102985), 12.00 MiB | 11.99 MiB/s Receiving objects: 16% (16478/102985), 12.00 MiB | 11.99 MiB/s Receiving objects: 17% (17508/102985), 12.00 MiB | 11.99 MiB/s Receiving objects: 18% (18538/102985), 12.00 MiB | 11.99 MiB/s Receiving objects: 19% (19568/102985), 12.00 MiB | 11.99 MiB/s Receiving objects: 20% (20597/102985), 12.00 MiB | 11.99 MiB/s Receiving objects: 21% (21627/102985), 12.00 MiB | 11.99 MiB/s Receiving objects: 22% (22657/102985), 12.00 MiB | 11.99 MiB/s Receiving objects: 23% (23687/102985), 12.00 MiB | 11.99 MiB/s Receiving objects: 24% (24717/102985), 12.00 MiB | 11.99 MiB/s Receiving objects: 25% (25747/102985), 12.00 MiB | 11.99 MiB/s Receiving objects: 26% (26777/102985), 12.00 MiB | 11.99 MiB/s Receiving objects: 27% (27806/102985), 12.00 MiB | 11.99 MiB/s Receiving objects: 28% (28836/102985), 12.00 MiB | 11.99 MiB/s Receiving objects: 29% (29866/102985), 12.00 MiB | 11.99 MiB/s Receiving objects: 30% (30896/102985), 12.00 MiB | 11.99 MiB/s Receiving objects: 31% (31926/102985), 12.00 MiB | 11.99 MiB/s Receiving objects: 32% (32956/102985), 12.00 MiB | 11.99 MiB/s Receiving objects: 33% (33986/102985), 12.00 MiB | 11.99 MiB/s Receiving objects: 34% (35015/102985), 34.70 MiB | 23.13 MiB/s Receiving objects: 35% (36045/102985), 34.70 MiB | 23.13 MiB/s Receiving objects: 36% (37075/102985), 34.70 MiB | 23.13 MiB/s Receiving objects: 37% (38105/102985), 34.70 MiB | 23.13 MiB/s Receiving objects: 38% (39135/102985), 34.70 MiB | 23.13 MiB/s Receiving objects: 39% (40165/102985), 34.70 MiB | 23.13 MiB/s Receiving objects: 40% (41194/102985), 34.70 MiB | 23.13 MiB/s Receiving objects: 41% (42224/102985), 34.70 MiB | 23.13 MiB/s Receiving objects: 42% (43254/102985), 34.70 MiB | 23.13 MiB/s Receiving objects: 43% (44284/102985), 34.70 MiB | 23.13 MiB/s Receiving objects: 43% (44825/102985), 34.70 MiB | 23.13 MiB/s Receiving objects: 44% (45314/102985), 54.24 MiB | 27.12 MiB/s Receiving objects: 45% (46344/102985), 54.24 MiB | 27.12 MiB/s Receiving objects: 46% (47374/102985), 54.24 MiB | 27.12 MiB/s Receiving objects: 47% (48403/102985), 54.24 MiB | 27.12 MiB/s Receiving objects: 48% (49433/102985), 54.24 MiB | 27.12 MiB/s Receiving objects: 49% (50463/102985), 70.61 MiB | 27.85 MiB/s Receiving objects: 50% (51493/102985), 70.61 MiB | 27.85 MiB/s Receiving objects: 51% (52523/102985), 70.61 MiB | 27.85 MiB/s Receiving objects: 52% (53553/102985), 70.61 MiB | 27.85 MiB/s Receiving objects: 53% (54583/102985), 70.61 MiB | 27.85 MiB/s Receiving objects: 54% (55612/102985), 70.61 MiB | 27.85 MiB/s Receiving objects: 55% (56642/102985), 70.61 MiB | 27.85 MiB/s Receiving objects: 55% (57049/102985), 70.61 MiB | 27.85 MiB/s Receiving objects: 55% (57106/102985), 103.73 MiB | 29.32 MiB/s Receiving objects: 55% (57227/102985), 152.31 MiB | 32.29 MiB/s Receiving objects: 56% (57672/102985), 152.31 MiB | 32.29 MiB/s Receiving objects: 57% (58702/102985), 152.31 MiB | 32.29 MiB/s Receiving objects: 58% (59732/102985), 166.84 MiB | 33.93 MiB/s Receiving objects: 59% (60762/102985), 166.84 MiB | 33.93 MiB/s Receiving objects: 60% (61791/102985), 166.84 MiB | 33.93 MiB/s Receiving objects: 61% (62821/102985), 166.84 MiB | 33.93 MiB/s Receiving objects: 62% (63851/102985), 166.84 MiB | 33.93 MiB/s Receiving objects: 62% (64426/102985), 166.84 MiB | 33.93 MiB/s Receiving objects: 63% (64881/102985), 185.29 MiB | 32.99 MiB/s Receiving objects: 64% (65911/102985), 185.29 MiB | 32.99 MiB/s Receiving objects: 65% (66941/102985), 185.29 MiB | 32.99 MiB/s Receiving objects: 66% (67971/102985), 185.29 MiB | 32.99 MiB/s Receiving objects: 67% (69000/102985), 185.29 MiB | 32.99 MiB/s Receiving objects: 68% (70030/102985), 185.29 MiB | 32.99 MiB/s Receiving objects: 69% (71060/102985), 185.29 MiB | 32.99 MiB/s Receiving objects: 70% (72090/102985), 185.29 MiB | 32.99 MiB/s Receiving objects: 71% (73120/102985), 185.29 MiB | 32.99 MiB/s Receiving objects: 72% (74150/102985), 185.29 MiB | 32.99 MiB/s Receiving objects: 73% (75180/102985), 202.01 MiB | 32.37 MiB/s Receiving objects: 74% (76209/102985), 202.01 MiB | 32.37 MiB/s Receiving objects: 74% (76685/102985), 202.01 MiB | 32.37 MiB/s Receiving objects: 75% (77239/102985), 219.87 MiB | 32.91 MiB/s Receiving objects: 76% (78269/102985), 219.87 MiB | 32.91 MiB/s Receiving objects: 77% (79299/102985), 219.87 MiB | 32.91 MiB/s Receiving objects: 78% (80329/102985), 238.04 MiB | 33.25 MiB/s Receiving objects: 79% (81359/102985), 238.04 MiB | 33.25 MiB/s Receiving objects: 80% (82388/102985), 238.04 MiB | 33.25 MiB/s Receiving objects: 81% (83418/102985), 238.04 MiB | 33.25 MiB/s Receiving objects: 81% (83804/102985), 238.04 MiB | 33.25 MiB/s Receiving objects: 82% (84448/102985), 273.07 MiB | 33.78 MiB/s Receiving objects: 82% (84516/102985), 290.78 MiB | 34.28 MiB/s Receiving objects: 83% (85478/102985), 307.61 MiB | 34.42 MiB/s Receiving objects: 84% (86508/102985), 307.61 MiB | 34.42 MiB/s Receiving objects: 84% (86699/102985), 307.61 MiB | 34.42 MiB/s Receiving objects: 85% (87538/102985), 325.53 MiB | 35.17 MiB/s Receiving objects: 86% (88568/102985), 325.53 MiB | 35.17 MiB/s Receiving objects: 87% (89597/102985), 325.53 MiB | 35.17 MiB/s Receiving objects: 88% (90627/102985), 325.53 MiB | 35.17 MiB/s Receiving objects: 88% (91588/102985), 343.24 MiB | 35.00 MiB/s Receiving objects: 89% (91657/102985), 360.38 MiB | 35.09 MiB/s Receiving objects: 90% (92687/102985), 378.20 MiB | 35.13 MiB/s Receiving objects: 91% (93717/102985), 378.20 MiB | 35.13 MiB/s Receiving objects: 92% (94747/102985), 378.20 MiB | 35.13 MiB/s Receiving objects: 93% (95777/102985), 378.20 MiB | 35.13 MiB/s Receiving objects: 94% (96806/102985), 378.20 MiB | 35.13 MiB/s Receiving objects: 95% (97836/102985), 378.20 MiB | 35.13 MiB/s Receiving objects: 96% (98866/102985), 378.20 MiB | 35.13 MiB/s Receiving objects: 97% (99896/102985), 378.20 MiB | 35.13 MiB/s Receiving objects: 98% (100926/102985), 378.20 MiB | 35.13 MiB/s Receiving objects: 99% (101956/102985), 378.20 MiB | 35.13 MiB/s Receiving objects: 99% (102834/102985), 378.20 MiB | 35.13 MiB/s remote: Total 102985 (delta 8122), reused 7424 (delta 7366), pack-reused 93607 (from 4)
  7. 15.65 s Receiving objects: 100% (102985/102985), 378.20 MiB | 35.13 MiB/s Receiving objects: 100% (102985/102985), 391.53 MiB | 32.61 MiB/s, done.
  8. 18.71 s Resolving deltas: 0% (0/67477) Resolving deltas: 1% (675/67477) Resolving deltas: 2% (1350/67477) Resolving deltas: 3% (2025/67477) Resolving deltas: 4% (2700/67477) Resolving deltas: 5% (3374/67477) Resolving deltas: 6% (4050/67477) Resolving deltas: 7% (4724/67477) Resolving deltas: 8% (5399/67477) Resolving deltas: 9% (6073/67477) Resolving deltas: 10% (6748/67477) Resolving deltas: 11% (7423/67477) Resolving deltas: 12% (8098/67477) Resolving deltas: 13% (8773/67477) Resolving deltas: 14% (9447/67477) Resolving deltas: 15% (10122/67477) Resolving deltas: 16% (10797/67477) Resolving deltas: 17% (11472/67477) Resolving deltas: 18% (12146/67477) Resolving deltas: 19% (12821/67477) Resolving deltas: 20% (13496/67477) Resolving deltas: 21% (14171/67477) Resolving deltas: 22% (14845/67477) Resolving deltas: 23% (15520/67477) Resolving deltas: 24% (16195/67477) Resolving deltas: 25% (16870/67477) Resolving deltas: 26% (17545/67477) Resolving deltas: 27% (18219/67477) Resolving deltas: 28% (18894/67477) Resolving deltas: 29% (19569/67477) Resolving deltas: 30% (20244/67477) Resolving deltas: 31% (20918/67477) Resolving deltas: 32% (21593/67477) Resolving deltas: 33% (22268/67477) Resolving deltas: 34% (22943/67477) Resolving deltas: 35% (23617/67477) Resolving deltas: 36% (24292/67477) Resolving deltas: 37% (24967/67477) Resolving deltas: 38% (25642/67477) Resolving deltas: 39% (26317/67477) Resolving deltas: 40% (26991/67477) Resolving deltas: 41% (27666/67477) Resolving deltas: 42% (28341/67477) Resolving deltas: 43% (29016/67477) Resolving deltas: 44% (29691/67477) Resolving deltas: 45% (30366/67477) Resolving deltas: 45% (30855/67477) Resolving deltas: 46% (31040/67477) Resolving deltas: 47% (31715/67477) Resolving deltas: 48% (32389/67477) Resolving deltas: 49% (33064/67477) Resolving deltas: 50% (33739/67477) Resolving deltas: 51% (34415/67477) Resolving deltas: 52% (35089/67477) Resolving deltas: 53% (35763/67477) Resolving deltas: 54% (36438/67477) Resolving deltas: 55% (37113/67477) Resolving deltas: 56% (37788/67477) Resolving deltas: 57% (38463/67477) Resolving deltas: 58% (39137/67477) Resolving deltas: 59% (39812/67477) Resolving deltas: 60% (40487/67477) Resolving deltas: 61% (41161/67477) Resolving deltas: 62% (41836/67477) Resolving deltas: 63% (42511/67477) Resolving deltas: 64% (43187/67477) Resolving deltas: 65% (43861/67477) Resolving deltas: 66% (44535/67477) Resolving deltas: 67% (45210/67477) Resolving deltas: 68% (45885/67477) Resolving deltas: 69% (46560/67477) Resolving deltas: 70% (47234/67477) Resolving deltas: 70% (47572/67477) Resolving deltas: 71% (47909/67477) Resolving deltas: 72% (48584/67477) Resolving deltas: 73% (49259/67477) Resolving deltas: 74% (49933/67477) Resolving deltas: 75% (50608/67477) Resolving deltas: 76% (51283/67477) Resolving deltas: 77% (51958/67477) Resolving deltas: 78% (52633/67477) Resolving deltas: 79% (53307/67477) Resolving deltas: 80% (53982/67477) Resolving deltas: 81% (54657/67477) Resolving deltas: 82% (55332/67477) Resolving deltas: 83% (56006/67477) Resolving deltas: 84% (56681/67477) Resolving deltas: 85% (57356/67477) Resolving deltas: 86% (58032/67477) Resolving deltas: 87% (58705/67477) Resolving deltas: 88% (59380/67477) Resolving deltas: 89% (60055/67477) Resolving deltas: 90% (60730/67477) Resolving deltas: 91% (61405/67477) Resolving deltas: 92% (62079/67477) Resolving deltas: 93% (62755/67477) Resolving deltas: 94% (63429/67477) Resolving deltas: 95% (64104/67477) Resolving deltas: 96% (64778/67477) Resolving deltas: 97% (65453/67477) Resolving deltas: 98% (66128/67477) Resolving deltas: 98% (66320/67477) Resolving deltas: 99% (66803/67477) Resolving deltas: 100% (67477/67477) Resolving deltas: 100% (67477/67477), done.
  9. 19.48 s Fetching commit 0ea2140565027f7541293396e9053cd67c4c0a1e for feynkit ...
  10. 19.48 s $ /nix/store/5vpcfsdx1lcnlb2y4k7xyc74shp5qwbh-git-2.54.0/bin/git fetch origin 0ea2140565027f7541293396e9053cd67c4c0a1e
  11. 19.92 s From https://github.com/alphal00p/gammaloop
  12. 19.92 s * branch 0ea2140565027f7541293396e9053cd67c4c0a1e -> FETCH_HEAD
  13. 19.93 s $ /nix/store/61685rbaxmpigwi3z23i33sv3jyfl70q-coreutils-9.11/bin/timeout --kill-after=15s 7200s /nix/store/5vpcfsdx1lcnlb2y4k7xyc74shp5qwbh-git-2.54.0/bin/git -c advice.detachedHead=false checkout 0ea2140565027f7541293396e9053cd67c4c0a1e
  14. 20.20 s HEAD is now at 0ea214056 unify Python generation arguments and return empty results
  15. 20.21 s $ /nix/store/61685rbaxmpigwi3z23i33sv3jyfl70q-coreutils-9.11/bin/timeout --kill-after=15s 7200s /nix/store/wknkybkzrc16r11vk5vrykh4wmw7a353-nix-2.34.8/bin/nix --extra-experimental-features nix-command --extra-experimental-features flakes --log-format internal-json run .#packages.x86_64-linux.nix-ci-check-gammaloop-nextest-feynkit --print-build-logs
  16. 20.33 s warning: ignoring untrusted flake configuration setting 'extra-substituters'.
  17. 20.33 s Pass '--accept-flake-config' to trust it
  18. 20.33 s warning: ignoring untrusted flake configuration setting 'extra-trusted-public-keys'.
  19. 20.33 s Pass '--accept-flake-config' to trust it
  20. 20.33 s
  21. 20.52 s do you want to allow configuration setting 'extra-substituters' to be set to 'https://cache.nix-ci.com' (y/N)? do you want to permanently mark this value as untrusted (y/N)? warning: ignoring untrusted flake configuration setting 'extra-substituters'.
  22. 20.52 s Pass '--accept-flake-config' to trust it
  23. 20.52 s evaluating derivation 'gdo you want to allow configuration setting 'extra-trusted-public-keys' to be set to 'nix-ci:g3xV5BDTLtIBZr/A00IU1x0EtKKlb7YLgBN2SgYgM6A=' (y/N)? do you want to permanently mark this value as untrusted (y/N)? warning: ignoring untrusted flake configuration setting 'extra-trusted-public-keys'.
  24. 20.52 s Pass '--accept-flake-config' to trust it
  25. 25.82 s copying '/nix/store/rx7m evaluating derivation 'g copying '/nix/store/rx7m evaluating derivation 'g copying '/nix/store/rx7m evaluating derivation 'g [0/1 built] [1/0/1 built] building ggammaloop-nextest-feynkit> Extracting 1 binary and 2 linked paths to /build/source
  26. 25.90 s gammaloop-nextest-feynkit> Extracted 15 files to /build/source in 0.08s
  27. 25.91 s gammaloop-nextest-feynkit> ------------
  28. 25.91 s gammaloop-nextest-feynkit> Nextest run ID 99f16bfb-46b6-4ce8-b371-08458e2679ea with nextest profile: ci_gammaloop
  29. 25.91 s gammaloop-nextest-feynkit> Starting 1 test across 1 binary
  30. 25.91 s gammaloop-nextest-feynkit> ------------
  31. 25.91 s gammaloop-nextest-feynkit> Summary [ 0.005s] 1 test run: 1 passed, 0 skipped
  32. 25.95 s gammaloop-nextest-feynkit>
  33. 25.95 s gammaloop-nextest-feynkit> ========== nextest test summary ==========
  34. 25.95 s gammaloop-nextest-feynkit> report: target/nextest/ci_gammaloop/junit.xml
  35. 25.95 s gammaloop-nextest-feynkit> tests: 1, failures: 0, errors: 0
  36. 25.95 s gammaloop-nextest-feynkit> No failing testcases found.
  37. 25.95 s gammaloop-nextest-feynkit> =========================================
  38. 25.96 s gammaloop-nextest-feynkit> Extracting 1 binary and 2 linked paths to /build/source
  39. 26.05 s gammaloop-nextest-feynkit> Extracted 15 files to /build/source in 0.09s
  40. 26.06 s gammaloop-nextest-feynkit> ------------
  41. 26.06 s gammaloop-nextest-feynkit> Nextest run ID 3ec0e44e-fc8d-4f96-9494-2de7a2618de6 with nextest profile: ci_gammaloop
  42. 26.06 s gammaloop-nextest-feynkit> Starting 33 tests across 1 binary
  43. 26.09 s gammaloop-nextest-feynkit> ------------
  44. 26.09 s gammaloop-nextest-feynkit> Summary [ 0.025s] 33 tests run: 33 passed, 0 skipped
  45. 26.13 s gammaloop-nextest-feynkit>
  46. 26.13 s gammaloop-nextest-feynkit> ========== nextest test summary ==========
  47. 26.13 s gammaloop-nextest-feynkit> report: target/nextest/ci_gammaloop/junit.xml
  48. 26.13 s gammaloop-nextest-feynkit> tests: 33, failures: 0, errors: 0
  49. 26.13 s gammaloop-nextest-feynkit> No failing testcases found.
  50. 26.13 s gammaloop-nextest-feynkit> =========================================
  51. 26.14 s gammaloop-nextest-feynkit> Extracting 2 binaries and 2 linked paths to /build/source
  52. 26.29 s gammaloop-nextest-feynkit> Extracted 16 files to /build/source in 0.15s
  53. 26.30 s gammaloop-nextest-feynkit> ------------
  54. 26.30 s gammaloop-nextest-feynkit> Nextest run ID 9c6808af-eaf2-463d-847d-350386af0cf5 with nextest profile: ci_gammaloop
  55. 26.30 s gammaloop-nextest-feynkit> Starting 58 tests across 2 binaries
  56. 26.37 s gammaloop-nextest-feynkit> ------------
  57. 26.37 s gammaloop-nextest-feynkit> Summary [ 0.068s] 58 tests run: 58 passed, 0 skipped
  58. 26.40 s gammaloop-nextest-feynkit>
  59. 26.40 s gammaloop-nextest-feynkit> ========== nextest test summary ==========
  60. 26.40 s gammaloop-nextest-feynkit> report: target/nextest/ci_gammaloop/junit.xml
  61. 26.40 s gammaloop-nextest-feynkit> tests: 58, failures: 0, errors: 0
  62. 26.40 s gammaloop-nextest-feynkit> No failing testcases found.
  63. 26.40 s gammaloop-nextest-feynkit> =========================================
  64. 26.42 s gammaloop-nextest-feynkit> Extracting 1 binary and 2 linked paths to /build/source
  65. 26.51 s gammaloop-nextest-feynkit> Extracted 15 files to /build/source in 0.09s
  66. 26.54 s gammaloop-nextest-feynkit> ------------
  67. 26.54 s gammaloop-nextest-feynkit> Nextest run ID 81aa1e7e-52e3-4148-9211-ff1abef3dbac with nextest profile: ci_gammaloop
  68. 26.54 s gammaloop-nextest-feynkit> Starting 24 tests across 1 binary
  69. 26.61 s gammaloop-nextest-feynkit> ------------
  70. 26.61 s gammaloop-nextest-feynkit> Summary [ 0.074s] 24 tests run: 24 passed, 0 skipped
  71. 26.65 s gammaloop-nextest-feynkit>
  72. 26.65 s gammaloop-nextest-feynkit> ========== nextest test summary ==========
  73. 26.65 s gammaloop-nextest-feynkit> report: target/nextest/ci_gammaloop/junit.xml
  74. 26.65 s gammaloop-nextest-feynkit> tests: 24, failures: 0, errors: 0
  75. 26.65 s gammaloop-nextest-feynkit> No failing testcases found.
  76. 26.65 s gammaloop-nextest-feynkit> =========================================
  77. 26.67 s gammaloop-nextest-feynkit> Extracting 1 binary and 1 linked path to /build/source
  78. 26.75 s gammaloop-nextest-feynkit> Extracted 7 files to /build/source in 0.09s
  79. 26.77 s gammaloop-nextest-feynkit> ------------
  80. 26.77 s gammaloop-nextest-feynkit> Nextest run ID 288dfed9-8876-42b4-9878-eec3500f1822 with nextest profile: ci_gammaloop
  81. 26.77 s gammaloop-nextest-feynkit> Starting 21 tests across 1 binary
  82. 26.79 s gammaloop-nextest-feynkit> ------------
  83. 26.79 s gammaloop-nextest-feynkit> Summary [ 0.026s] 21 tests run: 21 passed, 0 skipped
  84. 26.84 s gammaloop-nextest-feynkit>
  85. 26.84 s gammaloop-nextest-feynkit> ========== nextest test summary ==========
  86. 26.84 s gammaloop-nextest-feynkit> report: target/nextest/ci_gammaloop/junit.xml
  87. 26.84 s gammaloop-nextest-feynkit> tests: 21, failures: 0, errors: 0
  88. 26.84 s gammaloop-nextest-feynkit> No failing testcases found.
  89. 26.84 s gammaloop-nextest-feynkit> =========================================
  90. 26.86 s gammaloop-nextest-feynkit> Extracting 2 binaries and 2 linked paths to /build/source
  91. 26.99 s gammaloop-nextest-feynkit> Extracted 16 files to /build/source in 0.13s
  92. 27.02 s gammaloop-nextest-feynkit> ------------
  93. 27.02 s gammaloop-nextest-feynkit> Nextest run ID 286d155c-517b-45aa-ae53-269432b0f188 with nextest profile: ci_gammaloop
  94. 27.02 s gammaloop-nextest-feynkit> Starting 14 tests across 2 binaries
  95. 27.08 s gammaloop-nextest-feynkit> ------------
  96. 27.08 s gammaloop-nextest-feynkit> Summary [ 0.053s] 14 tests run: 14 passed, 0 skipped
  97. 27.13 s gammaloop-nextest-feynkit>
  98. 27.13 s gammaloop-nextest-feynkit> ========== nextest test summary ==========
  99. 27.13 s gammaloop-nextest-feynkit> report: target/nextest/ci_gammaloop/junit.xml
  100. 27.13 s gammaloop-nextest-feynkit> tests: 14, failures: 0, errors: 0
  101. 27.13 s gammaloop-nextest-feynkit> No failing testcases found.
  102. 27.13 s gammaloop-nextest-feynkit> =========================================
  103. 27.15 s gammaloop-nextest-feynkit> Extracting 5 binaries (including 3 non-test binaries) and 2 linked paths to /build/source
  104. 27.83 s gammaloop-nextest-feynkit> Extracted 22 files to /build/source in 0.68s
  105. 27.84 s gammaloop-nextest-feynkit> ------------
  106. 27.84 s gammaloop-nextest-feynkit> Nextest run ID cafb618c-c6b7-46ef-92cd-ecad18270916 with nextest profile: ci_gammaloop
  107. 27.84 s gammaloop-nextest-feynkit> Starting 12 tests across 2 binaries
  108. 27.89 s gammaloop-nextest-feynkit> FAIL [ 0.052s] (11/12) feynkit-py tests::standalone_python_pipeline_covers_generation_graphs_cff_and_kinematics
  109. 27.89 s gammaloop-nextest-feynkit> stdout ---
  110. 27.89 s gammaloop-nextest-feynkit>
  111. 27.89 s gammaloop-nextest-feynkit> running 1 test
  112. 27.89 s gammaloop-nextest-feynkit> test tests::standalone_python_pipeline_covers_generation_graphs_cff_and_kinematics ... FAILED
  113. 27.89 s gammaloop-nextest-feynkit>
  114. 27.89 s gammaloop-nextest-feynkit> failures:
  115. 27.89 s gammaloop-nextest-feynkit>
  116. 27.89 s gammaloop-nextest-feynkit> failures:
  117. 27.89 s gammaloop-nextest-feynkit> tests::standalone_python_pipeline_covers_generation_graphs_cff_and_kinematics
  118. 27.89 s gammaloop-nextest-feynkit>
  119. 27.89 s gammaloop-nextest-feynkit> test result: FAILED. 0 passed; 1 failed; 0 ignored; 0 measured; 10 filtered out; finished in 0.04s
  120. 27.89 s gammaloop-nextest-feynkit>
  121. 27.89 s gammaloop-nextest-feynkit> stderr ---
  122. 27.89 s gammaloop-nextest-feynkit>
  123. 27.89 s gammaloop-nextest-feynkit> thread 'tests::standalone_python_pipeline_covers_generation_graphs_cff_and_kinematics' (894) panicked at crates/feynkit-py/src/lib.rs:431:57:
  124. 27.89 s gammaloop-nextest-feynkit> called `Result::unwrap()` on an `Err` value: PyErr { type: <class 'AssertionError'>, value: AssertionError(), traceback: Some("Traceback (most recent call last):\n File \"<string>\", line 39, in <module>\n") }
  125. 27.89 s gammaloop-nextest-feynkit> stack backtrace:
  126. 27.89 s gammaloop-nextest-feynkit> 0: __rustc::rust_begin_unwind
  127. 27.89 s gammaloop-nextest-feynkit> 1: core::panicking::panic_fmt
  128. 27.89 s gammaloop-nextest-feynkit> 2: core::result::unwrap_failed
  129. 27.89 s gammaloop-nextest-feynkit> 3: feynkit_py::tests::standalone_python_pipeline_covers_generation_graphs_cff_and_kinematics
  130. 27.89 s gammaloop-nextest-feynkit> 4: <feynkit_py::tests::standalone_python_pipeline_covers_generation_graphs_cff_and_kinematics::{closure#0} as core::ops::function::FnOnce<()>>::call_once
  131. 27.89 s gammaloop-nextest-feynkit> note: Some details are omitted, run with `RUST_BACKTRACE=full` for a verbose backtrace.
  132. 27.89 s gammaloop-nextest-feynkit>
  133. 28.38 s gammaloop-nextest-feynkit> ------------
  134. 28.38 s gammaloop-nextest-feynkit> Summary [ 0.539s] 12 tests run: 11 passed, 1 failed, 0 skipped
  135. 28.38 s gammaloop-nextest-feynkit> FAIL [ 0.052s] (11/12) feynkit-py tests::standalone_python_pipeline_covers_generation_graphs_cff_and_kinematics
  136. 28.38 s gammaloop-nextest-feynkit> stdout ---
  137. 28.38 s gammaloop-nextest-feynkit>
  138. 28.38 s gammaloop-nextest-feynkit> running 1 test
  139. 28.38 s gammaloop-nextest-feynkit> test tests::standalone_python_pipeline_covers_generation_graphs_cff_and_kinematics ... FAILED
  140. 28.38 s gammaloop-nextest-feynkit>
  141. 28.38 s gammaloop-nextest-feynkit> failures:
  142. 28.38 s gammaloop-nextest-feynkit>
  143. 28.38 s gammaloop-nextest-feynkit> failures:
  144. 28.38 s gammaloop-nextest-feynkit> tests::standalone_python_pipeline_covers_generation_graphs_cff_and_kinematics
  145. 28.38 s gammaloop-nextest-feynkit>
  146. 28.38 s gammaloop-nextest-feynkit> test result: FAILED. 0 passed; 1 failed; 0 ignored; 0 measured; 10 filtered out; finished in 0.04s
  147. 28.38 s gammaloop-nextest-feynkit>
  148. 28.38 s gammaloop-nextest-feynkit> stderr ---
  149. 28.38 s gammaloop-nextest-feynkit>
  150. 28.38 s gammaloop-nextest-feynkit> thread 'tests::standalone_python_pipeline_covers_generation_graphs_cff_and_kinematics' (894) panicked at crates/feynkit-py/src/lib.rs:431:57:
  151. 28.38 s gammaloop-nextest-feynkit> called `Result::unwrap()` on an `Err` value: PyErr { type: <class 'AssertionError'>, value: AssertionError(), traceback: Some("Traceback (most recent call last):\n File \"<string>\", line 39, in <module>\n") }
  152. 28.38 s gammaloop-nextest-feynkit> stack backtrace:
  153. 28.38 s gammaloop-nextest-feynkit> 0: __rustc::rust_begin_unwind
  154. 28.38 s gammaloop-nextest-feynkit> 1: core::panicking::panic_fmt
  155. 28.38 s gammaloop-nextest-feynkit> 2: core::result::unwrap_failed
  156. 28.38 s gammaloop-nextest-feynkit> 3: feynkit_py::tests::standalone_python_pipeline_covers_generation_graphs_cff_and_kinematics
  157. 28.38 s gammaloop-nextest-feynkit> 4: <feynkit_py::tests::standalone_python_pipeline_covers_generation_graphs_cff_and_kinematics::{closure#0} as core::ops::function::FnOnce<()>>::call_once
  158. 28.38 s gammaloop-nextest-feynkit> note: Some details are omitted, run with `RUST_BACKTRACE=full` for a verbose backtrace.
  159. 28.38 s gammaloop-nextest-feynkit>
  160. 28.39 s gammaloop-nextest-feynkit> error: test run failed
  161. 28.43 s gammaloop-nextest-feynkit>
  162. 28.43 s gammaloop-nextest-feynkit> ========== nextest test summary ==========
  163. 28.43 s gammaloop-nextest-feynkit> report: target/nextest/ci_gammaloop/junit.xml
  164. 28.43 s gammaloop-nextest-feynkit> tests: 12, failures: 1, errors: 0
  165. 28.43 s gammaloop-nextest-feynkit>
  166. 28.43 s gammaloop-nextest-feynkit> 1. feynkit-py::tests::standalone_python_pipeline_covers_generation_graphs_cff_and_kinematics
  167. 28.43 s gammaloop-nextest-feynkit> failure: test failure with exit code 101
  168. 28.43 s gammaloop-nextest-feynkit> thread 'tests::standalone_python_pipeline_covers_generation_graphs_cff_and_kinematics' (894) panicked at crates/feynkit-py/src/lib.rs:431:57:
  169. 28.43 s gammaloop-nextest-feynkit> called `Result::unwrap()` on an `Err` value: PyErr { type: <class 'AssertionError'>, value: AssertionError(), traceback: Some("Traceback (most recent call last):\n File \"<string>\", line 39, in <module>\n") }
  170. 28.43 s gammaloop-nextest-feynkit> stack backtrace:
  171. 28.43 s gammaloop-nextest-feynkit> 0: __rustc::rust_begin_unwind
  172. 28.43 s gammaloop-nextest-feynkit> 1: core::panicking::panic_fmt
  173. 28.43 s gammaloop-nextest-feynkit> 2: core::result::unwrap_failed
  174. 28.43 s gammaloop-nextest-feynkit> 3: feynkit_py::tests::standalone_python_pipeline_covers_generation_graphs_cff_and_kinematics
  175. 28.43 s gammaloop-nextest-feynkit> 4: <feynkit_py::tests::standalone_python_pipeline_covers_generation_graphs_cff_and_kinematics::{closure#0} as core::ops::function::FnOnce<()>>::call_once
  176. 28.43 s gammaloop-nextest-feynkit> note: Some details are omitted, run with `RUST_BACKTRACE=full` for a verbose backtrace.
  177. 28.43 s gammaloop-nextest-feynkit> system-out
  178. 28.43 s gammaloop-nextest-feynkit> running 1 test
  179. 28.43 s gammaloop-nextest-feynkit> test tests::standalone_python_pipeline_covers_generation_graphs_cff_and_kinematics ... FAILED
  180. 28.43 s gammaloop-nextest-feynkit>
  181. 28.43 s gammaloop-nextest-feynkit> failures:
  182. 28.43 s gammaloop-nextest-feynkit>
  183. 28.43 s gammaloop-nextest-feynkit> failures:
  184. 28.43 s gammaloop-nextest-feynkit> tests::standalone_python_pipeline_covers_generation_graphs_cff_and_kinematics
  185. 28.43 s gammaloop-nextest-feynkit>
  186. 28.43 s gammaloop-nextest-feynkit> test result: FAILED. 0 passed; 1 failed; 0 ignored; 0 measured; 10 filtered out; finished in 0.04s
  187. 28.43 s gammaloop-nextest-feynkit> system-err
  188. 28.43 s gammaloop-nextest-feynkit> thread 'tests::standalone_python_pipeline_covers_generation_graphs_cff_and_kinematics' (894) panicked at crates/feynkit-py/src/lib.rs:431:57:
  189. 28.43 s gammaloop-nextest-feynkit> called `Result::unwrap()` on an `Err` value: PyErr { type: <class 'AssertionError'>, value: AssertionError(), traceback: Some("Traceback (most recent call last):\n File \"<string>\", line 39, in <module>\n") }
  190. 28.43 s gammaloop-nextest-feynkit> stack backtrace:
  191. 28.43 s gammaloop-nextest-feynkit> 0: __rustc::rust_begin_unwind
  192. 28.43 s gammaloop-nextest-feynkit> 1: core::panicking::panic_fmt
  193. 28.43 s gammaloop-nextest-feynkit> 2: core::result::unwrap_failed
  194. 28.43 s gammaloop-nextest-feynkit> 3: feynkit_py::tests::standalone_python_pipeline_covers_generation_graphs_cff_and_kinematics
  195. 28.43 s gammaloop-nextest-feynkit> 4: <feynkit_py::tests::standalone_python_pipeline_covers_generation_graphs_cff_and_kinematics::{closure#0} as core::ops::function::FnOnce<()>>::call_once
  196. 28.43 s gammaloop-nextest-feynkit> note: Some details are omitted, run with `RUST_BACKTRACE=full` for a verbose backtrace.
  197. 28.43 s gammaloop-nextest-feynkit> =========================================
  198. 28.44 s gammaloop-nextest-feynkit> Extracting 1 binary and 2 linked paths to /build/source
  199. 28.56 s gammaloop-nextest-feynkit> Extracted 15 files to /build/source in 0.12s
  200. 28.57 s gammaloop-nextest-feynkit> ------------
  201. 28.57 s gammaloop-nextest-feynkit> Nextest run ID 2b3c2c3f-a71b-4977-b634-293550895522 with nextest profile: ci_gammaloop
  202. 28.57 s gammaloop-nextest-feynkit> Starting 45 tests across 1 binary (1 test skipped)
  203. 28.69 s gammaloop-nextest-feynkit> ------------
  204. 28.69 s gammaloop-nextest-feynkit> Summary [ 0.124s] 45 tests run: 45 passed, 1 skipped
  205. 28.73 s gammaloop-nextest-feynkit>
  206. 28.73 s gammaloop-nextest-feynkit> ========== nextest test summary ==========
  207. 28.73 s gammaloop-nextest-feynkit> report: target/nextest/ci_gammaloop/junit.xml
  208. 28.73 s gammaloop-nextest-feynkit> tests: 45, failures: 0, errors: 0
  209. 28.73 s gammaloop-nextest-feynkit> No failing testcases found.
  210. 28.73 s gammaloop-nextest-feynkit> =========================================
  211. 28.74 s gammaloop-nextest-feynkit> Extracting 1 binary and 2 linked paths to /build/source
  212. 28.85 s gammaloop-nextest-feynkit> Extracted 15 files to /build/source in 0.11s
  213. 28.86 s gammaloop-nextest-feynkit> ------------
  214. 28.86 s gammaloop-nextest-feynkit> Nextest run ID debc1f5e-c31f-477f-9540-f7768f455fba with nextest profile: ci_gammaloop
  215. 28.86 s gammaloop-nextest-feynkit> Starting 2 tests across 1 binary
  216. 28.88 s gammaloop-nextest-feynkit> ------------
  217. 28.88 s gammaloop-nextest-feynkit> Summary [ 0.018s] 2 tests run: 2 passed, 0 skipped
  218. 28.93 s gammaloop-nextest-feynkit>
  219. 28.93 s gammaloop-nextest-feynkit> ========== nextest test summary ==========
  220. 28.93 s gammaloop-nextest-feynkit> report: target/nextest/ci_gammaloop/junit.xml
  221. 28.93 s gammaloop-nextest-feynkit> tests: 2, failures: 0, errors: 0
  222. 28.93 s gammaloop-nextest-feynkit> No failing testcases found.
  223. 28.93 s gammaloop-nextest-feynkit> =========================================
  224. 29.20 s error: Cannot build '/nix/store/jq3pivlmd32m1d0ydmfkh08srar1g0g4-gammaloop-nextest-feynkit.drv'.
  225. 29.20 s Reason: builder failed with exit code 100.
  226. 29.20 s Output paths:
  227. 29.20 s /nix/store/146bccmhaiz98v6rks8q5iz1kacwh0sh-gammaloop-nextest-feynkit
  228. 29.20 s Last 199 log lines:
  229. 29.20 s > Extracting 1 binary and 2 linked paths to /build/source
  230. 29.20 s > Extracted 15 files to /build/source in 0.08s
  231. 29.20 s > ------------
  232. 29.20 s > Nextest run ID 99f16bfb-46b6-4ce8-b371-08458e2679ea with nextest profile: ci_gammaloop
  233. 29.20 s > Starting 1 test across 1 binary
  234. 29.20 s > ------------
  235. 29.20 s > Summary [ 0.005s] 1 test run: 1 passed, 0 skipped
  236. 29.20 s >
  237. 29.20 s > ========== nextest test summary ==========
  238. 29.20 s > report: target/nextest/ci_gammaloop/junit.xml
  239. 29.20 s > tests: 1, failures: 0, errors: 0
  240. 29.20 s > No failing testcases found.
  241. 29.20 s > =========================================
  242. 29.20 s > Extracting 1 binary and 2 linked paths to /build/source
  243. 29.20 s > Extracted 15 files to /build/source in 0.09s
  244. 29.20 s > ------------
  245. 29.20 s > Nextest run ID 3ec0e44e-fc8d-4f96-9494-2de7a2618de6 with nextest profile: ci_gammaloop
  246. 29.20 s > Starting 33 tests across 1 binary
  247. 29.20 s > ------------
  248. 29.20 s > Summary [ 0.025s] 33 tests run: 33 passed, 0 skipped
  249. 29.20 s >
  250. 29.20 s > ========== nextest test summary ==========
  251. 29.20 s > report: target/nextest/ci_gammaloop/junit.xml
  252. 29.20 s > tests: 33, failures: 0, errors: 0
  253. 29.20 s > No failing testcases found.
  254. 29.20 s > =========================================
  255. 29.20 s > Extracting 2 binaries and 2 linked paths to /build/source
  256. 29.20 s > Extracted 16 files to /build/source in 0.15s
  257. 29.20 s > ------------
  258. 29.20 s > Nextest run ID 9c6808af-eaf2-463d-847d-350386af0cf5 with nextest profile: ci_gammaloop
  259. 29.20 s > Starting 58 tests across 2 binaries
  260. 29.20 s > ------------
  261. 29.20 s > Summary [ 0.068s] 58 tests run: 58 passed, 0 skipped
  262. 29.20 s >
  263. 29.20 s > ========== nextest test summary ==========
  264. 29.20 s > report: target/nextest/ci_gammaloop/junit.xml
  265. 29.20 s > tests: 58, failures: 0, errors: 0
  266. 29.20 s > No failing testcases found.
  267. 29.20 s > =========================================
  268. 29.20 s > Extracting 1 binary and 2 linked paths to /build/source
  269. 29.20 s > Extracted 15 files to /build/source in 0.09s
  270. 29.20 s > ------------
  271. 29.20 s > Nextest run ID 81aa1e7e-52e3-4148-9211-ff1abef3dbac with nextest profile: ci_gammaloop
  272. 29.20 s > Starting 24 tests across 1 binary
  273. 29.20 s > ------------
  274. 29.20 s > Summary [ 0.074s] 24 tests run: 24 passed, 0 skipped
  275. 29.20 s >
  276. 29.20 s > ========== nextest test summary ==========
  277. 29.20 s > report: target/nextest/ci_gammaloop/junit.xml
  278. 29.20 s > tests: 24, failures: 0, errors: 0
  279. 29.20 s > No failing testcases found.
  280. 29.20 s > =========================================
  281. 29.20 s > Extracting 1 binary and 1 linked path to /build/source
  282. 29.20 s > Extracted 7 files to /build/source in 0.09s
  283. 29.20 s > ------------
  284. 29.20 s > Nextest run ID 288dfed9-8876-42b4-9878-eec3500f1822 with nextest profile: ci_gammaloop
  285. 29.20 s > Starting 21 tests across 1 binary
  286. 29.20 s > ------------
  287. 29.20 s > Summary [ 0.026s] 21 tests run: 21 passed, 0 skipped
  288. 29.20 s >
  289. 29.20 s > ========== nextest test summary ==========
  290. 29.20 s > report: target/nextest/ci_gammaloop/junit.xml
  291. 29.20 s > tests: 21, failures: 0, errors: 0
  292. 29.20 s > No failing testcases found.
  293. 29.20 s > =========================================
  294. 29.20 s > Extracting 2 binaries and 2 linked paths to /build/source
  295. 29.20 s > Extracted 16 files to /build/source in 0.13s
  296. 29.20 s > ------------
  297. 29.20 s > Nextest run ID 286d155c-517b-45aa-ae53-269432b0f188 with nextest profile: ci_gammaloop
  298. 29.20 s > Starting 14 tests across 2 binaries
  299. 29.20 s > ------------
  300. 29.20 s > Summary [ 0.053s] 14 tests run: 14 passed, 0 skipped
  301. 29.20 s >
  302. 29.20 s > ========== nextest test summary ==========
  303. 29.20 s > report: target/nextest/ci_gammaloop/junit.xml
  304. 29.20 s > tests: 14, failures: 0, errors: 0
  305. 29.20 s > No failing testcases found.
  306. 29.20 s > =========================================
  307. 29.20 s > Extracting 5 binaries (including 3 non-test binaries) and 2 linked paths to /build/source
  308. 29.20 s > Extracted 22 files to /build/source in 0.68s
  309. 29.20 s > ------------
  310. 29.20 s > Nextest run ID cafb618c-c6b7-46ef-92cd-ecad18270916 with nextest profile: ci_gammaloop
  311. 29.20 s > Starting 12 tests across 2 binaries
  312. 29.20 s > FAIL [ 0.052s] (11/12) feynkit-py tests::standalone_python_pipeline_covers_generation_graphs_cff_and_kinematics
  313. 29.20 s > stdout ---
  314. 29.20 s >
  315. 29.20 s > running 1 test
  316. 29.20 s > test tests::standalone_python_pipeline_covers_generation_graphs_cff_and_kinematics ... FAILED
  317. 29.20 s >
  318. 29.20 s > failures:
  319. 29.20 s >
  320. 29.20 s > failures:
  321. 29.20 s > tests::standalone_python_pipeline_covers_generation_graphs_cff_and_kinematics
  322. 29.20 s >
  323. 29.20 s > test result: FAILED. 0 passed; 1 failed; 0 ignored; 0 measured; 10 filtered out; finished in 0.04s
  324. 29.20 s >
  325. 29.20 s > stderr ---
  326. 29.20 s >
  327. 29.20 s > thread 'tests::standalone_python_pipeline_covers_generation_graphs_cff_and_kinematics' (894) panicked at crates/feynkit-py/src/lib.rs:431:57:
  328. 29.20 s > called `Result::unwrap()` on an `Err` value: PyErr { type: <class 'AssertionError'>, value: AssertionError(), traceback: Some("Traceback (most recent call last):\n File \"<string>\", line 39, in <module>\n") }
  329. 29.20 s > stack backtrace:
  330. 29.20 s > 0: __rustc::rust_begin_unwind
  331. 29.20 s > 1: core::panicking::panic_fmt
  332. 29.20 s > 2: core::result::unwrap_failed
  333. 29.20 s > 3: feynkit_py::tests::standalone_python_pipeline_covers_generation_graphs_cff_and_kinematics
  334. 29.20 s > 4: <feynkit_py::tests::standalone_python_pipeline_covers_generation_graphs_cff_and_kinematics::{closure#0} as core::ops::function::FnOnce<()>>::call_once
  335. 29.20 s > note: Some details are omitted, run with `RUST_BACKTRACE=full` for a verbose backtrace.
  336. 29.20 s >
  337. 29.20 s > ------------
  338. 29.20 s > Summary [ 0.539s] 12 tests run: 11 passed, 1 failed, 0 skipped
  339. 29.20 s > FAIL [ 0.052s] (11/12) feynkit-py tests::standalone_python_pipeline_covers_generation_graphs_cff_and_kinematics
  340. 29.20 s > stdout ---
  341. 29.20 s >
  342. 29.20 s > running 1 test
  343. 29.20 s > test tests::standalone_python_pipeline_covers_generation_graphs_cff_and_kinematics ... FAILED
  344. 29.20 s >
  345. 29.20 s > failures:
  346. 29.20 s >
  347. 29.20 s > failures:
  348. 29.20 s > tests::standalone_python_pipeline_covers_generation_graphs_cff_and_kinematics
  349. 29.20 s >
  350. 29.20 s > test result: FAILED. 0 passed; 1 failed; 0 ignored; 0 measured; 10 filtered out; finished in 0.04s
  351. 29.20 s >
  352. 29.20 s > stderr ---
  353. 29.20 s >
  354. 29.20 s > thread 'tests::standalone_python_pipeline_covers_generation_graphs_cff_and_kinematics' (894) panicked at crates/feynkit-py/src/lib.rs:431:57:
  355. 29.20 s > called `Result::unwrap()` on an `Err` value: PyErr { type: <class 'AssertionError'>, value: AssertionError(), traceback: Some("Traceback (most recent call last):\n File \"<string>\", line 39, in <module>\n") }
  356. 29.20 s > stack backtrace:
  357. 29.20 s > 0: __rustc::rust_begin_unwind
  358. 29.20 s > 1: core::panicking::panic_fmt
  359. 29.20 s > 2: core::result::unwrap_failed
  360. 29.20 s > 3: feynkit_py::tests::standalone_python_pipeline_covers_generation_graphs_cff_and_kinematics
  361. 29.20 s > 4: <feynkit_py::tests::standalone_python_pipeline_covers_generation_graphs_cff_and_kinematics::{closure#0} as core::ops::function::FnOnce<()>>::call_once
  362. 29.20 s > note: Some details are omitted, run with `RUST_BACKTRACE=full` for a verbose backtrace.
  363. 29.20 s >
  364. 29.20 s > error: test run failed
  365. 29.20 s >
  366. 29.20 s > ========== nextest test summary ==========
  367. 29.20 s > report: target/nextest/ci_gammaloop/junit.xml
  368. 29.20 s > tests: 12, failures: 1, errors: 0
  369. 29.20 s >
  370. 29.20 s > 1. feynkit-py::tests::standalone_python_pipeline_covers_generation_graphs_cff_and_kinematics
  371. 29.20 s > failure: test failure with exit code 101
  372. 29.20 s > thread 'tests::standalone_python_pipeline_covers_generation_graphs_cff_and_kinematics' (894) panicked at crates/feynkit-py/src/lib.rs:431:57:
  373. 29.20 s > called `Result::unwrap()` on an `Err` value: PyErr { type: <class 'AssertionError'>, value: AssertionError(), traceback: Some("Traceback (most recent call last):\n File \"<string>\", line 39, in <module>\n") }
  374. 29.20 s > stack backtrace:
  375. 29.20 s > 0: __rustc::rust_begin_unwind
  376. 29.20 s > 1: core::panicking::panic_fmt
  377. 29.20 s > 2: core::result::unwrap_failed
  378. 29.20 s > 3: feynkit_py::tests::standalone_python_pipeline_covers_generation_graphs_cff_and_kinematics
  379. 29.20 s > 4: <feynkit_py::tests::standalone_python_pipeline_covers_generation_graphs_cff_and_kinematics::{closure#0} as core::ops::function::FnOnce<()>>::call_once
  380. 29.20 s > note: Some details are omitted, run with `RUST_BACKTRACE=full` for a verbose backtrace.
  381. 29.20 s > system-out
  382. 29.20 s > running 1 test
  383. 29.20 s > test tests::standalone_python_pipeline_covers_generation_graphs_cff_and_kinematics ... FAILED
  384. 29.20 s >
  385. 29.20 s > failures:
  386. 29.20 s >
  387. 29.20 s > failures:
  388. 29.20 s > tests::standalone_python_pipeline_covers_generation_graphs_cff_and_kinematics
  389. 29.20 s >
  390. 29.20 s > test result: FAILED. 0 passed; 1 failed; 0 ignored; 0 measured; 10 filtered out; finished in 0.04s
  391. 29.20 s > system-err
  392. 29.20 s > thread 'tests::standalone_python_pipeline_covers_generation_graphs_cff_and_kinematics' (894) panicked at crates/feynkit-py/src/lib.rs:431:57:
  393. 29.20 s > called `Result::unwrap()` on an `Err` value: PyErr { type: <class 'AssertionError'>, value: AssertionError(), traceback: Some("Traceback (most recent call last):\n File \"<string>\", line 39, in <module>\n") }
  394. 29.20 s > stack backtrace:
  395. 29.20 s > 0: __rustc::rust_begin_unwind
  396. 29.20 s > 1: core::panicking::panic_fmt
  397. 29.20 s > 2: core::result::unwrap_failed
  398. 29.20 s > 3: feynkit_py::tests::standalone_python_pipeline_covers_generation_graphs_cff_and_kinematics
  399. 29.20 s > 4: <feynkit_py::tests::standalone_python_pipeline_covers_generation_graphs_cff_and_kinematics::{closure#0} as core::ops::function::FnOnce<()>>::call_once
  400. 29.20 s > note: Some details are omitted, run with `RUST_BACKTRACE=full` for a verbose backtrace.
  401. 29.20 s > =========================================
  402. 29.20 s > Extracting 1 binary and 2 linked paths to /build/source
  403. 29.20 s > Extracted 15 files to /build/source in 0.12s
  404. 29.20 s > ------------
  405. 29.20 s > Nextest run ID 2b3c2c3f-a71b-4977-b634-293550895522 with nextest profile: ci_gammaloop
  406. 29.20 s > Starting 45 tests across 1 binary (1 test skipped)
  407. 29.20 s > ------------
  408. 29.20 s > Summary [ 0.124s] 45 tests run: 45 passed, 1 skipped
  409. 29.20 s >
  410. 29.20 s > ========== nextest test summary ==========
  411. 29.20 s > report: target/nextest/ci_gammaloop/junit.xml
  412. 29.20 s > tests: 45, failures: 0, errors: 0
  413. 29.20 s > No failing testcases found.
  414. 29.20 s > =========================================
  415. 29.20 s > Extracting 1 binary and 2 linked paths to /build/source
  416. 29.20 s > Extracted 15 files to /build/source in 0.11s
  417. 29.20 s > ------------
  418. 29.20 s > Nextest run ID debc1f5e-c31f-477f-9540-f7768f455fba with nextest profile: ci_gammaloop
  419. 29.20 s > Starting 2 tests across 1 binary
  420. 29.20 s > ------------
  421. 29.20 s > Summary [ 0.018s] 2 tests run: 2 passed, 0 skipped
  422. 29.20 s >
  423. 29.20 s > ========== nextest test summary ==========
  424. 29.20 s > report: target/nextest/ci_gammaloop/junit.xml
  425. 29.20 s > tests: 2, failures: 0, errors: 0
  426. 29.20 s > No failing testcases found.
  427. 29.20 s > =========================================
  428. 29.20 s For full logs, run:
  429. 29.20 s nix log /nix/store/jq3pivlmd32m1d0ydmfkh08srar1g0g4-gammaloop-nextest-feynkit.drv
  430. 29.41 s [0 built (1 failed)]Run failed.