test packages.x86_64-linux.nix-ci-check-gammaloop-nextest-feynkit

Reproduce this run
Retry Run
  1. 0.00 s $ /nix/store/61685rbaxmpigwi3z23i33sv3jyfl70q-coreutils-9.11/bin/timeout --kill-after=15s 7200s /nix/store/wknkybkzrc16r11vk5vrykh4wmw7a353-nix-2.34.8/bin/nix --extra-experimental-features nix-command --extra-experimental-features flakes flake clone git+https://github.com/alphal00p/gammaloop --dest /tmp/nix-ci-worker/stable-pwd/repo/
  2. 0.10 s Cloning into '/tmp/nix-ci-worker/stable-pwd/repo'...
  3. 0.84 s remote: Enumerating objects: 102985, done.
  4. 0.96 s remote: Counting objects: 0% (1/9378) remote: Counting objects: 1% (94/9378) remote: Counting objects: 2% (188/9378) remote: Counting objects: 3% (282/9378) remote: Counting objects: 4% (376/9378) remote: Counting objects: 5% (469/9378) remote: Counting objects: 6% (563/9378) remote: Counting objects: 7% (657/9378) remote: Counting objects: 8% (751/9378) remote: Counting objects: 9% (845/9378) remote: Counting objects: 10% (938/9378) remote: Counting objects: 11% (1032/9378) remote: Counting objects: 12% (1126/9378) remote: Counting objects: 13% (1220/9378) remote: Counting objects: 14% (1313/9378) remote: Counting objects: 15% (1407/9378) remote: Counting objects: 16% (1501/9378) remote: Counting objects: 17% (1595/9378) remote: Counting objects: 18% (1689/9378) remote: Counting objects: 19% (1782/9378) remote: Counting objects: 20% (1876/9378) remote: Counting objects: 21% (1970/9378) remote: Counting objects: 22% (2064/9378) remote: Counting objects: 23% (2157/9378) remote: Counting objects: 24% (2251/9378) remote: Counting objects: 25% (2345/9378) remote: Counting objects: 26% (2439/9378) remote: Counting objects: 27% (2533/9378) remote: Counting objects: 28% (2626/9378) remote: Counting objects: 29% (2720/9378) remote: Counting objects: 30% (2814/9378) remote: Counting objects: 31% (2908/9378) remote: Counting objects: 32% (3001/9378) remote: Counting objects: 33% (3095/9378) remote: Counting objects: 34% (3189/9378) remote: Counting objects: 35% (3283/9378) remote: Counting objects: 36% (3377/9378) remote: Counting objects: 37% (3470/9378) remote: Counting objects: 38% (3564/9378) remote: Counting objects: 39% (3658/9378) remote: Counting objects: 40% (3752/9378) remote: Counting objects: 41% (3845/9378) remote: Counting objects: 42% (3939/9378) remote: Counting objects: 43% (4033/9378) remote: Counting objects: 44% (4127/9378) remote: Counting objects: 45% (4221/9378) remote: Counting objects: 46% (4314/9378) remote: Counting objects: 47% (4408/9378) remote: Counting objects: 48% (4502/9378) remote: Counting objects: 49% (4596/9378) remote: Counting objects: 50% (4689/9378) remote: Counting objects: 51% (4783/9378) remote: Counting objects: 52% (4877/9378) remote: Counting objects: 53% (4971/9378) remote: Counting objects: 54% (5065/9378) remote: Counting objects: 55% (5158/9378) remote: Counting objects: 56% (5252/9378) remote: Counting objects: 57% (5346/9378) remote: Counting objects: 58% (5440/9378) remote: Counting objects: 59% (5534/9378) remote: Counting objects: 60% (5627/9378) remote: Counting objects: 61% (5721/9378) remote: Counting objects: 62% (5815/9378) remote: Counting objects: 63% (5909/9378) remote: Counting objects: 64% (6002/9378) remote: Counting objects: 65% (6096/9378) remote: Counting objects: 66% (6190/9378) remote: Counting objects: 67% (6284/9378) remote: Counting objects: 68% (6378/9378) remote: Counting objects: 69% (6471/9378) remote: Counting objects: 70% (6565/9378) remote: Counting objects: 71% (6659/9378) remote: Counting objects: 72% (6753/9378) remote: Counting objects: 73% (6846/9378) remote: Counting objects: 74% (6940/9378) remote: Counting objects: 75% (7034/9378) remote: Counting objects: 76% (7128/9378) remote: Counting objects: 77% (7222/9378) remote: Counting objects: 78% (7315/9378) remote: Counting objects: 79% (7409/9378) remote: Counting objects: 80% (7503/9378) remote: Counting objects: 81% (7597/9378) remote: Counting objects: 82% (7690/9378) remote: Counting objects: 83% (7784/9378) remote: Counting objects: 84% (7878/9378) remote: Counting objects: 85% (7972/9378) remote: Counting objects: 86% (8066/9378) remote: Counting objects: 87% (8159/9378) remote: Counting objects: 88% (8253/9378) remote: Counting objects: 89% (8347/9378) remote: Counting objects: 90% (8441/9378) remote: Counting objects: 91% (8534/9378) remote: Counting objects: 92% (8628/9378) remote: Counting objects: 93% (8722/9378) remote: Counting objects: 94% (8816/9378) remote: Counting objects: 95% (8910/9378) remote: Counting objects: 96% (9003/9378) remote: Counting objects: 97% (9097/9378) remote: Counting objects: 98% (9191/9378) remote: Counting objects: 99% (9285/9378) remote: Counting objects: 100% (9378/9378) remote: Counting objects: 100% (9378/9378), done.
  5. 3.13 s remote: Compressing objects: 0% (1/2006) remote: Compressing objects: 1% (21/2006) remote: Compressing objects: 2% (41/2006) remote: Compressing objects: 3% (61/2006) remote: Compressing objects: 4% (81/2006) remote: Compressing objects: 5% (101/2006) remote: Compressing objects: 6% (121/2006) remote: Compressing objects: 7% (141/2006) remote: Compressing objects: 8% (161/2006) remote: Compressing objects: 8% (170/2006) remote: Compressing objects: 9% (181/2006) remote: Compressing objects: 10% (201/2006) remote: Compressing objects: 11% (221/2006) remote: Compressing objects: 12% (241/2006) remote: Compressing objects: 13% (261/2006) remote: Compressing objects: 14% (281/2006) remote: Compressing objects: 15% (301/2006) remote: Compressing objects: 16% (321/2006) remote: Compressing objects: 17% (342/2006) remote: Compressing objects: 18% (362/2006) remote: Compressing objects: 19% (382/2006) remote: Compressing objects: 20% (402/2006) remote: Compressing objects: 21% (422/2006) remote: Compressing objects: 22% (442/2006) remote: Compressing objects: 22% (453/2006) remote: Compressing objects: 23% (462/2006) remote: Compressing objects: 24% (482/2006) remote: Compressing objects: 25% (502/2006) remote: Compressing objects: 26% (522/2006) remote: Compressing objects: 27% (542/2006) remote: Compressing objects: 28% (562/2006) remote: Compressing objects: 29% (582/2006) remote: Compressing objects: 30% (602/2006) remote: Compressing objects: 31% (622/2006) remote: Compressing objects: 32% (642/2006) remote: Compressing objects: 33% (662/2006) remote: Compressing objects: 34% (683/2006) remote: Compressing objects: 35% (703/2006) remote: Compressing objects: 36% (723/2006) remote: Compressing objects: 37% (743/2006) remote: Compressing objects: 38% (763/2006) remote: Compressing objects: 39% (783/2006) remote: Compressing objects: 40% (803/2006) remote: Compressing objects: 41% (823/2006) remote: Compressing objects: 42% (843/2006) remote: Compressing objects: 43% (863/2006) remote: Compressing objects: 44% (883/2006) remote: Compressing objects: 45% (903/2006) remote: Compressing objects: 46% (923/2006) remote: Compressing objects: 47% (943/2006) remote: Compressing objects: 48% (963/2006) remote: Compressing objects: 49% (983/2006) remote: Compressing objects: 50% (1003/2006) remote: Compressing objects: 51% (1024/2006) remote: Compressing objects: 52% (1044/2006) remote: Compressing objects: 53% (1064/2006) remote: Compressing objects: 54% (1084/2006) remote: Compressing objects: 55% (1104/2006) remote: Compressing objects: 56% (1124/2006) remote: Compressing objects: 57% (1144/2006) remote: Compressing objects: 58% (1164/2006) remote: Compressing objects: 59% (1184/2006) remote: Compressing objects: 60% (1204/2006) remote: Compressing objects: 61% (1224/2006) remote: Compressing objects: 62% (1244/2006) remote: Compressing objects: 63% (1264/2006) remote: Compressing objects: 64% (1284/2006) remote: Compressing objects: 65% (1304/2006) remote: Compressing objects: 66% (1324/2006) remote: Compressing objects: 67% (1345/2006) remote: Compressing objects: 68% (1365/2006) remote: Compressing objects: 69% (1385/2006) remote: Compressing objects: 70% (1405/2006) remote: Compressing objects: 71% (1425/2006) remote: Compressing objects: 72% (1445/2006) remote: Compressing objects: 73% (1465/2006) remote: Compressing objects: 74% (1485/2006) remote: Compressing objects: 75% (1505/2006) remote: Compressing objects: 76% (1525/2006) remote: Compressing objects: 77% (1545/2006) remote: Compressing objects: 78% (1565/2006) remote: Compressing objects: 79% (1585/2006) remote: Compressing objects: 80% (1605/2006) remote: Compressing objects: 81% (1625/2006) remote: Compressing objects: 82% (1645/2006) remote: Compressing objects: 83% (1665/2006) remote: Compressing objects: 84% (1686/2006) remote: Compressing objects: 85% (1706/2006) remote: Compressing objects: 86% (1726/2006) remote: Compressing objects: 87% (1746/2006) remote: Compressing objects: 88% (1766/2006) remote: Compressing objects: 89% (1786/2006) remote: Compressing objects: 90% (1806/2006) remote: Compressing objects: 91% (1826/2006) remote: Compressing objects: 92% (1846/2006) remote: Compressing objects: 93% (1866/2006) remote: Compressing objects: 94% (1886/2006) remote: Compressing objects: 95% (1906/2006) remote: Compressing objects: 96% (1926/2006) remote: Compressing objects: 97% (1946/2006) remote: Compressing objects: 98% (1966/2006) remote: Compressing objects: 99% (1986/2006) remote: Compressing objects: 100% (2006/2006) remote: Compressing objects: 100% (2006/2006), done.
  6. 23.85 s Receiving objects: 0% (1/102985) Receiving objects: 1% (1030/102985) Receiving objects: 2% (2060/102985) Receiving objects: 3% (3090/102985) Receiving objects: 4% (4120/102985) Receiving objects: 5% (5150/102985), 8.50 MiB | 16.98 MiB/s Receiving objects: 6% (6180/102985), 8.50 MiB | 16.98 MiB/s Receiving objects: 7% (7209/102985), 8.50 MiB | 16.98 MiB/s Receiving objects: 7% (8238/102985), 18.07 MiB | 18.07 MiB/s Receiving objects: 8% (8239/102985), 18.07 MiB | 18.07 MiB/s Receiving objects: 9% (9269/102985), 18.07 MiB | 18.07 MiB/s Receiving objects: 10% (10299/102985), 18.07 MiB | 18.07 MiB/s Receiving objects: 11% (11329/102985), 18.07 MiB | 18.07 MiB/s Receiving objects: 12% (12359/102985), 18.07 MiB | 18.07 MiB/s Receiving objects: 13% (13389/102985), 18.07 MiB | 18.07 MiB/s Receiving objects: 14% (14418/102985), 18.07 MiB | 18.07 MiB/s Receiving objects: 15% (15448/102985), 18.07 MiB | 18.07 MiB/s Receiving objects: 16% (16478/102985), 18.07 MiB | 18.07 MiB/s Receiving objects: 17% (17508/102985), 18.07 MiB | 18.07 MiB/s Receiving objects: 18% (18538/102985), 18.07 MiB | 18.07 MiB/s Receiving objects: 19% (19568/102985), 18.07 MiB | 18.07 MiB/s Receiving objects: 20% (20597/102985), 18.07 MiB | 18.07 MiB/s Receiving objects: 21% (21627/102985), 18.07 MiB | 18.07 MiB/s Receiving objects: 22% (22657/102985), 18.07 MiB | 18.07 MiB/s Receiving objects: 23% (23687/102985), 18.07 MiB | 18.07 MiB/s Receiving objects: 24% (24717/102985), 18.07 MiB | 18.07 MiB/s Receiving objects: 25% (25747/102985), 18.07 MiB | 18.07 MiB/s Receiving objects: 26% (26777/102985), 18.07 MiB | 18.07 MiB/s Receiving objects: 27% (27806/102985), 18.07 MiB | 18.07 MiB/s Receiving objects: 28% (28836/102985), 18.07 MiB | 18.07 MiB/s Receiving objects: 29% (29866/102985), 18.07 MiB | 18.07 MiB/s Receiving objects: 30% (30896/102985), 18.07 MiB | 18.07 MiB/s Receiving objects: 31% (31926/102985), 27.80 MiB | 18.53 MiB/s Receiving objects: 32% (32956/102985), 27.80 MiB | 18.53 MiB/s Receiving objects: 33% (33986/102985), 27.80 MiB | 18.53 MiB/s Receiving objects: 33% (34975/102985), 35.82 MiB | 17.91 MiB/s Receiving objects: 34% (35015/102985), 35.82 MiB | 17.91 MiB/s Receiving objects: 35% (36045/102985), 35.82 MiB | 17.91 MiB/s Receiving objects: 36% (37075/102985), 35.82 MiB | 17.91 MiB/s Receiving objects: 37% (38105/102985), 35.82 MiB | 17.91 MiB/s Receiving objects: 38% (39135/102985), 35.82 MiB | 17.91 MiB/s Receiving objects: 39% (40165/102985), 46.60 MiB | 18.62 MiB/s Receiving objects: 40% (41194/102985), 46.60 MiB | 18.62 MiB/s Receiving objects: 41% (42224/102985), 46.60 MiB | 18.62 MiB/s Receiving objects: 42% (43254/102985), 46.60 MiB | 18.62 MiB/s Receiving objects: 43% (44284/102985), 46.60 MiB | 18.62 MiB/s Receiving objects: 44% (45314/102985), 46.60 MiB | 18.62 MiB/s Receiving objects: 44% (46338/102985), 46.60 MiB | 18.62 MiB/s Receiving objects: 45% (46344/102985), 56.35 MiB | 18.77 MiB/s Receiving objects: 46% (47374/102985), 56.35 MiB | 18.77 MiB/s Receiving objects: 47% (48403/102985), 56.35 MiB | 18.77 MiB/s Receiving objects: 48% (49433/102985), 65.63 MiB | 18.74 MiB/s Receiving objects: 49% (50463/102985), 65.63 MiB | 18.74 MiB/s Receiving objects: 50% (51493/102985), 65.63 MiB | 18.74 MiB/s Receiving objects: 51% (52523/102985), 65.63 MiB | 18.74 MiB/s Receiving objects: 51% (52770/102985), 65.63 MiB | 18.74 MiB/s Receiving objects: 52% (53553/102985), 76.06 MiB | 18.96 MiB/s Receiving objects: 53% (54583/102985), 76.06 MiB | 18.96 MiB/s Receiving objects: 54% (55612/102985), 76.06 MiB | 18.96 MiB/s Receiving objects: 55% (56642/102985), 76.06 MiB | 18.96 MiB/s Receiving objects: 55% (57064/102985), 95.04 MiB | 19.17 MiB/s Receiving objects: 55% (57095/102985), 114.47 MiB | 19.19 MiB/s Receiving objects: 55% (57164/102985), 132.95 MiB | 19.13 MiB/s Receiving objects: 55% (57222/102985), 139.51 MiB | 18.41 MiB/s Receiving objects: 55% (57227/102985), 154.52 MiB | 15.30 MiB/s Receiving objects: 56% (57672/102985), 161.43 MiB | 14.74 MiB/s Receiving objects: 57% (58702/102985), 161.43 MiB | 14.74 MiB/s Receiving objects: 58% (59732/102985), 161.43 MiB | 14.74 MiB/s Receiving objects: 58% (60013/102985), 161.43 MiB | 14.74 MiB/s Receiving objects: 59% (60762/102985), 167.79 MiB | 13.94 MiB/s Receiving objects: 60% (61791/102985), 167.79 MiB | 13.94 MiB/s Receiving objects: 61% (62821/102985), 167.79 MiB | 13.94 MiB/s Receiving objects: 62% (63851/102985), 176.57 MiB | 13.79 MiB/s Receiving objects: 62% (64549/102985), 185.05 MiB | 13.47 MiB/s Receiving objects: 63% (64881/102985), 185.05 MiB | 13.47 MiB/s Receiving objects: 64% (65911/102985), 185.05 MiB | 13.47 MiB/s Receiving objects: 65% (66941/102985), 185.05 MiB | 13.47 MiB/s Receiving objects: 66% (67971/102985), 185.05 MiB | 13.47 MiB/s Receiving objects: 67% (69000/102985), 185.05 MiB | 13.47 MiB/s Receiving objects: 68% (70030/102985), 193.57 MiB | 13.46 MiB/s Receiving objects: 69% (71060/102985), 193.57 MiB | 13.46 MiB/s Receiving objects: 70% (72090/102985), 193.57 MiB | 13.46 MiB/s Receiving objects: 71% (73120/102985), 193.57 MiB | 13.46 MiB/s Receiving objects: 72% (74150/102985), 193.57 MiB | 13.46 MiB/s Receiving objects: 73% (75180/102985), 193.57 MiB | 13.46 MiB/s Receiving objects: 73% (75325/102985), 193.57 MiB | 13.46 MiB/s Receiving objects: 74% (76209/102985), 210.43 MiB | 14.62 MiB/s Receiving objects: 74% (76672/102985), 217.02 MiB | 15.01 MiB/s Receiving objects: 74% (77115/102985), 230.36 MiB | 15.31 MiB/s Receiving objects: 75% (77239/102985), 230.36 MiB | 15.31 MiB/s Receiving objects: 76% (78269/102985), 230.36 MiB | 15.31 MiB/s Receiving objects: 77% (79299/102985), 230.36 MiB | 15.31 MiB/s Receiving objects: 78% (80329/102985), 238.64 MiB | 15.74 MiB/s Receiving objects: 79% (81359/102985), 238.64 MiB | 15.74 MiB/s Receiving objects: 80% (82388/102985), 238.64 MiB | 15.74 MiB/s Receiving objects: 81% (83418/102985), 238.64 MiB | 15.74 MiB/s Receiving objects: 81% (83636/102985), 238.64 MiB | 15.74 MiB/s Receiving objects: 81% (84187/102985), 265.37 MiB | 15.95 MiB/s Receiving objects: 82% (84448/102985), 274.65 MiB | 15.88 MiB/s Receiving objects: 82% (84516/102985), 289.24 MiB | 17.50 MiB/s Receiving objects: 82% (84874/102985), 302.07 MiB | 18.88 MiB/s Receiving objects: 83% (85478/102985), 316.93 MiB | 20.68 MiB/s Receiving objects: 84% (86508/102985), 316.93 MiB | 20.68 MiB/s Receiving objects: 85% (87538/102985), 316.93 MiB | 20.68 MiB/s Receiving objects: 86% (88568/102985), 330.65 MiB | 22.26 MiB/s Receiving objects: 87% (89597/102985), 330.65 MiB | 22.26 MiB/s Receiving objects: 88% (90627/102985), 330.65 MiB | 22.26 MiB/s Receiving objects: 88% (91112/102985), 343.88 MiB | 23.36 MiB/s Receiving objects: 89% (91657/102985), 358.73 MiB | 24.88 MiB/s Receiving objects: 89% (91771/102985), 372.01 MiB | 25.93 MiB/s Receiving objects: 90% (92687/102985), 372.01 MiB | 25.93 MiB/s Receiving objects: 91% (93717/102985), 372.01 MiB | 25.93 MiB/s Receiving objects: 92% (94747/102985), 372.01 MiB | 25.93 MiB/s Receiving objects: 93% (95777/102985), 372.01 MiB | 25.93 MiB/s Receiving objects: 94% (96806/102985), 372.01 MiB | 25.93 MiB/s Receiving objects: 95% (97836/102985), 372.01 MiB | 25.93 MiB/s Receiving objects: 96% (98866/102985), 386.17 MiB | 26.82 MiB/s Receiving objects: 97% (99896/102985), 386.17 MiB | 26.82 MiB/s Receiving objects: 98% (100926/102985), 386.17 MiB | 26.82 MiB/s Receiving objects: 99% (101956/102985), 386.17 MiB | 26.82 MiB/s remote: Total 102985 (delta 8122), reused 7424 (delta 7366), pack-reused 93607 (from 4)
  7. 23.85 s Receiving objects: 100% (102985/102985), 386.17 MiB | 26.82 MiB/s Receiving objects: 100% (102985/102985), 391.53 MiB | 18.90 MiB/s, done.
  8. 25.63 s Resolving deltas: 0% (0/67477) Resolving deltas: 1% (675/67477) Resolving deltas: 2% (1350/67477) Resolving deltas: 3% (2025/67477) Resolving deltas: 4% (2700/67477) Resolving deltas: 5% (3374/67477) Resolving deltas: 6% (4050/67477) Resolving deltas: 7% (4724/67477) Resolving deltas: 8% (5399/67477) Resolving deltas: 9% (6073/67477) Resolving deltas: 10% (6749/67477) Resolving deltas: 11% (7423/67477) Resolving deltas: 12% (8098/67477) Resolving deltas: 13% (8773/67477) Resolving deltas: 14% (9447/67477) Resolving deltas: 15% (10122/67477) Resolving deltas: 16% (10797/67477) Resolving deltas: 17% (11473/67477) Resolving deltas: 18% (12146/67477) Resolving deltas: 19% (12822/67477) Resolving deltas: 20% (13496/67477) Resolving deltas: 21% (14171/67477) Resolving deltas: 22% (14845/67477) Resolving deltas: 23% (15520/67477) Resolving deltas: 24% (16196/67477) Resolving deltas: 25% (16870/67477) Resolving deltas: 26% (17545/67477) Resolving deltas: 27% (18219/67477) Resolving deltas: 28% (18894/67477) Resolving deltas: 29% (19569/67477) Resolving deltas: 30% (20244/67477) Resolving deltas: 31% (20920/67477) Resolving deltas: 32% (21593/67477) Resolving deltas: 33% (22268/67477) Resolving deltas: 34% (22943/67477) Resolving deltas: 35% (23617/67477) Resolving deltas: 36% (24292/67477) Resolving deltas: 37% (24968/67477) Resolving deltas: 38% (25642/67477) Resolving deltas: 39% (26317/67477) Resolving deltas: 40% (26991/67477) Resolving deltas: 41% (27666/67477) Resolving deltas: 42% (28341/67477) Resolving deltas: 43% (29016/67477) Resolving deltas: 44% (29690/67477) Resolving deltas: 45% (30365/67477) Resolving deltas: 46% (31041/67477) Resolving deltas: 47% (31715/67477) Resolving deltas: 48% (32389/67477) Resolving deltas: 49% (33064/67477) Resolving deltas: 50% (33739/67477) Resolving deltas: 51% (34414/67477) Resolving deltas: 52% (35089/67477) Resolving deltas: 53% (35763/67477) Resolving deltas: 54% (36439/67477) Resolving deltas: 55% (37113/67477) Resolving deltas: 56% (37789/67477) Resolving deltas: 57% (38462/67477) Resolving deltas: 58% (39137/67477) Resolving deltas: 59% (39812/67477) Resolving deltas: 60% (40488/67477) Resolving deltas: 60% (40888/67477) Resolving deltas: 61% (41161/67477) Resolving deltas: 62% (41836/67477) Resolving deltas: 63% (42511/67477) Resolving deltas: 64% (43187/67477) Resolving deltas: 65% (43861/67477) Resolving deltas: 66% (44535/67477) Resolving deltas: 67% (45214/67477) Resolving deltas: 68% (45885/67477) Resolving deltas: 69% (46560/67477) Resolving deltas: 70% (47234/67477) Resolving deltas: 71% (47910/67477) Resolving deltas: 72% (48584/67477) Resolving deltas: 73% (49259/67477) Resolving deltas: 74% (49933/67477) Resolving deltas: 75% (50608/67477) Resolving deltas: 76% (51283/67477) Resolving deltas: 77% (51958/67477) Resolving deltas: 78% (52633/67477) Resolving deltas: 79% (53307/67477) Resolving deltas: 80% (53982/67477) Resolving deltas: 81% (54657/67477) Resolving deltas: 82% (55332/67477) Resolving deltas: 83% (56006/67477) Resolving deltas: 84% (56682/67477) Resolving deltas: 85% (57356/67477) Resolving deltas: 86% (58031/67477) Resolving deltas: 87% (58705/67477) Resolving deltas: 88% (59380/67477) Resolving deltas: 89% (60055/67477) Resolving deltas: 90% (60730/67477) Resolving deltas: 91% (61405/67477) Resolving deltas: 92% (62079/67477) Resolving deltas: 93% (62754/67477) Resolving deltas: 94% (63429/67477) Resolving deltas: 95% (64106/67477) Resolving deltas: 96% (64778/67477) Resolving deltas: 97% (65455/67477) Resolving deltas: 98% (66128/67477) Resolving deltas: 99% (66803/67477) Resolving deltas: 100% (67477/67477) Resolving deltas: 100% (67477/67477), done.
  9. 26.34 s Fetching commit 0ea2140565027f7541293396e9053cd67c4c0a1e for feynkit ...
  10. 26.34 s $ /nix/store/5vpcfsdx1lcnlb2y4k7xyc74shp5qwbh-git-2.54.0/bin/git fetch origin 0ea2140565027f7541293396e9053cd67c4c0a1e
  11. 26.81 s From https://github.com/alphal00p/gammaloop
  12. 26.81 s * branch 0ea2140565027f7541293396e9053cd67c4c0a1e -> FETCH_HEAD
  13. 26.85 s $ /nix/store/61685rbaxmpigwi3z23i33sv3jyfl70q-coreutils-9.11/bin/timeout --kill-after=15s 7200s /nix/store/5vpcfsdx1lcnlb2y4k7xyc74shp5qwbh-git-2.54.0/bin/git -c advice.detachedHead=false checkout 0ea2140565027f7541293396e9053cd67c4c0a1e
  14. 27.12 s HEAD is now at 0ea214056 unify Python generation arguments and return empty results
  15. 27.13 s $ /nix/store/61685rbaxmpigwi3z23i33sv3jyfl70q-coreutils-9.11/bin/timeout --kill-after=15s 7200s /nix/store/wknkybkzrc16r11vk5vrykh4wmw7a353-nix-2.34.8/bin/nix --extra-experimental-features nix-command --extra-experimental-features flakes --log-format internal-json run .#packages.x86_64-linux.nix-ci-check-gammaloop-nextest-feynkit --print-build-logs
  16. 27.31 s warning: ignoring untrusted flake configuration setting 'extra-substituters'.
  17. 27.31 s Pass '--accept-flake-config' to trust it
  18. 27.31 s warning: ignoring untrusted flake configuration setting 'extra-trusted-public-keys'.
  19. 27.31 s Pass '--accept-flake-config' to trust it
  20. 33.47 s
  21. 33.83 s evaluating derivation 'gdo you want to allow configuration setting 'extra-substituters' to be set to 'https://cache.nix-ci.com' (y/N)? do you want to permanently mark this value as untrusted (y/N)? warning: ignoring untrusted flake configuration setting 'extra-substituters'.
  22. 33.83 s Pass '--accept-flake-config' to trust it
  23. 33.83 s do you want to allow configuration setting 'extra-trusted-public-keys' to be set to 'nix-ci:g3xV5BDTLtIBZr/A00IU1x0EtKKlb7YLgBN2SgYgM6A=' (y/N)? do you want to permanently mark this value as untrusted (y/N)? warning: ignoring untrusted flake configuration setting 'extra-trusted-public-keys'.
  24. 33.83 s Pass '--accept-flake-config' to trust it
  25. 42.87 s copying '/nix/store/rx7m evaluating derivation 'g copying '/nix/store/rx7m evaluating derivation 'g copying '/nix/store/rx7m evaluating derivation 'g copying '/nix/store/rx7m evaluating derivation 'g copying '/nix/store/rx7m evaluating derivation 'g copying '/nix/store/rx7m evaluating derivation 'g copying '/nix/store/rx7m evaluating derivation 'g querying gammaloop-nexte [0.0 KiB DL] [0/1 built, 0.0 KiB DL] [1/0/1 built, 0.0 KiB DLgammaloop-nextest-feynkit> Extracting 1 binary and 2 linked paths to /build/source
  26. 42.96 s gammaloop-nextest-feynkit> Extracted 15 files to /build/source in 0.08s
  27. 42.99 s gammaloop-nextest-feynkit> ------------
  28. 42.99 s gammaloop-nextest-feynkit> Nextest run ID 3baff935-e66a-461f-afa9-0d46e22e6336 with nextest profile: ci_gammaloop
  29. 42.99 s gammaloop-nextest-feynkit> Starting 1 test across 1 binary
  30. 43.01 s gammaloop-nextest-feynkit> ------------
  31. 43.01 s gammaloop-nextest-feynkit> Summary [ 0.021s] 1 test run: 1 passed, 0 skipped
  32. 43.07 s gammaloop-nextest-feynkit>
  33. 43.07 s gammaloop-nextest-feynkit> ========== nextest test summary ==========
  34. 43.07 s gammaloop-nextest-feynkit> report: target/nextest/ci_gammaloop/junit.xml
  35. 43.07 s gammaloop-nextest-feynkit> tests: 1, failures: 0, errors: 0
  36. 43.07 s gammaloop-nextest-feynkit> No failing testcases found.
  37. 43.07 s gammaloop-nextest-feynkit> =========================================
  38. 43.10 s gammaloop-nextest-feynkit> Extracting 1 binary and 2 linked paths to /build/source
  39. 43.22 s gammaloop-nextest-feynkit> Extracted 15 files to /build/source in 0.13s
  40. 43.25 s gammaloop-nextest-feynkit> ------------
  41. 43.25 s gammaloop-nextest-feynkit> Nextest run ID 1d6db0cf-33cf-41b7-8721-502016e26c3c with nextest profile: ci_gammaloop
  42. 43.25 s gammaloop-nextest-feynkit> Starting 33 tests across 1 binary
  43. 43.34 s gammaloop-nextest-feynkit> ------------
  44. 43.34 s gammaloop-nextest-feynkit> Summary [ 0.084s] 33 tests run: 33 passed, 0 skipped
  45. 43.39 s gammaloop-nextest-feynkit>
  46. 43.39 s gammaloop-nextest-feynkit> ========== nextest test summary ==========
  47. 43.39 s gammaloop-nextest-feynkit> report: target/nextest/ci_gammaloop/junit.xml
  48. 43.39 s gammaloop-nextest-feynkit> tests: 33, failures: 0, errors: 0
  49. 43.39 s gammaloop-nextest-feynkit> No failing testcases found.
  50. 43.39 s gammaloop-nextest-feynkit> =========================================
  51. 43.41 s gammaloop-nextest-feynkit> Extracting 2 binaries and 2 linked paths to /build/source
  52. 43.63 s gammaloop-nextest-feynkit> Extracted 16 files to /build/source in 0.22s
  53. 43.66 s gammaloop-nextest-feynkit> ------------
  54. 43.66 s gammaloop-nextest-feynkit> Nextest run ID 42216139-85a9-47b5-ae9b-f6c2e22b4649 with nextest profile: ci_gammaloop
  55. 43.66 s gammaloop-nextest-feynkit> Starting 58 tests across 2 binaries
  56. 43.81 s gammaloop-nextest-feynkit> ------------
  57. 43.81 s gammaloop-nextest-feynkit> Summary [ 0.146s] 58 tests run: 58 passed, 0 skipped
  58. 43.87 s gammaloop-nextest-feynkit>
  59. 43.87 s gammaloop-nextest-feynkit> ========== nextest test summary ==========
  60. 43.87 s gammaloop-nextest-feynkit> report: target/nextest/ci_gammaloop/junit.xml
  61. 43.87 s gammaloop-nextest-feynkit> tests: 58, failures: 0, errors: 0
  62. 43.87 s gammaloop-nextest-feynkit> No failing testcases found.
  63. 43.87 s gammaloop-nextest-feynkit> =========================================
  64. 43.90 s gammaloop-nextest-feynkit> Extracting 1 binary and 2 linked paths to /build/source
  65. 44.02 s gammaloop-nextest-feynkit> Extracted 15 files to /build/source in 0.12s
  66. 44.04 s gammaloop-nextest-feynkit> ------------
  67. 44.04 s gammaloop-nextest-feynkit> Nextest run ID e2bae9ef-4226-4d40-8c69-0c44e8cf3523 with nextest profile: ci_gammaloop
  68. 44.04 s gammaloop-nextest-feynkit> Starting 24 tests across 1 binary
  69. 44.13 s gammaloop-nextest-feynkit> ------------
  70. 44.13 s gammaloop-nextest-feynkit> Summary [ 0.083s] 24 tests run: 24 passed, 0 skipped
  71. 44.18 s gammaloop-nextest-feynkit>
  72. 44.18 s gammaloop-nextest-feynkit> ========== nextest test summary ==========
  73. 44.18 s gammaloop-nextest-feynkit> report: target/nextest/ci_gammaloop/junit.xml
  74. 44.18 s gammaloop-nextest-feynkit> tests: 24, failures: 0, errors: 0
  75. 44.18 s gammaloop-nextest-feynkit> No failing testcases found.
  76. 44.18 s gammaloop-nextest-feynkit> =========================================
  77. 44.21 s gammaloop-nextest-feynkit> Extracting 1 binary and 1 linked path to /build/source
  78. 44.33 s gammaloop-nextest-feynkit> Extracted 7 files to /build/source in 0.12s
  79. 44.38 s gammaloop-nextest-feynkit> ------------
  80. 44.38 s gammaloop-nextest-feynkit> Nextest run ID adb5f1b5-19e6-4f13-bb38-fefdc4828182 with nextest profile: ci_gammaloop
  81. 44.38 s gammaloop-nextest-feynkit> Starting 21 tests across 1 binary
  82. 44.44 s gammaloop-nextest-feynkit> ------------
  83. 44.44 s gammaloop-nextest-feynkit> Summary [ 0.064s] 21 tests run: 21 passed, 0 skipped
  84. 44.49 s gammaloop-nextest-feynkit>
  85. 44.49 s gammaloop-nextest-feynkit> ========== nextest test summary ==========
  86. 44.49 s gammaloop-nextest-feynkit> report: target/nextest/ci_gammaloop/junit.xml
  87. 44.49 s gammaloop-nextest-feynkit> tests: 21, failures: 0, errors: 0
  88. 44.49 s gammaloop-nextest-feynkit> No failing testcases found.
  89. 44.49 s gammaloop-nextest-feynkit> =========================================
  90. 44.51 s gammaloop-nextest-feynkit> Extracting 2 binaries and 2 linked paths to /build/source
  91. 44.65 s gammaloop-nextest-feynkit> Extracted 16 files to /build/source in 0.14s
  92. 44.69 s gammaloop-nextest-feynkit> ------------
  93. 44.69 s gammaloop-nextest-feynkit> Nextest run ID 85721fb9-894b-4085-a9d5-79b8373ac503 with nextest profile: ci_gammaloop
  94. 44.69 s gammaloop-nextest-feynkit> Starting 14 tests across 2 binaries
  95. 44.78 s gammaloop-nextest-feynkit> ------------
  96. 44.78 s gammaloop-nextest-feynkit> Summary [ 0.082s] 14 tests run: 14 passed, 0 skipped
  97. 44.83 s gammaloop-nextest-feynkit>
  98. 44.83 s gammaloop-nextest-feynkit> ========== nextest test summary ==========
  99. 44.83 s gammaloop-nextest-feynkit> report: target/nextest/ci_gammaloop/junit.xml
  100. 44.83 s gammaloop-nextest-feynkit> tests: 14, failures: 0, errors: 0
  101. 44.83 s gammaloop-nextest-feynkit> No failing testcases found.
  102. 44.83 s gammaloop-nextest-feynkit> =========================================
  103. 44.86 s gammaloop-nextest-feynkit> Extracting 5 binaries (including 3 non-test binaries) and 2 linked paths to /build/source
  104. 45.68 s gammaloop-nextest-feynkit> Extracted 22 files to /build/source in 0.83s
  105. 45.71 s gammaloop-nextest-feynkit> ------------
  106. 45.71 s gammaloop-nextest-feynkit> Nextest run ID adf2336c-039f-43e2-afef-5b6f26b86f5f with nextest profile: ci_gammaloop
  107. 45.71 s gammaloop-nextest-feynkit> Starting 12 tests across 2 binaries
  108. 45.80 s gammaloop-nextest-feynkit> FAIL [ 0.084s] (11/12) feynkit-py tests::standalone_python_pipeline_covers_generation_graphs_cff_and_kinematics
  109. 45.80 s gammaloop-nextest-feynkit> stdout ---
  110. 45.80 s gammaloop-nextest-feynkit>
  111. 45.80 s gammaloop-nextest-feynkit> running 1 test
  112. 45.80 s gammaloop-nextest-feynkit> test tests::standalone_python_pipeline_covers_generation_graphs_cff_and_kinematics ... FAILED
  113. 45.80 s gammaloop-nextest-feynkit>
  114. 45.80 s gammaloop-nextest-feynkit> failures:
  115. 45.80 s gammaloop-nextest-feynkit>
  116. 45.80 s gammaloop-nextest-feynkit> failures:
  117. 45.80 s gammaloop-nextest-feynkit> tests::standalone_python_pipeline_covers_generation_graphs_cff_and_kinematics
  118. 45.80 s gammaloop-nextest-feynkit>
  119. 45.80 s gammaloop-nextest-feynkit> test result: FAILED. 0 passed; 1 failed; 0 ignored; 0 measured; 10 filtered out; finished in 0.07s
  120. 45.80 s gammaloop-nextest-feynkit>
  121. 45.80 s gammaloop-nextest-feynkit> stderr ---
  122. 45.80 s gammaloop-nextest-feynkit>
  123. 45.80 s gammaloop-nextest-feynkit> thread 'tests::standalone_python_pipeline_covers_generation_graphs_cff_and_kinematics' (886) panicked at crates/feynkit-py/src/lib.rs:431:57:
  124. 45.80 s gammaloop-nextest-feynkit> called `Result::unwrap()` on an `Err` value: PyErr { type: <class 'AssertionError'>, value: AssertionError(), traceback: Some("Traceback (most recent call last):\n File \"<string>\", line 39, in <module>\n") }
  125. 45.80 s gammaloop-nextest-feynkit> stack backtrace:
  126. 45.80 s gammaloop-nextest-feynkit> 0: __rustc::rust_begin_unwind
  127. 45.80 s gammaloop-nextest-feynkit> 1: core::panicking::panic_fmt
  128. 45.80 s gammaloop-nextest-feynkit> 2: core::result::unwrap_failed
  129. 45.80 s gammaloop-nextest-feynkit> 3: feynkit_py::tests::standalone_python_pipeline_covers_generation_graphs_cff_and_kinematics
  130. 45.80 s gammaloop-nextest-feynkit> 4: <feynkit_py::tests::standalone_python_pipeline_covers_generation_graphs_cff_and_kinematics::{closure#0} as core::ops::function::FnOnce<()>>::call_once
  131. 45.80 s gammaloop-nextest-feynkit> note: Some details are omitted, run with `RUST_BACKTRACE=full` for a verbose backtrace.
  132. 45.80 s gammaloop-nextest-feynkit>
  133. 46.40 s gammaloop-nextest-feynkit> ------------
  134. 46.40 s gammaloop-nextest-feynkit> Summary [ 0.690s] 12 tests run: 11 passed, 1 failed, 0 skipped
  135. 46.40 s gammaloop-nextest-feynkit> FAIL [ 0.084s] (11/12) feynkit-py tests::standalone_python_pipeline_covers_generation_graphs_cff_and_kinematics
  136. 46.40 s gammaloop-nextest-feynkit> stdout ---
  137. 46.40 s gammaloop-nextest-feynkit>
  138. 46.40 s gammaloop-nextest-feynkit> running 1 test
  139. 46.40 s gammaloop-nextest-feynkit> test tests::standalone_python_pipeline_covers_generation_graphs_cff_and_kinematics ... FAILED
  140. 46.40 s gammaloop-nextest-feynkit>
  141. 46.40 s gammaloop-nextest-feynkit> failures:
  142. 46.40 s gammaloop-nextest-feynkit>
  143. 46.40 s gammaloop-nextest-feynkit> failures:
  144. 46.40 s gammaloop-nextest-feynkit> tests::standalone_python_pipeline_covers_generation_graphs_cff_and_kinematics
  145. 46.40 s gammaloop-nextest-feynkit>
  146. 46.40 s gammaloop-nextest-feynkit> test result: FAILED. 0 passed; 1 failed; 0 ignored; 0 measured; 10 filtered out; finished in 0.07s
  147. 46.40 s gammaloop-nextest-feynkit>
  148. 46.40 s gammaloop-nextest-feynkit> stderr ---
  149. 46.40 s gammaloop-nextest-feynkit>
  150. 46.40 s gammaloop-nextest-feynkit> thread 'tests::standalone_python_pipeline_covers_generation_graphs_cff_and_kinematics' (886) panicked at crates/feynkit-py/src/lib.rs:431:57:
  151. 46.40 s gammaloop-nextest-feynkit> called `Result::unwrap()` on an `Err` value: PyErr { type: <class 'AssertionError'>, value: AssertionError(), traceback: Some("Traceback (most recent call last):\n File \"<string>\", line 39, in <module>\n") }
  152. 46.40 s gammaloop-nextest-feynkit> stack backtrace:
  153. 46.40 s gammaloop-nextest-feynkit> 0: __rustc::rust_begin_unwind
  154. 46.40 s gammaloop-nextest-feynkit> 1: core::panicking::panic_fmt
  155. 46.40 s gammaloop-nextest-feynkit> 2: core::result::unwrap_failed
  156. 46.40 s gammaloop-nextest-feynkit> 3: feynkit_py::tests::standalone_python_pipeline_covers_generation_graphs_cff_and_kinematics
  157. 46.40 s gammaloop-nextest-feynkit> 4: <feynkit_py::tests::standalone_python_pipeline_covers_generation_graphs_cff_and_kinematics::{closure#0} as core::ops::function::FnOnce<()>>::call_once
  158. 46.40 s gammaloop-nextest-feynkit> note: Some details are omitted, run with `RUST_BACKTRACE=full` for a verbose backtrace.
  159. 46.40 s gammaloop-nextest-feynkit>
  160. 46.41 s gammaloop-nextest-feynkit> error: test run failed
  161. 46.45 s gammaloop-nextest-feynkit>
  162. 46.45 s gammaloop-nextest-feynkit> ========== nextest test summary ==========
  163. 46.45 s gammaloop-nextest-feynkit> report: target/nextest/ci_gammaloop/junit.xml
  164. 46.45 s gammaloop-nextest-feynkit> tests: 12, failures: 1, errors: 0
  165. 46.45 s gammaloop-nextest-feynkit>
  166. 46.45 s gammaloop-nextest-feynkit> 1. feynkit-py::tests::standalone_python_pipeline_covers_generation_graphs_cff_and_kinematics
  167. 46.45 s gammaloop-nextest-feynkit> failure: test failure with exit code 101
  168. 46.45 s gammaloop-nextest-feynkit> thread 'tests::standalone_python_pipeline_covers_generation_graphs_cff_and_kinematics' (886) panicked at crates/feynkit-py/src/lib.rs:431:57:
  169. 46.45 s gammaloop-nextest-feynkit> called `Result::unwrap()` on an `Err` value: PyErr { type: <class 'AssertionError'>, value: AssertionError(), traceback: Some("Traceback (most recent call last):\n File \"<string>\", line 39, in <module>\n") }
  170. 46.45 s gammaloop-nextest-feynkit> stack backtrace:
  171. 46.45 s gammaloop-nextest-feynkit> 0: __rustc::rust_begin_unwind
  172. 46.45 s gammaloop-nextest-feynkit> 1: core::panicking::panic_fmt
  173. 46.45 s gammaloop-nextest-feynkit> 2: core::result::unwrap_failed
  174. 46.45 s gammaloop-nextest-feynkit> 3: feynkit_py::tests::standalone_python_pipeline_covers_generation_graphs_cff_and_kinematics
  175. 46.45 s gammaloop-nextest-feynkit> 4: <feynkit_py::tests::standalone_python_pipeline_covers_generation_graphs_cff_and_kinematics::{closure#0} as core::ops::function::FnOnce<()>>::call_once
  176. 46.45 s gammaloop-nextest-feynkit> note: Some details are omitted, run with `RUST_BACKTRACE=full` for a verbose backtrace.
  177. 46.45 s gammaloop-nextest-feynkit> system-out
  178. 46.45 s gammaloop-nextest-feynkit> running 1 test
  179. 46.45 s gammaloop-nextest-feynkit> test tests::standalone_python_pipeline_covers_generation_graphs_cff_and_kinematics ... FAILED
  180. 46.45 s gammaloop-nextest-feynkit>
  181. 46.45 s gammaloop-nextest-feynkit> failures:
  182. 46.45 s gammaloop-nextest-feynkit>
  183. 46.45 s gammaloop-nextest-feynkit> failures:
  184. 46.45 s gammaloop-nextest-feynkit> tests::standalone_python_pipeline_covers_generation_graphs_cff_and_kinematics
  185. 46.45 s gammaloop-nextest-feynkit>
  186. 46.45 s gammaloop-nextest-feynkit> test result: FAILED. 0 passed; 1 failed; 0 ignored; 0 measured; 10 filtered out; finished in 0.07s
  187. 46.45 s gammaloop-nextest-feynkit> system-err
  188. 46.45 s gammaloop-nextest-feynkit> thread 'tests::standalone_python_pipeline_covers_generation_graphs_cff_and_kinematics' (886) panicked at crates/feynkit-py/src/lib.rs:431:57:
  189. 46.45 s gammaloop-nextest-feynkit> called `Result::unwrap()` on an `Err` value: PyErr { type: <class 'AssertionError'>, value: AssertionError(), traceback: Some("Traceback (most recent call last):\n File \"<string>\", line 39, in <module>\n") }
  190. 46.45 s gammaloop-nextest-feynkit> stack backtrace:
  191. 46.45 s gammaloop-nextest-feynkit> 0: __rustc::rust_begin_unwind
  192. 46.45 s gammaloop-nextest-feynkit> 1: core::panicking::panic_fmt
  193. 46.45 s gammaloop-nextest-feynkit> 2: core::result::unwrap_failed
  194. 46.45 s gammaloop-nextest-feynkit> 3: feynkit_py::tests::standalone_python_pipeline_covers_generation_graphs_cff_and_kinematics
  195. 46.45 s gammaloop-nextest-feynkit> 4: <feynkit_py::tests::standalone_python_pipeline_covers_generation_graphs_cff_and_kinematics::{closure#0} as core::ops::function::FnOnce<()>>::call_once
  196. 46.45 s gammaloop-nextest-feynkit> note: Some details are omitted, run with `RUST_BACKTRACE=full` for a verbose backtrace.
  197. 46.45 s gammaloop-nextest-feynkit> =========================================
  198. 46.48 s gammaloop-nextest-feynkit> Extracting 1 binary and 2 linked paths to /build/source
  199. 46.62 s gammaloop-nextest-feynkit> Extracted 15 files to /build/source in 0.14s
  200. 46.65 s gammaloop-nextest-feynkit> ------------
  201. 46.65 s gammaloop-nextest-feynkit> Nextest run ID 6a650bab-9c3b-4c90-b41d-bb808302833d with nextest profile: ci_gammaloop
  202. 46.65 s gammaloop-nextest-feynkit> Starting 45 tests across 1 binary (1 test skipped)
  203. 46.86 s gammaloop-nextest-feynkit> ------------
  204. 46.86 s gammaloop-nextest-feynkit> Summary [ 0.213s] 45 tests run: 45 passed, 1 skipped
  205. 46.92 s gammaloop-nextest-feynkit>
  206. 46.92 s gammaloop-nextest-feynkit> ========== nextest test summary ==========
  207. 46.92 s gammaloop-nextest-feynkit> report: target/nextest/ci_gammaloop/junit.xml
  208. 46.92 s gammaloop-nextest-feynkit> tests: 45, failures: 0, errors: 0
  209. 46.92 s gammaloop-nextest-feynkit> No failing testcases found.
  210. 46.92 s gammaloop-nextest-feynkit> =========================================
  211. 46.95 s gammaloop-nextest-feynkit> Extracting 1 binary and 2 linked paths to /build/source
  212. 47.07 s gammaloop-nextest-feynkit> Extracted 15 files to /build/source in 0.12s
  213. 47.10 s gammaloop-nextest-feynkit> ------------
  214. 47.10 s gammaloop-nextest-feynkit> Nextest run ID 92c40da5-101f-49e9-81a7-7024f5f02eb6 with nextest profile: ci_gammaloop
  215. 47.10 s gammaloop-nextest-feynkit> Starting 2 tests across 1 binary
  216. 47.14 s gammaloop-nextest-feynkit> ------------
  217. 47.14 s gammaloop-nextest-feynkit> Summary [ 0.044s] 2 tests run: 2 passed, 0 skipped
  218. 47.20 s gammaloop-nextest-feynkit>
  219. 47.20 s gammaloop-nextest-feynkit> ========== nextest test summary ==========
  220. 47.20 s gammaloop-nextest-feynkit> report: target/nextest/ci_gammaloop/junit.xml
  221. 47.20 s gammaloop-nextest-feynkit> tests: 2, failures: 0, errors: 0
  222. 47.20 s gammaloop-nextest-feynkit> No failing testcases found.
  223. 47.20 s gammaloop-nextest-feynkit> =========================================
  224. 47.46 s error: Cannot build '/nix/store/jq3pivlmd32m1d0ydmfkh08srar1g0g4-gammaloop-nextest-feynkit.drv'.
  225. 47.46 s Reason: builder failed with exit code 100.
  226. 47.46 s Output paths:
  227. 47.46 s /nix/store/146bccmhaiz98v6rks8q5iz1kacwh0sh-gammaloop-nextest-feynkit
  228. 47.46 s Last 199 log lines:
  229. 47.46 s > Extracting 1 binary and 2 linked paths to /build/source
  230. 47.46 s > Extracted 15 files to /build/source in 0.08s
  231. 47.46 s > ------------
  232. 47.46 s > Nextest run ID 3baff935-e66a-461f-afa9-0d46e22e6336 with nextest profile: ci_gammaloop
  233. 47.46 s > Starting 1 test across 1 binary
  234. 47.46 s > ------------
  235. 47.46 s > Summary [ 0.021s] 1 test run: 1 passed, 0 skipped
  236. 47.46 s >
  237. 47.46 s > ========== nextest test summary ==========
  238. 47.46 s > report: target/nextest/ci_gammaloop/junit.xml
  239. 47.46 s > tests: 1, failures: 0, errors: 0
  240. 47.46 s > No failing testcases found.
  241. 47.46 s > =========================================
  242. 47.46 s > Extracting 1 binary and 2 linked paths to /build/source
  243. 47.46 s > Extracted 15 files to /build/source in 0.13s
  244. 47.46 s > ------------
  245. 47.46 s > Nextest run ID 1d6db0cf-33cf-41b7-8721-502016e26c3c with nextest profile: ci_gammaloop
  246. 47.46 s > Starting 33 tests across 1 binary
  247. 47.46 s > ------------
  248. 47.46 s > Summary [ 0.084s] 33 tests run: 33 passed, 0 skipped
  249. 47.46 s >
  250. 47.46 s > ========== nextest test summary ==========
  251. 47.46 s > report: target/nextest/ci_gammaloop/junit.xml
  252. 47.46 s > tests: 33, failures: 0, errors: 0
  253. 47.46 s > No failing testcases found.
  254. 47.46 s > =========================================
  255. 47.46 s > Extracting 2 binaries and 2 linked paths to /build/source
  256. 47.46 s > Extracted 16 files to /build/source in 0.22s
  257. 47.46 s > ------------
  258. 47.46 s > Nextest run ID 42216139-85a9-47b5-ae9b-f6c2e22b4649 with nextest profile: ci_gammaloop
  259. 47.46 s > Starting 58 tests across 2 binaries
  260. 47.46 s > ------------
  261. 47.46 s > Summary [ 0.146s] 58 tests run: 58 passed, 0 skipped
  262. 47.46 s >
  263. 47.46 s > ========== nextest test summary ==========
  264. 47.46 s > report: target/nextest/ci_gammaloop/junit.xml
  265. 47.46 s > tests: 58, failures: 0, errors: 0
  266. 47.46 s > No failing testcases found.
  267. 47.46 s > =========================================
  268. 47.46 s > Extracting 1 binary and 2 linked paths to /build/source
  269. 47.46 s > Extracted 15 files to /build/source in 0.12s
  270. 47.46 s > ------------
  271. 47.46 s > Nextest run ID e2bae9ef-4226-4d40-8c69-0c44e8cf3523 with nextest profile: ci_gammaloop
  272. 47.46 s > Starting 24 tests across 1 binary
  273. 47.46 s > ------------
  274. 47.46 s > Summary [ 0.083s] 24 tests run: 24 passed, 0 skipped
  275. 47.46 s >
  276. 47.46 s > ========== nextest test summary ==========
  277. 47.46 s > report: target/nextest/ci_gammaloop/junit.xml
  278. 47.46 s > tests: 24, failures: 0, errors: 0
  279. 47.46 s > No failing testcases found.
  280. 47.46 s > =========================================
  281. 47.46 s > Extracting 1 binary and 1 linked path to /build/source
  282. 47.46 s > Extracted 7 files to /build/source in 0.12s
  283. 47.46 s > ------------
  284. 47.46 s > Nextest run ID adb5f1b5-19e6-4f13-bb38-fefdc4828182 with nextest profile: ci_gammaloop
  285. 47.46 s > Starting 21 tests across 1 binary
  286. 47.46 s > ------------
  287. 47.46 s > Summary [ 0.064s] 21 tests run: 21 passed, 0 skipped
  288. 47.46 s >
  289. 47.46 s > ========== nextest test summary ==========
  290. 47.46 s > report: target/nextest/ci_gammaloop/junit.xml
  291. 47.46 s > tests: 21, failures: 0, errors: 0
  292. 47.46 s > No failing testcases found.
  293. 47.46 s > =========================================
  294. 47.46 s > Extracting 2 binaries and 2 linked paths to /build/source
  295. 47.46 s > Extracted 16 files to /build/source in 0.14s
  296. 47.46 s > ------------
  297. 47.46 s > Nextest run ID 85721fb9-894b-4085-a9d5-79b8373ac503 with nextest profile: ci_gammaloop
  298. 47.46 s > Starting 14 tests across 2 binaries
  299. 47.46 s > ------------
  300. 47.46 s > Summary [ 0.082s] 14 tests run: 14 passed, 0 skipped
  301. 47.46 s >
  302. 47.46 s > ========== nextest test summary ==========
  303. 47.46 s > report: target/nextest/ci_gammaloop/junit.xml
  304. 47.46 s > tests: 14, failures: 0, errors: 0
  305. 47.46 s > No failing testcases found.
  306. 47.46 s > =========================================
  307. 47.46 s > Extracting 5 binaries (including 3 non-test binaries) and 2 linked paths to /build/source
  308. 47.46 s > Extracted 22 files to /build/source in 0.83s
  309. 47.46 s > ------------
  310. 47.46 s > Nextest run ID adf2336c-039f-43e2-afef-5b6f26b86f5f with nextest profile: ci_gammaloop
  311. 47.46 s > Starting 12 tests across 2 binaries
  312. 47.46 s > FAIL [ 0.084s] (11/12) feynkit-py tests::standalone_python_pipeline_covers_generation_graphs_cff_and_kinematics
  313. 47.46 s > stdout ---
  314. 47.46 s >
  315. 47.46 s > running 1 test
  316. 47.46 s > test tests::standalone_python_pipeline_covers_generation_graphs_cff_and_kinematics ... FAILED
  317. 47.46 s >
  318. 47.46 s > failures:
  319. 47.46 s >
  320. 47.46 s > failures:
  321. 47.46 s > tests::standalone_python_pipeline_covers_generation_graphs_cff_and_kinematics
  322. 47.46 s >
  323. 47.46 s > test result: FAILED. 0 passed; 1 failed; 0 ignored; 0 measured; 10 filtered out; finished in 0.07s
  324. 47.46 s >
  325. 47.46 s > stderr ---
  326. 47.46 s >
  327. 47.46 s > thread 'tests::standalone_python_pipeline_covers_generation_graphs_cff_and_kinematics' (886) panicked at crates/feynkit-py/src/lib.rs:431:57:
  328. 47.46 s > called `Result::unwrap()` on an `Err` value: PyErr { type: <class 'AssertionError'>, value: AssertionError(), traceback: Some("Traceback (most recent call last):\n File \"<string>\", line 39, in <module>\n") }
  329. 47.46 s > stack backtrace:
  330. 47.46 s > 0: __rustc::rust_begin_unwind
  331. 47.46 s > 1: core::panicking::panic_fmt
  332. 47.46 s > 2: core::result::unwrap_failed
  333. 47.46 s > 3: feynkit_py::tests::standalone_python_pipeline_covers_generation_graphs_cff_and_kinematics
  334. 47.46 s > 4: <feynkit_py::tests::standalone_python_pipeline_covers_generation_graphs_cff_and_kinematics::{closure#0} as core::ops::function::FnOnce<()>>::call_once
  335. 47.46 s > note: Some details are omitted, run with `RUST_BACKTRACE=full` for a verbose backtrace.
  336. 47.46 s >
  337. 47.46 s > ------------
  338. 47.46 s > Summary [ 0.690s] 12 tests run: 11 passed, 1 failed, 0 skipped
  339. 47.46 s > FAIL [ 0.084s] (11/12) feynkit-py tests::standalone_python_pipeline_covers_generation_graphs_cff_and_kinematics
  340. 47.46 s > stdout ---
  341. 47.46 s >
  342. 47.46 s > running 1 test
  343. 47.46 s > test tests::standalone_python_pipeline_covers_generation_graphs_cff_and_kinematics ... FAILED
  344. 47.46 s >
  345. 47.46 s > failures:
  346. 47.46 s >
  347. 47.46 s > failures:
  348. 47.46 s > tests::standalone_python_pipeline_covers_generation_graphs_cff_and_kinematics
  349. 47.46 s >
  350. 47.46 s > test result: FAILED. 0 passed; 1 failed; 0 ignored; 0 measured; 10 filtered out; finished in 0.07s
  351. 47.46 s >
  352. 47.46 s > stderr ---
  353. 47.46 s >
  354. 47.46 s > thread 'tests::standalone_python_pipeline_covers_generation_graphs_cff_and_kinematics' (886) panicked at crates/feynkit-py/src/lib.rs:431:57:
  355. 47.46 s > called `Result::unwrap()` on an `Err` value: PyErr { type: <class 'AssertionError'>, value: AssertionError(), traceback: Some("Traceback (most recent call last):\n File \"<string>\", line 39, in <module>\n") }
  356. 47.46 s > stack backtrace:
  357. 47.46 s > 0: __rustc::rust_begin_unwind
  358. 47.46 s > 1: core::panicking::panic_fmt
  359. 47.46 s > 2: core::result::unwrap_failed
  360. 47.46 s > 3: feynkit_py::tests::standalone_python_pipeline_covers_generation_graphs_cff_and_kinematics
  361. 47.46 s > 4: <feynkit_py::tests::standalone_python_pipeline_covers_generation_graphs_cff_and_kinematics::{closure#0} as core::ops::function::FnOnce<()>>::call_once
  362. 47.46 s > note: Some details are omitted, run with `RUST_BACKTRACE=full` for a verbose backtrace.
  363. 47.46 s >
  364. 47.46 s > error: test run failed
  365. 47.46 s >
  366. 47.46 s > ========== nextest test summary ==========
  367. 47.46 s > report: target/nextest/ci_gammaloop/junit.xml
  368. 47.46 s > tests: 12, failures: 1, errors: 0
  369. 47.46 s >
  370. 47.46 s > 1. feynkit-py::tests::standalone_python_pipeline_covers_generation_graphs_cff_and_kinematics
  371. 47.46 s > failure: test failure with exit code 101
  372. 47.46 s > thread 'tests::standalone_python_pipeline_covers_generation_graphs_cff_and_kinematics' (886) panicked at crates/feynkit-py/src/lib.rs:431:57:
  373. 47.46 s > called `Result::unwrap()` on an `Err` value: PyErr { type: <class 'AssertionError'>, value: AssertionError(), traceback: Some("Traceback (most recent call last):\n File \"<string>\", line 39, in <module>\n") }
  374. 47.46 s > stack backtrace:
  375. 47.46 s > 0: __rustc::rust_begin_unwind
  376. 47.46 s > 1: core::panicking::panic_fmt
  377. 47.46 s > 2: core::result::unwrap_failed
  378. 47.46 s > 3: feynkit_py::tests::standalone_python_pipeline_covers_generation_graphs_cff_and_kinematics
  379. 47.46 s > 4: <feynkit_py::tests::standalone_python_pipeline_covers_generation_graphs_cff_and_kinematics::{closure#0} as core::ops::function::FnOnce<()>>::call_once
  380. 47.46 s > note: Some details are omitted, run with `RUST_BACKTRACE=full` for a verbose backtrace.
  381. 47.46 s > system-out
  382. 47.46 s > running 1 test
  383. 47.46 s > test tests::standalone_python_pipeline_covers_generation_graphs_cff_and_kinematics ... FAILED
  384. 47.46 s >
  385. 47.46 s > failures:
  386. 47.46 s >
  387. 47.46 s > failures:
  388. 47.46 s > tests::standalone_python_pipeline_covers_generation_graphs_cff_and_kinematics
  389. 47.46 s >
  390. 47.46 s > test result: FAILED. 0 passed; 1 failed; 0 ignored; 0 measured; 10 filtered out; finished in 0.07s
  391. 47.46 s > system-err
  392. 47.46 s > thread 'tests::standalone_python_pipeline_covers_generation_graphs_cff_and_kinematics' (886) panicked at crates/feynkit-py/src/lib.rs:431:57:
  393. 47.46 s > called `Result::unwrap()` on an `Err` value: PyErr { type: <class 'AssertionError'>, value: AssertionError(), traceback: Some("Traceback (most recent call last):\n File \"<string>\", line 39, in <module>\n") }
  394. 47.46 s > stack backtrace:
  395. 47.46 s > 0: __rustc::rust_begin_unwind
  396. 47.46 s > 1: core::panicking::panic_fmt
  397. 47.46 s > 2: core::result::unwrap_failed
  398. 47.46 s > 3: feynkit_py::tests::standalone_python_pipeline_covers_generation_graphs_cff_and_kinematics
  399. 47.46 s > 4: <feynkit_py::tests::standalone_python_pipeline_covers_generation_graphs_cff_and_kinematics::{closure#0} as core::ops::function::FnOnce<()>>::call_once
  400. 47.46 s > note: Some details are omitted, run with `RUST_BACKTRACE=full` for a verbose backtrace.
  401. 47.46 s > =========================================
  402. 47.46 s > Extracting 1 binary and 2 linked paths to /build/source
  403. 47.46 s > Extracted 15 files to /build/source in 0.14s
  404. 47.46 s > ------------
  405. 47.46 s > Nextest run ID 6a650bab-9c3b-4c90-b41d-bb808302833d with nextest profile: ci_gammaloop
  406. 47.46 s > Starting 45 tests across 1 binary (1 test skipped)
  407. 47.46 s > ------------
  408. 47.46 s > Summary [ 0.213s] 45 tests run: 45 passed, 1 skipped
  409. 47.46 s >
  410. 47.46 s > ========== nextest test summary ==========
  411. 47.46 s > report: target/nextest/ci_gammaloop/junit.xml
  412. 47.46 s > tests: 45, failures: 0, errors: 0
  413. 47.46 s > No failing testcases found.
  414. 47.46 s > =========================================
  415. 47.46 s > Extracting 1 binary and 2 linked paths to /build/source
  416. 47.46 s > Extracted 15 files to /build/source in 0.12s
  417. 47.46 s > ------------
  418. 47.46 s > Nextest run ID 92c40da5-101f-49e9-81a7-7024f5f02eb6 with nextest profile: ci_gammaloop
  419. 47.46 s > Starting 2 tests across 1 binary
  420. 47.46 s > ------------
  421. 47.46 s > Summary [ 0.044s] 2 tests run: 2 passed, 0 skipped
  422. 47.46 s >
  423. 47.46 s > ========== nextest test summary ==========
  424. 47.46 s > report: target/nextest/ci_gammaloop/junit.xml
  425. 47.46 s > tests: 2, failures: 0, errors: 0
  426. 47.46 s > No failing testcases found.
  427. 47.46 s > =========================================
  428. 47.46 s For full logs, run:
  429. 47.46 s nix log /nix/store/jq3pivlmd32m1d0ydmfkh08srar1g0g4-gammaloop-nextest-feynkit.drv
  430. 47.69 s [0 built (1 failed), 0.0Run failed.