test packages.x86_64-linux.nix-ci-check-gammaloop-nextest-core
0.00 s
$ /nix/store/61685rbaxmpigwi3z23i33sv3jyfl70q-coreutils-9.11/bin/timeout --kill-after=15s 7200s /nix/store/wknkybkzrc16r11vk5vrykh4wmw7a353-nix-2.34.8/bin/nix --extra-experimental-features nix-command --extra-experimental-features flakes flake clone git+https://github.com/alphal00p/gammaloop --dest /tmp/nix-ci-worker/stable-pwd/repo/
0.07 s
Cloning into '/tmp/nix-ci-worker/stable-pwd/repo'...
1.79 s
remote: Enumerating objects: 102985, done.
1.91 s
remote: Counting objects: 0% (1/9378)
remote: Counting objects: 1% (94/9378)
remote: Counting objects: 2% (188/9378)
remote: Counting objects: 3% (282/9378)
remote: Counting objects: 4% (376/9378)
remote: Counting objects: 5% (469/9378)
remote: Counting objects: 6% (563/9378)
remote: Counting objects: 7% (657/9378)
remote: Counting objects: 8% (751/9378)
remote: Counting objects: 9% (845/9378)
remote: Counting objects: 10% (938/9378)
remote: Counting objects: 11% (1032/9378)
remote: Counting objects: 12% (1126/9378)
remote: Counting objects: 13% (1220/9378)
remote: Counting objects: 14% (1313/9378)
remote: Counting objects: 15% (1407/9378)
remote: Counting objects: 16% (1501/9378)
remote: Counting objects: 17% (1595/9378)
remote: Counting objects: 18% (1689/9378)
remote: Counting objects: 19% (1782/9378)
remote: Counting objects: 20% (1876/9378)
remote: Counting objects: 21% (1970/9378)
remote: Counting objects: 22% (2064/9378)
remote: Counting objects: 23% (2157/9378)
remote: Counting objects: 24% (2251/9378)
remote: Counting objects: 25% (2345/9378)
remote: Counting objects: 26% (2439/9378)
remote: Counting objects: 27% (2533/9378)
remote: Counting objects: 28% (2626/9378)
remote: Counting objects: 29% (2720/9378)
remote: Counting objects: 30% (2814/9378)
remote: Counting objects: 31% (2908/9378)
remote: Counting objects: 32% (3001/9378)
remote: Counting objects: 33% (3095/9378)
remote: Counting objects: 34% (3189/9378)
remote: Counting objects: 35% (3283/9378)
remote: Counting objects: 36% (3377/9378)
remote: Counting objects: 37% (3470/9378)
remote: Counting objects: 38% (3564/9378)
remote: Counting objects: 39% (3658/9378)
remote: Counting objects: 40% (3752/9378)
remote: Counting objects: 41% (3845/9378)
remote: Counting objects: 42% (3939/9378)
remote: Counting objects: 43% (4033/9378)
remote: Counting objects: 44% (4127/9378)
remote: Counting objects: 45% (4221/9378)
remote: Counting objects: 46% (4314/9378)
remote: Counting objects: 47% (4408/9378)
remote: Counting objects: 48% (4502/9378)
remote: Counting objects: 49% (4596/9378)
remote: Counting objects: 50% (4689/9378)
remote: Counting objects: 51% (4783/9378)
remote: Counting objects: 52% (4877/9378)
remote: Counting objects: 53% (4971/9378)
remote: Counting objects: 54% (5065/9378)
remote: Counting objects: 55% (5158/9378)
remote: Counting objects: 56% (5252/9378)
remote: Counting objects: 57% (5346/9378)
remote: Counting objects: 58% (5440/9378)
remote: Counting objects: 59% (5534/9378)
remote: Counting objects: 60% (5627/9378)
remote: Counting objects: 61% (5721/9378)
remote: Counting objects: 62% (5815/9378)
remote: Counting objects: 63% (5909/9378)
remote: Counting objects: 64% (6002/9378)
remote: Counting objects: 65% (6096/9378)
remote: Counting objects: 66% (6190/9378)
remote: Counting objects: 67% (6284/9378)
remote: Counting objects: 68% (6378/9378)
remote: Counting objects: 69% (6471/9378)
remote: Counting objects: 70% (6565/9378)
remote: Counting objects: 71% (6659/9378)
remote: Counting objects: 72% (6753/9378)
remote: Counting objects: 73% (6846/9378)
remote: Counting objects: 74% (6940/9378)
remote: Counting objects: 75% (7034/9378)
remote: Counting objects: 76% (7128/9378)
remote: Counting objects: 77% (7222/9378)
remote: Counting objects: 78% (7315/9378)
remote: Counting objects: 79% (7409/9378)
remote: Counting objects: 80% (7503/9378)
remote: Counting objects: 81% (7597/9378)
remote: Counting objects: 82% (7690/9378)
remote: Counting objects: 83% (7784/9378)
remote: Counting objects: 84% (7878/9378)
remote: Counting objects: 85% (7972/9378)
remote: Counting objects: 86% (8066/9378)
remote: Counting objects: 87% (8159/9378)
remote: Counting objects: 88% (8253/9378)
remote: Counting objects: 89% (8347/9378)
remote: Counting objects: 90% (8441/9378)
remote: Counting objects: 91% (8534/9378)
remote: Counting objects: 92% (8628/9378)
remote: Counting objects: 93% (8722/9378)
remote: Counting objects: 94% (8816/9378)
remote: Counting objects: 95% (8910/9378)
remote: Counting objects: 96% (9003/9378)
remote: Counting objects: 97% (9097/9378)
remote: Counting objects: 98% (9191/9378)
remote: Counting objects: 99% (9285/9378)
remote: Counting objects: 100% (9378/9378)
remote: Counting objects: 100% (9378/9378), done.
4.67 s
remote: Compressing objects: 0% (1/2006)
remote: Compressing objects: 1% (21/2006)
remote: Compressing objects: 2% (41/2006)
remote: Compressing objects: 3% (61/2006)
remote: Compressing objects: 4% (81/2006)
remote: Compressing objects: 5% (101/2006)
remote: Compressing objects: 6% (121/2006)
remote: Compressing objects: 7% (141/2006)
remote: Compressing objects: 7% (145/2006)
remote: Compressing objects: 8% (161/2006)
remote: Compressing objects: 9% (181/2006)
remote: Compressing objects: 10% (201/2006)
remote: Compressing objects: 11% (221/2006)
remote: Compressing objects: 12% (241/2006)
remote: Compressing objects: 13% (261/2006)
remote: Compressing objects: 14% (281/2006)
remote: Compressing objects: 14% (297/2006)
remote: Compressing objects: 15% (301/2006)
remote: Compressing objects: 16% (321/2006)
remote: Compressing objects: 17% (342/2006)
remote: Compressing objects: 18% (362/2006)
remote: Compressing objects: 19% (382/2006)
remote: Compressing objects: 20% (402/2006)
remote: Compressing objects: 21% (422/2006)
remote: Compressing objects: 22% (442/2006)
remote: Compressing objects: 23% (462/2006)
remote: Compressing objects: 24% (482/2006)
remote: Compressing objects: 25% (502/2006)
remote: Compressing objects: 26% (522/2006)
remote: Compressing objects: 27% (542/2006)
remote: Compressing objects: 28% (562/2006)
remote: Compressing objects: 29% (582/2006)
remote: Compressing objects: 30% (602/2006)
remote: Compressing objects: 31% (622/2006)
remote: Compressing objects: 32% (642/2006)
remote: Compressing objects: 33% (662/2006)
remote: Compressing objects: 34% (683/2006)
remote: Compressing objects: 35% (703/2006)
remote: Compressing objects: 36% (723/2006)
remote: Compressing objects: 37% (743/2006)
remote: Compressing objects: 38% (763/2006)
remote: Compressing objects: 39% (783/2006)
remote: Compressing objects: 40% (803/2006)
remote: Compressing objects: 41% (823/2006)
remote: Compressing objects: 42% (843/2006)
remote: Compressing objects: 43% (863/2006)
remote: Compressing objects: 44% (883/2006)
remote: Compressing objects: 45% (903/2006)
remote: Compressing objects: 46% (923/2006)
remote: Compressing objects: 47% (943/2006)
remote: Compressing objects: 48% (963/2006)
remote: Compressing objects: 49% (983/2006)
remote: Compressing objects: 50% (1003/2006)
remote: Compressing objects: 51% (1024/2006)
remote: Compressing objects: 52% (1044/2006)
remote: Compressing objects: 53% (1064/2006)
remote: Compressing objects: 54% (1084/2006)
remote: Compressing objects: 55% (1104/2006)
remote: Compressing objects: 56% (1124/2006)
remote: Compressing objects: 57% (1144/2006)
remote: Compressing objects: 58% (1164/2006)
remote: Compressing objects: 59% (1184/2006)
remote: Compressing objects: 60% (1204/2006)
remote: Compressing objects: 61% (1224/2006)
remote: Compressing objects: 62% (1244/2006)
remote: Compressing objects: 63% (1264/2006)
remote: Compressing objects: 64% (1284/2006)
remote: Compressing objects: 65% (1304/2006)
remote: Compressing objects: 66% (1324/2006)
remote: Compressing objects: 67% (1345/2006)
remote: Compressing objects: 68% (1365/2006)
remote: Compressing objects: 69% (1385/2006)
remote: Compressing objects: 70% (1405/2006)
remote: Compressing objects: 71% (1425/2006)
remote: Compressing objects: 72% (1445/2006)
remote: Compressing objects: 73% (1465/2006)
remote: Compressing objects: 74% (1485/2006)
remote: Compressing objects: 75% (1505/2006)
remote: Compressing objects: 76% (1525/2006)
remote: Compressing objects: 77% (1545/2006)
remote: Compressing objects: 78% (1565/2006)
remote: Compressing objects: 79% (1585/2006)
remote: Compressing objects: 80% (1605/2006)
remote: Compressing objects: 81% (1625/2006)
remote: Compressing objects: 82% (1645/2006)
remote: Compressing objects: 83% (1665/2006)
remote: Compressing objects: 84% (1686/2006)
remote: Compressing objects: 85% (1706/2006)
remote: Compressing objects: 86% (1726/2006)
remote: Compressing objects: 87% (1746/2006)
remote: Compressing objects: 88% (1766/2006)
remote: Compressing objects: 89% (1786/2006)
remote: Compressing objects: 90% (1806/2006)
remote: Compressing objects: 91% (1826/2006)
remote: Compressing objects: 92% (1846/2006)
remote: Compressing objects: 93% (1866/2006)
remote: Compressing objects: 94% (1886/2006)
remote: Compressing objects: 95% (1906/2006)
remote: Compressing objects: 96% (1926/2006)
remote: Compressing objects: 97% (1946/2006)
remote: Compressing objects: 98% (1966/2006)
remote: Compressing objects: 99% (1986/2006)
remote: Compressing objects: 100% (2006/2006)
remote: Compressing objects: 100% (2006/2006), done.
17.61 s
Receiving objects: 0% (1/102985)
Receiving objects: 1% (1030/102985)
Receiving objects: 2% (2060/102985)
Receiving objects: 3% (3090/102985)
Receiving objects: 4% (4120/102985)
Receiving objects: 5% (5150/102985)
Receiving objects: 6% (6180/102985)
Receiving objects: 7% (7209/102985), 10.08 MiB | 20.14 MiB/s
Receiving objects: 8% (8239/102985), 10.08 MiB | 20.14 MiB/s
Receiving objects: 9% (9269/102985), 10.08 MiB | 20.14 MiB/s
Receiving objects: 10% (10299/102985), 10.08 MiB | 20.14 MiB/s
Receiving objects: 11% (11329/102985), 10.08 MiB | 20.14 MiB/s
Receiving objects: 12% (12359/102985), 10.08 MiB | 20.14 MiB/s
Receiving objects: 13% (13389/102985), 10.08 MiB | 20.14 MiB/s
Receiving objects: 14% (14418/102985), 10.08 MiB | 20.14 MiB/s
Receiving objects: 15% (15448/102985), 10.08 MiB | 20.14 MiB/s
Receiving objects: 16% (16478/102985), 10.08 MiB | 20.14 MiB/s
Receiving objects: 17% (17508/102985), 10.08 MiB | 20.14 MiB/s
Receiving objects: 18% (18538/102985), 10.08 MiB | 20.14 MiB/s
Receiving objects: 19% (19568/102985), 10.08 MiB | 20.14 MiB/s
Receiving objects: 20% (20597/102985), 10.08 MiB | 20.14 MiB/s
Receiving objects: 21% (21627/102985), 10.08 MiB | 20.14 MiB/s
Receiving objects: 22% (22657/102985), 10.08 MiB | 20.14 MiB/s
Receiving objects: 23% (23687/102985), 10.08 MiB | 20.14 MiB/s
Receiving objects: 24% (24717/102985), 10.08 MiB | 20.14 MiB/s
Receiving objects: 25% (25747/102985), 10.08 MiB | 20.14 MiB/s
Receiving objects: 25% (26741/102985), 10.08 MiB | 20.14 MiB/s
Receiving objects: 26% (26777/102985), 10.08 MiB | 20.14 MiB/s
Receiving objects: 27% (27806/102985), 26.58 MiB | 26.57 MiB/s
Receiving objects: 28% (28836/102985), 26.58 MiB | 26.57 MiB/s
Receiving objects: 29% (29866/102985), 26.58 MiB | 26.57 MiB/s
Receiving objects: 30% (30896/102985), 26.58 MiB | 26.57 MiB/s
Receiving objects: 31% (31926/102985), 26.58 MiB | 26.57 MiB/s
Receiving objects: 32% (32956/102985), 26.58 MiB | 26.57 MiB/s
Receiving objects: 33% (33986/102985), 26.58 MiB | 26.57 MiB/s
Receiving objects: 34% (35015/102985), 26.58 MiB | 26.57 MiB/s
Receiving objects: 35% (36045/102985), 26.58 MiB | 26.57 MiB/s
Receiving objects: 36% (37075/102985), 26.58 MiB | 26.57 MiB/s
Receiving objects: 37% (38105/102985), 41.06 MiB | 27.03 MiB/s
Receiving objects: 38% (39135/102985), 41.06 MiB | 27.03 MiB/s
Receiving objects: 39% (40165/102985), 41.06 MiB | 27.03 MiB/s
Receiving objects: 40% (41194/102985), 41.06 MiB | 27.03 MiB/s
Receiving objects: 41% (42224/102985), 41.06 MiB | 27.03 MiB/s
Receiving objects: 42% (43254/102985), 41.06 MiB | 27.03 MiB/s
Receiving objects: 43% (44284/102985), 41.06 MiB | 27.03 MiB/s
Receiving objects: 44% (45314/102985), 41.06 MiB | 27.03 MiB/s
Receiving objects: 44% (45434/102985), 41.06 MiB | 27.03 MiB/s
Receiving objects: 45% (46344/102985), 55.98 MiB | 27.73 MiB/s
Receiving objects: 46% (47374/102985), 55.98 MiB | 27.73 MiB/s
Receiving objects: 47% (48403/102985), 55.98 MiB | 27.73 MiB/s
Receiving objects: 48% (49433/102985), 55.98 MiB | 27.73 MiB/s
Receiving objects: 49% (50463/102985), 55.98 MiB | 27.73 MiB/s
Receiving objects: 50% (51493/102985), 71.32 MiB | 28.12 MiB/s
Receiving objects: 51% (52523/102985), 71.32 MiB | 28.12 MiB/s
Receiving objects: 52% (53553/102985), 71.32 MiB | 28.12 MiB/s
Receiving objects: 53% (54583/102985), 71.32 MiB | 28.12 MiB/s
Receiving objects: 54% (55612/102985), 71.32 MiB | 28.12 MiB/s
Receiving objects: 55% (56642/102985), 71.32 MiB | 28.12 MiB/s
Receiving objects: 55% (57048/102985), 71.32 MiB | 28.12 MiB/s
Receiving objects: 55% (57102/102985), 118.39 MiB | 29.05 MiB/s
Receiving objects: 55% (57227/102985), 148.62 MiB | 30.27 MiB/s
Receiving objects: 56% (57672/102985), 148.62 MiB | 30.27 MiB/s
Receiving objects: 57% (58702/102985), 164.28 MiB | 30.09 MiB/s
Receiving objects: 58% (59732/102985), 164.28 MiB | 30.09 MiB/s
Receiving objects: 59% (60762/102985), 164.28 MiB | 30.09 MiB/s
Receiving objects: 60% (61791/102985), 164.28 MiB | 30.09 MiB/s
Receiving objects: 61% (62821/102985), 164.28 MiB | 30.09 MiB/s
Receiving objects: 61% (63492/102985), 164.28 MiB | 30.09 MiB/s
Receiving objects: 62% (63851/102985), 164.28 MiB | 30.09 MiB/s
Receiving objects: 63% (64881/102985), 180.45 MiB | 30.49 MiB/s
Receiving objects: 64% (65911/102985), 180.45 MiB | 30.49 MiB/s
Receiving objects: 65% (66941/102985), 180.45 MiB | 30.49 MiB/s
Receiving objects: 66% (67971/102985), 180.45 MiB | 30.49 MiB/s
Receiving objects: 67% (69000/102985), 180.45 MiB | 30.49 MiB/s
Receiving objects: 68% (70030/102985), 180.45 MiB | 30.49 MiB/s
Receiving objects: 69% (71060/102985), 180.45 MiB | 30.49 MiB/s
Receiving objects: 70% (72090/102985), 180.45 MiB | 30.49 MiB/s
Receiving objects: 71% (73120/102985), 180.45 MiB | 30.49 MiB/s
Receiving objects: 72% (74150/102985), 197.17 MiB | 30.88 MiB/s
Receiving objects: 73% (75180/102985), 197.17 MiB | 30.88 MiB/s
Receiving objects: 73% (75766/102985), 197.17 MiB | 30.88 MiB/s
Receiving objects: 74% (76209/102985), 197.17 MiB | 30.88 MiB/s
Receiving objects: 75% (77239/102985), 229.46 MiB | 31.50 MiB/s
Receiving objects: 76% (78269/102985), 229.46 MiB | 31.50 MiB/s
Receiving objects: 77% (79299/102985), 229.46 MiB | 31.50 MiB/s
Receiving objects: 78% (80329/102985), 229.46 MiB | 31.50 MiB/s
Receiving objects: 78% (81306/102985), 229.46 MiB | 31.50 MiB/s
Receiving objects: 79% (81359/102985), 229.46 MiB | 31.50 MiB/s
Receiving objects: 80% (82388/102985), 229.46 MiB | 31.50 MiB/s
Receiving objects: 81% (83418/102985), 229.46 MiB | 31.50 MiB/s
Receiving objects: 81% (84230/102985), 262.69 MiB | 31.88 MiB/s
Receiving objects: 82% (84448/102985), 262.69 MiB | 31.88 MiB/s
Receiving objects: 82% (84529/102985), 306.25 MiB | 31.37 MiB/s
Receiving objects: 83% (85478/102985), 315.30 MiB | 29.89 MiB/s
Receiving objects: 84% (86508/102985), 315.30 MiB | 29.89 MiB/s
Receiving objects: 85% (87538/102985), 315.30 MiB | 29.89 MiB/s
Receiving objects: 85% (87908/102985), 315.30 MiB | 29.89 MiB/s
Receiving objects: 86% (88568/102985), 331.61 MiB | 29.80 MiB/s
Receiving objects: 87% (89597/102985), 331.61 MiB | 29.80 MiB/s
Receiving objects: 88% (90627/102985), 331.61 MiB | 29.80 MiB/s
Receiving objects: 88% (91590/102985), 348.07 MiB | 29.92 MiB/s
Receiving objects: 89% (91657/102985), 364.63 MiB | 29.95 MiB/s
Receiving objects: 90% (92687/102985), 381.12 MiB | 29.95 MiB/s
Receiving objects: 91% (93717/102985), 381.12 MiB | 29.95 MiB/s
Receiving objects: 92% (94747/102985), 381.12 MiB | 29.95 MiB/s
Receiving objects: 93% (95777/102985), 381.12 MiB | 29.95 MiB/s
Receiving objects: 94% (96806/102985), 381.12 MiB | 29.95 MiB/s
Receiving objects: 95% (97836/102985), 381.12 MiB | 29.95 MiB/s
Receiving objects: 96% (98866/102985), 381.12 MiB | 29.95 MiB/s
Receiving objects: 97% (99896/102985), 381.12 MiB | 29.95 MiB/s
Receiving objects: 98% (100926/102985), 381.12 MiB | 29.95 MiB/s
Receiving objects: 99% (101956/102985), 381.12 MiB | 29.95 MiB/s
remote: Total 102985 (delta 8122), reused 7424 (delta 7366), pack-reused 93607 (from 4)
17.61 s
Receiving objects: 100% (102985/102985), 381.12 MiB | 29.95 MiB/s
Receiving objects: 100% (102985/102985), 391.53 MiB | 30.27 MiB/s, done.
19.25 s
Resolving deltas: 0% (0/67477)
Resolving deltas: 1% (675/67477)
Resolving deltas: 2% (1350/67477)
Resolving deltas: 3% (2025/67477)
Resolving deltas: 4% (2700/67477)
Resolving deltas: 5% (3374/67477)
Resolving deltas: 6% (4049/67477)
Resolving deltas: 7% (4724/67477)
Resolving deltas: 8% (5399/67477)
Resolving deltas: 9% (6073/67477)
Resolving deltas: 10% (6748/67477)
Resolving deltas: 11% (7423/67477)
Resolving deltas: 12% (8099/67477)
Resolving deltas: 13% (8773/67477)
Resolving deltas: 14% (9447/67477)
Resolving deltas: 15% (10122/67477)
Resolving deltas: 16% (10797/67477)
Resolving deltas: 17% (11472/67477)
Resolving deltas: 18% (12146/67477)
Resolving deltas: 19% (12821/67477)
Resolving deltas: 20% (13496/67477)
Resolving deltas: 21% (14171/67477)
Resolving deltas: 22% (14845/67477)
Resolving deltas: 23% (15520/67477)
Resolving deltas: 24% (16195/67477)
Resolving deltas: 25% (16870/67477)
Resolving deltas: 26% (17545/67477)
Resolving deltas: 27% (18219/67477)
Resolving deltas: 28% (18894/67477)
Resolving deltas: 29% (19569/67477)
Resolving deltas: 30% (20244/67477)
Resolving deltas: 31% (20918/67477)
Resolving deltas: 32% (21595/67477)
Resolving deltas: 33% (22269/67477)
Resolving deltas: 34% (22943/67477)
Resolving deltas: 35% (23617/67477)
Resolving deltas: 36% (24292/67477)
Resolving deltas: 37% (24968/67477)
Resolving deltas: 38% (25642/67477)
Resolving deltas: 39% (26317/67477)
Resolving deltas: 40% (26991/67477)
Resolving deltas: 41% (27666/67477)
Resolving deltas: 42% (28341/67477)
Resolving deltas: 43% (29016/67477)
Resolving deltas: 44% (29690/67477)
Resolving deltas: 45% (30365/67477)
Resolving deltas: 46% (31040/67477)
Resolving deltas: 47% (31715/67477)
Resolving deltas: 48% (32392/67477)
Resolving deltas: 49% (33064/67477)
Resolving deltas: 50% (33739/67477)
Resolving deltas: 51% (34414/67477)
Resolving deltas: 52% (35089/67477)
Resolving deltas: 53% (35763/67477)
Resolving deltas: 54% (36439/67477)
Resolving deltas: 55% (37113/67477)
Resolving deltas: 56% (37789/67477)
Resolving deltas: 57% (38463/67477)
Resolving deltas: 58% (39137/67477)
Resolving deltas: 58% (39206/67477)
Resolving deltas: 59% (39813/67477)
Resolving deltas: 60% (40487/67477)
Resolving deltas: 61% (41161/67477)
Resolving deltas: 62% (41836/67477)
Resolving deltas: 63% (42511/67477)
Resolving deltas: 64% (43186/67477)
Resolving deltas: 65% (43861/67477)
Resolving deltas: 66% (44535/67477)
Resolving deltas: 67% (45210/67477)
Resolving deltas: 68% (45885/67477)
Resolving deltas: 69% (46561/67477)
Resolving deltas: 70% (47234/67477)
Resolving deltas: 71% (47909/67477)
Resolving deltas: 72% (48584/67477)
Resolving deltas: 73% (49259/67477)
Resolving deltas: 74% (49933/67477)
Resolving deltas: 75% (50608/67477)
Resolving deltas: 76% (51283/67477)
Resolving deltas: 77% (51958/67477)
Resolving deltas: 78% (52633/67477)
Resolving deltas: 79% (53307/67477)
Resolving deltas: 80% (53982/67477)
Resolving deltas: 81% (54657/67477)
Resolving deltas: 82% (55332/67477)
Resolving deltas: 83% (56006/67477)
Resolving deltas: 84% (56681/67477)
Resolving deltas: 85% (57356/67477)
Resolving deltas: 86% (58031/67477)
Resolving deltas: 87% (58705/67477)
Resolving deltas: 88% (59380/67477)
Resolving deltas: 89% (60055/67477)
Resolving deltas: 90% (60730/67477)
Resolving deltas: 91% (61405/67477)
Resolving deltas: 92% (62079/67477)
Resolving deltas: 93% (62754/67477)
Resolving deltas: 94% (63429/67477)
Resolving deltas: 95% (64104/67477)
Resolving deltas: 96% (64778/67477)
Resolving deltas: 97% (65453/67477)
Resolving deltas: 98% (66128/67477)
Resolving deltas: 99% (66804/67477)
Resolving deltas: 100% (67477/67477)
Resolving deltas: 100% (67477/67477), done.
19.62 s
Fetching commit 0ea2140565027f7541293396e9053cd67c4c0a1e for feynkit ...
19.62 s
$ /nix/store/5vpcfsdx1lcnlb2y4k7xyc74shp5qwbh-git-2.54.0/bin/git fetch origin 0ea2140565027f7541293396e9053cd67c4c0a1e
20.18 s
From https://github.com/alphal00p/gammaloop
20.18 s
* branch 0ea2140565027f7541293396e9053cd67c4c0a1e -> FETCH_HEAD
20.19 s
$ /nix/store/61685rbaxmpigwi3z23i33sv3jyfl70q-coreutils-9.11/bin/timeout --kill-after=15s 7200s /nix/store/5vpcfsdx1lcnlb2y4k7xyc74shp5qwbh-git-2.54.0/bin/git -c advice.detachedHead=false checkout 0ea2140565027f7541293396e9053cd67c4c0a1e
20.44 s
HEAD is now at 0ea214056 unify Python generation arguments and return empty results
20.45 s
$ /nix/store/61685rbaxmpigwi3z23i33sv3jyfl70q-coreutils-9.11/bin/timeout --kill-after=15s 7200s /nix/store/wknkybkzrc16r11vk5vrykh4wmw7a353-nix-2.34.8/bin/nix --extra-experimental-features nix-command --extra-experimental-features flakes --log-format internal-json run .#packages.x86_64-linux.nix-ci-check-gammaloop-nextest-core --print-build-logs
20.59 s
warning: ignoring untrusted flake configuration setting 'extra-substituters'.
20.59 s
Pass '--accept-flake-config' to trust it
20.59 s
warning: ignoring untrusted flake configuration setting 'extra-trusted-public-keys'.
20.59 s
Pass '--accept-flake-config' to trust it
25.80 s
26.13 s
evaluating derivation 'gdo you want to allow configuration setting 'extra-substituters' to be set to 'https://cache.nix-ci.com ' (y/N)? do you want to permanently mark this value as untrusted (y/N)? warning: ignoring untrusted flake configuration setting 'extra-substituters'.
26.13 s
Pass '--accept-flake-config' to trust it
26.13 s
do you want to allow configuration setting 'extra-trusted-public-keys' to be set to 'nix-ci:g3xV5BDTLtIBZr/A00IU1x0EtKKlb7YLgBN2SgYgM6A= ' (y/N)? do you want to permanently mark this value as untrusted (y/N)? warning: ignoring untrusted flake configuration setting 'extra-trusted-public-keys'.
26.13 s
Pass '--accept-flake-config' to trust it
34.61 s
copying '/nix/store/rx7m
evaluating derivation 'g
copying '/nix/store/rx7m
evaluating derivation 'g
copying '/nix/store/rx7m
evaluating derivation 'g
copying '/nix/store/rx7m
evaluating derivation 'g
copying '/nix/store/rx7m
evaluating derivation 'g
copying '/nix/store/rx7m
evaluating derivation 'g
copying '/nix/store/rx7m
evaluating derivation 'g
copying '/nix/store/rx7m
evaluating derivation 'g
copying '/nix/store/rx7m
evaluating derivation 'g
copying '/nix/store/rx7m
evaluating derivation 'g
copying '/nix/store/rx7m
evaluating derivation 'g
copying '/nix/store/rx7m
evaluating derivation 'g
copying '/nix/store/rx7m
evaluating derivation 'g
querying gammaloop-nexte
[0 /8 built, 0.6 KiB DL]
[0 /1 built, 1 copied (4.
[1 /0 /1 built, 1 copied (gammaloop-nextest-core> Extracting 4 binaries (including 2 non-test binaries), 1 build script output directory, and 2 linked paths to /build/source
35.12 s
gammaloop-nextest-core> Extracted 20 files to /build/source in 0.51s
35.13 s
gammaloop-nextest-core> ------------
35.13 s
gammaloop-nextest-core> Nextest run ID 36237d79-c91e-4f15-8e38-e6048fb2bbe0 with nextest profile: ci_gammaloop
35.13 s
gammaloop-nextest-core> Starting 341 tests across 2 binaries (1 test skipped )
35.59 s
gammaloop-nextest-core> ------------
35.59 s
gammaloop-nextest-core> Summary [ 0.459s] 341 tests run: 341 passed , 1 skipped
35.62 s
gammaloop-nextest-core>
35.62 s
gammaloop-nextest-core> ========== nextest test summary ==========
35.62 s
gammaloop-nextest-core> report: target/nextest/ci_gammaloop/junit.xml
35.62 s
gammaloop-nextest-core> tests: 341, failures: 0, errors: 0
35.62 s
gammaloop-nextest-core> No failing testcases found.
35.62 s
gammaloop-nextest-core> =========================================
35.63 s
gammaloop-nextest-core> Extracting 1 binary and 1 linked path to /build/source
35.71 s
gammaloop-nextest-core> Extracted 7 files to /build/source in 0.08s
35.72 s
gammaloop-nextest-core> ------------
35.72 s
gammaloop-nextest-core> Nextest run ID 38febf65-857f-48a8-bbef-ae43443e5255 with nextest profile: ci_gammaloop
35.72 s
gammaloop-nextest-core> Starting 19 tests across 1 binary
35.73 s
gammaloop-nextest-core> ------------
35.73 s
gammaloop-nextest-core> Summary [ 0.012s] 19 tests run: 19 passed , 0 skipped
35.76 s
gammaloop-nextest-core>
35.76 s
gammaloop-nextest-core> ========== nextest test summary ==========
35.76 s
gammaloop-nextest-core> report: target/nextest/ci_gammaloop/junit.xml
35.76 s
gammaloop-nextest-core> tests: 19, failures: 0, errors: 0
35.76 s
gammaloop-nextest-core> No failing testcases found.
35.76 s
gammaloop-nextest-core> =========================================
35.78 s
gammaloop-nextest-core> Extracting 1 binary to /build/source
35.82 s
gammaloop-nextest-core> Extracted 4 files to /build/source in 0.04s
35.83 s
gammaloop-nextest-core> ------------
35.83 s
gammaloop-nextest-core> Nextest run ID 65b5ed0e-ee5d-4f05-a96d-869c55301c7c with nextest profile: ci_gammaloop
35.83 s
gammaloop-nextest-core> Starting 0 tests across 1 binary
35.83 s
gammaloop-nextest-core> ------------
35.83 s
gammaloop-nextest-core> Summary [ 0.000s] 0 tests run: 0 passed , 0 skipped
35.86 s
gammaloop-nextest-core>
35.86 s
gammaloop-nextest-core> ========== nextest test summary ==========
35.86 s
gammaloop-nextest-core> report: target/nextest/ci_gammaloop/junit.xml
35.86 s
gammaloop-nextest-core> tests: 0, failures: 0, errors: 0
35.86 s
gammaloop-nextest-core> No failing testcases found.
35.86 s
gammaloop-nextest-core> =========================================
35.87 s
gammaloop-nextest-core> Extracting 4 binaries (including 1 non-test binary), 1 build script output directory, and 2 linked paths to /build/source
36.37 s
gammaloop-nextest-core> Extracted 19 files to /build/source in 0.50s
36.38 s
gammaloop-nextest-core> ------------
36.38 s
gammaloop-nextest-core> Nextest run ID 7f26fc95-1da4-433d-bece-9d36c2f1e396 with nextest profile: ci_gammaloop
36.38 s
gammaloop-nextest-core> Starting 422 tests across 3 binaries (31 tests skipped , including 30 tests via profile.ci_gammaloop.default-filter )
37.07 s
gammaloop-nextest-core> FAIL [ 0.084s] (370/422) gammalooprs utils::test_utils :: normalization
37.07 s
gammaloop-nextest-core> stdout ---
37.07 s
gammaloop-nextest-core>
37.07 s
gammaloop-nextest-core> running 1 test
37.07 s
gammaloop-nextest-core> ━━━━━━━━━━━━━━━━━━━━━━━━━━━━━━━ Snapshot Summary ━━━━━━━━━━━━━━━━━━━━━━━━━━━━━━━
37.07 s
gammaloop-nextest-core> Snapshot: normalization-2
37.07 s
gammaloop-nextest-core> Source: crates/gammalooprs/src/utils/test_utils.rs:44
37.07 s
gammaloop-nextest-core> ────────────────────────────────────────────────────────────────────────────────
37.07 s
gammaloop-nextest-core> Expression: b.to_canonical_string()
37.07 s
gammaloop-nextest-core> ────────────────────────────────────────────────────────────────────────────────
37.07 s
gammaloop-nextest-core> -old snapshot
37.07 s
gammaloop-nextest-core> +new results
37.07 s
gammaloop-nextest-core> ────────────┬───────────────────────────────────────────────────────────────────
37.07 s
gammaloop-nextest-core> 1 │-gammalooprs::{spenso::rank1,spenso::tensor}::Q(1,spenso::{}::cind(1))
37.07 s
gammaloop-nextest-core> 1 │+gammalooprs::{spenso::rank1,spenso::tensor,spenso::tensor-label:q}::Q(1,spenso::{}::cind(1))
37.07 s
gammaloop-nextest-core> ────────────┴───────────────────────────────────────────────────────────────────
37.07 s
gammaloop-nextest-core> To update snapshots run `cargo insta review`
37.07 s
gammaloop-nextest-core> Stopped on the first failure. Run `cargo insta test` to run all snapshots.
37.07 s
gammaloop-nextest-core> test utils::test_utils::normalization ... FAILED
37.07 s
gammaloop-nextest-core>
37.07 s
gammaloop-nextest-core> failures:
37.07 s
gammaloop-nextest-core>
37.07 s
gammaloop-nextest-core> failures:
37.07 s
gammaloop-nextest-core> utils::test_utils::normalization
37.07 s
gammaloop-nextest-core>
37.07 s
gammaloop-nextest-core> test result: FAILED. 0 passed; 1 failed; 0 ignored; 0 measured; 446 filtered out; finished in 0.07s
37.07 s
gammaloop-nextest-core>
37.07 s
gammaloop-nextest-core> stderr ---
37.07 s
gammaloop-nextest-core>
37.07 s
gammaloop-nextest-core> thread 'utils::test_utils::normalization' (2244) panicked at /nix/store/c7lwckzlfrfsdw1ay0aqz4dpc2j7ry8d-vendor-cargo-deps/c19b7c6f923b580ac259164a89f2577984ad5ab09ee9d583b888f934adbbe8d0/insta-1.47.2/src/runtime.rs:719:13:
37.07 s
gammaloop-nextest-core> snapshot assertion for 'normalization-2' failed in line 44
37.07 s
gammaloop-nextest-core> stack backtrace:
37.07 s
gammaloop-nextest-core> 0: __rustc::rust_begin_unwind
37.07 s
gammaloop-nextest-core> 1: core::panicking::panic_fmt
37.07 s
gammaloop-nextest-core> 2: insta::runtime::assert_snapshot
37.07 s
gammaloop-nextest-core> 3: gammalooprs::utils::test_utils::normalization
37.07 s
gammaloop-nextest-core> 4: <gammalooprs::utils::test_utils::normalization::{closure#0} as core::ops::function::FnOnce<()>>::call_once
37.07 s
gammaloop-nextest-core> note: Some details are omitted, run with `RUST_BACKTRACE=full` for a verbose backtrace.
37.07 s
gammaloop-nextest-core>
43.31 s
gammaloop-nextest-core> ------------
43.31 s
gammaloop-nextest-core> Summary [ 6.929s] 422 tests run: 421 passed , 1 failed , 31 skipped
43.31 s
gammaloop-nextest-core> FAIL [ 0.084s] (370/422) gammalooprs utils::test_utils :: normalization
43.31 s
gammaloop-nextest-core> stdout ---
43.31 s
gammaloop-nextest-core>
43.31 s
gammaloop-nextest-core> running 1 test
43.31 s
gammaloop-nextest-core> ━━━━━━━━━━━━━━━━━━━━━━━━━━━━━━━ Snapshot Summary ━━━━━━━━━━━━━━━━━━━━━━━━━━━━━━━
43.31 s
gammaloop-nextest-core> Snapshot: normalization-2
43.31 s
gammaloop-nextest-core> Source: crates/gammalooprs/src/utils/test_utils.rs:44
43.31 s
gammaloop-nextest-core> ────────────────────────────────────────────────────────────────────────────────
43.31 s
gammaloop-nextest-core> Expression: b.to_canonical_string()
43.31 s
gammaloop-nextest-core> ────────────────────────────────────────────────────────────────────────────────
43.31 s
gammaloop-nextest-core> -old snapshot
43.31 s
gammaloop-nextest-core> +new results
43.31 s
gammaloop-nextest-core> ────────────┬───────────────────────────────────────────────────────────────────
43.31 s
gammaloop-nextest-core> 1 │-gammalooprs::{spenso::rank1,spenso::tensor}::Q(1,spenso::{}::cind(1))
43.31 s
gammaloop-nextest-core> 1 │+gammalooprs::{spenso::rank1,spenso::tensor,spenso::tensor-label:q}::Q(1,spenso::{}::cind(1))
43.31 s
gammaloop-nextest-core> ────────────┴───────────────────────────────────────────────────────────────────
43.31 s
gammaloop-nextest-core> To update snapshots run `cargo insta review`
43.31 s
gammaloop-nextest-core> Stopped on the first failure. Run `cargo insta test` to run all snapshots.
43.31 s
gammaloop-nextest-core> test utils::test_utils::normalization ... FAILED
43.31 s
gammaloop-nextest-core>
43.31 s
gammaloop-nextest-core> failures:
43.31 s
gammaloop-nextest-core>
43.31 s
gammaloop-nextest-core> failures:
43.31 s
gammaloop-nextest-core> utils::test_utils::normalization
43.31 s
gammaloop-nextest-core>
43.31 s
gammaloop-nextest-core> test result: FAILED. 0 passed; 1 failed; 0 ignored; 0 measured; 446 filtered out; finished in 0.07s
43.31 s
gammaloop-nextest-core>
43.31 s
gammaloop-nextest-core> stderr ---
43.31 s
gammaloop-nextest-core>
43.31 s
gammaloop-nextest-core> thread 'utils::test_utils::normalization' (2244) panicked at /nix/store/c7lwckzlfrfsdw1ay0aqz4dpc2j7ry8d-vendor-cargo-deps/c19b7c6f923b580ac259164a89f2577984ad5ab09ee9d583b888f934adbbe8d0/insta-1.47.2/src/runtime.rs:719:13:
43.31 s
gammaloop-nextest-core> snapshot assertion for 'normalization-2' failed in line 44
43.31 s
gammaloop-nextest-core> stack backtrace:
43.31 s
gammaloop-nextest-core> 0: __rustc::rust_begin_unwind
43.31 s
gammaloop-nextest-core> 1: core::panicking::panic_fmt
43.31 s
gammaloop-nextest-core> 2: insta::runtime::assert_snapshot
43.31 s
gammaloop-nextest-core> 3: gammalooprs::utils::test_utils::normalization
43.31 s
gammaloop-nextest-core> 4: <gammalooprs::utils::test_utils::normalization::{closure#0} as core::ops::function::FnOnce<()>>::call_once
43.31 s
gammaloop-nextest-core> note: Some details are omitted, run with `RUST_BACKTRACE=full` for a verbose backtrace.
43.31 s
gammaloop-nextest-core>
43.32 s
gammaloop-nextest-core> error : test run failed
43.34 s
gammaloop-nextest-core>
43.34 s
gammaloop-nextest-core> ========== nextest test summary ==========
43.34 s
gammaloop-nextest-core> report: target/nextest/ci_gammaloop/junit.xml
43.34 s
gammaloop-nextest-core> tests: 422, failures: 1, errors: 0
43.34 s
gammaloop-nextest-core>
43.34 s
gammaloop-nextest-core> 1. gammalooprs::utils::test_utils::normalization
43.35 s
gammaloop-nextest-core> failure: test failure with exit code 101
43.35 s
gammaloop-nextest-core> thread 'utils::test_utils::normalization' (2244) panicked at /nix/store/c7lwckzlfrfsdw1ay0aqz4dpc2j7ry8d-vendor-cargo-deps/c19b7c6f923b580ac259164a89f2577984ad5ab09ee9d583b888f934adbbe8d0/insta-1.47.2/src/runtime.rs:719:13:
43.35 s
gammaloop-nextest-core> snapshot assertion for 'normalization-2' failed in line 44
43.35 s
gammaloop-nextest-core> stack backtrace:
43.35 s
gammaloop-nextest-core> 0: __rustc::rust_begin_unwind
43.35 s
gammaloop-nextest-core> 1: core::panicking::panic_fmt
43.35 s
gammaloop-nextest-core> 2: insta::runtime::assert_snapshot
43.35 s
gammaloop-nextest-core> 3: gammalooprs::utils::test_utils::normalization
43.35 s
gammaloop-nextest-core> 4: <gammalooprs::utils::test_utils::normalization::{closure#0} as core::ops::function::FnOnce<()>>::call_once
43.35 s
gammaloop-nextest-core> note: Some details are omitted, run with `RUST_BACKTRACE=full` for a verbose backtrace.
43.35 s
gammaloop-nextest-core> system-out
43.35 s
gammaloop-nextest-core> running 1 test
43.35 s
gammaloop-nextest-core> ━━━━━━━━━━━━━━━━━━━━━━━━━━━━━━━ Snapshot Summary ━━━━━━━━━━━━━━━━━━━━━━━━━━━━━━━
43.35 s
gammaloop-nextest-core> Snapshot: normalization-2
43.35 s
gammaloop-nextest-core> Source: crates/gammalooprs/src/utils/test_utils.rs:44
43.35 s
gammaloop-nextest-core> ────────────────────────────────────────────────────────────────────────────────
43.35 s
gammaloop-nextest-core> Expression: b.to_canonical_string()
43.35 s
gammaloop-nextest-core> ────────────────────────────────────────────────────────────────────────────────
43.35 s
gammaloop-nextest-core> -old snapshot
43.35 s
gammaloop-nextest-core> +new results
43.35 s
gammaloop-nextest-core> ────────────┬───────────────────────────────────────────────────────────────────
43.35 s
gammaloop-nextest-core> 1 │-gammalooprs::{spenso::rank1,spenso::tensor}::Q(1,spenso::{}::cind(1))
43.35 s
gammaloop-nextest-core> 1 │+gammalooprs::{spenso::rank1,spenso::tensor,spenso::tensor-label:q}::Q(1,spenso::{}::cind(1))
43.35 s
gammaloop-nextest-core> ────────────┴───────────────────────────────────────────────────────────────────
43.35 s
gammaloop-nextest-core> To update snapshots run `cargo insta review`
43.35 s
gammaloop-nextest-core> Stopped on the first failure. Run `cargo insta test` to run all snapshots.
43.35 s
gammaloop-nextest-core> test utils::test_utils::normalization ... FAILED
43.35 s
gammaloop-nextest-core>
43.35 s
gammaloop-nextest-core> failures:
43.35 s
gammaloop-nextest-core>
43.35 s
gammaloop-nextest-core> failures:
43.35 s
gammaloop-nextest-core> utils::test_utils::normalization
43.35 s
gammaloop-nextest-core>
43.35 s
gammaloop-nextest-core> test result: FAILED. 0 passed; 1 failed; 0 ignored; 0 measured; 446 filtered out; finished in 0.07s
43.35 s
gammaloop-nextest-core> system-err
43.35 s
gammaloop-nextest-core> thread 'utils::test_utils::normalization' (2244) panicked at /nix/store/c7lwckzlfrfsdw1ay0aqz4dpc2j7ry8d-vendor-cargo-deps/c19b7c6f923b580ac259164a89f2577984ad5ab09ee9d583b888f934adbbe8d0/insta-1.47.2/src/runtime.rs:719:13:
43.35 s
gammaloop-nextest-core> snapshot assertion for 'normalization-2' failed in line 44
43.35 s
gammaloop-nextest-core> stack backtrace:
43.35 s
gammaloop-nextest-core> 0: __rustc::rust_begin_unwind
43.35 s
gammaloop-nextest-core> 1: core::panicking::panic_fmt
43.35 s
gammaloop-nextest-core> 2: insta::runtime::assert_snapshot
43.35 s
gammaloop-nextest-core> 3: gammalooprs::utils::test_utils::normalization
43.35 s
gammaloop-nextest-core> 4: <gammalooprs::utils::test_utils::normalization::{closure#0} as core::ops::function::FnOnce<()>>::call_once
43.35 s
gammaloop-nextest-core> note: Some details are omitted, run with `RUST_BACKTRACE=full` for a verbose backtrace.
43.35 s
gammaloop-nextest-core> =========================================
43.54 s
[0 built (1 failed ), 1 cerror: Cannot build '/nix/store/qji9l315iamc2bjmaqh0aj7m5903cnd9-gammaloop-nextest-core.drv '.
43.54 s
Reason: builder failed with exit code 100 .
43.54 s
Output paths:
43.54 s
/nix/store/dina7lrcxrgnxy2bb5ddv5k2n1l7833c-gammaloop-nextest-core
43.54 s
Last 176 log lines:
43.54 s
> Extracting 4 binaries (including 2 non-test binaries), 1 build script output directory, and 2 linked paths to /build/source
43.54 s
> Extracted 20 files to /build/source in 0.51s
43.54 s
> ------------
43.54 s
> Nextest run ID 36237d79-c91e-4f15-8e38-e6048fb2bbe0 with nextest profile: ci_gammaloop
43.54 s
> Starting 341 tests across 2 binaries (1 test skipped )
43.54 s
> ------------
43.54 s
> Summary [ 0.459s] 341 tests run: 341 passed , 1 skipped
43.54 s
>
43.54 s
> ========== nextest test summary ==========
43.54 s
> report: target/nextest/ci_gammaloop/junit.xml
43.54 s
> tests: 341, failures: 0, errors: 0
43.54 s
> No failing testcases found.
43.54 s
> =========================================
43.54 s
> Extracting 1 binary and 1 linked path to /build/source
43.54 s
> Extracted 7 files to /build/source in 0.08s
43.54 s
> ------------
43.54 s
> Nextest run ID 38febf65-857f-48a8-bbef-ae43443e5255 with nextest profile: ci_gammaloop
43.54 s
> Starting 19 tests across 1 binary
43.54 s
> ------------
43.54 s
> Summary [ 0.012s] 19 tests run: 19 passed , 0 skipped
43.54 s
>
43.54 s
> ========== nextest test summary ==========
43.54 s
> report: target/nextest/ci_gammaloop/junit.xml
43.54 s
> tests: 19, failures: 0, errors: 0
43.54 s
> No failing testcases found.
43.54 s
> =========================================
43.54 s
> Extracting 1 binary to /build/source
43.54 s
> Extracted 4 files to /build/source in 0.04s
43.54 s
> ------------
43.54 s
> Nextest run ID 65b5ed0e-ee5d-4f05-a96d-869c55301c7c with nextest profile: ci_gammaloop
43.54 s
> Starting 0 tests across 1 binary
43.54 s
> ------------
43.54 s
> Summary [ 0.000s] 0 tests run: 0 passed , 0 skipped
43.54 s
>
43.54 s
> ========== nextest test summary ==========
43.54 s
> report: target/nextest/ci_gammaloop/junit.xml
43.54 s
> tests: 0, failures: 0, errors: 0
43.54 s
> No failing testcases found.
43.54 s
> =========================================
43.54 s
> Extracting 4 binaries (including 1 non-test binary), 1 build script output directory, and 2 linked paths to /build/source
43.54 s
> Extracted 19 files to /build/source in 0.50s
43.54 s
> ------------
43.54 s
> Nextest run ID 7f26fc95-1da4-433d-bece-9d36c2f1e396 with nextest profile: ci_gammaloop
43.54 s
> Starting 422 tests across 3 binaries (31 tests skipped , including 30 tests via profile.ci_gammaloop.default-filter )
43.54 s
> FAIL [ 0.084s] (370/422) gammalooprs utils::test_utils :: normalization
43.54 s
> stdout ---
43.54 s
>
43.54 s
> running 1 test
43.54 s
> ━━━━━━━━━━━━━━━━━━━━━━━━━━━━━━━ Snapshot Summary ━━━━━━━━━━━━━━━━━━━━━━━━━━━━━━━
43.54 s
> Snapshot: normalization-2
43.54 s
> Source: crates/gammalooprs/src/utils/test_utils.rs:44
43.54 s
> ────────────────────────────────────────────────────────────────────────────────
43.54 s
> Expression: b.to_canonical_string()
43.54 s
> ────────────────────────────────────────────────────────────────────────────────
43.54 s
> -old snapshot
43.54 s
> +new results
43.54 s
> ────────────┬───────────────────────────────────────────────────────────────────
43.54 s
> 1 │-gammalooprs::{spenso::rank1,spenso::tensor}::Q(1,spenso::{}::cind(1))
43.54 s
> 1 │+gammalooprs::{spenso::rank1,spenso::tensor,spenso::tensor-label:q}::Q(1,spenso::{}::cind(1))
43.54 s
> ────────────┴───────────────────────────────────────────────────────────────────
43.54 s
> To update snapshots run `cargo insta review`
43.54 s
> Stopped on the first failure. Run `cargo insta test` to run all snapshots.
43.54 s
> test utils::test_utils::normalization ... FAILED
43.54 s
>
43.54 s
> failures:
43.54 s
>
43.54 s
> failures:
43.54 s
> utils::test_utils::normalization
43.54 s
>
43.54 s
> test result: FAILED. 0 passed; 1 failed; 0 ignored; 0 measured; 446 filtered out; finished in 0.07s
43.54 s
>
43.54 s
> stderr ---
43.54 s
>
43.54 s
> thread 'utils::test_utils::normalization' (2244) panicked at /nix/store/c7lwckzlfrfsdw1ay0aqz4dpc2j7ry8d-vendor-cargo-deps/c19b7c6f923b580ac259164a89f2577984ad5ab09ee9d583b888f934adbbe8d0/insta-1.47.2/src/runtime.rs:719:13:
43.54 s
> snapshot assertion for 'normalization-2' failed in line 44
43.54 s
> stack backtrace:
43.54 s
> 0: __rustc::rust_begin_unwind
43.54 s
> 1: core::panicking::panic_fmt
43.54 s
> 2: insta::runtime::assert_snapshot
43.54 s
> 3: gammalooprs::utils::test_utils::normalization
43.54 s
> 4: <gammalooprs::utils::test_utils::normalization::{closure#0} as core::ops::function::FnOnce<()>>::call_once
43.54 s
> note: Some details are omitted, run with `RUST_BACKTRACE=full` for a verbose backtrace.
43.54 s
>
43.54 s
> ------------
43.54 s
> Summary [ 6.929s] 422 tests run: 421 passed , 1 failed , 31 skipped
43.54 s
> FAIL [ 0.084s] (370/422) gammalooprs utils::test_utils :: normalization
43.54 s
> stdout ---
43.54 s
>
43.54 s
> running 1 test
43.54 s
> ━━━━━━━━━━━━━━━━━━━━━━━━━━━━━━━ Snapshot Summary ━━━━━━━━━━━━━━━━━━━━━━━━━━━━━━━
43.54 s
> Snapshot: normalization-2
43.54 s
> Source: crates/gammalooprs/src/utils/test_utils.rs:44
43.54 s
> ────────────────────────────────────────────────────────────────────────────────
43.54 s
> Expression: b.to_canonical_string()
43.54 s
> ────────────────────────────────────────────────────────────────────────────────
43.54 s
> -old snapshot
43.54 s
> +new results
43.54 s
> ────────────┬───────────────────────────────────────────────────────────────────
43.54 s
> 1 │-gammalooprs::{spenso::rank1,spenso::tensor}::Q(1,spenso::{}::cind(1))
43.54 s
> 1 │+gammalooprs::{spenso::rank1,spenso::tensor,spenso::tensor-label:q}::Q(1,spenso::{}::cind(1))
43.54 s
> ────────────┴───────────────────────────────────────────────────────────────────
43.54 s
> To update snapshots run `cargo insta review`
43.54 s
> Stopped on the first failure. Run `cargo insta test` to run all snapshots.
43.54 s
> test utils::test_utils::normalization ... FAILED
43.54 s
>
43.54 s
> failures:
43.54 s
>
43.54 s
> failures:
43.54 s
> utils::test_utils::normalization
43.54 s
>
43.54 s
> test result: FAILED. 0 passed; 1 failed; 0 ignored; 0 measured; 446 filtered out; finished in 0.07s
43.54 s
>
43.54 s
> stderr ---
43.54 s
>
43.54 s
> thread 'utils::test_utils::normalization' (2244) panicked at /nix/store/c7lwckzlfrfsdw1ay0aqz4dpc2j7ry8d-vendor-cargo-deps/c19b7c6f923b580ac259164a89f2577984ad5ab09ee9d583b888f934adbbe8d0/insta-1.47.2/src/runtime.rs:719:13:
43.54 s
> snapshot assertion for 'normalization-2' failed in line 44
43.54 s
> stack backtrace:
43.54 s
> 0: __rustc::rust_begin_unwind
43.54 s
> 1: core::panicking::panic_fmt
43.54 s
> 2: insta::runtime::assert_snapshot
43.54 s
> 3: gammalooprs::utils::test_utils::normalization
43.54 s
> 4: <gammalooprs::utils::test_utils::normalization::{closure#0} as core::ops::function::FnOnce<()>>::call_once
43.54 s
> note: Some details are omitted, run with `RUST_BACKTRACE=full` for a verbose backtrace.
43.54 s
>
43.54 s
> error : test run failed
43.54 s
>
43.54 s
> ========== nextest test summary ==========
43.54 s
> report: target/nextest/ci_gammaloop/junit.xml
43.54 s
> tests: 422, failures: 1, errors: 0
43.54 s
>
43.54 s
> 1. gammalooprs::utils::test_utils::normalization
43.54 s
> failure: test failure with exit code 101
43.54 s
> thread 'utils::test_utils::normalization' (2244) panicked at /nix/store/c7lwckzlfrfsdw1ay0aqz4dpc2j7ry8d-vendor-cargo-deps/c19b7c6f923b580ac259164a89f2577984ad5ab09ee9d583b888f934adbbe8d0/insta-1.47.2/src/runtime.rs:719:13:
43.54 s
> snapshot assertion for 'normalization-2' failed in line 44
43.54 s
> stack backtrace:
43.54 s
> 0: __rustc::rust_begin_unwind
43.54 s
> 1: core::panicking::panic_fmt
43.54 s
> 2: insta::runtime::assert_snapshot
43.54 s
> 3: gammalooprs::utils::test_utils::normalization
43.54 s
> 4: <gammalooprs::utils::test_utils::normalization::{closure#0} as core::ops::function::FnOnce<()>>::call_once
43.54 s
> note: Some details are omitted, run with `RUST_BACKTRACE=full` for a verbose backtrace.
43.54 s
> system-out
43.54 s
> running 1 test
43.54 s
> ━━━━━━━━━━━━━━━━━━━━━━━━━━━━━━━ Snapshot Summary ━━━━━━━━━━━━━━━━━━━━━━━━━━━━━━━
43.54 s
> Snapshot: normalization-2
43.54 s
> Source: crates/gammalooprs/src/utils/test_utils.rs:44
43.54 s
> ────────────────────────────────────────────────────────────────────────────────
43.54 s
> Expression: b.to_canonical_string()
43.54 s
> ────────────────────────────────────────────────────────────────────────────────
43.54 s
> -old snapshot
43.54 s
> +new results
43.54 s
> ────────────┬───────────────────────────────────────────────────────────────────
43.54 s
> 1 │-gammalooprs::{spenso::rank1,spenso::tensor}::Q(1,spenso::{}::cind(1))
43.54 s
> 1 │+gammalooprs::{spenso::rank1,spenso::tensor,spenso::tensor-label:q}::Q(1,spenso::{}::cind(1))
43.54 s
> ────────────┴───────────────────────────────────────────────────────────────────
43.54 s
> To update snapshots run `cargo insta review`
43.54 s
> Stopped on the first failure. Run `cargo insta test` to run all snapshots.
43.54 s
> test utils::test_utils::normalization ... FAILED
43.54 s
>
43.54 s
> failures:
43.54 s
>
43.54 s
> failures:
43.54 s
> utils::test_utils::normalization
43.54 s
>
43.54 s
> test result: FAILED. 0 passed; 1 failed; 0 ignored; 0 measured; 446 filtered out; finished in 0.07s
43.54 s
> system-err
43.54 s
> thread 'utils::test_utils::normalization' (2244) panicked at /nix/store/c7lwckzlfrfsdw1ay0aqz4dpc2j7ry8d-vendor-cargo-deps/c19b7c6f923b580ac259164a89f2577984ad5ab09ee9d583b888f934adbbe8d0/insta-1.47.2/src/runtime.rs:719:13:
43.54 s
> snapshot assertion for 'normalization-2' failed in line 44
43.54 s
> stack backtrace:
43.54 s
> 0: __rustc::rust_begin_unwind
43.54 s
> 1: core::panicking::panic_fmt
43.54 s
> 2: insta::runtime::assert_snapshot
43.54 s
> 3: gammalooprs::utils::test_utils::normalization
43.54 s
> 4: <gammalooprs::utils::test_utils::normalization::{closure#0} as core::ops::function::FnOnce<()>>::call_once
43.54 s
> note: Some details are omitted, run with `RUST_BACKTRACE=full` for a verbose backtrace.
43.54 s
> =========================================
43.54 s
For full logs, run:
43.54 s
nix log /nix/store/qji9l315iamc2bjmaqh0aj7m5903cnd9-gammaloop-nextest-core.drv
43.71 s
Run failed.