test packages.x86_64-linux.nix-ci-check-gammaloop-nextest-core
0.00 s
$ /nix/store/61685rbaxmpigwi3z23i33sv3jyfl70q-coreutils-9.11/bin/timeout --kill-after=15s 7200s /nix/store/wknkybkzrc16r11vk5vrykh4wmw7a353-nix-2.34.8/bin/nix --extra-experimental-features nix-command --extra-experimental-features flakes flake clone git+https://github.com/alphal00p/gammaloop --dest /tmp/nix-ci-worker/stable-pwd/repo/
0.07 s
Cloning into '/tmp/nix-ci-worker/stable-pwd/repo'...
2.96 s
remote: Enumerating objects: 93516
remote: Enumerating objects: 102985, done.
3.07 s
remote: Counting objects: 0% (1/9469)
remote: Counting objects: 1% (95/9469)
remote: Counting objects: 2% (190/9469)
remote: Counting objects: 3% (285/9469)
remote: Counting objects: 4% (379/9469)
remote: Counting objects: 5% (474/9469)
remote: Counting objects: 6% (569/9469)
remote: Counting objects: 7% (663/9469)
remote: Counting objects: 8% (758/9469)
remote: Counting objects: 9% (853/9469)
remote: Counting objects: 10% (947/9469)
remote: Counting objects: 11% (1042/9469)
remote: Counting objects: 12% (1137/9469)
remote: Counting objects: 13% (1231/9469)
remote: Counting objects: 14% (1326/9469)
remote: Counting objects: 15% (1421/9469)
remote: Counting objects: 16% (1516/9469)
remote: Counting objects: 17% (1610/9469)
remote: Counting objects: 18% (1705/9469)
remote: Counting objects: 19% (1800/9469)
remote: Counting objects: 20% (1894/9469)
remote: Counting objects: 21% (1989/9469)
remote: Counting objects: 22% (2084/9469)
remote: Counting objects: 23% (2178/9469)
remote: Counting objects: 24% (2273/9469)
remote: Counting objects: 25% (2368/9469)
remote: Counting objects: 26% (2462/9469)
remote: Counting objects: 27% (2557/9469)
remote: Counting objects: 28% (2652/9469)
remote: Counting objects: 29% (2747/9469)
remote: Counting objects: 30% (2841/9469)
remote: Counting objects: 31% (2936/9469)
remote: Counting objects: 32% (3031/9469)
remote: Counting objects: 33% (3125/9469)
remote: Counting objects: 34% (3220/9469)
remote: Counting objects: 35% (3315/9469)
remote: Counting objects: 36% (3409/9469)
remote: Counting objects: 37% (3504/9469)
remote: Counting objects: 38% (3599/9469)
remote: Counting objects: 39% (3693/9469)
remote: Counting objects: 40% (3788/9469)
remote: Counting objects: 41% (3883/9469)
remote: Counting objects: 42% (3977/9469)
remote: Counting objects: 43% (4072/9469)
remote: Counting objects: 44% (4167/9469)
remote: Counting objects: 45% (4262/9469)
remote: Counting objects: 46% (4356/9469)
remote: Counting objects: 47% (4451/9469)
remote: Counting objects: 48% (4546/9469)
remote: Counting objects: 49% (4640/9469)
remote: Counting objects: 50% (4735/9469)
remote: Counting objects: 51% (4830/9469)
remote: Counting objects: 52% (4924/9469)
remote: Counting objects: 53% (5019/9469)
remote: Counting objects: 54% (5114/9469)
remote: Counting objects: 55% (5208/9469)
remote: Counting objects: 56% (5303/9469)
remote: Counting objects: 57% (5398/9469)
remote: Counting objects: 58% (5493/9469)
remote: Counting objects: 59% (5587/9469)
remote: Counting objects: 60% (5682/9469)
remote: Counting objects: 61% (5777/9469)
remote: Counting objects: 62% (5871/9469)
remote: Counting objects: 63% (5966/9469)
remote: Counting objects: 64% (6061/9469)
remote: Counting objects: 65% (6155/9469)
remote: Counting objects: 66% (6250/9469)
remote: Counting objects: 67% (6345/9469)
remote: Counting objects: 68% (6439/9469)
remote: Counting objects: 69% (6534/9469)
remote: Counting objects: 70% (6629/9469)
remote: Counting objects: 71% (6723/9469)
remote: Counting objects: 72% (6818/9469)
remote: Counting objects: 73% (6913/9469)
remote: Counting objects: 74% (7008/9469)
remote: Counting objects: 75% (7102/9469)
remote: Counting objects: 76% (7197/9469)
remote: Counting objects: 77% (7292/9469)
remote: Counting objects: 78% (7386/9469)
remote: Counting objects: 79% (7481/9469)
remote: Counting objects: 80% (7576/9469)
remote: Counting objects: 81% (7670/9469)
remote: Counting objects: 82% (7765/9469)
remote: Counting objects: 83% (7860/9469)
remote: Counting objects: 84% (7954/9469)
remote: Counting objects: 85% (8049/9469)
remote: Counting objects: 86% (8144/9469)
remote: Counting objects: 87% (8239/9469)
remote: Counting objects: 88% (8333/9469)
remote: Counting objects: 89% (8428/9469)
remote: Counting objects: 90% (8523/9469)
remote: Counting objects: 91% (8617/9469)
remote: Counting objects: 92% (8712/9469)
remote: Counting objects: 93% (8807/9469)
remote: Counting objects: 94% (8901/9469)
remote: Counting objects: 95% (8996/9469)
remote: Counting objects: 96% (9091/9469)
remote: Counting objects: 97% (9185/9469)
remote: Counting objects: 98% (9280/9469)
remote: Counting objects: 99% (9375/9469)
remote: Counting objects: 100% (9469/9469)
remote: Counting objects: 100% (9469/9469), done.
5.56 s
remote: Compressing objects: 0% (1/2044)
remote: Compressing objects: 1% (21/2044)
remote: Compressing objects: 2% (41/2044)
remote: Compressing objects: 3% (62/2044)
remote: Compressing objects: 4% (82/2044)
remote: Compressing objects: 5% (103/2044)
remote: Compressing objects: 6% (123/2044)
remote: Compressing objects: 7% (144/2044)
remote: Compressing objects: 8% (164/2044)
remote: Compressing objects: 8% (166/2044)
remote: Compressing objects: 9% (184/2044)
remote: Compressing objects: 10% (205/2044)
remote: Compressing objects: 11% (225/2044)
remote: Compressing objects: 12% (246/2044)
remote: Compressing objects: 13% (266/2044)
remote: Compressing objects: 14% (287/2044)
remote: Compressing objects: 15% (307/2044)
remote: Compressing objects: 16% (328/2044)
remote: Compressing objects: 17% (348/2044)
remote: Compressing objects: 17% (360/2044)
remote: Compressing objects: 18% (368/2044)
remote: Compressing objects: 19% (389/2044)
remote: Compressing objects: 20% (409/2044)
remote: Compressing objects: 21% (430/2044)
remote: Compressing objects: 22% (450/2044)
remote: Compressing objects: 23% (471/2044)
remote: Compressing objects: 24% (491/2044)
remote: Compressing objects: 25% (511/2044)
remote: Compressing objects: 26% (532/2044)
remote: Compressing objects: 27% (552/2044)
remote: Compressing objects: 28% (573/2044)
remote: Compressing objects: 29% (593/2044)
remote: Compressing objects: 30% (614/2044)
remote: Compressing objects: 31% (634/2044)
remote: Compressing objects: 32% (655/2044)
remote: Compressing objects: 33% (675/2044)
remote: Compressing objects: 34% (695/2044)
remote: Compressing objects: 35% (716/2044)
remote: Compressing objects: 36% (736/2044)
remote: Compressing objects: 37% (757/2044)
remote: Compressing objects: 38% (777/2044)
remote: Compressing objects: 39% (798/2044)
remote: Compressing objects: 40% (818/2044)
remote: Compressing objects: 41% (839/2044)
remote: Compressing objects: 42% (859/2044)
remote: Compressing objects: 43% (879/2044)
remote: Compressing objects: 44% (900/2044)
remote: Compressing objects: 45% (920/2044)
remote: Compressing objects: 46% (941/2044)
remote: Compressing objects: 47% (961/2044)
remote: Compressing objects: 48% (982/2044)
remote: Compressing objects: 49% (1002/2044)
remote: Compressing objects: 50% (1022/2044)
remote: Compressing objects: 51% (1043/2044)
remote: Compressing objects: 52% (1063/2044)
remote: Compressing objects: 53% (1084/2044)
remote: Compressing objects: 54% (1104/2044)
remote: Compressing objects: 55% (1125/2044)
remote: Compressing objects: 56% (1145/2044)
remote: Compressing objects: 57% (1166/2044)
remote: Compressing objects: 58% (1186/2044)
remote: Compressing objects: 59% (1206/2044)
remote: Compressing objects: 60% (1227/2044)
remote: Compressing objects: 61% (1247/2044)
remote: Compressing objects: 62% (1268/2044)
remote: Compressing objects: 63% (1288/2044)
remote: Compressing objects: 64% (1309/2044)
remote: Compressing objects: 65% (1329/2044)
remote: Compressing objects: 66% (1350/2044)
remote: Compressing objects: 67% (1370/2044)
remote: Compressing objects: 68% (1390/2044)
remote: Compressing objects: 69% (1411/2044)
remote: Compressing objects: 70% (1431/2044)
remote: Compressing objects: 71% (1452/2044)
remote: Compressing objects: 72% (1472/2044)
remote: Compressing objects: 73% (1493/2044)
remote: Compressing objects: 74% (1513/2044)
remote: Compressing objects: 75% (1533/2044)
remote: Compressing objects: 76% (1554/2044)
remote: Compressing objects: 77% (1574/2044)
remote: Compressing objects: 78% (1595/2044)
remote: Compressing objects: 79% (1615/2044)
remote: Compressing objects: 80% (1636/2044)
remote: Compressing objects: 81% (1656/2044)
remote: Compressing objects: 82% (1677/2044)
remote: Compressing objects: 83% (1697/2044)
remote: Compressing objects: 84% (1717/2044)
remote: Compressing objects: 85% (1738/2044)
remote: Compressing objects: 86% (1758/2044)
remote: Compressing objects: 87% (1779/2044)
remote: Compressing objects: 88% (1799/2044)
remote: Compressing objects: 89% (1820/2044)
remote: Compressing objects: 90% (1840/2044)
remote: Compressing objects: 91% (1861/2044)
remote: Compressing objects: 92% (1881/2044)
remote: Compressing objects: 93% (1901/2044)
remote: Compressing objects: 94% (1922/2044)
remote: Compressing objects: 95% (1942/2044)
remote: Compressing objects: 96% (1963/2044)
remote: Compressing objects: 97% (1983/2044)
remote: Compressing objects: 98% (2004/2044)
remote: Compressing objects: 99% (2024/2044)
remote: Compressing objects: 100% (2044/2044)
remote: Compressing objects: 100% (2044/2044), done.
19.50 s
Receiving objects: 0% (1/102985)
Receiving objects: 1% (1030/102985)
Receiving objects: 2% (2060/102985)
Receiving objects: 3% (3090/102985)
Receiving objects: 4% (4120/102985)
Receiving objects: 5% (5150/102985)
Receiving objects: 6% (6180/102985)
Receiving objects: 7% (7209/102985), 11.17 MiB | 22.32 MiB/s
Receiving objects: 8% (8239/102985), 11.17 MiB | 22.32 MiB/s
Receiving objects: 9% (9269/102985), 11.17 MiB | 22.32 MiB/s
Receiving objects: 10% (10299/102985), 11.17 MiB | 22.32 MiB/s
Receiving objects: 11% (11329/102985), 11.17 MiB | 22.32 MiB/s
Receiving objects: 12% (12359/102985), 11.17 MiB | 22.32 MiB/s
Receiving objects: 13% (13389/102985), 11.17 MiB | 22.32 MiB/s
Receiving objects: 14% (14418/102985), 11.17 MiB | 22.32 MiB/s
Receiving objects: 15% (15448/102985), 11.17 MiB | 22.32 MiB/s
Receiving objects: 16% (16478/102985), 11.17 MiB | 22.32 MiB/s
Receiving objects: 17% (17508/102985), 11.17 MiB | 22.32 MiB/s
Receiving objects: 18% (18538/102985), 11.17 MiB | 22.32 MiB/s
Receiving objects: 19% (19568/102985), 11.17 MiB | 22.32 MiB/s
Receiving objects: 20% (20597/102985), 11.17 MiB | 22.32 MiB/s
Receiving objects: 21% (21627/102985), 11.17 MiB | 22.32 MiB/s
Receiving objects: 22% (22657/102985), 11.17 MiB | 22.32 MiB/s
Receiving objects: 23% (23687/102985), 11.17 MiB | 22.32 MiB/s
Receiving objects: 24% (24717/102985), 11.17 MiB | 22.32 MiB/s
Receiving objects: 25% (25747/102985), 11.17 MiB | 22.32 MiB/s
Receiving objects: 26% (26777/102985), 11.17 MiB | 22.32 MiB/s
Receiving objects: 27% (27806/102985), 11.17 MiB | 22.32 MiB/s
Receiving objects: 28% (28836/102985), 11.17 MiB | 22.32 MiB/s
Receiving objects: 29% (29866/102985), 11.17 MiB | 22.32 MiB/s
Receiving objects: 30% (30896/102985), 11.17 MiB | 22.32 MiB/s
Receiving objects: 30% (31012/102985), 11.17 MiB | 22.32 MiB/s
Receiving objects: 31% (31926/102985), 27.48 MiB | 27.50 MiB/s
Receiving objects: 32% (32956/102985), 27.48 MiB | 27.50 MiB/s
Receiving objects: 33% (33986/102985), 27.48 MiB | 27.50 MiB/s
Receiving objects: 34% (35015/102985), 27.48 MiB | 27.50 MiB/s
Receiving objects: 35% (36045/102985), 27.48 MiB | 27.50 MiB/s
Receiving objects: 36% (37075/102985), 27.48 MiB | 27.50 MiB/s
Receiving objects: 37% (38105/102985), 42.83 MiB | 28.57 MiB/s
Receiving objects: 38% (39135/102985), 42.83 MiB | 28.57 MiB/s
Receiving objects: 39% (40165/102985), 42.83 MiB | 28.57 MiB/s
Receiving objects: 40% (41194/102985), 42.83 MiB | 28.57 MiB/s
Receiving objects: 41% (42224/102985), 42.83 MiB | 28.57 MiB/s
Receiving objects: 42% (43254/102985), 42.83 MiB | 28.57 MiB/s
Receiving objects: 43% (44284/102985), 42.83 MiB | 28.57 MiB/s
Receiving objects: 44% (45314/102985), 42.83 MiB | 28.57 MiB/s
Receiving objects: 45% (46344/102985), 42.83 MiB | 28.57 MiB/s
Receiving objects: 45% (46381/102985), 57.14 MiB | 28.52 MiB/s
Receiving objects: 46% (47374/102985), 57.14 MiB | 28.52 MiB/s
Receiving objects: 47% (48403/102985), 57.14 MiB | 28.52 MiB/s
Receiving objects: 48% (49433/102985), 64.71 MiB | 25.84 MiB/s
Receiving objects: 49% (50463/102985), 64.71 MiB | 25.84 MiB/s
Receiving objects: 49% (51343/102985), 64.71 MiB | 25.84 MiB/s
Receiving objects: 50% (51493/102985), 73.85 MiB | 24.58 MiB/s
Receiving objects: 51% (52523/102985), 73.85 MiB | 24.58 MiB/s
Receiving objects: 52% (53553/102985), 73.85 MiB | 24.58 MiB/s
Receiving objects: 53% (54583/102985), 73.85 MiB | 24.58 MiB/s
Receiving objects: 54% (55612/102985), 73.85 MiB | 24.58 MiB/s
Receiving objects: 55% (56642/102985), 73.85 MiB | 24.58 MiB/s
Receiving objects: 56% (57672/102985), 82.66 MiB | 23.59 MiB/s
Receiving objects: 56% (57988/102985), 92.32 MiB | 23.04 MiB/s
Receiving objects: 57% (58702/102985), 92.32 MiB | 23.04 MiB/s
Receiving objects: 58% (59732/102985), 92.32 MiB | 23.04 MiB/s
Receiving objects: 59% (60762/102985), 101.22 MiB | 22.46 MiB/s
Receiving objects: 60% (61791/102985), 101.22 MiB | 22.46 MiB/s
Receiving objects: 60% (61860/102985), 101.22 MiB | 22.46 MiB/s
Receiving objects: 61% (62821/102985), 110.17 MiB | 21.97 MiB/s
Receiving objects: 62% (63851/102985), 110.17 MiB | 21.97 MiB/s
Receiving objects: 62% (64215/102985), 135.24 MiB | 20.48 MiB/s
Receiving objects: 63% (64881/102985), 151.79 MiB | 21.00 MiB/s
Receiving objects: 64% (65911/102985), 151.79 MiB | 21.00 MiB/s
Receiving objects: 64% (66247/102985), 168.20 MiB | 22.96 MiB/s
Receiving objects: 64% (66274/102985), 200.38 MiB | 26.12 MiB/s
Receiving objects: 64% (66392/102985), 233.05 MiB | 29.27 MiB/s
Receiving objects: 64% (66493/102985), 249.07 MiB | 30.83 MiB/s
Receiving objects: 65% (66941/102985), 281.20 MiB | 32.43 MiB/s
Receiving objects: 66% (67971/102985), 281.20 MiB | 32.43 MiB/s
Receiving objects: 66% (68582/102985), 281.20 MiB | 32.43 MiB/s
Receiving objects: 67% (69000/102985), 297.41 MiB | 32.35 MiB/s
Receiving objects: 68% (70030/102985), 297.41 MiB | 32.35 MiB/s
Receiving objects: 69% (71060/102985), 297.41 MiB | 32.35 MiB/s
Receiving objects: 70% (72090/102985), 297.41 MiB | 32.35 MiB/s
Receiving objects: 71% (73120/102985), 297.41 MiB | 32.35 MiB/s
Receiving objects: 72% (74150/102985), 313.20 MiB | 32.21 MiB/s
Receiving objects: 73% (75180/102985), 313.20 MiB | 32.21 MiB/s
Receiving objects: 74% (76209/102985), 313.20 MiB | 32.21 MiB/s
Receiving objects: 75% (77239/102985), 313.20 MiB | 32.21 MiB/s
Receiving objects: 76% (78269/102985), 313.20 MiB | 32.21 MiB/s
Receiving objects: 77% (79299/102985), 313.20 MiB | 32.21 MiB/s
Receiving objects: 78% (80329/102985), 313.20 MiB | 32.21 MiB/s
Receiving objects: 79% (81359/102985), 313.20 MiB | 32.21 MiB/s
Receiving objects: 80% (82388/102985), 313.20 MiB | 32.21 MiB/s
Receiving objects: 80% (83051/102985), 313.20 MiB | 32.21 MiB/s
Receiving objects: 81% (83418/102985), 313.20 MiB | 32.21 MiB/s
Receiving objects: 82% (84448/102985), 329.44 MiB | 32.45 MiB/s
Receiving objects: 83% (85478/102985), 329.44 MiB | 32.45 MiB/s
Receiving objects: 83% (86466/102985), 361.52 MiB | 32.20 MiB/s
Receiving objects: 84% (86508/102985), 361.52 MiB | 32.20 MiB/s
Receiving objects: 85% (87538/102985), 361.52 MiB | 32.20 MiB/s
Receiving objects: 86% (88568/102985), 361.52 MiB | 32.20 MiB/s
Receiving objects: 87% (89597/102985), 361.52 MiB | 32.20 MiB/s
Receiving objects: 88% (90627/102985), 361.52 MiB | 32.20 MiB/s
Receiving objects: 89% (91657/102985), 361.52 MiB | 32.20 MiB/s
Receiving objects: 90% (92687/102985), 361.52 MiB | 32.20 MiB/s
Receiving objects: 91% (93717/102985), 377.64 MiB | 32.12 MiB/s
Receiving objects: 92% (94747/102985), 377.64 MiB | 32.12 MiB/s
Receiving objects: 93% (95777/102985), 377.64 MiB | 32.12 MiB/s
Receiving objects: 94% (96806/102985), 377.64 MiB | 32.12 MiB/s
Receiving objects: 95% (97836/102985), 377.64 MiB | 32.12 MiB/s
Receiving objects: 96% (98866/102985), 377.64 MiB | 32.12 MiB/s
Receiving objects: 97% (99896/102985), 377.64 MiB | 32.12 MiB/s
Receiving objects: 98% (100926/102985), 377.64 MiB | 32.12 MiB/s
Receiving objects: 99% (101956/102985), 377.64 MiB | 32.12 MiB/s
remote: Total 102985 (delta 8188), reused 7477 (delta 7419), pack-reused 93516 (from 4)
19.50 s
Receiving objects: 100% (102985/102985), 377.64 MiB | 32.12 MiB/s
Receiving objects: 100% (102985/102985), 391.54 MiB | 28.09 MiB/s, done.
22.63 s
Resolving deltas: 0% (0/67457)
Resolving deltas: 1% (676/67457)
Resolving deltas: 2% (1350/67457)
Resolving deltas: 3% (2024/67457)
Resolving deltas: 4% (2700/67457)
Resolving deltas: 5% (3373/67457)
Resolving deltas: 6% (4048/67457)
Resolving deltas: 7% (4722/67457)
Resolving deltas: 8% (5398/67457)
Resolving deltas: 9% (6073/67457)
Resolving deltas: 10% (6746/67457)
Resolving deltas: 11% (7421/67457)
Resolving deltas: 12% (8096/67457)
Resolving deltas: 13% (8770/67457)
Resolving deltas: 14% (9444/67457)
Resolving deltas: 15% (10119/67457)
Resolving deltas: 16% (10794/67457)
Resolving deltas: 17% (11468/67457)
Resolving deltas: 18% (12144/67457)
Resolving deltas: 19% (12817/67457)
Resolving deltas: 20% (13492/67457)
Resolving deltas: 21% (14167/67457)
Resolving deltas: 22% (14841/67457)
Resolving deltas: 23% (15516/67457)
Resolving deltas: 24% (16190/67457)
Resolving deltas: 25% (16865/67457)
Resolving deltas: 26% (17539/67457)
Resolving deltas: 27% (18214/67457)
Resolving deltas: 28% (18888/67457)
Resolving deltas: 29% (19563/67457)
Resolving deltas: 30% (20238/67457)
Resolving deltas: 31% (20912/67457)
Resolving deltas: 32% (21587/67457)
Resolving deltas: 33% (22261/67457)
Resolving deltas: 34% (22936/67457)
Resolving deltas: 35% (23611/67457)
Resolving deltas: 36% (24285/67457)
Resolving deltas: 37% (24960/67457)
Resolving deltas: 38% (25634/67457)
Resolving deltas: 39% (26309/67457)
Resolving deltas: 40% (26983/67457)
Resolving deltas: 41% (27658/67457)
Resolving deltas: 42% (28332/67457)
Resolving deltas: 43% (29007/67457)
Resolving deltas: 44% (29682/67457)
Resolving deltas: 45% (30356/67457)
Resolving deltas: 46% (31031/67457)
Resolving deltas: 47% (31705/67457)
Resolving deltas: 47% (31822/67457)
Resolving deltas: 48% (32380/67457)
Resolving deltas: 49% (33054/67457)
Resolving deltas: 50% (33729/67457)
Resolving deltas: 51% (34404/67457)
Resolving deltas: 52% (35078/67457)
Resolving deltas: 53% (35753/67457)
Resolving deltas: 54% (36427/67457)
Resolving deltas: 55% (37102/67457)
Resolving deltas: 56% (37776/67457)
Resolving deltas: 57% (38451/67457)
Resolving deltas: 58% (39126/67457)
Resolving deltas: 59% (39800/67457)
Resolving deltas: 60% (40475/67457)
Resolving deltas: 61% (41149/67457)
Resolving deltas: 62% (41824/67457)
Resolving deltas: 63% (42498/67457)
Resolving deltas: 64% (43173/67457)
Resolving deltas: 65% (43848/67457)
Resolving deltas: 66% (44522/67457)
Resolving deltas: 66% (44527/67457)
Resolving deltas: 67% (45198/67457)
Resolving deltas: 68% (45871/67457)
Resolving deltas: 69% (46546/67457)
Resolving deltas: 70% (47220/67457)
Resolving deltas: 71% (47895/67457)
Resolving deltas: 72% (48570/67457)
Resolving deltas: 73% (49244/67457)
Resolving deltas: 74% (49919/67457)
Resolving deltas: 75% (50593/67457)
Resolving deltas: 76% (51268/67457)
Resolving deltas: 77% (51942/67457)
Resolving deltas: 78% (52617/67457)
Resolving deltas: 79% (53292/67457)
Resolving deltas: 80% (53966/67457)
Resolving deltas: 81% (54641/67457)
Resolving deltas: 82% (55315/67457)
Resolving deltas: 83% (55990/67457)
Resolving deltas: 84% (56664/67457)
Resolving deltas: 85% (57339/67457)
Resolving deltas: 86% (58014/67457)
Resolving deltas: 87% (58688/67457)
Resolving deltas: 88% (59363/67457)
Resolving deltas: 89% (60037/67457)
Resolving deltas: 90% (60712/67457)
Resolving deltas: 91% (61386/67457)
Resolving deltas: 92% (62061/67457)
Resolving deltas: 93% (62736/67457)
Resolving deltas: 94% (63410/67457)
Resolving deltas: 95% (64085/67457)
Resolving deltas: 96% (64760/67457)
Resolving deltas: 96% (64833/67457)
Resolving deltas: 97% (65434/67457)
Resolving deltas: 98% (66108/67457)
Resolving deltas: 99% (66783/67457)
Resolving deltas: 100% (67457/67457)
Resolving deltas: 100% (67457/67457), done.
23.45 s
Fetching commit 0ea2140565027f7541293396e9053cd67c4c0a1e for feynkit ...
23.45 s
$ /nix/store/5vpcfsdx1lcnlb2y4k7xyc74shp5qwbh-git-2.54.0/bin/git fetch origin 0ea2140565027f7541293396e9053cd67c4c0a1e
24.01 s
From https://github.com/alphal00p/gammaloop
24.01 s
* branch 0ea2140565027f7541293396e9053cd67c4c0a1e -> FETCH_HEAD
24.05 s
$ /nix/store/61685rbaxmpigwi3z23i33sv3jyfl70q-coreutils-9.11/bin/timeout --kill-after=15s 7200s /nix/store/5vpcfsdx1lcnlb2y4k7xyc74shp5qwbh-git-2.54.0/bin/git -c advice.detachedHead=false checkout 0ea2140565027f7541293396e9053cd67c4c0a1e
24.34 s
HEAD is now at 0ea214056 unify Python generation arguments and return empty results
24.36 s
$ /nix/store/61685rbaxmpigwi3z23i33sv3jyfl70q-coreutils-9.11/bin/timeout --kill-after=15s 7200s /nix/store/wknkybkzrc16r11vk5vrykh4wmw7a353-nix-2.34.8/bin/nix --extra-experimental-features nix-command --extra-experimental-features flakes --log-format internal-json run .#packages.x86_64-linux.nix-ci-check-gammaloop-nextest-core --print-build-logs
24.59 s
warning: ignoring untrusted flake configuration setting 'extra-substituters'.
24.59 s
Pass '--accept-flake-config' to trust it
24.59 s
warning: ignoring untrusted flake configuration setting 'extra-trusted-public-keys'.
24.59 s
Pass '--accept-flake-config' to trust it
30.21 s
30.52 s
evaluating derivation 'gdo you want to allow configuration setting 'extra-substituters' to be set to 'https://cache.nix-ci.com ' (y/N)? do you want to permanently mark this value as untrusted (y/N)? warning: ignoring untrusted flake configuration setting 'extra-substituters'.
30.52 s
Pass '--accept-flake-config' to trust it
30.52 s
do you want to allow configuration setting 'extra-trusted-public-keys' to be set to 'nix-ci:g3xV5BDTLtIBZr/A00IU1x0EtKKlb7YLgBN2SgYgM6A= ' (y/N)? do you want to permanently mark this value as untrusted (y/N)? warning: ignoring untrusted flake configuration setting 'extra-trusted-public-keys'.
30.52 s
Pass '--accept-flake-config' to trust it
35.58 s
copying '/nix/store/rx7m
evaluating derivation 'g
copying '/nix/store/rx7m
evaluating derivation 'g
copying '/nix/store/rx7m
evaluating derivation 'g
copying '/nix/store/rx7m
evaluating derivation 'g
copying '/nix/store/rx7m
evaluating derivation 'g
copying '/nix/store/rx7m
evaluating derivation 'g
[0 /1 built]
[1 /0 /1 built] building g gammaloop-nextest-core> Extracting 4 binaries (including 2 non-test binaries), 1 build script output directory, and 2 linked paths to /build/source
36.13 s
gammaloop-nextest-core> Extracted 20 files to /build/source in 0.55s
36.20 s
gammaloop-nextest-core> ------------
36.20 s
gammaloop-nextest-core> Nextest run ID b8f3ce6c-f0bc-4a96-8480-73d78eb414b7 with nextest profile: ci_gammaloop
36.20 s
gammaloop-nextest-core> Starting 341 tests across 2 binaries (1 test skipped )
37.04 s
gammaloop-nextest-core> ------------
37.04 s
gammaloop-nextest-core> Summary [ 0.842s] 341 tests run: 341 passed , 1 skipped
37.08 s
gammaloop-nextest-core>
37.08 s
gammaloop-nextest-core> ========== nextest test summary ==========
37.08 s
gammaloop-nextest-core> report: target/nextest/ci_gammaloop/junit.xml
37.08 s
gammaloop-nextest-core> tests: 341, failures: 0, errors: 0
37.08 s
gammaloop-nextest-core> No failing testcases found.
37.08 s
gammaloop-nextest-core> =========================================
37.09 s
gammaloop-nextest-core> Extracting 1 binary and 1 linked path to /build/source
37.16 s
gammaloop-nextest-core> Extracted 7 files to /build/source in 0.07s
37.17 s
gammaloop-nextest-core> ------------
37.17 s
gammaloop-nextest-core> Nextest run ID a7c9b534-a6d4-4099-8915-23f6c435e949 with nextest profile: ci_gammaloop
37.17 s
gammaloop-nextest-core> Starting 19 tests across 1 binary
37.18 s
gammaloop-nextest-core> ------------
37.18 s
gammaloop-nextest-core> Summary [ 0.011s] 19 tests run: 19 passed , 0 skipped
37.21 s
gammaloop-nextest-core>
37.21 s
gammaloop-nextest-core> ========== nextest test summary ==========
37.21 s
gammaloop-nextest-core> report: target/nextest/ci_gammaloop/junit.xml
37.21 s
gammaloop-nextest-core> tests: 19, failures: 0, errors: 0
37.21 s
gammaloop-nextest-core> No failing testcases found.
37.21 s
gammaloop-nextest-core> =========================================
37.23 s
gammaloop-nextest-core> Extracting 1 binary to /build/source
37.26 s
gammaloop-nextest-core> Extracted 4 files to /build/source in 0.04s
37.27 s
gammaloop-nextest-core> ------------
37.27 s
gammaloop-nextest-core> Nextest run ID faac05a7-d33e-4068-ba65-dd349042fb44 with nextest profile: ci_gammaloop
37.27 s
gammaloop-nextest-core> Starting 0 tests across 1 binary
37.27 s
gammaloop-nextest-core> ------------
37.27 s
gammaloop-nextest-core> Summary [ 0.000s] 0 tests run: 0 passed , 0 skipped
37.30 s
gammaloop-nextest-core>
37.30 s
gammaloop-nextest-core> ========== nextest test summary ==========
37.30 s
gammaloop-nextest-core> report: target/nextest/ci_gammaloop/junit.xml
37.30 s
gammaloop-nextest-core> tests: 0, failures: 0, errors: 0
37.30 s
gammaloop-nextest-core> No failing testcases found.
37.30 s
gammaloop-nextest-core> =========================================
37.31 s
gammaloop-nextest-core> Extracting 4 binaries (including 1 non-test binary), 1 build script output directory, and 2 linked paths to /build/source
37.81 s
gammaloop-nextest-core> Extracted 19 files to /build/source in 0.49s
37.82 s
gammaloop-nextest-core> ------------
37.82 s
gammaloop-nextest-core> Nextest run ID ac51fd71-6a06-4685-8cf7-5897f24c863e with nextest profile: ci_gammaloop
37.82 s
gammaloop-nextest-core> Starting 422 tests across 3 binaries (31 tests skipped , including 30 tests via profile.ci_gammaloop.default-filter )
38.51 s
gammaloop-nextest-core> FAIL [ 0.074s] (371/422) gammalooprs utils::test_utils :: normalization
38.51 s
gammaloop-nextest-core> stdout ---
38.51 s
gammaloop-nextest-core>
38.51 s
gammaloop-nextest-core> running 1 test
38.51 s
gammaloop-nextest-core> ━━━━━━━━━━━━━━━━━━━━━━━━━━━━━━━ Snapshot Summary ━━━━━━━━━━━━━━━━━━━━━━━━━━━━━━━
38.51 s
gammaloop-nextest-core> Snapshot: normalization-2
38.51 s
gammaloop-nextest-core> Source: crates/gammalooprs/src/utils/test_utils.rs:44
38.51 s
gammaloop-nextest-core> ────────────────────────────────────────────────────────────────────────────────
38.51 s
gammaloop-nextest-core> Expression: b.to_canonical_string()
38.51 s
gammaloop-nextest-core> ────────────────────────────────────────────────────────────────────────────────
38.51 s
gammaloop-nextest-core> -old snapshot
38.51 s
gammaloop-nextest-core> +new results
38.51 s
gammaloop-nextest-core> ────────────┬───────────────────────────────────────────────────────────────────
38.51 s
gammaloop-nextest-core> 1 │-gammalooprs::{spenso::rank1,spenso::tensor}::Q(1,spenso::{}::cind(1))
38.51 s
gammaloop-nextest-core> 1 │+gammalooprs::{spenso::rank1,spenso::tensor,spenso::tensor-label:q}::Q(1,spenso::{}::cind(1))
38.51 s
gammaloop-nextest-core> ────────────┴───────────────────────────────────────────────────────────────────
38.51 s
gammaloop-nextest-core> To update snapshots run `cargo insta review`
38.51 s
gammaloop-nextest-core> Stopped on the first failure. Run `cargo insta test` to run all snapshots.
38.51 s
gammaloop-nextest-core> test utils::test_utils::normalization ... FAILED
38.51 s
gammaloop-nextest-core>
38.51 s
gammaloop-nextest-core> failures:
38.51 s
gammaloop-nextest-core>
38.51 s
gammaloop-nextest-core> failures:
38.51 s
gammaloop-nextest-core> utils::test_utils::normalization
38.51 s
gammaloop-nextest-core>
38.51 s
gammaloop-nextest-core> test result: FAILED. 0 passed; 1 failed; 0 ignored; 0 measured; 446 filtered out; finished in 0.06s
38.51 s
gammaloop-nextest-core>
38.51 s
gammaloop-nextest-core> stderr ---
38.51 s
gammaloop-nextest-core>
38.51 s
gammaloop-nextest-core> thread 'utils::test_utils::normalization' (2250) panicked at /nix/store/c7lwckzlfrfsdw1ay0aqz4dpc2j7ry8d-vendor-cargo-deps/c19b7c6f923b580ac259164a89f2577984ad5ab09ee9d583b888f934adbbe8d0/insta-1.47.2/src/runtime.rs:719:13:
38.51 s
gammaloop-nextest-core> snapshot assertion for 'normalization-2' failed in line 44
38.51 s
gammaloop-nextest-core> stack backtrace:
38.51 s
gammaloop-nextest-core> 0: __rustc::rust_begin_unwind
38.51 s
gammaloop-nextest-core> 1: core::panicking::panic_fmt
38.51 s
gammaloop-nextest-core> 2: insta::runtime::assert_snapshot
38.51 s
gammaloop-nextest-core> 3: gammalooprs::utils::test_utils::normalization
38.51 s
gammaloop-nextest-core> 4: <gammalooprs::utils::test_utils::normalization::{closure#0} as core::ops::function::FnOnce<()>>::call_once
38.51 s
gammaloop-nextest-core> note: Some details are omitted, run with `RUST_BACKTRACE=full` for a verbose backtrace.
38.51 s
gammaloop-nextest-core>
44.68 s
gammaloop-nextest-core> ------------
44.68 s
gammaloop-nextest-core> Summary [ 6.856s] 422 tests run: 421 passed , 1 failed , 31 skipped
44.68 s
gammaloop-nextest-core> FAIL [ 0.074s] (371/422) gammalooprs utils::test_utils :: normalization
44.68 s
gammaloop-nextest-core> stdout ---
44.68 s
gammaloop-nextest-core>
44.68 s
gammaloop-nextest-core> running 1 test
44.68 s
gammaloop-nextest-core> ━━━━━━━━━━━━━━━━━━━━━━━━━━━━━━━ Snapshot Summary ━━━━━━━━━━━━━━━━━━━━━━━━━━━━━━━
44.68 s
gammaloop-nextest-core> Snapshot: normalization-2
44.68 s
gammaloop-nextest-core> Source: crates/gammalooprs/src/utils/test_utils.rs:44
44.68 s
gammaloop-nextest-core> ────────────────────────────────────────────────────────────────────────────────
44.68 s
gammaloop-nextest-core> Expression: b.to_canonical_string()
44.68 s
gammaloop-nextest-core> ────────────────────────────────────────────────────────────────────────────────
44.68 s
gammaloop-nextest-core> -old snapshot
44.68 s
gammaloop-nextest-core> +new results
44.68 s
gammaloop-nextest-core> ────────────┬───────────────────────────────────────────────────────────────────
44.68 s
gammaloop-nextest-core> 1 │-gammalooprs::{spenso::rank1,spenso::tensor}::Q(1,spenso::{}::cind(1))
44.68 s
gammaloop-nextest-core> 1 │+gammalooprs::{spenso::rank1,spenso::tensor,spenso::tensor-label:q}::Q(1,spenso::{}::cind(1))
44.68 s
gammaloop-nextest-core> ────────────┴───────────────────────────────────────────────────────────────────
44.68 s
gammaloop-nextest-core> To update snapshots run `cargo insta review`
44.68 s
gammaloop-nextest-core> Stopped on the first failure. Run `cargo insta test` to run all snapshots.
44.68 s
gammaloop-nextest-core> test utils::test_utils::normalization ... FAILED
44.68 s
gammaloop-nextest-core>
44.68 s
gammaloop-nextest-core> failures:
44.68 s
gammaloop-nextest-core>
44.68 s
gammaloop-nextest-core> failures:
44.68 s
gammaloop-nextest-core> utils::test_utils::normalization
44.68 s
gammaloop-nextest-core>
44.68 s
gammaloop-nextest-core> test result: FAILED. 0 passed; 1 failed; 0 ignored; 0 measured; 446 filtered out; finished in 0.06s
44.68 s
gammaloop-nextest-core>
44.68 s
gammaloop-nextest-core> stderr ---
44.68 s
gammaloop-nextest-core>
44.68 s
gammaloop-nextest-core> thread 'utils::test_utils::normalization' (2250) panicked at /nix/store/c7lwckzlfrfsdw1ay0aqz4dpc2j7ry8d-vendor-cargo-deps/c19b7c6f923b580ac259164a89f2577984ad5ab09ee9d583b888f934adbbe8d0/insta-1.47.2/src/runtime.rs:719:13:
44.68 s
gammaloop-nextest-core> snapshot assertion for 'normalization-2' failed in line 44
44.68 s
gammaloop-nextest-core> stack backtrace:
44.68 s
gammaloop-nextest-core> 0: __rustc::rust_begin_unwind
44.68 s
gammaloop-nextest-core> 1: core::panicking::panic_fmt
44.68 s
gammaloop-nextest-core> 2: insta::runtime::assert_snapshot
44.68 s
gammaloop-nextest-core> 3: gammalooprs::utils::test_utils::normalization
44.68 s
gammaloop-nextest-core> 4: <gammalooprs::utils::test_utils::normalization::{closure#0} as core::ops::function::FnOnce<()>>::call_once
44.68 s
gammaloop-nextest-core> note: Some details are omitted, run with `RUST_BACKTRACE=full` for a verbose backtrace.
44.68 s
gammaloop-nextest-core>
44.69 s
gammaloop-nextest-core> error : test run failed
44.71 s
gammaloop-nextest-core>
44.71 s
gammaloop-nextest-core> ========== nextest test summary ==========
44.71 s
gammaloop-nextest-core> report: target/nextest/ci_gammaloop/junit.xml
44.71 s
gammaloop-nextest-core> tests: 422, failures: 1, errors: 0
44.71 s
gammaloop-nextest-core>
44.71 s
gammaloop-nextest-core> 1. gammalooprs::utils::test_utils::normalization
44.71 s
gammaloop-nextest-core> failure: test failure with exit code 101
44.71 s
gammaloop-nextest-core> thread 'utils::test_utils::normalization' (2250) panicked at /nix/store/c7lwckzlfrfsdw1ay0aqz4dpc2j7ry8d-vendor-cargo-deps/c19b7c6f923b580ac259164a89f2577984ad5ab09ee9d583b888f934adbbe8d0/insta-1.47.2/src/runtime.rs:719:13:
44.71 s
gammaloop-nextest-core> snapshot assertion for 'normalization-2' failed in line 44
44.71 s
gammaloop-nextest-core> stack backtrace:
44.71 s
gammaloop-nextest-core> 0: __rustc::rust_begin_unwind
44.71 s
gammaloop-nextest-core> 1: core::panicking::panic_fmt
44.71 s
gammaloop-nextest-core> 2: insta::runtime::assert_snapshot
44.71 s
gammaloop-nextest-core> 3: gammalooprs::utils::test_utils::normalization
44.71 s
gammaloop-nextest-core> 4: <gammalooprs::utils::test_utils::normalization::{closure#0} as core::ops::function::FnOnce<()>>::call_once
44.71 s
gammaloop-nextest-core> note: Some details are omitted, run with `RUST_BACKTRACE=full` for a verbose backtrace.
44.71 s
gammaloop-nextest-core> system-out
44.71 s
gammaloop-nextest-core> running 1 test
44.71 s
gammaloop-nextest-core> ━━━━━━━━━━━━━━━━━━━━━━━━━━━━━━━ Snapshot Summary ━━━━━━━━━━━━━━━━━━━━━━━━━━━━━━━
44.71 s
gammaloop-nextest-core> Snapshot: normalization-2
44.71 s
gammaloop-nextest-core> Source: crates/gammalooprs/src/utils/test_utils.rs:44
44.71 s
gammaloop-nextest-core> ────────────────────────────────────────────────────────────────────────────────
44.71 s
gammaloop-nextest-core> Expression: b.to_canonical_string()
44.71 s
gammaloop-nextest-core> ────────────────────────────────────────────────────────────────────────────────
44.71 s
gammaloop-nextest-core> -old snapshot
44.71 s
gammaloop-nextest-core> +new results
44.71 s
gammaloop-nextest-core> ────────────┬───────────────────────────────────────────────────────────────────
44.72 s
gammaloop-nextest-core> 1 │-gammalooprs::{spenso::rank1,spenso::tensor}::Q(1,spenso::{}::cind(1))
44.72 s
gammaloop-nextest-core> 1 │+gammalooprs::{spenso::rank1,spenso::tensor,spenso::tensor-label:q}::Q(1,spenso::{}::cind(1))
44.72 s
gammaloop-nextest-core> ────────────┴───────────────────────────────────────────────────────────────────
44.72 s
gammaloop-nextest-core> To update snapshots run `cargo insta review`
44.72 s
gammaloop-nextest-core> Stopped on the first failure. Run `cargo insta test` to run all snapshots.
44.72 s
gammaloop-nextest-core> test utils::test_utils::normalization ... FAILED
44.72 s
gammaloop-nextest-core>
44.72 s
gammaloop-nextest-core> failures:
44.72 s
gammaloop-nextest-core>
44.72 s
gammaloop-nextest-core> failures:
44.72 s
gammaloop-nextest-core> utils::test_utils::normalization
44.72 s
gammaloop-nextest-core>
44.72 s
gammaloop-nextest-core> test result: FAILED. 0 passed; 1 failed; 0 ignored; 0 measured; 446 filtered out; finished in 0.06s
44.72 s
gammaloop-nextest-core> system-err
44.72 s
gammaloop-nextest-core> thread 'utils::test_utils::normalization' (2250) panicked at /nix/store/c7lwckzlfrfsdw1ay0aqz4dpc2j7ry8d-vendor-cargo-deps/c19b7c6f923b580ac259164a89f2577984ad5ab09ee9d583b888f934adbbe8d0/insta-1.47.2/src/runtime.rs:719:13:
44.72 s
gammaloop-nextest-core> snapshot assertion for 'normalization-2' failed in line 44
44.72 s
gammaloop-nextest-core> stack backtrace:
44.72 s
gammaloop-nextest-core> 0: __rustc::rust_begin_unwind
44.72 s
gammaloop-nextest-core> 1: core::panicking::panic_fmt
44.72 s
gammaloop-nextest-core> 2: insta::runtime::assert_snapshot
44.72 s
gammaloop-nextest-core> 3: gammalooprs::utils::test_utils::normalization
44.72 s
gammaloop-nextest-core> 4: <gammalooprs::utils::test_utils::normalization::{closure#0} as core::ops::function::FnOnce<()>>::call_once
44.72 s
gammaloop-nextest-core> note: Some details are omitted, run with `RUST_BACKTRACE=full` for a verbose backtrace.
44.72 s
gammaloop-nextest-core> =========================================
44.88 s
error: Cannot build '/nix/store/qji9l315iamc2bjmaqh0aj7m5903cnd9-gammaloop-nextest-core.drv '.
44.88 s
Reason: builder failed with exit code 100 .
44.88 s
Output paths:
44.88 s
/nix/store/dina7lrcxrgnxy2bb5ddv5k2n1l7833c-gammaloop-nextest-core
44.88 s
Last 176 log lines:
44.88 s
> Extracting 4 binaries (including 2 non-test binaries), 1 build script output directory, and 2 linked paths to /build/source
44.88 s
> Extracted 20 files to /build/source in 0.55s
44.88 s
> ------------
44.88 s
> Nextest run ID b8f3ce6c-f0bc-4a96-8480-73d78eb414b7 with nextest profile: ci_gammaloop
44.88 s
> Starting 341 tests across 2 binaries (1 test skipped )
44.88 s
> ------------
44.88 s
> Summary [ 0.842s] 341 tests run: 341 passed , 1 skipped
44.88 s
>
44.88 s
> ========== nextest test summary ==========
44.88 s
> report: target/nextest/ci_gammaloop/junit.xml
44.88 s
> tests: 341, failures: 0, errors: 0
44.88 s
> No failing testcases found.
44.88 s
> =========================================
44.88 s
> Extracting 1 binary and 1 linked path to /build/source
44.88 s
> Extracted 7 files to /build/source in 0.07s
44.88 s
> ------------
44.88 s
> Nextest run ID a7c9b534-a6d4-4099-8915-23f6c435e949 with nextest profile: ci_gammaloop
44.88 s
> Starting 19 tests across 1 binary
44.88 s
> ------------
44.88 s
> Summary [ 0.011s] 19 tests run: 19 passed , 0 skipped
44.88 s
>
44.88 s
> ========== nextest test summary ==========
44.88 s
> report: target/nextest/ci_gammaloop/junit.xml
44.88 s
> tests: 19, failures: 0, errors: 0
44.88 s
> No failing testcases found.
44.88 s
> =========================================
44.88 s
> Extracting 1 binary to /build/source
44.88 s
> Extracted 4 files to /build/source in 0.04s
44.88 s
> ------------
44.88 s
> Nextest run ID faac05a7-d33e-4068-ba65-dd349042fb44 with nextest profile: ci_gammaloop
44.88 s
> Starting 0 tests across 1 binary
44.88 s
> ------------
44.88 s
> Summary [ 0.000s] 0 tests run: 0 passed , 0 skipped
44.88 s
>
44.88 s
> ========== nextest test summary ==========
44.88 s
> report: target/nextest/ci_gammaloop/junit.xml
44.88 s
> tests: 0, failures: 0, errors: 0
44.88 s
> No failing testcases found.
44.88 s
> =========================================
44.88 s
> Extracting 4 binaries (including 1 non-test binary), 1 build script output directory, and 2 linked paths to /build/source
44.88 s
> Extracted 19 files to /build/source in 0.49s
44.88 s
> ------------
44.88 s
> Nextest run ID ac51fd71-6a06-4685-8cf7-5897f24c863e with nextest profile: ci_gammaloop
44.88 s
> Starting 422 tests across 3 binaries (31 tests skipped , including 30 tests via profile.ci_gammaloop.default-filter )
44.88 s
> FAIL [ 0.074s] (371/422) gammalooprs utils::test_utils :: normalization
44.88 s
> stdout ---
44.88 s
>
44.88 s
> running 1 test
44.88 s
> ━━━━━━━━━━━━━━━━━━━━━━━━━━━━━━━ Snapshot Summary ━━━━━━━━━━━━━━━━━━━━━━━━━━━━━━━
44.88 s
> Snapshot: normalization-2
44.88 s
> Source: crates/gammalooprs/src/utils/test_utils.rs:44
44.88 s
> ────────────────────────────────────────────────────────────────────────────────
44.88 s
> Expression: b.to_canonical_string()
44.88 s
> ────────────────────────────────────────────────────────────────────────────────
44.88 s
> -old snapshot
44.88 s
> +new results
44.88 s
> ────────────┬───────────────────────────────────────────────────────────────────
44.88 s
> 1 │-gammalooprs::{spenso::rank1,spenso::tensor}::Q(1,spenso::{}::cind(1))
44.88 s
> 1 │+gammalooprs::{spenso::rank1,spenso::tensor,spenso::tensor-label:q}::Q(1,spenso::{}::cind(1))
44.88 s
> ────────────┴───────────────────────────────────────────────────────────────────
44.88 s
> To update snapshots run `cargo insta review`
44.88 s
> Stopped on the first failure. Run `cargo insta test` to run all snapshots.
44.88 s
> test utils::test_utils::normalization ... FAILED
44.88 s
>
44.88 s
> failures:
44.88 s
>
44.88 s
> failures:
44.88 s
> utils::test_utils::normalization
44.88 s
>
44.88 s
> test result: FAILED. 0 passed; 1 failed; 0 ignored; 0 measured; 446 filtered out; finished in 0.06s
44.88 s
>
44.88 s
> stderr ---
44.88 s
>
44.88 s
> thread 'utils::test_utils::normalization' (2250) panicked at /nix/store/c7lwckzlfrfsdw1ay0aqz4dpc2j7ry8d-vendor-cargo-deps/c19b7c6f923b580ac259164a89f2577984ad5ab09ee9d583b888f934adbbe8d0/insta-1.47.2/src/runtime.rs:719:13:
44.88 s
> snapshot assertion for 'normalization-2' failed in line 44
44.88 s
> stack backtrace:
44.88 s
> 0: __rustc::rust_begin_unwind
44.88 s
> 1: core::panicking::panic_fmt
44.88 s
> 2: insta::runtime::assert_snapshot
44.88 s
> 3: gammalooprs::utils::test_utils::normalization
44.88 s
> 4: <gammalooprs::utils::test_utils::normalization::{closure#0} as core::ops::function::FnOnce<()>>::call_once
44.88 s
> note: Some details are omitted, run with `RUST_BACKTRACE=full` for a verbose backtrace.
44.88 s
>
44.88 s
> ------------
44.88 s
> Summary [ 6.856s] 422 tests run: 421 passed , 1 failed , 31 skipped
44.88 s
> FAIL [ 0.074s] (371/422) gammalooprs utils::test_utils :: normalization
44.88 s
> stdout ---
44.88 s
>
44.88 s
> running 1 test
44.88 s
> ━━━━━━━━━━━━━━━━━━━━━━━━━━━━━━━ Snapshot Summary ━━━━━━━━━━━━━━━━━━━━━━━━━━━━━━━
44.88 s
> Snapshot: normalization-2
44.88 s
> Source: crates/gammalooprs/src/utils/test_utils.rs:44
44.88 s
> ────────────────────────────────────────────────────────────────────────────────
44.88 s
> Expression: b.to_canonical_string()
44.88 s
> ────────────────────────────────────────────────────────────────────────────────
44.88 s
> -old snapshot
44.88 s
> +new results
44.88 s
> ────────────┬───────────────────────────────────────────────────────────────────
44.88 s
> 1 │-gammalooprs::{spenso::rank1,spenso::tensor}::Q(1,spenso::{}::cind(1))
44.88 s
> 1 │+gammalooprs::{spenso::rank1,spenso::tensor,spenso::tensor-label:q}::Q(1,spenso::{}::cind(1))
44.88 s
> ────────────┴───────────────────────────────────────────────────────────────────
44.88 s
> To update snapshots run `cargo insta review`
44.88 s
> Stopped on the first failure. Run `cargo insta test` to run all snapshots.
44.88 s
> test utils::test_utils::normalization ... FAILED
44.88 s
>
44.88 s
> failures:
44.88 s
>
44.88 s
> failures:
44.88 s
> utils::test_utils::normalization
44.88 s
>
44.88 s
> test result: FAILED. 0 passed; 1 failed; 0 ignored; 0 measured; 446 filtered out; finished in 0.06s
44.88 s
>
44.88 s
> stderr ---
44.88 s
>
44.88 s
> thread 'utils::test_utils::normalization' (2250) panicked at /nix/store/c7lwckzlfrfsdw1ay0aqz4dpc2j7ry8d-vendor-cargo-deps/c19b7c6f923b580ac259164a89f2577984ad5ab09ee9d583b888f934adbbe8d0/insta-1.47.2/src/runtime.rs:719:13:
44.88 s
> snapshot assertion for 'normalization-2' failed in line 44
44.88 s
> stack backtrace:
44.88 s
> 0: __rustc::rust_begin_unwind
44.88 s
> 1: core::panicking::panic_fmt
44.88 s
> 2: insta::runtime::assert_snapshot
44.88 s
> 3: gammalooprs::utils::test_utils::normalization
44.88 s
> 4: <gammalooprs::utils::test_utils::normalization::{closure#0} as core::ops::function::FnOnce<()>>::call_once
44.88 s
> note: Some details are omitted, run with `RUST_BACKTRACE=full` for a verbose backtrace.
44.88 s
>
44.88 s
> error : test run failed
44.88 s
>
44.88 s
> ========== nextest test summary ==========
44.88 s
> report: target/nextest/ci_gammaloop/junit.xml
44.88 s
> tests: 422, failures: 1, errors: 0
44.88 s
>
44.88 s
> 1. gammalooprs::utils::test_utils::normalization
44.88 s
> failure: test failure with exit code 101
44.88 s
> thread 'utils::test_utils::normalization' (2250) panicked at /nix/store/c7lwckzlfrfsdw1ay0aqz4dpc2j7ry8d-vendor-cargo-deps/c19b7c6f923b580ac259164a89f2577984ad5ab09ee9d583b888f934adbbe8d0/insta-1.47.2/src/runtime.rs:719:13:
44.88 s
> snapshot assertion for 'normalization-2' failed in line 44
44.88 s
> stack backtrace:
44.88 s
> 0: __rustc::rust_begin_unwind
44.88 s
> 1: core::panicking::panic_fmt
44.88 s
> 2: insta::runtime::assert_snapshot
44.88 s
> 3: gammalooprs::utils::test_utils::normalization
44.88 s
> 4: <gammalooprs::utils::test_utils::normalization::{closure#0} as core::ops::function::FnOnce<()>>::call_once
44.88 s
> note: Some details are omitted, run with `RUST_BACKTRACE=full` for a verbose backtrace.
44.88 s
> system-out
44.88 s
> running 1 test
44.88 s
> ━━━━━━━━━━━━━━━━━━━━━━━━━━━━━━━ Snapshot Summary ━━━━━━━━━━━━━━━━━━━━━━━━━━━━━━━
44.88 s
> Snapshot: normalization-2
44.88 s
> Source: crates/gammalooprs/src/utils/test_utils.rs:44
44.88 s
> ────────────────────────────────────────────────────────────────────────────────
44.88 s
> Expression: b.to_canonical_string()
44.88 s
> ────────────────────────────────────────────────────────────────────────────────
44.88 s
> -old snapshot
44.88 s
> +new results
44.88 s
> ────────────┬───────────────────────────────────────────────────────────────────
44.88 s
> 1 │-gammalooprs::{spenso::rank1,spenso::tensor}::Q(1,spenso::{}::cind(1))
44.88 s
> 1 │+gammalooprs::{spenso::rank1,spenso::tensor,spenso::tensor-label:q}::Q(1,spenso::{}::cind(1))
44.88 s
> ────────────┴───────────────────────────────────────────────────────────────────
44.88 s
> To update snapshots run `cargo insta review`
44.88 s
> Stopped on the first failure. Run `cargo insta test` to run all snapshots.
44.88 s
> test utils::test_utils::normalization ... FAILED
44.88 s
>
44.88 s
> failures:
44.88 s
>
44.88 s
> failures:
44.88 s
> utils::test_utils::normalization
44.88 s
>
44.88 s
> test result: FAILED. 0 passed; 1 failed; 0 ignored; 0 measured; 446 filtered out; finished in 0.06s
44.88 s
> system-err
44.88 s
> thread 'utils::test_utils::normalization' (2250) panicked at /nix/store/c7lwckzlfrfsdw1ay0aqz4dpc2j7ry8d-vendor-cargo-deps/c19b7c6f923b580ac259164a89f2577984ad5ab09ee9d583b888f934adbbe8d0/insta-1.47.2/src/runtime.rs:719:13:
44.88 s
> snapshot assertion for 'normalization-2' failed in line 44
44.88 s
> stack backtrace:
44.88 s
> 0: __rustc::rust_begin_unwind
44.88 s
> 1: core::panicking::panic_fmt
44.88 s
> 2: insta::runtime::assert_snapshot
44.88 s
> 3: gammalooprs::utils::test_utils::normalization
44.88 s
> 4: <gammalooprs::utils::test_utils::normalization::{closure#0} as core::ops::function::FnOnce<()>>::call_once
44.88 s
> note: Some details are omitted, run with `RUST_BACKTRACE=full` for a verbose backtrace.
44.88 s
> =========================================
44.88 s
For full logs, run:
44.88 s
nix log /nix/store/qji9l315iamc2bjmaqh0aj7m5903cnd9-gammaloop-nextest-core.drv
45.06 s
[0 built (1 failed )]Run failed.