test packages.x86_64-linux.nix-ci-check-gammaloop-nextest-docs
0.00 s
$ /nix/store/61685rbaxmpigwi3z23i33sv3jyfl70q-coreutils-9.11/bin/timeout --kill-after=15s 7200s /nix/store/wknkybkzrc16r11vk5vrykh4wmw7a353-nix-2.34.8/bin/nix --extra-experimental-features nix-command --extra-experimental-features flakes flake clone git+https://github.com/alphal00p/gammaloop --dest /tmp/nix-ci-worker/stable-pwd/repo/
0.06 s
Cloning into '/tmp/nix-ci-worker/stable-pwd/repo'...
0.82 s
remote: Enumerating objects: 103497, done.
0.95 s
remote: Counting objects: 0% (1/10120)
remote: Counting objects: 1% (102/10120)
remote: Counting objects: 2% (203/10120)
remote: Counting objects: 3% (304/10120)
remote: Counting objects: 4% (405/10120)
remote: Counting objects: 5% (506/10120)
remote: Counting objects: 6% (608/10120)
remote: Counting objects: 7% (709/10120)
remote: Counting objects: 8% (810/10120)
remote: Counting objects: 9% (911/10120)
remote: Counting objects: 10% (1012/10120)
remote: Counting objects: 11% (1114/10120)
remote: Counting objects: 12% (1215/10120)
remote: Counting objects: 13% (1316/10120)
remote: Counting objects: 14% (1417/10120)
remote: Counting objects: 15% (1518/10120)
remote: Counting objects: 16% (1620/10120)
remote: Counting objects: 17% (1721/10120)
remote: Counting objects: 18% (1822/10120)
remote: Counting objects: 19% (1923/10120)
remote: Counting objects: 20% (2024/10120)
remote: Counting objects: 21% (2126/10120)
remote: Counting objects: 22% (2227/10120)
remote: Counting objects: 23% (2328/10120)
remote: Counting objects: 24% (2429/10120)
remote: Counting objects: 25% (2530/10120)
remote: Counting objects: 26% (2632/10120)
remote: Counting objects: 27% (2733/10120)
remote: Counting objects: 28% (2834/10120)
remote: Counting objects: 29% (2935/10120)
remote: Counting objects: 30% (3036/10120)
remote: Counting objects: 31% (3138/10120)
remote: Counting objects: 32% (3239/10120)
remote: Counting objects: 33% (3340/10120)
remote: Counting objects: 34% (3441/10120)
remote: Counting objects: 35% (3542/10120)
remote: Counting objects: 36% (3644/10120)
remote: Counting objects: 37% (3745/10120)
remote: Counting objects: 38% (3846/10120)
remote: Counting objects: 39% (3947/10120)
remote: Counting objects: 40% (4048/10120)
remote: Counting objects: 41% (4150/10120)
remote: Counting objects: 42% (4251/10120)
remote: Counting objects: 43% (4352/10120)
remote: Counting objects: 44% (4453/10120)
remote: Counting objects: 45% (4554/10120)
remote: Counting objects: 46% (4656/10120)
remote: Counting objects: 47% (4757/10120)
remote: Counting objects: 48% (4858/10120)
remote: Counting objects: 49% (4959/10120)
remote: Counting objects: 50% (5060/10120)
remote: Counting objects: 51% (5162/10120)
remote: Counting objects: 52% (5263/10120)
remote: Counting objects: 53% (5364/10120)
remote: Counting objects: 54% (5465/10120)
remote: Counting objects: 55% (5566/10120)
remote: Counting objects: 56% (5668/10120)
remote: Counting objects: 57% (5769/10120)
remote: Counting objects: 58% (5870/10120)
remote: Counting objects: 59% (5971/10120)
remote: Counting objects: 60% (6072/10120)
remote: Counting objects: 61% (6174/10120)
remote: Counting objects: 62% (6275/10120)
remote: Counting objects: 63% (6376/10120)
remote: Counting objects: 64% (6477/10120)
remote: Counting objects: 65% (6578/10120)
remote: Counting objects: 66% (6680/10120)
remote: Counting objects: 67% (6781/10120)
remote: Counting objects: 68% (6882/10120)
remote: Counting objects: 69% (6983/10120)
remote: Counting objects: 70% (7084/10120)
remote: Counting objects: 71% (7186/10120)
remote: Counting objects: 72% (7287/10120)
remote: Counting objects: 73% (7388/10120)
remote: Counting objects: 74% (7489/10120)
remote: Counting objects: 75% (7590/10120)
remote: Counting objects: 76% (7692/10120)
remote: Counting objects: 77% (7793/10120)
remote: Counting objects: 78% (7894/10120)
remote: Counting objects: 79% (7995/10120)
remote: Counting objects: 80% (8096/10120)
remote: Counting objects: 81% (8198/10120)
remote: Counting objects: 82% (8299/10120)
remote: Counting objects: 83% (8400/10120)
remote: Counting objects: 84% (8501/10120)
remote: Counting objects: 85% (8602/10120)
remote: Counting objects: 86% (8704/10120)
remote: Counting objects: 87% (8805/10120)
remote: Counting objects: 88% (8906/10120)
remote: Counting objects: 89% (9007/10120)
remote: Counting objects: 90% (9108/10120)
remote: Counting objects: 91% (9210/10120)
remote: Counting objects: 92% (9311/10120)
remote: Counting objects: 93% (9412/10120)
remote: Counting objects: 94% (9513/10120)
remote: Counting objects: 95% (9614/10120)
remote: Counting objects: 96% (9716/10120)
remote: Counting objects: 97% (9817/10120)
remote: Counting objects: 98% (9918/10120)
remote: Counting objects: 99% (10019/10120)
remote: Counting objects: 100% (10120/10120)
remote: Counting objects: 100% (10120/10120), done.
3.08 s
remote: Compressing objects: 0% (1/2291)
remote: Compressing objects: 1% (23/2291)
remote: Compressing objects: 2% (46/2291)
remote: Compressing objects: 3% (69/2291)
remote: Compressing objects: 4% (92/2291)
remote: Compressing objects: 5% (115/2291)
remote: Compressing objects: 6% (138/2291)
remote: Compressing objects: 7% (161/2291)
remote: Compressing objects: 8% (184/2291)
remote: Compressing objects: 9% (207/2291)
remote: Compressing objects: 10% (230/2291)
remote: Compressing objects: 10% (238/2291)
remote: Compressing objects: 11% (253/2291)
remote: Compressing objects: 12% (275/2291)
remote: Compressing objects: 13% (298/2291)
remote: Compressing objects: 14% (321/2291)
remote: Compressing objects: 15% (344/2291)
remote: Compressing objects: 16% (367/2291)
remote: Compressing objects: 17% (390/2291)
remote: Compressing objects: 18% (413/2291)
remote: Compressing objects: 19% (436/2291)
remote: Compressing objects: 20% (459/2291)
remote: Compressing objects: 21% (482/2291)
remote: Compressing objects: 22% (505/2291)
remote: Compressing objects: 23% (527/2291)
remote: Compressing objects: 23% (545/2291)
remote: Compressing objects: 24% (550/2291)
remote: Compressing objects: 25% (573/2291)
remote: Compressing objects: 26% (596/2291)
remote: Compressing objects: 27% (619/2291)
remote: Compressing objects: 28% (642/2291)
remote: Compressing objects: 29% (665/2291)
remote: Compressing objects: 30% (688/2291)
remote: Compressing objects: 31% (711/2291)
remote: Compressing objects: 32% (734/2291)
remote: Compressing objects: 33% (757/2291)
remote: Compressing objects: 34% (779/2291)
remote: Compressing objects: 35% (802/2291)
remote: Compressing objects: 36% (825/2291)
remote: Compressing objects: 37% (848/2291)
remote: Compressing objects: 38% (871/2291)
remote: Compressing objects: 39% (894/2291)
remote: Compressing objects: 40% (917/2291)
remote: Compressing objects: 41% (940/2291)
remote: Compressing objects: 42% (963/2291)
remote: Compressing objects: 43% (986/2291)
remote: Compressing objects: 44% (1009/2291)
remote: Compressing objects: 45% (1031/2291)
remote: Compressing objects: 46% (1054/2291)
remote: Compressing objects: 47% (1077/2291)
remote: Compressing objects: 48% (1100/2291)
remote: Compressing objects: 49% (1123/2291)
remote: Compressing objects: 50% (1146/2291)
remote: Compressing objects: 51% (1169/2291)
remote: Compressing objects: 52% (1192/2291)
remote: Compressing objects: 53% (1215/2291)
remote: Compressing objects: 54% (1238/2291)
remote: Compressing objects: 55% (1261/2291)
remote: Compressing objects: 56% (1283/2291)
remote: Compressing objects: 57% (1306/2291)
remote: Compressing objects: 58% (1329/2291)
remote: Compressing objects: 59% (1352/2291)
remote: Compressing objects: 60% (1375/2291)
remote: Compressing objects: 61% (1398/2291)
remote: Compressing objects: 62% (1421/2291)
remote: Compressing objects: 63% (1444/2291)
remote: Compressing objects: 64% (1467/2291)
remote: Compressing objects: 65% (1490/2291)
remote: Compressing objects: 66% (1513/2291)
remote: Compressing objects: 67% (1535/2291)
remote: Compressing objects: 68% (1558/2291)
remote: Compressing objects: 69% (1581/2291)
remote: Compressing objects: 70% (1604/2291)
remote: Compressing objects: 71% (1627/2291)
remote: Compressing objects: 72% (1650/2291)
remote: Compressing objects: 73% (1673/2291)
remote: Compressing objects: 74% (1696/2291)
remote: Compressing objects: 75% (1719/2291)
remote: Compressing objects: 76% (1742/2291)
remote: Compressing objects: 77% (1765/2291)
remote: Compressing objects: 78% (1787/2291)
remote: Compressing objects: 79% (1810/2291)
remote: Compressing objects: 80% (1833/2291)
remote: Compressing objects: 81% (1856/2291)
remote: Compressing objects: 82% (1879/2291)
remote: Compressing objects: 83% (1902/2291)
remote: Compressing objects: 84% (1925/2291)
remote: Compressing objects: 85% (1948/2291)
remote: Compressing objects: 86% (1971/2291)
remote: Compressing objects: 87% (1994/2291)
remote: Compressing objects: 88% (2017/2291)
remote: Compressing objects: 89% (2039/2291)
remote: Compressing objects: 90% (2062/2291)
remote: Compressing objects: 91% (2085/2291)
remote: Compressing objects: 92% (2108/2291)
remote: Compressing objects: 93% (2131/2291)
remote: Compressing objects: 94% (2154/2291)
remote: Compressing objects: 95% (2177/2291)
remote: Compressing objects: 96% (2200/2291)
remote: Compressing objects: 97% (2223/2291)
remote: Compressing objects: 98% (2246/2291)
remote: Compressing objects: 99% (2269/2291)
remote: Compressing objects: 100% (2291/2291)
remote: Compressing objects: 100% (2291/2291), done.
15.98 s
Receiving objects: 0% (1/103497)
Receiving objects: 1% (1035/103497)
Receiving objects: 2% (2070/103497)
Receiving objects: 3% (3105/103497)
Receiving objects: 4% (4140/103497)
Receiving objects: 5% (5175/103497), 9.20 MiB | 18.42 MiB/s
Receiving objects: 6% (6210/103497), 9.20 MiB | 18.42 MiB/s
Receiving objects: 7% (7245/103497), 9.20 MiB | 18.42 MiB/s
Receiving objects: 8% (8280/103497), 9.20 MiB | 18.42 MiB/s
Receiving objects: 9% (9315/103497), 9.20 MiB | 18.42 MiB/s
Receiving objects: 10% (10350/103497), 9.20 MiB | 18.42 MiB/s
Receiving objects: 11% (11385/103497), 9.20 MiB | 18.42 MiB/s
Receiving objects: 12% (12420/103497), 9.20 MiB | 18.42 MiB/s
Receiving objects: 13% (13455/103497), 9.20 MiB | 18.42 MiB/s
Receiving objects: 14% (14490/103497), 9.20 MiB | 18.42 MiB/s
Receiving objects: 15% (15525/103497), 9.20 MiB | 18.42 MiB/s
Receiving objects: 16% (16560/103497), 9.20 MiB | 18.42 MiB/s
Receiving objects: 17% (17595/103497), 9.20 MiB | 18.42 MiB/s
Receiving objects: 18% (18630/103497), 9.20 MiB | 18.42 MiB/s
Receiving objects: 19% (19665/103497), 9.20 MiB | 18.42 MiB/s
Receiving objects: 20% (20700/103497), 9.20 MiB | 18.42 MiB/s
Receiving objects: 21% (21735/103497), 9.20 MiB | 18.42 MiB/s
Receiving objects: 22% (22770/103497), 9.20 MiB | 18.42 MiB/s
Receiving objects: 23% (23805/103497), 9.20 MiB | 18.42 MiB/s
Receiving objects: 24% (24840/103497), 9.20 MiB | 18.42 MiB/s
Receiving objects: 25% (25875/103497), 9.20 MiB | 18.42 MiB/s
Receiving objects: 26% (26910/103497), 9.20 MiB | 18.42 MiB/s
Receiving objects: 27% (27945/103497), 9.20 MiB | 18.42 MiB/s
Receiving objects: 28% (28980/103497), 9.20 MiB | 18.42 MiB/s
Receiving objects: 29% (30015/103497), 9.20 MiB | 18.42 MiB/s
Receiving objects: 30% (31050/103497), 9.20 MiB | 18.42 MiB/s
Receiving objects: 30% (31426/103497), 27.68 MiB | 27.72 MiB/s
Receiving objects: 31% (32085/103497), 27.68 MiB | 27.72 MiB/s
Receiving objects: 32% (33120/103497), 27.68 MiB | 27.72 MiB/s
Receiving objects: 33% (34155/103497), 27.68 MiB | 27.72 MiB/s
Receiving objects: 34% (35189/103497), 27.68 MiB | 27.72 MiB/s
Receiving objects: 35% (36224/103497), 27.68 MiB | 27.72 MiB/s
Receiving objects: 36% (37259/103497), 27.68 MiB | 27.72 MiB/s
Receiving objects: 37% (38294/103497), 42.50 MiB | 28.33 MiB/s
Receiving objects: 38% (39329/103497), 42.50 MiB | 28.33 MiB/s
Receiving objects: 39% (40364/103497), 42.50 MiB | 28.33 MiB/s
Receiving objects: 40% (41399/103497), 42.50 MiB | 28.33 MiB/s
Receiving objects: 41% (42434/103497), 42.50 MiB | 28.33 MiB/s
Receiving objects: 42% (43469/103497), 42.50 MiB | 28.33 MiB/s
Receiving objects: 43% (44504/103497), 42.50 MiB | 28.33 MiB/s
Receiving objects: 44% (45539/103497), 42.50 MiB | 28.33 MiB/s
Receiving objects: 44% (46418/103497), 57.82 MiB | 28.87 MiB/s
Receiving objects: 45% (46574/103497), 57.82 MiB | 28.87 MiB/s
Receiving objects: 46% (47609/103497), 57.82 MiB | 28.87 MiB/s
Receiving objects: 47% (48644/103497), 57.82 MiB | 28.87 MiB/s
Receiving objects: 48% (49679/103497), 57.82 MiB | 28.87 MiB/s
Receiving objects: 49% (50714/103497), 57.82 MiB | 28.87 MiB/s
Receiving objects: 50% (51749/103497), 72.96 MiB | 29.11 MiB/s
Receiving objects: 51% (52784/103497), 72.96 MiB | 29.11 MiB/s
Receiving objects: 52% (53819/103497), 72.96 MiB | 29.11 MiB/s
Receiving objects: 53% (54854/103497), 72.96 MiB | 29.11 MiB/s
Receiving objects: 54% (55889/103497), 72.96 MiB | 29.11 MiB/s
Receiving objects: 55% (56924/103497), 72.96 MiB | 29.11 MiB/s
Receiving objects: 55% (57056/103497), 72.96 MiB | 29.11 MiB/s
Receiving objects: 55% (57103/103497), 103.92 MiB | 29.55 MiB/s
Receiving objects: 55% (57227/103497), 149.76 MiB | 31.09 MiB/s
Receiving objects: 56% (57959/103497), 149.76 MiB | 31.09 MiB/s
Receiving objects: 57% (58994/103497), 165.19 MiB | 30.39 MiB/s
Receiving objects: 58% (60029/103497), 165.19 MiB | 30.39 MiB/s
Receiving objects: 59% (61064/103497), 165.19 MiB | 30.39 MiB/s
Receiving objects: 60% (62099/103497), 165.19 MiB | 30.39 MiB/s
Receiving objects: 61% (63134/103497), 165.19 MiB | 30.39 MiB/s
Receiving objects: 61% (63767/103497), 165.19 MiB | 30.39 MiB/s
Receiving objects: 62% (64169/103497), 165.19 MiB | 30.39 MiB/s
Receiving objects: 63% (65204/103497), 180.75 MiB | 30.54 MiB/s
Receiving objects: 64% (66239/103497), 180.75 MiB | 30.54 MiB/s
Receiving objects: 65% (67274/103497), 180.75 MiB | 30.54 MiB/s
Receiving objects: 66% (68309/103497), 180.75 MiB | 30.54 MiB/s
Receiving objects: 67% (69343/103497), 180.75 MiB | 30.54 MiB/s
Receiving objects: 68% (70378/103497), 180.75 MiB | 30.54 MiB/s
Receiving objects: 69% (71413/103497), 180.75 MiB | 30.54 MiB/s
Receiving objects: 70% (72448/103497), 180.75 MiB | 30.54 MiB/s
Receiving objects: 71% (73483/103497), 196.21 MiB | 30.57 MiB/s
Receiving objects: 72% (74518/103497), 196.21 MiB | 30.57 MiB/s
Receiving objects: 73% (75553/103497), 196.21 MiB | 30.57 MiB/s
Receiving objects: 73% (75885/103497), 196.21 MiB | 30.57 MiB/s
Receiving objects: 74% (76588/103497), 211.64 MiB | 30.64 MiB/s
Receiving objects: 75% (77623/103497), 227.19 MiB | 30.69 MiB/s
Receiving objects: 76% (78658/103497), 227.19 MiB | 30.69 MiB/s
Receiving objects: 77% (79693/103497), 227.19 MiB | 30.69 MiB/s
Receiving objects: 77% (80685/103497), 227.19 MiB | 30.69 MiB/s
Receiving objects: 78% (80728/103497), 227.19 MiB | 30.69 MiB/s
Receiving objects: 79% (81763/103497), 242.78 MiB | 30.72 MiB/s
Receiving objects: 80% (82798/103497), 242.78 MiB | 30.72 MiB/s
Receiving objects: 81% (83833/103497), 242.78 MiB | 30.72 MiB/s
Receiving objects: 81% (84190/103497), 258.32 MiB | 30.74 MiB/s
Receiving objects: 81% (84515/103497), 304.49 MiB | 30.84 MiB/s
Receiving objects: 82% (84868/103497), 304.49 MiB | 30.84 MiB/s
Receiving objects: 83% (85903/103497), 319.86 MiB | 30.82 MiB/s
Receiving objects: 84% (86938/103497), 319.86 MiB | 30.82 MiB/s
Receiving objects: 84% (87968/103497), 335.26 MiB | 30.83 MiB/s
Receiving objects: 85% (87973/103497), 335.26 MiB | 30.83 MiB/s
Receiving objects: 86% (89008/103497), 335.26 MiB | 30.83 MiB/s
Receiving objects: 87% (90043/103497), 335.26 MiB | 30.83 MiB/s
Receiving objects: 88% (91078/103497), 335.26 MiB | 30.83 MiB/s
Receiving objects: 88% (91430/103497), 350.84 MiB | 30.88 MiB/s
Receiving objects: 89% (92113/103497), 366.48 MiB | 30.91 MiB/s
Receiving objects: 90% (93148/103497), 381.83 MiB | 30.85 MiB/s
Receiving objects: 91% (94183/103497), 381.83 MiB | 30.85 MiB/s
Receiving objects: 92% (95218/103497), 381.83 MiB | 30.85 MiB/s
Receiving objects: 93% (96253/103497), 381.83 MiB | 30.85 MiB/s
Receiving objects: 94% (97288/103497), 381.83 MiB | 30.85 MiB/s
Receiving objects: 95% (98323/103497), 381.83 MiB | 30.85 MiB/s
Receiving objects: 96% (99358/103497), 381.83 MiB | 30.85 MiB/s
Receiving objects: 97% (100393/103497), 381.83 MiB | 30.85 MiB/s
Receiving objects: 98% (101428/103497), 381.83 MiB | 30.85 MiB/s
Receiving objects: 99% (102463/103497), 381.83 MiB | 30.85 MiB/s
remote: Total 103497 (delta 8623), reused 8045 (delta 7804), pack-reused 93377 (from 4)
15.98 s
Receiving objects: 100% (103497/103497), 381.83 MiB | 30.85 MiB/s
Receiving objects: 100% (103497/103497), 391.99 MiB | 30.44 MiB/s, done.
17.07 s
Resolving deltas: 0% (0/67811)
Resolving deltas: 1% (679/67811)
Resolving deltas: 2% (1357/67811)
Resolving deltas: 3% (2035/67811)
Resolving deltas: 4% (2713/67811)
Resolving deltas: 5% (3391/67811)
Resolving deltas: 6% (4069/67811)
Resolving deltas: 7% (4747/67811)
Resolving deltas: 8% (5425/67811)
Resolving deltas: 9% (6105/67811)
Resolving deltas: 10% (6782/67811)
Resolving deltas: 11% (7461/67811)
Resolving deltas: 12% (8138/67811)
Resolving deltas: 13% (8816/67811)
Resolving deltas: 14% (9494/67811)
Resolving deltas: 15% (10172/67811)
Resolving deltas: 16% (10850/67811)
Resolving deltas: 17% (11529/67811)
Resolving deltas: 18% (12206/67811)
Resolving deltas: 19% (12885/67811)
Resolving deltas: 20% (13563/67811)
Resolving deltas: 21% (14241/67811)
Resolving deltas: 22% (14919/67811)
Resolving deltas: 23% (15597/67811)
Resolving deltas: 24% (16275/67811)
Resolving deltas: 25% (16954/67811)
Resolving deltas: 26% (17631/67811)
Resolving deltas: 27% (18310/67811)
Resolving deltas: 28% (18988/67811)
Resolving deltas: 29% (19666/67811)
Resolving deltas: 30% (20344/67811)
Resolving deltas: 31% (21022/67811)
Resolving deltas: 32% (21700/67811)
Resolving deltas: 33% (22378/67811)
Resolving deltas: 34% (23057/67811)
Resolving deltas: 35% (23734/67811)
Resolving deltas: 36% (24412/67811)
Resolving deltas: 37% (25091/67811)
Resolving deltas: 38% (25769/67811)
Resolving deltas: 39% (26447/67811)
Resolving deltas: 40% (27125/67811)
Resolving deltas: 41% (27804/67811)
Resolving deltas: 42% (28482/67811)
Resolving deltas: 43% (29159/67811)
Resolving deltas: 44% (29837/67811)
Resolving deltas: 45% (30515/67811)
Resolving deltas: 46% (31195/67811)
Resolving deltas: 47% (31872/67811)
Resolving deltas: 48% (32550/67811)
Resolving deltas: 49% (33228/67811)
Resolving deltas: 50% (33907/67811)
Resolving deltas: 51% (34589/67811)
Resolving deltas: 52% (35262/67811)
Resolving deltas: 53% (35940/67811)
Resolving deltas: 54% (36620/67811)
Resolving deltas: 55% (37297/67811)
Resolving deltas: 56% (37975/67811)
Resolving deltas: 57% (38653/67811)
Resolving deltas: 58% (39331/67811)
Resolving deltas: 59% (40009/67811)
Resolving deltas: 60% (40687/67811)
Resolving deltas: 61% (41365/67811)
Resolving deltas: 62% (42045/67811)
Resolving deltas: 63% (42721/67811)
Resolving deltas: 64% (43401/67811)
Resolving deltas: 65% (44078/67811)
Resolving deltas: 66% (44756/67811)
Resolving deltas: 67% (45434/67811)
Resolving deltas: 68% (46112/67811)
Resolving deltas: 69% (46790/67811)
Resolving deltas: 70% (47468/67811)
Resolving deltas: 71% (48146/67811)
Resolving deltas: 72% (48824/67811)
Resolving deltas: 73% (49503/67811)
Resolving deltas: 74% (50181/67811)
Resolving deltas: 75% (50860/67811)
Resolving deltas: 76% (51537/67811)
Resolving deltas: 77% (52215/67811)
Resolving deltas: 78% (52893/67811)
Resolving deltas: 79% (53571/67811)
Resolving deltas: 80% (54249/67811)
Resolving deltas: 81% (54927/67811)
Resolving deltas: 82% (55606/67811)
Resolving deltas: 83% (56284/67811)
Resolving deltas: 84% (56962/67811)
Resolving deltas: 85% (57643/67811)
Resolving deltas: 86% (58318/67811)
Resolving deltas: 87% (58996/67811)
Resolving deltas: 88% (59674/67811)
Resolving deltas: 88% (59812/67811)
Resolving deltas: 89% (60352/67811)
Resolving deltas: 90% (61030/67811)
Resolving deltas: 91% (61709/67811)
Resolving deltas: 92% (62387/67811)
Resolving deltas: 93% (63065/67811)
Resolving deltas: 94% (63743/67811)
Resolving deltas: 95% (64421/67811)
Resolving deltas: 96% (65099/67811)
Resolving deltas: 97% (65777/67811)
Resolving deltas: 98% (66455/67811)
Resolving deltas: 99% (67133/67811)
Resolving deltas: 100% (67811/67811)
Resolving deltas: 100% (67811/67811), done.
17.57 s
Fetching commit 13c9bb203f1daef2670356779366ed6afc72bc51 for feynkit ...
17.57 s
$ /nix/store/5vpcfsdx1lcnlb2y4k7xyc74shp5qwbh-git-2.54.0/bin/git fetch origin 13c9bb203f1daef2670356779366ed6afc72bc51
18.05 s
From https://github.com/alphal00p/gammaloop
18.05 s
* branch 13c9bb203f1daef2670356779366ed6afc72bc51 -> FETCH_HEAD
18.06 s
$ /nix/store/61685rbaxmpigwi3z23i33sv3jyfl70q-coreutils-9.11/bin/timeout --kill-after=15s 7200s /nix/store/5vpcfsdx1lcnlb2y4k7xyc74shp5qwbh-git-2.54.0/bin/git -c advice.detachedHead=false checkout 13c9bb203f1daef2670356779366ed6afc72bc51
18.28 s
HEAD is now at 13c9bb203 bundle readable math typography in notebook HTML
18.28 s
$ /nix/store/61685rbaxmpigwi3z23i33sv3jyfl70q-coreutils-9.11/bin/timeout --kill-after=15s 7200s /nix/store/wknkybkzrc16r11vk5vrykh4wmw7a353-nix-2.34.8/bin/nix --extra-experimental-features nix-command --extra-experimental-features flakes --log-format internal-json run .#packages.x86_64-linux.nix-ci-check-gammaloop-nextest-docs --print-build-logs
18.38 s
warning: ignoring untrusted flake configuration setting 'extra-substituters'.
18.38 s
Pass '--accept-flake-config' to trust it
18.38 s
warning: ignoring untrusted flake configuration setting 'extra-trusted-public-keys'.
18.38 s
Pass '--accept-flake-config' to trust it
23.19 s
23.34 s
Downloading cached nix-ci-check-gammaloop-nextest-docs from https://cache.nix-ci.com
23.38 s
Downloaded cached nix-ci-check-gammaloop-nextest-docs (1128 B) in 38ms
23.38 s
Progress: 0 of 1 built, 1 of 1 downloaded from cache
23.48 s
do you want to allow configuration setting 'extra-substituters' to be set to 'https://cache.nix-ci.com ' (y/N)? do you want to permanently mark this value as untrusted (y/N)? warning: ignoring untrusted flake configuration setting 'extra-substituters'.
23.48 s
Pass '--accept-flake-config' to trust it
23.48 s
evaluating derivation 'gdo you want to allow configuration setting 'extra-trusted-public-keys' to be set to 'nix-ci:g3xV5BDTLtIBZr/A00IU1x0EtKKlb7YLgBN2SgYgM6A= ' (y/N)? do you want to permanently mark this value as untrusted (y/N)? warning: ignoring untrusted flake configuration setting 'extra-trusted-public-keys'.
23.48 s
Pass '--accept-flake-config' to trust it
31.76 s
copying '/nix/store/hc7a
evaluating derivation 'g
copying '/nix/store/hc7a
evaluating derivation 'g
copying '/nix/store/hc7a
evaluating derivation 'g
copying '/nix/store/hc7a
evaluating derivation 'g
querying gammaloop-nexte
querying info about miss
querying gammaloop-nexte
[2.9 KiB DL] querying st
[14.2 KiB DL] querying c
[35.2 KiB DL] querying p
[64.2 /63.6 KiB DL] query
[78.8 KiB DL] querying b
[0 /15 built, 16 /0 /103 co
[0 /14 built, 16 /2 /103 co
[0 /14 built, 16 /14 /103 c
[0 /14 built, 16 /19 /103 c
[0 /14 built, 16 /26 /103 c
[0 /13 built, 16 /32 /103 c
[0 /11 built, 9 /41 /103 co
[0 /11 built, 6 /47 /103 co
[0 /10 built, 4 /49 /103 co
[0 /10 built, 7 /50 /103 co
[0 /10 built, 5 /54 /103 co
[0 /10 built, 4 /56 /103 co
[0 /10 built, 3 /57 /103 co
[0 /10 built, 16 /58 /103 c
[0 /9 built, 16 /65 /103 co
[0 /9 built, 14 /69 /103 co
[0 /9 built, 12 /78 /103 co
[0 /9 built, 11 /81 /103 co
[0 /9 built, 8 /87 /103 cop
[0 /9 built, 7 /88 /103 cop
[0 /9 built, 8 /91 /103 cop
[0 /9 built, 7 /92 /103 cop
[0 /9 built, 7 /93 /103 cop
[0 /8 built, 6 /94 /103 copbuilder.pl> Running phase: patchPhase
31.76 s
[1 /0 /7 built, 5 /95 /103 cbuilder.pl> Running phase: updateAutotoolsGnuConfigScriptsPhase
31.77 s
builder.pl> Running phase: configurePhase
31.78 s
builder.pl> no configure script, doing nothing
31.78 s
builder.pl> Running phase: buildPhase
31.78 s
builder.pl> Running phase: checkPhase
31.79 s
[1 /0 /6 built, 4 /96 /103 cbuilder.pl> Running phase: installPhase
31.79 s
builder.pl> no Makefile or custom installPhase, doing nothing
31.79 s
builder.pl> Running phase: fixupPhase
31.80 s
builder.pl> shrinking RPATHs of ELF executables and libraries in /nix/store/zzmspl8wdn2a3ancrz8dg3kci887nw6d-builder.pl
31.81 s
builder.pl> checking for references to /build/ in /nix/store/zzmspl8wdn2a3ancrz8dg3kci887nw6d-builder.pl...
31.81 s
builder.pl> patching script interpreter paths in /nix/store/zzmspl8wdn2a3ancrz8dg3kci887nw6d-builder.pl
31.84 s
builder.pl (post)> Uploading to the NixCI cache: /nix/store/zzmspl8wdn2a3ancrz8dg3kci887nw6d-builder.pl
31.88 s
builder.pl (post)> warning: 'warn-short-path-literals' is deprecated, use 'lint-short-path-literals = ignore' instead
32.00 s
builder.pl (post)> copying 0 paths...
32.05 s
builder.pl (post)> warning: 'warn-short-path-literals' is deprecated, use 'lint-short-path-literals = ignore' instead
32.51 s
builder.pl (post)> copying 0 paths...
34.08 s
[1 /5 built, 3 /98 /103 cop
[1 /5 built, 2 /99 /103 cop
[1 /4 built, 1 /100 /103 co
[1 /4 built, 1 /101 /103 co
[1 /4 built, 1 /102 /103 co
[1 /3 built, 103 copied (typst> structuredAttrs is enabled
34.13 s
[1 /1 /3 built, 103 copiedtypst> created 4 symlinks in user environment
34.21 s
typst (post)> Uploading to the NixCI cache: /nix/store/yc93gbspdkf53nwjsf1mbydbsaq9snxl-typst-0.15.1-env
34.24 s
typst (post)> warning: 'warn-short-path-literals' is deprecated, use 'lint-short-path-literals = ignore' instead
34.37 s
typst (post)> copying 0 paths...
34.41 s
typst (post)> warning: 'warn-short-path-literals' is deprecated, use 'lint-short-path-literals = ignore' instead
34.90 s
typst (post)> copying 0 paths...
35.27 s
[2 /4 built, 103 copied (
[1 /2 /3 built, 103 copiedgammaloop-nextest-docs> Extracting 2 binaries to /build/source
35.31 s
gammaloop-nextest-docs> Extracted 5 files to /build/source in 0.04s
35.32 s
gammaloop-nextest-docs> ------------
35.32 s
gammaloop-nextest-docs> Nextest run ID ea85f89a-f04e-473d-b29a-2b8cc1718ccd with nextest profile: ci_gammaloop
35.32 s
gammaloop-nextest-docs> Starting 129 tests across 2 binaries
35.35 s
gammaloop-nextest-docs> FAIL [ 0.014s] ( 26/129) alphal00p-docs-builder tests :: developer_architecture_is_classified_searchable_and_source_backed
35.35 s
gammaloop-nextest-docs> stdout ---
35.35 s
gammaloop-nextest-docs>
35.35 s
gammaloop-nextest-docs> running 1 test
35.35 s
gammaloop-nextest-docs> test tests::developer_architecture_is_classified_searchable_and_source_backed ... FAILED
35.35 s
gammaloop-nextest-docs>
35.35 s
gammaloop-nextest-docs> failures:
35.35 s
gammaloop-nextest-docs>
35.35 s
gammaloop-nextest-docs> failures:
35.35 s
gammaloop-nextest-docs> tests::developer_architecture_is_classified_searchable_and_source_backed
35.35 s
gammaloop-nextest-docs>
35.35 s
gammaloop-nextest-docs> test result: FAILED. 0 passed; 1 failed; 0 ignored; 0 measured; 128 filtered out; finished in 0.01s
35.35 s
gammaloop-nextest-docs>
35.35 s
gammaloop-nextest-docs> stderr ---
35.35 s
gammaloop-nextest-docs>
35.35 s
gammaloop-nextest-docs> thread 'tests::developer_architecture_is_classified_searchable_and_source_backed' (289) panicked at crates/alphal00p-docs-builder/src/lib.rs:12751:14:
35.35 s
gammaloop-nextest-docs> called `Result::unwrap()` on an `Err` value: failed to copy documentation asset crates/spynso3/typst/STIXTwoMath-Regular.woff2
35.35 s
gammaloop-nextest-docs>
35.35 s
gammaloop-nextest-docs> Caused by:
35.35 s
gammaloop-nextest-docs> No such file or directory (os error 2)
35.35 s
gammaloop-nextest-docs>
35.35 s
gammaloop-nextest-docs> Location:
35.35 s
gammaloop-nextest-docs> crates/alphal00p-docs-builder/src/lib.rs:2276:18
35.35 s
gammaloop-nextest-docs> stack backtrace:
35.35 s
gammaloop-nextest-docs> 0: __rustc::rust_begin_unwind
35.35 s
gammaloop-nextest-docs> 1: core::panicking::panic_fmt
35.35 s
gammaloop-nextest-docs> 2: core::result::unwrap_failed
35.35 s
gammaloop-nextest-docs> 3: alphal00p_docs_builder::tests::developer_architecture_is_classified_searchable_and_source_backed
35.35 s
gammaloop-nextest-docs> 4: <alphal00p_docs_builder::tests::developer_architecture_is_classified_searchable_and_source_backed::{closure#0} as core::ops::function::FnOnce<()>>::call_once
35.35 s
gammaloop-nextest-docs> note: Some details are omitted, run with `RUST_BACKTRACE=full` for a verbose backtrace.
35.35 s
gammaloop-nextest-docs>
35.35 s
gammaloop-nextest-docs> FAIL [ 0.008s] ( 28/129) alphal00p-docs-builder tests :: every_product_orients_rust_to_native_rustdoc_and_keeps_legacy_redirects
35.35 s
gammaloop-nextest-docs> stdout ---
35.35 s
gammaloop-nextest-docs>
35.35 s
gammaloop-nextest-docs> running 1 test
35.35 s
gammaloop-nextest-docs> test tests::every_product_orients_rust_to_native_rustdoc_and_keeps_legacy_redirects ... FAILED
35.35 s
gammaloop-nextest-docs>
35.35 s
gammaloop-nextest-docs> failures:
35.35 s
gammaloop-nextest-docs>
35.35 s
gammaloop-nextest-docs> failures:
35.35 s
gammaloop-nextest-docs> tests::every_product_orients_rust_to_native_rustdoc_and_keeps_legacy_redirects
35.35 s
gammaloop-nextest-docs>
35.35 s
gammaloop-nextest-docs> test result: FAILED. 0 passed; 1 failed; 0 ignored; 0 measured; 128 filtered out; finished in 0.00s
35.35 s
gammaloop-nextest-docs>
35.35 s
gammaloop-nextest-docs> stderr ---
35.35 s
gammaloop-nextest-docs>
35.35 s
gammaloop-nextest-docs> thread 'tests::every_product_orients_rust_to_native_rustdoc_and_keeps_legacy_redirects' (309) panicked at crates/alphal00p-docs-builder/src/lib.rs:12555:46:
35.35 s
gammaloop-nextest-docs> called `Result::unwrap()` on an `Err` value: failed to copy documentation asset crates/spynso3/typst/STIXTwoMath-Regular.woff2
35.35 s
gammaloop-nextest-docs>
35.35 s
gammaloop-nextest-docs> Caused by:
35.35 s
gammaloop-nextest-docs> No such file or directory (os error 2)
35.35 s
gammaloop-nextest-docs>
35.35 s
gammaloop-nextest-docs> Location:
35.35 s
gammaloop-nextest-docs> crates/alphal00p-docs-builder/src/lib.rs:2276:18
35.35 s
gammaloop-nextest-docs> stack backtrace:
35.35 s
gammaloop-nextest-docs> 0: __rustc::rust_begin_unwind
35.35 s
gammaloop-nextest-docs> 1: core::panicking::panic_fmt
35.35 s
gammaloop-nextest-docs> 2: core::result::unwrap_failed
35.35 s
gammaloop-nextest-docs> 3: alphal00p_docs_builder::tests::every_product_orients_rust_to_native_rustdoc_and_keeps_legacy_redirects
35.35 s
gammaloop-nextest-docs> 4: <alphal00p_docs_builder::tests::every_product_orients_rust_to_native_rustdoc_and_keeps_legacy_redirects::{closure#0} as core::ops::function::FnOnce<()>>::call_once
35.35 s
gammaloop-nextest-docs> note: Some details are omitted, run with `RUST_BACKTRACE=full` for a verbose backtrace.
35.35 s
gammaloop-nextest-docs>
35.39 s
gammaloop-nextest-docs> FAIL [ 0.011s] ( 54/129) alphal00p-docs-builder tests :: portal_emits_routes_and_valid_assets
35.39 s
gammaloop-nextest-docs> stdout ---
35.39 s
gammaloop-nextest-docs>
35.39 s
gammaloop-nextest-docs> running 1 test
35.39 s
gammaloop-nextest-docs> test tests::portal_emits_routes_and_valid_assets ... FAILED
35.39 s
gammaloop-nextest-docs>
35.39 s
gammaloop-nextest-docs> failures:
35.39 s
gammaloop-nextest-docs>
35.39 s
gammaloop-nextest-docs> failures:
35.39 s
gammaloop-nextest-docs> tests::portal_emits_routes_and_valid_assets
35.39 s
gammaloop-nextest-docs>
35.39 s
gammaloop-nextest-docs> test result: FAILED. 0 passed; 1 failed; 0 ignored; 0 measured; 128 filtered out; finished in 0.01s
35.39 s
gammaloop-nextest-docs>
35.39 s
gammaloop-nextest-docs> stderr ---
35.39 s
gammaloop-nextest-docs>
35.39 s
gammaloop-nextest-docs> thread 'tests::portal_emits_routes_and_valid_assets' (424) panicked at crates/alphal00p-docs-builder/src/lib.rs:9684:14:
35.39 s
gammaloop-nextest-docs> called `Result::unwrap()` on an `Err` value: failed to copy documentation asset crates/spynso3/typst/STIXTwoMath-Regular.woff2
35.39 s
gammaloop-nextest-docs>
35.39 s
gammaloop-nextest-docs> Caused by:
35.39 s
gammaloop-nextest-docs> No such file or directory (os error 2)
35.39 s
gammaloop-nextest-docs>
35.39 s
gammaloop-nextest-docs> Location:
35.39 s
gammaloop-nextest-docs> crates/alphal00p-docs-builder/src/lib.rs:2276:18
35.39 s
gammaloop-nextest-docs> stack backtrace:
35.39 s
gammaloop-nextest-docs> 0: __rustc::rust_begin_unwind
35.39 s
gammaloop-nextest-docs> 1: core::panicking::panic_fmt
35.39 s
gammaloop-nextest-docs> 2: core::result::unwrap_failed
35.39 s
gammaloop-nextest-docs> 3: alphal00p_docs_builder::tests::write_test_portal
35.39 s
gammaloop-nextest-docs> 4: alphal00p_docs_builder::tests::portal_emits_routes_and_valid_assets
35.39 s
gammaloop-nextest-docs> 5: <alphal00p_docs_builder::tests::portal_emits_routes_and_valid_assets::{closure#0} as core::ops::function::FnOnce<()>>::call_once
35.39 s
gammaloop-nextest-docs> note: Some details are omitted, run with `RUST_BACKTRACE=full` for a verbose backtrace.
35.39 s
gammaloop-nextest-docs>
35.39 s
gammaloop-nextest-docs> FAIL [ 0.010s] ( 55/129) alphal00p-docs-builder tests :: portal_task_chooser_routes_each_goal_to_the_registered_quickstart
35.39 s
gammaloop-nextest-docs> stdout ---
35.39 s
gammaloop-nextest-docs>
35.39 s
gammaloop-nextest-docs> running 1 test
35.39 s
gammaloop-nextest-docs> test tests::portal_task_chooser_routes_each_goal_to_the_registered_quickstart ... FAILED
35.39 s
gammaloop-nextest-docs>
35.39 s
gammaloop-nextest-docs> failures:
35.39 s
gammaloop-nextest-docs>
35.39 s
gammaloop-nextest-docs> failures:
35.39 s
gammaloop-nextest-docs> tests::portal_task_chooser_routes_each_goal_to_the_registered_quickstart
35.39 s
gammaloop-nextest-docs>
35.39 s
gammaloop-nextest-docs> test result: FAILED. 0 passed; 1 failed; 0 ignored; 0 measured; 128 filtered out; finished in 0.00s
35.39 s
gammaloop-nextest-docs>
35.39 s
gammaloop-nextest-docs> stderr ---
35.39 s
gammaloop-nextest-docs>
35.39 s
gammaloop-nextest-docs> thread 'tests::portal_task_chooser_routes_each_goal_to_the_registered_quickstart' (431) panicked at crates/alphal00p-docs-builder/src/lib.rs:9684:14:
35.39 s
gammaloop-nextest-docs> called `Result::unwrap()` on an `Err` value: failed to copy documentation asset crates/spynso3/typst/STIXTwoMath-Regular.woff2
35.39 s
gammaloop-nextest-docs>
35.39 s
gammaloop-nextest-docs> Caused by:
35.39 s
gammaloop-nextest-docs> No such file or directory (os error 2)
35.39 s
gammaloop-nextest-docs>
35.39 s
gammaloop-nextest-docs> Location:
35.39 s
gammaloop-nextest-docs> crates/alphal00p-docs-builder/src/lib.rs:2276:18
35.39 s
gammaloop-nextest-docs> stack backtrace:
35.39 s
gammaloop-nextest-docs> 0: __rustc::rust_begin_unwind
35.39 s
gammaloop-nextest-docs> 1: core::panicking::panic_fmt
35.39 s
gammaloop-nextest-docs> 2: core::result::unwrap_failed
35.39 s
gammaloop-nextest-docs> 3: alphal00p_docs_builder::tests::write_test_portal
35.39 s
gammaloop-nextest-docs> 4: alphal00p_docs_builder::tests::portal_task_chooser_routes_each_goal_to_the_registered_quickstart
35.39 s
gammaloop-nextest-docs> 5: <alphal00p_docs_builder::tests::portal_task_chooser_routes_each_goal_to_the_registered_quickstart::{closure#0} as core::ops::function::FnOnce<()>>::call_once
35.39 s
gammaloop-nextest-docs> note: Some details are omitted, run with `RUST_BACKTRACE=full` for a verbose backtrace.
35.39 s
gammaloop-nextest-docs>
35.39 s
gammaloop-nextest-docs> FAIL [ 0.012s] ( 56/129) alphal00p-docs-builder tests :: portal_and_developer_pages_use_federated_search_and_feedback
35.39 s
gammaloop-nextest-docs> stdout ---
35.39 s
gammaloop-nextest-docs>
35.39 s
gammaloop-nextest-docs> running 1 test
35.39 s
gammaloop-nextest-docs> test tests::portal_and_developer_pages_use_federated_search_and_feedback ... FAILED
35.39 s
gammaloop-nextest-docs>
35.39 s
gammaloop-nextest-docs> failures:
35.39 s
gammaloop-nextest-docs>
35.39 s
gammaloop-nextest-docs> failures:
35.39 s
gammaloop-nextest-docs> tests::portal_and_developer_pages_use_federated_search_and_feedback
35.39 s
gammaloop-nextest-docs>
35.39 s
gammaloop-nextest-docs> test result: FAILED. 0 passed; 1 failed; 0 ignored; 0 measured; 128 filtered out; finished in 0.01s
35.39 s
gammaloop-nextest-docs>
35.39 s
gammaloop-nextest-docs> stderr ---
35.39 s
gammaloop-nextest-docs>
35.39 s
gammaloop-nextest-docs> thread 'tests::portal_and_developer_pages_use_federated_search_and_feedback' (425) panicked at crates/alphal00p-docs-builder/src/lib.rs:9684:14:
35.39 s
gammaloop-nextest-docs> called `Result::unwrap()` on an `Err` value: failed to copy documentation asset crates/spynso3/typst/STIXTwoMath-Regular.woff2
35.39 s
gammaloop-nextest-docs>
35.39 s
gammaloop-nextest-docs> Caused by:
35.39 s
gammaloop-nextest-docs> No such file or directory (os error 2)
35.39 s
gammaloop-nextest-docs>
35.39 s
gammaloop-nextest-docs> Location:
35.39 s
gammaloop-nextest-docs> crates/alphal00p-docs-builder/src/lib.rs:2276:18
35.39 s
gammaloop-nextest-docs> stack backtrace:
35.39 s
gammaloop-nextest-docs> 0: __rustc::rust_begin_unwind
35.39 s
gammaloop-nextest-docs> 1: core::panicking::panic_fmt
35.39 s
gammaloop-nextest-docs> 2: core::result::unwrap_failed
35.39 s
gammaloop-nextest-docs> 3: alphal00p_docs_builder::tests::write_test_portal
35.39 s
gammaloop-nextest-docs> 4: alphal00p_docs_builder::tests::portal_and_developer_pages_use_federated_search_and_feedback
35.39 s
gammaloop-nextest-docs> 5: <alphal00p_docs_builder::tests::portal_and_developer_pages_use_federated_search_and_feedback::{closure#0} as core::ops::function::FnOnce<()>>::call_once
35.39 s
gammaloop-nextest-docs> note: Some details are omitted, run with `RUST_BACKTRACE=full` for a verbose backtrace.
35.39 s
gammaloop-nextest-docs>
35.44 s
gammaloop-nextest-docs> FAIL [ 0.118s] ( 86/129) alphal00p-docs-builder tests :: checked_in_registry_is_valid
35.44 s
gammaloop-nextest-docs> stdout ---
35.44 s
gammaloop-nextest-docs>
35.44 s
gammaloop-nextest-docs> running 1 test
35.44 s
gammaloop-nextest-docs> test tests::checked_in_registry_is_valid ... FAILED
35.44 s
gammaloop-nextest-docs>
35.44 s
gammaloop-nextest-docs> failures:
35.44 s
gammaloop-nextest-docs>
35.44 s
gammaloop-nextest-docs> failures:
35.44 s
gammaloop-nextest-docs> tests::checked_in_registry_is_valid
35.44 s
gammaloop-nextest-docs>
35.44 s
gammaloop-nextest-docs> test result: FAILED. 0 passed; 1 failed; 0 ignored; 0 measured; 128 filtered out; finished in 0.11s
35.44 s
gammaloop-nextest-docs>
35.44 s
gammaloop-nextest-docs> stderr ---
35.44 s
gammaloop-nextest-docs>
35.44 s
gammaloop-nextest-docs> thread 'tests::checked_in_registry_is_valid' (187) panicked at crates/alphal00p-docs-builder/src/lib.rs:12260:50:
35.44 s
gammaloop-nextest-docs> called `Result::unwrap()` on an `Err` value: required documentation source is missing: /build/source/crates/spynso3/typst/STIXTwoMath-Regular.woff2
35.44 s
gammaloop-nextest-docs>
35.44 s
gammaloop-nextest-docs> Location:
35.44 s
gammaloop-nextest-docs> crates/alphal00p-docs-builder/src/lib.rs:5103:9
35.44 s
gammaloop-nextest-docs> stack backtrace:
35.44 s
gammaloop-nextest-docs> 0: __rustc::rust_begin_unwind
35.44 s
gammaloop-nextest-docs> 1: core::panicking::panic_fmt
35.44 s
gammaloop-nextest-docs> 2: core::result::unwrap_failed
35.44 s
gammaloop-nextest-docs> 3: alphal00p_docs_builder::tests::checked_in_registry_is_valid
35.44 s
gammaloop-nextest-docs> 4: <alphal00p_docs_builder::tests::checked_in_registry_is_valid::{closure#0} as core::ops::function::FnOnce<()>>::call_once
35.44 s
gammaloop-nextest-docs> note: Some details are omitted, run with `RUST_BACKTRACE=full` for a verbose backtrace.
35.44 s
gammaloop-nextest-docs>
35.44 s
gammaloop-nextest-docs> FAIL [ 0.119s] ( 88/129) alphal00p-docs-builder provenance_tests :: each_build_captures_one_revision_before_rendering
35.44 s
gammaloop-nextest-docs> stdout ---
35.44 s
gammaloop-nextest-docs>
35.44 s
gammaloop-nextest-docs> running 1 test
35.44 s
gammaloop-nextest-docs>
35.44 s
gammaloop-nextest-docs> running 1 test
35.44 s
gammaloop-nextest-docs> test provenance_tests::each_build_captures_one_revision_before_rendering ... FAILED
35.44 s
gammaloop-nextest-docs>
35.44 s
gammaloop-nextest-docs> failures:
35.44 s
gammaloop-nextest-docs>
35.44 s
gammaloop-nextest-docs> failures:
35.44 s
gammaloop-nextest-docs> provenance_tests::each_build_captures_one_revision_before_rendering
35.44 s
gammaloop-nextest-docs>
35.44 s
gammaloop-nextest-docs> test result: FAILED. 0 passed; 1 failed; 0 ignored; 0 measured; 128 filtered out; finished in 0.10s
35.44 s
gammaloop-nextest-docs>
35.44 s
gammaloop-nextest-docs> test provenance_tests::each_build_captures_one_revision_before_rendering ... FAILED
35.44 s
gammaloop-nextest-docs>
35.44 s
gammaloop-nextest-docs> failures:
35.44 s
gammaloop-nextest-docs>
35.44 s
gammaloop-nextest-docs> failures:
35.44 s
gammaloop-nextest-docs> provenance_tests::each_build_captures_one_revision_before_rendering
35.44 s
gammaloop-nextest-docs>
35.44 s
gammaloop-nextest-docs> test result: FAILED. 0 passed; 1 failed; 0 ignored; 0 measured; 128 filtered out; finished in 0.11s
35.44 s
gammaloop-nextest-docs>
35.44 s
gammaloop-nextest-docs> stderr ---
35.44 s
gammaloop-nextest-docs>
35.44 s
gammaloop-nextest-docs> thread 'provenance_tests::each_build_captures_one_revision_before_rendering' (253) panicked at crates/alphal00p-docs-builder/src/provenance_tests.rs:297:14:
35.44 s
gammaloop-nextest-docs> called `Result::unwrap()` on an `Err` value: required documentation source is missing: /build/source/target/nix-ci-tmp/.tmpuiqmMo/checkout/crates/spynso3/typst/STIXTwoMath-Regular.woff2
35.44 s
gammaloop-nextest-docs>
35.44 s
gammaloop-nextest-docs> Location:
35.44 s
gammaloop-nextest-docs> crates/alphal00p-docs-builder/src/lib.rs:5103:9
35.44 s
gammaloop-nextest-docs> stack backtrace:
35.44 s
gammaloop-nextest-docs> 0: __rustc::rust_begin_unwind
35.44 s
gammaloop-nextest-docs> 1: core::panicking::panic_fmt
35.44 s
gammaloop-nextest-docs> 2: core::result::unwrap_failed
35.44 s
gammaloop-nextest-docs> 3: alphal00p_docs_builder::provenance_tests::each_build_captures_one_revision_before_rendering
35.44 s
gammaloop-nextest-docs> 4: <alphal00p_docs_builder::provenance_tests::each_build_captures_one_revision_before_rendering::{closure#0} as core::ops::function::FnOnce<()>>::call_once
35.44 s
gammaloop-nextest-docs> note: Some details are omitted, run with `RUST_BACKTRACE=full` for a verbose backtrace.
35.44 s
gammaloop-nextest-docs>
35.44 s
gammaloop-nextest-docs> thread 'provenance_tests::each_build_captures_one_revision_before_rendering' (170) panicked at crates/alphal00p-docs-builder/src/provenance_tests.rs:274:9:
35.44 s
gammaloop-nextest-docs> assertion failed: command.status().unwrap().success()
35.44 s
gammaloop-nextest-docs> stack backtrace:
35.44 s
gammaloop-nextest-docs> 0: __rustc::rust_begin_unwind
35.44 s
gammaloop-nextest-docs> 1: core::panicking::panic_fmt
35.44 s
gammaloop-nextest-docs> 2: core::panicking::panic
35.44 s
gammaloop-nextest-docs> 3: alphal00p_docs_builder::provenance_tests::each_build_captures_one_revision_before_rendering
35.44 s
gammaloop-nextest-docs> 4: <alphal00p_docs_builder::provenance_tests::each_build_captures_one_revision_before_rendering::{closure#0} as core::ops::function::FnOnce<()>>::call_once
35.44 s
gammaloop-nextest-docs> note: Some details are omitted, run with `RUST_BACKTRACE=full` for a verbose backtrace.
35.44 s
gammaloop-nextest-docs>
35.44 s
gammaloop-nextest-docs> FAIL [ 0.010s] ( 89/129) alphal00p-docs-builder tests :: site_assets_replace_read_only_generated_files
35.44 s
gammaloop-nextest-docs> stdout ---
35.44 s
gammaloop-nextest-docs>
35.44 s
gammaloop-nextest-docs> running 1 test
35.44 s
gammaloop-nextest-docs> test tests::site_assets_replace_read_only_generated_files ... FAILED
35.44 s
gammaloop-nextest-docs>
35.44 s
gammaloop-nextest-docs> failures:
35.44 s
gammaloop-nextest-docs>
35.44 s
gammaloop-nextest-docs> failures:
35.44 s
gammaloop-nextest-docs> tests::site_assets_replace_read_only_generated_files
35.44 s
gammaloop-nextest-docs>
35.44 s
gammaloop-nextest-docs> test result: FAILED. 0 passed; 1 failed; 0 ignored; 0 measured; 128 filtered out; finished in 0.01s
35.44 s
gammaloop-nextest-docs>
35.44 s
gammaloop-nextest-docs> stderr ---
35.44 s
gammaloop-nextest-docs>
35.44 s
gammaloop-nextest-docs> thread 'tests::site_assets_replace_read_only_generated_files' (670) panicked at crates/alphal00p-docs-builder/src/lib.rs:12305:50:
35.44 s
gammaloop-nextest-docs> called `Result::unwrap()` on an `Err` value: failed to copy documentation asset crates/spynso3/typst/STIXTwoMath-Regular.woff2
35.44 s
gammaloop-nextest-docs>
35.44 s
gammaloop-nextest-docs> Caused by:
35.44 s
gammaloop-nextest-docs> No such file or directory (os error 2)
35.44 s
gammaloop-nextest-docs>
35.44 s
gammaloop-nextest-docs> Location:
35.44 s
gammaloop-nextest-docs> crates/alphal00p-docs-builder/src/lib.rs:2276:18
35.44 s
gammaloop-nextest-docs> stack backtrace:
35.44 s
gammaloop-nextest-docs> 0: __rustc::rust_begin_unwind
35.44 s
gammaloop-nextest-docs> 1: core::panicking::panic_fmt
35.44 s
gammaloop-nextest-docs> 2: core::result::unwrap_failed
35.44 s
gammaloop-nextest-docs> 3: alphal00p_docs_builder::tests::site_assets_replace_read_only_generated_files
35.44 s
gammaloop-nextest-docs> 4: <alphal00p_docs_builder::tests::site_assets_replace_read_only_generated_files::{closure#0} as core::ops::function::FnOnce<()>>::call_once
35.44 s
gammaloop-nextest-docs> note: Some details are omitted, run with `RUST_BACKTRACE=full` for a verbose backtrace.
35.44 s
gammaloop-nextest-docs>
35.44 s
gammaloop-nextest-docs> FAIL [ 0.108s] ( 90/129) alphal00p-docs-builder tests :: developer_scope_ranges_ignore_unrelated_edits_and_warn_only_while_watching
35.44 s
gammaloop-nextest-docs> stdout ---
35.44 s
gammaloop-nextest-docs>
35.44 s
gammaloop-nextest-docs> running 1 test
35.44 s
gammaloop-nextest-docs> test tests::developer_scope_ranges_ignore_unrelated_edits_and_warn_only_while_watching ... FAILED
35.44 s
gammaloop-nextest-docs>
35.44 s
gammaloop-nextest-docs> failures:
35.44 s
gammaloop-nextest-docs>
35.44 s
gammaloop-nextest-docs> failures:
35.44 s
gammaloop-nextest-docs> tests::developer_scope_ranges_ignore_unrelated_edits_and_warn_only_while_watching
35.44 s
gammaloop-nextest-docs>
35.44 s
gammaloop-nextest-docs> test result: FAILED. 0 passed; 1 failed; 0 ignored; 0 measured; 128 filtered out; finished in 0.10s
35.44 s
gammaloop-nextest-docs>
35.44 s
gammaloop-nextest-docs> stderr ---
35.44 s
gammaloop-nextest-docs>
35.44 s
gammaloop-nextest-docs> thread 'tests::developer_scope_ranges_ignore_unrelated_edits_and_warn_only_while_watching' (287) panicked at crates/alphal00p-docs-builder/src/lib.rs:12350:29:
35.44 s
gammaloop-nextest-docs> called `Result::unwrap()` on an `Err` value: required documentation source is missing: /build/source/crates/spynso3/typst/STIXTwoMath-Regular.woff2
35.44 s
gammaloop-nextest-docs>
35.44 s
gammaloop-nextest-docs> Location:
35.44 s
gammaloop-nextest-docs> crates/alphal00p-docs-builder/src/lib.rs:5103:9
35.44 s
gammaloop-nextest-docs> stack backtrace:
35.44 s
gammaloop-nextest-docs> 0: __rustc::rust_begin_unwind
35.44 s
gammaloop-nextest-docs> 1: core::panicking::panic_fmt
35.44 s
gammaloop-nextest-docs> 2: core::result::unwrap_failed
35.44 s
gammaloop-nextest-docs> 3: alphal00p_docs_builder::tests::developer_scope_ranges_ignore_unrelated_edits_and_warn_only_while_watching
35.44 s
gammaloop-nextest-docs> 4: <alphal00p_docs_builder::tests::developer_scope_ranges_ignore_unrelated_edits_and_warn_only_while_watching::{closure#0} as core::ops::function::FnOnce<()>>::call_once
35.44 s
gammaloop-nextest-docs> note: Some details are omitted, run with `RUST_BACKTRACE=full` for a verbose backtrace.
35.44 s
gammaloop-nextest-docs>
35.47 s
gammaloop-nextest-docs> FAIL [ 0.127s] (121/129) alphal00p-docs-builder tests :: every_product_requires_a_task_chooser_and_each_supported_interface
35.47 s
gammaloop-nextest-docs> stdout ---
35.47 s
gammaloop-nextest-docs>
35.47 s
gammaloop-nextest-docs> running 1 test
35.47 s
gammaloop-nextest-docs> test tests::every_product_requires_a_task_chooser_and_each_supported_interface ... FAILED
35.47 s
gammaloop-nextest-docs>
35.47 s
gammaloop-nextest-docs> failures:
35.47 s
gammaloop-nextest-docs>
35.47 s
gammaloop-nextest-docs> failures:
35.47 s
gammaloop-nextest-docs> tests::every_product_requires_a_task_chooser_and_each_supported_interface
35.47 s
gammaloop-nextest-docs>
35.47 s
gammaloop-nextest-docs> test result: FAILED. 0 passed; 1 failed; 0 ignored; 0 measured; 128 filtered out; finished in 0.12s
35.47 s
gammaloop-nextest-docs>
35.47 s
gammaloop-nextest-docs> stderr ---
35.47 s
gammaloop-nextest-docs>
35.47 s
gammaloop-nextest-docs> thread 'tests::every_product_requires_a_task_chooser_and_each_supported_interface' (327) panicked at crates/alphal00p-docs-builder/src/lib.rs:12274:9:
35.47 s
gammaloop-nextest-docs> assertion failed: format!("{error:#}").contains("has no quickstart page")
35.47 s
gammaloop-nextest-docs> stack backtrace:
35.47 s
gammaloop-nextest-docs> 0: __rustc::rust_begin_unwind
35.47 s
gammaloop-nextest-docs> 1: core::panicking::panic_fmt
35.47 s
gammaloop-nextest-docs> 2: core::panicking::panic
35.47 s
gammaloop-nextest-docs> 3: alphal00p_docs_builder::tests::every_product_requires_a_task_chooser_and_each_supported_interface
35.47 s
gammaloop-nextest-docs> 4: <alphal00p_docs_builder::tests::every_product_requires_a_task_chooser_and_each_supported_interface::{closure#0} as core::ops::function::FnOnce<()>>::call_once
35.47 s
gammaloop-nextest-docs> note: Some details are omitted, run with `RUST_BACKTRACE=full` for a verbose backtrace.
35.47 s
gammaloop-nextest-docs>
35.48 s
gammaloop-nextest-docs> FAIL [ 0.111s] (122/129) alphal00p-docs-builder tests :: pdf_manual_chapter_order_must_match_the_page_registry
35.48 s
gammaloop-nextest-docs> stdout ---
35.48 s
gammaloop-nextest-docs>
35.48 s
gammaloop-nextest-docs> running 1 test
35.48 s
gammaloop-nextest-docs> test tests::pdf_manual_chapter_order_must_match_the_page_registry ... FAILED
35.48 s
gammaloop-nextest-docs>
35.48 s
gammaloop-nextest-docs> failures:
35.48 s
gammaloop-nextest-docs>
35.48 s
gammaloop-nextest-docs> failures:
35.48 s
gammaloop-nextest-docs> tests::pdf_manual_chapter_order_must_match_the_page_registry
35.48 s
gammaloop-nextest-docs>
35.48 s
gammaloop-nextest-docs> test result: FAILED. 0 passed; 1 failed; 0 ignored; 0 measured; 128 filtered out; finished in 0.11s
35.48 s
gammaloop-nextest-docs>
35.48 s
gammaloop-nextest-docs> stderr ---
35.48 s
gammaloop-nextest-docs>
35.48 s
gammaloop-nextest-docs> thread 'tests::pdf_manual_chapter_order_must_match_the_page_registry' (396) panicked at crates/alphal00p-docs-builder/src/lib.rs:12330:9:
35.48 s
gammaloop-nextest-docs> assertion failed: format!("{error:#}").contains("PDF manual chapter order differs")
35.48 s
gammaloop-nextest-docs> stack backtrace:
35.48 s
gammaloop-nextest-docs> 0: __rustc::rust_begin_unwind
35.48 s
gammaloop-nextest-docs> 1: core::panicking::panic_fmt
35.48 s
gammaloop-nextest-docs> 2: core::panicking::panic
35.48 s
gammaloop-nextest-docs> 3: alphal00p_docs_builder::tests::pdf_manual_chapter_order_must_match_the_page_registry
35.48 s
gammaloop-nextest-docs> 4: <alphal00p_docs_builder::tests::pdf_manual_chapter_order_must_match_the_page_registry::{closure#0} as core::ops::function::FnOnce<()>>::call_once
35.48 s
gammaloop-nextest-docs> note: Some details are omitted, run with `RUST_BACKTRACE=full` for a verbose backtrace.
35.48 s
gammaloop-nextest-docs>
45.51 s
gammaloop-nextest-docs> ------------
45.51 s
gammaloop-nextest-docs> Summary [ 10.186s] 129 tests run: 118 passed , 11 failed , 0 skipped
45.51 s
gammaloop-nextest-docs> FAIL [ 0.014s] ( 26/129) alphal00p-docs-builder tests :: developer_architecture_is_classified_searchable_and_source_backed
45.51 s
gammaloop-nextest-docs> stdout ---
45.51 s
gammaloop-nextest-docs>
45.51 s
gammaloop-nextest-docs> running 1 test
45.51 s
gammaloop-nextest-docs> test tests::developer_architecture_is_classified_searchable_and_source_backed ... FAILED
45.51 s
gammaloop-nextest-docs>
45.51 s
gammaloop-nextest-docs> failures:
45.51 s
gammaloop-nextest-docs>
45.51 s
gammaloop-nextest-docs> failures:
45.51 s
gammaloop-nextest-docs> tests::developer_architecture_is_classified_searchable_and_source_backed
45.51 s
gammaloop-nextest-docs>
45.51 s
gammaloop-nextest-docs> test result: FAILED. 0 passed; 1 failed; 0 ignored; 0 measured; 128 filtered out; finished in 0.01s
45.51 s
gammaloop-nextest-docs>
45.51 s
gammaloop-nextest-docs> stderr ---
45.51 s
gammaloop-nextest-docs>
45.51 s
gammaloop-nextest-docs> thread 'tests::developer_architecture_is_classified_searchable_and_source_backed' (289) panicked at crates/alphal00p-docs-builder/src/lib.rs:12751:14:
45.51 s
gammaloop-nextest-docs> called `Result::unwrap()` on an `Err` value: failed to copy documentation asset crates/spynso3/typst/STIXTwoMath-Regular.woff2
45.51 s
gammaloop-nextest-docs>
45.51 s
gammaloop-nextest-docs> Caused by:
45.51 s
gammaloop-nextest-docs> No such file or directory (os error 2)
45.51 s
gammaloop-nextest-docs>
45.51 s
gammaloop-nextest-docs> Location:
45.51 s
gammaloop-nextest-docs> crates/alphal00p-docs-builder/src/lib.rs:2276:18
45.51 s
gammaloop-nextest-docs> stack backtrace:
45.51 s
gammaloop-nextest-docs> 0: __rustc::rust_begin_unwind
45.51 s
gammaloop-nextest-docs> 1: core::panicking::panic_fmt
45.51 s
gammaloop-nextest-docs> 2: core::result::unwrap_failed
45.51 s
gammaloop-nextest-docs> 3: alphal00p_docs_builder::tests::developer_architecture_is_classified_searchable_and_source_backed
45.51 s
gammaloop-nextest-docs> 4: <alphal00p_docs_builder::tests::developer_architecture_is_classified_searchable_and_source_backed::{closure#0} as core::ops::function::FnOnce<()>>::call_once
45.51 s
gammaloop-nextest-docs> note: Some details are omitted, run with `RUST_BACKTRACE=full` for a verbose backtrace.
45.51 s
gammaloop-nextest-docs>
45.51 s
gammaloop-nextest-docs> FAIL [ 0.008s] ( 28/129) alphal00p-docs-builder tests :: every_product_orients_rust_to_native_rustdoc_and_keeps_legacy_redirects
45.51 s
gammaloop-nextest-docs> stdout ---
45.51 s
gammaloop-nextest-docs>
45.51 s
gammaloop-nextest-docs> running 1 test
45.51 s
gammaloop-nextest-docs> test tests::every_product_orients_rust_to_native_rustdoc_and_keeps_legacy_redirects ... FAILED
45.51 s
gammaloop-nextest-docs>
45.51 s
gammaloop-nextest-docs> failures:
45.51 s
gammaloop-nextest-docs>
45.51 s
gammaloop-nextest-docs> failures:
45.51 s
gammaloop-nextest-docs> tests::every_product_orients_rust_to_native_rustdoc_and_keeps_legacy_redirects
45.51 s
gammaloop-nextest-docs>
45.51 s
gammaloop-nextest-docs> test result: FAILED. 0 passed; 1 failed; 0 ignored; 0 measured; 128 filtered out; finished in 0.00s
45.51 s
gammaloop-nextest-docs>
45.51 s
gammaloop-nextest-docs> stderr ---
45.51 s
gammaloop-nextest-docs>
45.51 s
gammaloop-nextest-docs> thread 'tests::every_product_orients_rust_to_native_rustdoc_and_keeps_legacy_redirects' (309) panicked at crates/alphal00p-docs-builder/src/lib.rs:12555:46:
45.51 s
gammaloop-nextest-docs> called `Result::unwrap()` on an `Err` value: failed to copy documentation asset crates/spynso3/typst/STIXTwoMath-Regular.woff2
45.51 s
gammaloop-nextest-docs>
45.51 s
gammaloop-nextest-docs> Caused by:
45.51 s
gammaloop-nextest-docs> No such file or directory (os error 2)
45.51 s
gammaloop-nextest-docs>
45.51 s
gammaloop-nextest-docs> Location:
45.51 s
gammaloop-nextest-docs> crates/alphal00p-docs-builder/src/lib.rs:2276:18
45.51 s
gammaloop-nextest-docs> stack backtrace:
45.51 s
gammaloop-nextest-docs> 0: __rustc::rust_begin_unwind
45.51 s
gammaloop-nextest-docs> 1: core::panicking::panic_fmt
45.51 s
gammaloop-nextest-docs> 2: core::result::unwrap_failed
45.51 s
gammaloop-nextest-docs> 3: alphal00p_docs_builder::tests::every_product_orients_rust_to_native_rustdoc_and_keeps_legacy_redirects
45.51 s
gammaloop-nextest-docs> 4: <alphal00p_docs_builder::tests::every_product_orients_rust_to_native_rustdoc_and_keeps_legacy_redirects::{closure#0} as core::ops::function::FnOnce<()>>::call_once
45.51 s
gammaloop-nextest-docs> note: Some details are omitted, run with `RUST_BACKTRACE=full` for a verbose backtrace.
45.51 s
gammaloop-nextest-docs>
45.51 s
gammaloop-nextest-docs> FAIL [ 0.011s] ( 54/129) alphal00p-docs-builder tests :: portal_emits_routes_and_valid_assets
45.51 s
gammaloop-nextest-docs> stdout ---
45.51 s
gammaloop-nextest-docs>
45.51 s
gammaloop-nextest-docs> running 1 test
45.51 s
gammaloop-nextest-docs> test tests::portal_emits_routes_and_valid_assets ... FAILED
45.51 s
gammaloop-nextest-docs>
45.51 s
gammaloop-nextest-docs> failures:
45.51 s
gammaloop-nextest-docs>
45.51 s
gammaloop-nextest-docs> failures:
45.51 s
gammaloop-nextest-docs> tests::portal_emits_routes_and_valid_assets
45.51 s
gammaloop-nextest-docs>
45.51 s
gammaloop-nextest-docs> test result: FAILED. 0 passed; 1 failed; 0 ignored; 0 measured; 128 filtered out; finished in 0.01s
45.51 s
gammaloop-nextest-docs>
45.51 s
gammaloop-nextest-docs> stderr ---
45.51 s
gammaloop-nextest-docs>
45.51 s
gammaloop-nextest-docs> thread 'tests::portal_emits_routes_and_valid_assets' (424) panicked at crates/alphal00p-docs-builder/src/lib.rs:9684:14:
45.51 s
gammaloop-nextest-docs> called `Result::unwrap()` on an `Err` value: failed to copy documentation asset crates/spynso3/typst/STIXTwoMath-Regular.woff2
45.51 s
gammaloop-nextest-docs>
45.51 s
gammaloop-nextest-docs> Caused by:
45.51 s
gammaloop-nextest-docs> No such file or directory (os error 2)
45.51 s
gammaloop-nextest-docs>
45.51 s
gammaloop-nextest-docs> Location:
45.51 s
gammaloop-nextest-docs> crates/alphal00p-docs-builder/src/lib.rs:2276:18
45.51 s
gammaloop-nextest-docs> stack backtrace:
45.51 s
gammaloop-nextest-docs> 0: __rustc::rust_begin_unwind
45.51 s
gammaloop-nextest-docs> 1: core::panicking::panic_fmt
45.51 s
gammaloop-nextest-docs> 2: core::result::unwrap_failed
45.51 s
gammaloop-nextest-docs> 3: alphal00p_docs_builder::tests::write_test_portal
45.51 s
gammaloop-nextest-docs> 4: alphal00p_docs_builder::tests::portal_emits_routes_and_valid_assets
45.51 s
gammaloop-nextest-docs> 5: <alphal00p_docs_builder::tests::portal_emits_routes_and_valid_assets::{closure#0} as core::ops::function::FnOnce<()>>::call_once
45.51 s
gammaloop-nextest-docs> note: Some details are omitted, run with `RUST_BACKTRACE=full` for a verbose backtrace.
45.51 s
gammaloop-nextest-docs>
45.51 s
gammaloop-nextest-docs> FAIL [ 0.010s] ( 55/129) alphal00p-docs-builder tests :: portal_task_chooser_routes_each_goal_to_the_registered_quickstart
45.51 s
gammaloop-nextest-docs> stdout ---
45.51 s
gammaloop-nextest-docs>
45.51 s
gammaloop-nextest-docs> running 1 test
45.51 s
gammaloop-nextest-docs> test tests::portal_task_chooser_routes_each_goal_to_the_registered_quickstart ... FAILED
45.51 s
gammaloop-nextest-docs>
45.51 s
gammaloop-nextest-docs> failures:
45.51 s
gammaloop-nextest-docs>
45.51 s
gammaloop-nextest-docs> failures:
45.51 s
gammaloop-nextest-docs> tests::portal_task_chooser_routes_each_goal_to_the_registered_quickstart
45.51 s
gammaloop-nextest-docs>
45.51 s
gammaloop-nextest-docs> test result: FAILED. 0 passed; 1 failed; 0 ignored; 0 measured; 128 filtered out; finished in 0.00s
45.51 s
gammaloop-nextest-docs>
45.51 s
gammaloop-nextest-docs> stderr ---
45.51 s
gammaloop-nextest-docs>
45.51 s
gammaloop-nextest-docs> thread 'tests::portal_task_chooser_routes_each_goal_to_the_registered_quickstart' (431) panicked at crates/alphal00p-docs-builder/src/lib.rs:9684:14:
45.51 s
gammaloop-nextest-docs> called `Result::unwrap()` on an `Err` value: failed to copy documentation asset crates/spynso3/typst/STIXTwoMath-Regular.woff2
45.51 s
gammaloop-nextest-docs>
45.51 s
gammaloop-nextest-docs> Caused by:
45.51 s
gammaloop-nextest-docs> No such file or directory (os error 2)
45.51 s
gammaloop-nextest-docs>
45.51 s
gammaloop-nextest-docs> Location:
45.51 s
gammaloop-nextest-docs> crates/alphal00p-docs-builder/src/lib.rs:2276:18
45.51 s
gammaloop-nextest-docs> stack backtrace:
45.51 s
gammaloop-nextest-docs> 0: __rustc::rust_begin_unwind
45.51 s
gammaloop-nextest-docs> 1: core::panicking::panic_fmt
45.51 s
gammaloop-nextest-docs> 2: core::result::unwrap_failed
45.51 s
gammaloop-nextest-docs> 3: alphal00p_docs_builder::tests::write_test_portal
45.51 s
gammaloop-nextest-docs> 4: alphal00p_docs_builder::tests::portal_task_chooser_routes_each_goal_to_the_registered_quickstart
45.51 s
gammaloop-nextest-docs> 5: <alphal00p_docs_builder::tests::portal_task_chooser_routes_each_goal_to_the_registered_quickstart::{closure#0} as core::ops::function::FnOnce<()>>::call_once
45.51 s
gammaloop-nextest-docs> note: Some details are omitted, run with `RUST_BACKTRACE=full` for a verbose backtrace.
45.51 s
gammaloop-nextest-docs>
45.51 s
gammaloop-nextest-docs> FAIL [ 0.012s] ( 56/129) alphal00p-docs-builder tests :: portal_and_developer_pages_use_federated_search_and_feedback
45.51 s
gammaloop-nextest-docs> stdout ---
45.51 s
gammaloop-nextest-docs>
45.51 s
gammaloop-nextest-docs> running 1 test
45.51 s
gammaloop-nextest-docs> test tests::portal_and_developer_pages_use_federated_search_and_feedback ... FAILED
45.51 s
gammaloop-nextest-docs>
45.51 s
gammaloop-nextest-docs> failures:
45.51 s
gammaloop-nextest-docs>
45.51 s
gammaloop-nextest-docs> failures:
45.51 s
gammaloop-nextest-docs> tests::portal_and_developer_pages_use_federated_search_and_feedback
45.51 s
gammaloop-nextest-docs>
45.51 s
gammaloop-nextest-docs> test result: FAILED. 0 passed; 1 failed; 0 ignored; 0 measured; 128 filtered out; finished in 0.01s
45.51 s
gammaloop-nextest-docs>
45.51 s
gammaloop-nextest-docs> stderr ---
45.51 s
gammaloop-nextest-docs>
45.51 s
gammaloop-nextest-docs> thread 'tests::portal_and_developer_pages_use_federated_search_and_feedback' (425) panicked at crates/alphal00p-docs-builder/src/lib.rs:9684:14:
45.51 s
gammaloop-nextest-docs> called `Result::unwrap()` on an `Err` value: failed to copy documentation asset crates/spynso3/typst/STIXTwoMath-Regular.woff2
45.51 s
gammaloop-nextest-docs>
45.51 s
gammaloop-nextest-docs> Caused by:
45.51 s
gammaloop-nextest-docs> No such file or directory (os error 2)
45.51 s
gammaloop-nextest-docs>
45.51 s
gammaloop-nextest-docs> Location:
45.51 s
gammaloop-nextest-docs> crates/alphal00p-docs-builder/src/lib.rs:2276:18
45.51 s
gammaloop-nextest-docs> stack backtrace:
45.51 s
gammaloop-nextest-docs> 0: __rustc::rust_begin_unwind
45.51 s
gammaloop-nextest-docs> 1: core::panicking::panic_fmt
45.51 s
gammaloop-nextest-docs> 2: core::result::unwrap_failed
45.51 s
gammaloop-nextest-docs> 3: alphal00p_docs_builder::tests::write_test_portal
45.51 s
gammaloop-nextest-docs> 4: alphal00p_docs_builder::tests::portal_and_developer_pages_use_federated_search_and_feedback
45.51 s
gammaloop-nextest-docs> 5: <alphal00p_docs_builder::tests::portal_and_developer_pages_use_federated_search_and_feedback::{closure#0} as core::ops::function::FnOnce<()>>::call_once
45.51 s
gammaloop-nextest-docs> note: Some details are omitted, run with `RUST_BACKTRACE=full` for a verbose backtrace.
45.51 s
gammaloop-nextest-docs>
45.51 s
gammaloop-nextest-docs> FAIL [ 0.118s] ( 86/129) alphal00p-docs-builder tests :: checked_in_registry_is_valid
45.51 s
gammaloop-nextest-docs> stdout ---
45.51 s
gammaloop-nextest-docs>
45.51 s
gammaloop-nextest-docs> running 1 test
45.51 s
gammaloop-nextest-docs> test tests::checked_in_registry_is_valid ... FAILED
45.51 s
gammaloop-nextest-docs>
45.51 s
gammaloop-nextest-docs> failures:
45.51 s
gammaloop-nextest-docs>
45.51 s
gammaloop-nextest-docs> failures:
45.51 s
gammaloop-nextest-docs> tests::checked_in_registry_is_valid
45.51 s
gammaloop-nextest-docs>
45.51 s
gammaloop-nextest-docs> test result: FAILED. 0 passed; 1 failed; 0 ignored; 0 measured; 128 filtered out; finished in 0.11s
45.51 s
gammaloop-nextest-docs>
45.51 s
gammaloop-nextest-docs> stderr ---
45.51 s
gammaloop-nextest-docs>
45.51 s
gammaloop-nextest-docs> thread 'tests::checked_in_registry_is_valid' (187) panicked at crates/alphal00p-docs-builder/src/lib.rs:12260:50:
45.51 s
gammaloop-nextest-docs> called `Result::unwrap()` on an `Err` value: required documentation source is missing: /build/source/crates/spynso3/typst/STIXTwoMath-Regular.woff2
45.51 s
gammaloop-nextest-docs>
45.51 s
gammaloop-nextest-docs> Location:
45.51 s
gammaloop-nextest-docs> crates/alphal00p-docs-builder/src/lib.rs:5103:9
45.51 s
gammaloop-nextest-docs> stack backtrace:
45.51 s
gammaloop-nextest-docs> 0: __rustc::rust_begin_unwind
45.51 s
gammaloop-nextest-docs> 1: core::panicking::panic_fmt
45.51 s
gammaloop-nextest-docs> 2: core::result::unwrap_failed
45.51 s
gammaloop-nextest-docs> 3: alphal00p_docs_builder::tests::checked_in_registry_is_valid
45.51 s
gammaloop-nextest-docs> 4: <alphal00p_docs_builder::tests::checked_in_registry_is_valid::{closure#0} as core::ops::function::FnOnce<()>>::call_once
45.51 s
gammaloop-nextest-docs> note: Some details are omitted, run with `RUST_BACKTRACE=full` for a verbose backtrace.
45.51 s
gammaloop-nextest-docs>
45.51 s
gammaloop-nextest-docs> FAIL [ 0.119s] ( 88/129) alphal00p-docs-builder provenance_tests :: each_build_captures_one_revision_before_rendering
45.51 s
gammaloop-nextest-docs> stdout ---
45.51 s
gammaloop-nextest-docs>
45.51 s
gammaloop-nextest-docs> running 1 test
45.51 s
gammaloop-nextest-docs>
45.51 s
gammaloop-nextest-docs> running 1 test
45.51 s
gammaloop-nextest-docs> test provenance_tests::each_build_captures_one_revision_before_rendering ... FAILED
45.51 s
gammaloop-nextest-docs>
45.51 s
gammaloop-nextest-docs> failures:
45.51 s
gammaloop-nextest-docs>
45.51 s
gammaloop-nextest-docs> failures:
45.51 s
gammaloop-nextest-docs> provenance_tests::each_build_captures_one_revision_before_rendering
45.51 s
gammaloop-nextest-docs>
45.51 s
gammaloop-nextest-docs> test result: FAILED. 0 passed; 1 failed; 0 ignored; 0 measured; 128 filtered out; finished in 0.10s
45.51 s
gammaloop-nextest-docs>
45.51 s
gammaloop-nextest-docs> test provenance_tests::each_build_captures_one_revision_before_rendering ... FAILED
45.51 s
gammaloop-nextest-docs>
45.51 s
gammaloop-nextest-docs> failures:
45.51 s
gammaloop-nextest-docs>
45.51 s
gammaloop-nextest-docs> failures:
45.51 s
gammaloop-nextest-docs> provenance_tests::each_build_captures_one_revision_before_rendering
45.51 s
gammaloop-nextest-docs>
45.51 s
gammaloop-nextest-docs> test result: FAILED. 0 passed; 1 failed; 0 ignored; 0 measured; 128 filtered out; finished in 0.11s
45.51 s
gammaloop-nextest-docs>
45.51 s
gammaloop-nextest-docs> stderr ---
45.51 s
gammaloop-nextest-docs>
45.51 s
gammaloop-nextest-docs> thread 'provenance_tests::each_build_captures_one_revision_before_rendering' (253) panicked at crates/alphal00p-docs-builder/src/provenance_tests.rs:297:14:
45.51 s
gammaloop-nextest-docs> called `Result::unwrap()` on an `Err` value: required documentation source is missing: /build/source/target/nix-ci-tmp/.tmpuiqmMo/checkout/crates/spynso3/typst/STIXTwoMath-Regular.woff2
45.51 s
gammaloop-nextest-docs>
45.51 s
gammaloop-nextest-docs> Location:
45.51 s
gammaloop-nextest-docs> crates/alphal00p-docs-builder/src/lib.rs:5103:9
45.51 s
gammaloop-nextest-docs> stack backtrace:
45.51 s
gammaloop-nextest-docs> 0: __rustc::rust_begin_unwind
45.51 s
gammaloop-nextest-docs> 1: core::panicking::panic_fmt
45.51 s
gammaloop-nextest-docs> 2: core::result::unwrap_failed
45.51 s
gammaloop-nextest-docs> 3: alphal00p_docs_builder::provenance_tests::each_build_captures_one_revision_before_rendering
45.51 s
gammaloop-nextest-docs> 4: <alphal00p_docs_builder::provenance_tests::each_build_captures_one_revision_before_rendering::{closure#0} as core::ops::function::FnOnce<()>>::call_once
45.51 s
gammaloop-nextest-docs> note: Some details are omitted, run with `RUST_BACKTRACE=full` for a verbose backtrace.
45.51 s
gammaloop-nextest-docs>
45.51 s
gammaloop-nextest-docs> thread 'provenance_tests::each_build_captures_one_revision_before_rendering' (170) panicked at crates/alphal00p-docs-builder/src/provenance_tests.rs:274:9:
45.51 s
gammaloop-nextest-docs> assertion failed: command.status().unwrap().success()
45.51 s
gammaloop-nextest-docs> stack backtrace:
45.51 s
gammaloop-nextest-docs> 0: __rustc::rust_begin_unwind
45.51 s
gammaloop-nextest-docs> 1: core::panicking::panic_fmt
45.51 s
gammaloop-nextest-docs> 2: core::panicking::panic
45.51 s
gammaloop-nextest-docs> 3: alphal00p_docs_builder::provenance_tests::each_build_captures_one_revision_before_rendering
45.51 s
gammaloop-nextest-docs> 4: <alphal00p_docs_builder::provenance_tests::each_build_captures_one_revision_before_rendering::{closure#0} as core::ops::function::FnOnce<()>>::call_once
45.51 s
gammaloop-nextest-docs> note: Some details are omitted, run with `RUST_BACKTRACE=full` for a verbose backtrace.
45.51 s
gammaloop-nextest-docs>
45.51 s
gammaloop-nextest-docs> FAIL [ 0.010s] ( 89/129) alphal00p-docs-builder tests :: site_assets_replace_read_only_generated_files
45.51 s
gammaloop-nextest-docs> stdout ---
45.51 s
gammaloop-nextest-docs>
45.51 s
gammaloop-nextest-docs> running 1 test
45.51 s
gammaloop-nextest-docs> test tests::site_assets_replace_read_only_generated_files ... FAILED
45.51 s
gammaloop-nextest-docs>
45.51 s
gammaloop-nextest-docs> failures:
45.51 s
gammaloop-nextest-docs>
45.51 s
gammaloop-nextest-docs> failures:
45.51 s
gammaloop-nextest-docs> tests::site_assets_replace_read_only_generated_files
45.51 s
gammaloop-nextest-docs>
45.51 s
gammaloop-nextest-docs> test result: FAILED. 0 passed; 1 failed; 0 ignored; 0 measured; 128 filtered out; finished in 0.01s
45.51 s
gammaloop-nextest-docs>
45.51 s
gammaloop-nextest-docs> stderr ---
45.51 s
gammaloop-nextest-docs>
45.51 s
gammaloop-nextest-docs> thread 'tests::site_assets_replace_read_only_generated_files' (670) panicked at crates/alphal00p-docs-builder/src/lib.rs:12305:50:
45.51 s
gammaloop-nextest-docs> called `Result::unwrap()` on an `Err` value: failed to copy documentation asset crates/spynso3/typst/STIXTwoMath-Regular.woff2
45.51 s
gammaloop-nextest-docs>
45.51 s
gammaloop-nextest-docs> Caused by:
45.51 s
gammaloop-nextest-docs> No such file or directory (os error 2)
45.51 s
gammaloop-nextest-docs>
45.51 s
gammaloop-nextest-docs> Location:
45.51 s
gammaloop-nextest-docs> crates/alphal00p-docs-builder/src/lib.rs:2276:18
45.51 s
gammaloop-nextest-docs> stack backtrace:
45.51 s
gammaloop-nextest-docs> 0: __rustc::rust_begin_unwind
45.51 s
gammaloop-nextest-docs> 1: core::panicking::panic_fmt
45.51 s
gammaloop-nextest-docs> 2: core::result::unwrap_failed
45.51 s
gammaloop-nextest-docs> 3: alphal00p_docs_builder::tests::site_assets_replace_read_only_generated_files
45.51 s
gammaloop-nextest-docs> 4: <alphal00p_docs_builder::tests::site_assets_replace_read_only_generated_files::{closure#0} as core::ops::function::FnOnce<()>>::call_once
45.51 s
gammaloop-nextest-docs> note: Some details are omitted, run with `RUST_BACKTRACE=full` for a verbose backtrace.
45.51 s
gammaloop-nextest-docs>
45.51 s
gammaloop-nextest-docs> FAIL [ 0.108s] ( 90/129) alphal00p-docs-builder tests :: developer_scope_ranges_ignore_unrelated_edits_and_warn_only_while_watching
45.51 s
gammaloop-nextest-docs> stdout ---
45.51 s
gammaloop-nextest-docs>
45.51 s
gammaloop-nextest-docs> running 1 test
45.51 s
gammaloop-nextest-docs> test tests::developer_scope_ranges_ignore_unrelated_edits_and_warn_only_while_watching ... FAILED
45.51 s
gammaloop-nextest-docs>
45.51 s
gammaloop-nextest-docs> failures:
45.51 s
gammaloop-nextest-docs>
45.51 s
gammaloop-nextest-docs> failures:
45.51 s
gammaloop-nextest-docs> tests::developer_scope_ranges_ignore_unrelated_edits_and_warn_only_while_watching
45.51 s
gammaloop-nextest-docs>
45.51 s
gammaloop-nextest-docs> test result: FAILED. 0 passed; 1 failed; 0 ignored; 0 measured; 128 filtered out; finished in 0.10s
45.51 s
gammaloop-nextest-docs>
45.51 s
gammaloop-nextest-docs> stderr ---
45.51 s
gammaloop-nextest-docs>
45.51 s
gammaloop-nextest-docs> thread 'tests::developer_scope_ranges_ignore_unrelated_edits_and_warn_only_while_watching' (287) panicked at crates/alphal00p-docs-builder/src/lib.rs:12350:29:
45.51 s
gammaloop-nextest-docs> called `Result::unwrap()` on an `Err` value: required documentation source is missing: /build/source/crates/spynso3/typst/STIXTwoMath-Regular.woff2
45.51 s
gammaloop-nextest-docs>
45.51 s
gammaloop-nextest-docs> Location:
45.51 s
gammaloop-nextest-docs> crates/alphal00p-docs-builder/src/lib.rs:5103:9
45.51 s
gammaloop-nextest-docs> stack backtrace:
45.51 s
gammaloop-nextest-docs> 0: __rustc::rust_begin_unwind
45.51 s
gammaloop-nextest-docs> 1: core::panicking::panic_fmt
45.51 s
gammaloop-nextest-docs> 2: core::result::unwrap_failed
45.51 s
gammaloop-nextest-docs> 3: alphal00p_docs_builder::tests::developer_scope_ranges_ignore_unrelated_edits_and_warn_only_while_watching
45.51 s
gammaloop-nextest-docs> 4: <alphal00p_docs_builder::tests::developer_scope_ranges_ignore_unrelated_edits_and_warn_only_while_watching::{closure#0} as core::ops::function::FnOnce<()>>::call_once
45.51 s
gammaloop-nextest-docs> note: Some details are omitted, run with `RUST_BACKTRACE=full` for a verbose backtrace.
45.51 s
gammaloop-nextest-docs>
45.51 s
gammaloop-nextest-docs> FAIL [ 0.127s] (121/129) alphal00p-docs-builder tests :: every_product_requires_a_task_chooser_and_each_supported_interface
45.51 s
gammaloop-nextest-docs> stdout ---
45.51 s
gammaloop-nextest-docs>
45.51 s
gammaloop-nextest-docs> running 1 test
45.51 s
gammaloop-nextest-docs> test tests::every_product_requires_a_task_chooser_and_each_supported_interface ... FAILED
45.51 s
gammaloop-nextest-docs>
45.51 s
gammaloop-nextest-docs> failures:
45.51 s
gammaloop-nextest-docs>
45.51 s
gammaloop-nextest-docs> failures:
45.51 s
gammaloop-nextest-docs> tests::every_product_requires_a_task_chooser_and_each_supported_interface
45.51 s
gammaloop-nextest-docs>
45.51 s
gammaloop-nextest-docs> test result: FAILED. 0 passed; 1 failed; 0 ignored; 0 measured; 128 filtered out; finished in 0.12s
45.51 s
gammaloop-nextest-docs>
45.51 s
gammaloop-nextest-docs> stderr ---
45.51 s
gammaloop-nextest-docs>
45.51 s
gammaloop-nextest-docs> thread 'tests::every_product_requires_a_task_chooser_and_each_supported_interface' (327) panicked at crates/alphal00p-docs-builder/src/lib.rs:12274:9:
45.51 s
gammaloop-nextest-docs> assertion failed: format!("{error:#}").contains("has no quickstart page")
45.51 s
gammaloop-nextest-docs> stack backtrace:
45.51 s
gammaloop-nextest-docs> 0: __rustc::rust_begin_unwind
45.51 s
gammaloop-nextest-docs> 1: core::panicking::panic_fmt
45.51 s
gammaloop-nextest-docs> 2: core::panicking::panic
45.51 s
gammaloop-nextest-docs> 3: alphal00p_docs_builder::tests::every_product_requires_a_task_chooser_and_each_supported_interface
45.51 s
gammaloop-nextest-docs> 4: <alphal00p_docs_builder::tests::every_product_requires_a_task_chooser_and_each_supported_interface::{closure#0} as core::ops::function::FnOnce<()>>::call_once
45.51 s
gammaloop-nextest-docs> note: Some details are omitted, run with `RUST_BACKTRACE=full` for a verbose backtrace.
45.51 s
gammaloop-nextest-docs>
45.51 s
gammaloop-nextest-docs> FAIL [ 0.111s] (122/129) alphal00p-docs-builder tests :: pdf_manual_chapter_order_must_match_the_page_registry
45.51 s
gammaloop-nextest-docs> stdout ---
45.51 s
gammaloop-nextest-docs>
45.51 s
gammaloop-nextest-docs> running 1 test
45.51 s
gammaloop-nextest-docs> test tests::pdf_manual_chapter_order_must_match_the_page_registry ... FAILED
45.51 s
gammaloop-nextest-docs>
45.51 s
gammaloop-nextest-docs> failures:
45.51 s
gammaloop-nextest-docs>
45.51 s
gammaloop-nextest-docs> failures:
45.51 s
gammaloop-nextest-docs> tests::pdf_manual_chapter_order_must_match_the_page_registry
45.51 s
gammaloop-nextest-docs>
45.51 s
gammaloop-nextest-docs> test result: FAILED. 0 passed; 1 failed; 0 ignored; 0 measured; 128 filtered out; finished in 0.11s
45.51 s
gammaloop-nextest-docs>
45.51 s
gammaloop-nextest-docs> stderr ---
45.51 s
gammaloop-nextest-docs>
45.51 s
gammaloop-nextest-docs> thread 'tests::pdf_manual_chapter_order_must_match_the_page_registry' (396) panicked at crates/alphal00p-docs-builder/src/lib.rs:12330:9:
45.51 s
gammaloop-nextest-docs> assertion failed: format!("{error:#}").contains("PDF manual chapter order differs")
45.51 s
gammaloop-nextest-docs> stack backtrace:
45.51 s
gammaloop-nextest-docs> 0: __rustc::rust_begin_unwind
45.51 s
gammaloop-nextest-docs> 1: core::panicking::panic_fmt
45.51 s
gammaloop-nextest-docs> 2: core::panicking::panic
45.51 s
gammaloop-nextest-docs> 3: alphal00p_docs_builder::tests::pdf_manual_chapter_order_must_match_the_page_registry
45.51 s
gammaloop-nextest-docs> 4: <alphal00p_docs_builder::tests::pdf_manual_chapter_order_must_match_the_page_registry::{closure#0} as core::ops::function::FnOnce<()>>::call_once
45.51 s
gammaloop-nextest-docs> note: Some details are omitted, run with `RUST_BACKTRACE=full` for a verbose backtrace.
45.51 s
gammaloop-nextest-docs>
45.51 s
gammaloop-nextest-docs> error : test run failed
45.54 s
gammaloop-nextest-docs>
45.54 s
gammaloop-nextest-docs> ========== nextest test summary ==========
45.54 s
gammaloop-nextest-docs> report: target/nextest/ci_gammaloop/junit.xml
45.54 s
gammaloop-nextest-docs> tests: 129, failures: 11, errors: 0
45.54 s
gammaloop-nextest-docs>
45.54 s
gammaloop-nextest-docs> 1. alphal00p-docs-builder::tests::developer_architecture_is_classified_searchable_and_source_backed
45.54 s
gammaloop-nextest-docs> failure: test failure with exit code 101
45.54 s
gammaloop-nextest-docs> thread 'tests::developer_architecture_is_classified_searchable_and_source_backed' (289) panicked at crates/alphal00p-docs-builder/src/lib.rs:12751:14:
45.54 s
gammaloop-nextest-docs> called `Result::unwrap()` on an `Err` value: failed to copy documentation asset crates/spynso3/typst/STIXTwoMath-Regular.woff2
45.54 s
gammaloop-nextest-docs>
45.54 s
gammaloop-nextest-docs> Caused by:
45.54 s
gammaloop-nextest-docs> No such file or directory (os error 2)
45.54 s
gammaloop-nextest-docs>
45.54 s
gammaloop-nextest-docs> Location:
45.54 s
gammaloop-nextest-docs> crates/alphal00p-docs-builder/src/lib.rs:2276:18
45.54 s
gammaloop-nextest-docs> stack backtrace:
45.54 s
gammaloop-nextest-docs> 0: __rustc::rust_begin_unwind
45.54 s
gammaloop-nextest-docs> 1: core::panicking::panic_fmt
45.54 s
gammaloop-nextest-docs> 2: core::result::unwrap_failed
45.54 s
gammaloop-nextest-docs> 3: alphal00p_docs_builder::tests::developer_architecture_is_classified_searchable_and_source_backed
45.54 s
gammaloop-nextest-docs> 4: <alphal00p_docs_builder::tests::developer_architecture_is_classified_searchable_and_source_backed::{closure#0} as core::ops::function::FnOnce<()>>::call_once
45.54 s
gammaloop-nextest-docs> note: Some details are omitted, run with `RUST_BACKTRACE=full` for a verbose backtrace.
45.54 s
gammaloop-nextest-docs> system-out
45.54 s
gammaloop-nextest-docs> running 1 test
45.54 s
gammaloop-nextest-docs> test tests::developer_architecture_is_classified_searchable_and_source_backed ... FAILED
45.54 s
gammaloop-nextest-docs>
45.54 s
gammaloop-nextest-docs> failures:
45.54 s
gammaloop-nextest-docs>
45.54 s
gammaloop-nextest-docs> failures:
45.54 s
gammaloop-nextest-docs> tests::developer_architecture_is_classified_searchable_and_source_backed
45.54 s
gammaloop-nextest-docs>
45.54 s
gammaloop-nextest-docs> test result: FAILED. 0 passed; 1 failed; 0 ignored; 0 measured; 128 filtered out; finished in 0.01s
45.54 s
gammaloop-nextest-docs> system-err
45.54 s
gammaloop-nextest-docs> thread 'tests::developer_architecture_is_classified_searchable_and_source_backed' (289) panicked at crates/alphal00p-docs-builder/src/lib.rs:12751:14:
45.54 s
gammaloop-nextest-docs> called `Result::unwrap()` on an `Err` value: failed to copy documentation asset crates/spynso3/typst/STIXTwoMath-Regular.woff2
45.54 s
gammaloop-nextest-docs>
45.54 s
gammaloop-nextest-docs> Caused by:
45.54 s
gammaloop-nextest-docs> No such file or directory (os error 2)
45.54 s
gammaloop-nextest-docs>
45.54 s
gammaloop-nextest-docs> Location:
45.54 s
gammaloop-nextest-docs> crates/alphal00p-docs-builder/src/lib.rs:2276:18
45.54 s
gammaloop-nextest-docs> stack backtrace:
45.54 s
gammaloop-nextest-docs> 0: __rustc::rust_begin_unwind
45.54 s
gammaloop-nextest-docs> 1: core::panicking::panic_fmt
45.54 s
gammaloop-nextest-docs> 2: core::result::unwrap_failed
45.54 s
gammaloop-nextest-docs> 3: alphal00p_docs_builder::tests::developer_architecture_is_classified_searchable_and_source_backed
45.54 s
gammaloop-nextest-docs> 4: <alphal00p_docs_builder::tests::developer_architecture_is_classified_searchable_and_source_backed::{closure#0} as core::ops::function::FnOnce<()>>::call_once
45.54 s
gammaloop-nextest-docs> note: Some details are omitted, run with `RUST_BACKTRACE=full` for a verbose backtrace.
45.54 s
gammaloop-nextest-docs>
45.54 s
gammaloop-nextest-docs> 2. alphal00p-docs-builder::tests::every_product_orients_rust_to_native_rustdoc_and_keeps_legacy_redirects
45.54 s
gammaloop-nextest-docs> failure: test failure with exit code 101
45.54 s
gammaloop-nextest-docs> thread 'tests::every_product_orients_rust_to_native_rustdoc_and_keeps_legacy_redirects' (309) panicked at crates/alphal00p-docs-builder/src/lib.rs:12555:46:
45.54 s
gammaloop-nextest-docs> called `Result::unwrap()` on an `Err` value: failed to copy documentation asset crates/spynso3/typst/STIXTwoMath-Regular.woff2
45.54 s
gammaloop-nextest-docs>
45.54 s
gammaloop-nextest-docs> Caused by:
45.54 s
gammaloop-nextest-docs> No such file or directory (os error 2)
45.54 s
gammaloop-nextest-docs>
45.54 s
gammaloop-nextest-docs> Location:
45.54 s
gammaloop-nextest-docs> crates/alphal00p-docs-builder/src/lib.rs:2276:18
45.54 s
gammaloop-nextest-docs> stack backtrace:
45.54 s
gammaloop-nextest-docs> 0: __rustc::rust_begin_unwind
45.54 s
gammaloop-nextest-docs> 1: core::panicking::panic_fmt
45.54 s
gammaloop-nextest-docs> 2: core::result::unwrap_failed
45.54 s
gammaloop-nextest-docs> 3: alphal00p_docs_builder::tests::every_product_orients_rust_to_native_rustdoc_and_keeps_legacy_redirects
45.54 s
gammaloop-nextest-docs> 4: <alphal00p_docs_builder::tests::every_product_orients_rust_to_native_rustdoc_and_keeps_legacy_redirects::{closure#0} as core::ops::function::FnOnce<()>>::call_once
45.54 s
gammaloop-nextest-docs> note: Some details are omitted, run with `RUST_BACKTRACE=full` for a verbose backtrace.
45.54 s
gammaloop-nextest-docs> system-out
45.54 s
gammaloop-nextest-docs> running 1 test
45.54 s
gammaloop-nextest-docs> test tests::every_product_orients_rust_to_native_rustdoc_and_keeps_legacy_redirects ... FAILED
45.54 s
gammaloop-nextest-docs>
45.54 s
gammaloop-nextest-docs> failures:
45.54 s
gammaloop-nextest-docs>
45.54 s
gammaloop-nextest-docs> failures:
45.54 s
gammaloop-nextest-docs> tests::every_product_orients_rust_to_native_rustdoc_and_keeps_legacy_redirects
45.54 s
gammaloop-nextest-docs>
45.54 s
gammaloop-nextest-docs> test result: FAILED. 0 passed; 1 failed; 0 ignored; 0 measured; 128 filtered out; finished in 0.00s
45.54 s
gammaloop-nextest-docs> system-err
45.54 s
gammaloop-nextest-docs> thread 'tests::every_product_orients_rust_to_native_rustdoc_and_keeps_legacy_redirects' (309) panicked at crates/alphal00p-docs-builder/src/lib.rs:12555:46:
45.54 s
gammaloop-nextest-docs> called `Result::unwrap()` on an `Err` value: failed to copy documentation asset crates/spynso3/typst/STIXTwoMath-Regular.woff2
45.54 s
gammaloop-nextest-docs>
45.54 s
gammaloop-nextest-docs> Caused by:
45.54 s
gammaloop-nextest-docs> No such file or directory (os error 2)
45.54 s
gammaloop-nextest-docs>
45.54 s
gammaloop-nextest-docs> Location:
45.54 s
gammaloop-nextest-docs> crates/alphal00p-docs-builder/src/lib.rs:2276:18
45.54 s
gammaloop-nextest-docs> stack backtrace:
45.54 s
gammaloop-nextest-docs> 0: __rustc::rust_begin_unwind
45.54 s
gammaloop-nextest-docs> 1: core::panicking::panic_fmt
45.54 s
gammaloop-nextest-docs> 2: core::result::unwrap_failed
45.54 s
gammaloop-nextest-docs> 3: alphal00p_docs_builder::tests::every_product_orients_rust_to_native_rustdoc_and_keeps_legacy_redirects
45.54 s
gammaloop-nextest-docs> 4: <alphal00p_docs_builder::tests::every_product_orients_rust_to_native_rustdoc_and_keeps_legacy_redirects::{closure#0} as core::ops::function::FnOnce<()>>::call_once
45.54 s
gammaloop-nextest-docs> note: Some details are omitted, run with `RUST_BACKTRACE=full` for a verbose backtrace.
45.54 s
gammaloop-nextest-docs>
45.54 s
gammaloop-nextest-docs> 3. alphal00p-docs-builder::tests::portal_emits_routes_and_valid_assets
45.54 s
gammaloop-nextest-docs> failure: test failure with exit code 101
45.54 s
gammaloop-nextest-docs> thread 'tests::portal_emits_routes_and_valid_assets' (424) panicked at crates/alphal00p-docs-builder/src/lib.rs:9684:14:
45.54 s
gammaloop-nextest-docs> called `Result::unwrap()` on an `Err` value: failed to copy documentation asset crates/spynso3/typst/STIXTwoMath-Regular.woff2
45.54 s
gammaloop-nextest-docs>
45.54 s
gammaloop-nextest-docs> Caused by:
45.54 s
gammaloop-nextest-docs> No such file or directory (os error 2)
45.54 s
gammaloop-nextest-docs>
45.54 s
gammaloop-nextest-docs> Location:
45.54 s
gammaloop-nextest-docs> crates/alphal00p-docs-builder/src/lib.rs:2276:18
45.54 s
gammaloop-nextest-docs> stack backtrace:
45.54 s
gammaloop-nextest-docs> 0: __rustc::rust_begin_unwind
45.54 s
gammaloop-nextest-docs> 1: core::panicking::panic_fmt
45.54 s
gammaloop-nextest-docs> 2: core::result::unwrap_failed
45.54 s
gammaloop-nextest-docs> 3: alphal00p_docs_builder::tests::write_test_portal
45.54 s
gammaloop-nextest-docs> 4: alphal00p_docs_builder::tests::portal_emits_routes_and_valid_assets
45.54 s
gammaloop-nextest-docs> 5: <alphal00p_docs_builder::tests::portal_emits_routes_and_valid_assets::{closure#0} as core::ops::function::FnOnce<()>>::call_once
45.54 s
gammaloop-nextest-docs> note: Some details are omitted, run with `RUST_BACKTRACE=full` for a verbose backtrace.
45.54 s
gammaloop-nextest-docs> system-out
45.54 s
gammaloop-nextest-docs> running 1 test
45.54 s
gammaloop-nextest-docs> test tests::portal_emits_routes_and_valid_assets ... FAILED
45.54 s
gammaloop-nextest-docs>
45.54 s
gammaloop-nextest-docs> failures:
45.54 s
gammaloop-nextest-docs>
45.54 s
gammaloop-nextest-docs> failures:
45.54 s
gammaloop-nextest-docs> tests::portal_emits_routes_and_valid_assets
45.54 s
gammaloop-nextest-docs>
45.54 s
gammaloop-nextest-docs> test result: FAILED. 0 passed; 1 failed; 0 ignored; 0 measured; 128 filtered out; finished in 0.01s
45.54 s
gammaloop-nextest-docs> system-err
45.54 s
gammaloop-nextest-docs> thread 'tests::portal_emits_routes_and_valid_assets' (424) panicked at crates/alphal00p-docs-builder/src/lib.rs:9684:14:
45.54 s
gammaloop-nextest-docs> called `Result::unwrap()` on an `Err` value: failed to copy documentation asset crates/spynso3/typst/STIXTwoMath-Regular.woff2
45.54 s
gammaloop-nextest-docs>
45.54 s
gammaloop-nextest-docs> Caused by:
45.54 s
gammaloop-nextest-docs> No such file or directory (os error 2)
45.54 s
gammaloop-nextest-docs>
45.54 s
gammaloop-nextest-docs> Location:
45.54 s
gammaloop-nextest-docs> crates/alphal00p-docs-builder/src/lib.rs:2276:18
45.54 s
gammaloop-nextest-docs> stack backtrace:
45.54 s
gammaloop-nextest-docs> 0: __rustc::rust_begin_unwind
45.54 s
gammaloop-nextest-docs> 1: core::panicking::panic_fmt
45.54 s
gammaloop-nextest-docs> 2: core::result::unwrap_failed
45.54 s
gammaloop-nextest-docs> 3: alphal00p_docs_builder::tests::write_test_portal
45.54 s
gammaloop-nextest-docs> 4: alphal00p_docs_builder::tests::portal_emits_routes_and_valid_assets
45.54 s
gammaloop-nextest-docs> 5: <alphal00p_docs_builder::tests::portal_emits_routes_and_valid_assets::{closure#0} as core::ops::function::FnOnce<()>>::call_once
45.54 s
gammaloop-nextest-docs> note: Some details are omitted, run with `RUST_BACKTRACE=full` for a verbose backtrace.
45.54 s
gammaloop-nextest-docs>
45.54 s
gammaloop-nextest-docs> 4. alphal00p-docs-builder::tests::portal_task_chooser_routes_each_goal_to_the_registered_quickstart
45.54 s
gammaloop-nextest-docs> failure: test failure with exit code 101
45.54 s
gammaloop-nextest-docs> thread 'tests::portal_task_chooser_routes_each_goal_to_the_registered_quickstart' (431) panicked at crates/alphal00p-docs-builder/src/lib.rs:9684:14:
45.54 s
gammaloop-nextest-docs> called `Result::unwrap()` on an `Err` value: failed to copy documentation asset crates/spynso3/typst/STIXTwoMath-Regular.woff2
45.54 s
gammaloop-nextest-docs>
45.54 s
gammaloop-nextest-docs> Caused by:
45.54 s
gammaloop-nextest-docs> No such file or directory (os error 2)
45.54 s
gammaloop-nextest-docs>
45.54 s
gammaloop-nextest-docs> Location:
45.54 s
gammaloop-nextest-docs> crates/alphal00p-docs-builder/src/lib.rs:2276:18
45.54 s
gammaloop-nextest-docs> stack backtrace:
45.54 s
gammaloop-nextest-docs> 0: __rustc::rust_begin_unwind
45.54 s
gammaloop-nextest-docs> 1: core::panicking::panic_fmt
45.54 s
gammaloop-nextest-docs> 2: core::result::unwrap_failed
45.54 s
gammaloop-nextest-docs> 3: alphal00p_docs_builder::tests::write_test_portal
45.54 s
gammaloop-nextest-docs> 4: alphal00p_docs_builder::tests::portal_task_chooser_routes_each_goal_to_the_registered_quickstart
45.54 s
gammaloop-nextest-docs> 5: <alphal00p_docs_builder::tests::portal_task_chooser_routes_each_goal_to_the_registered_quickstart::{closure#0} as core::ops::function::FnOnce<()>>::call_once
45.54 s
gammaloop-nextest-docs> note: Some details are omitted, run with `RUST_BACKTRACE=full` for a verbose backtrace.
45.54 s
gammaloop-nextest-docs> system-out
45.54 s
gammaloop-nextest-docs> running 1 test
45.54 s
gammaloop-nextest-docs> test tests::portal_task_chooser_routes_each_goal_to_the_registered_quickstart ... FAILED
45.54 s
gammaloop-nextest-docs>
45.54 s
gammaloop-nextest-docs> failures:
45.54 s
gammaloop-nextest-docs>
45.54 s
gammaloop-nextest-docs> failures:
45.54 s
gammaloop-nextest-docs> tests::portal_task_chooser_routes_each_goal_to_the_registered_quickstart
45.54 s
gammaloop-nextest-docs>
45.54 s
gammaloop-nextest-docs> test result: FAILED. 0 passed; 1 failed; 0 ignored; 0 measured; 128 filtered out; finished in 0.00s
45.54 s
gammaloop-nextest-docs> system-err
45.54 s
gammaloop-nextest-docs> thread 'tests::portal_task_chooser_routes_each_goal_to_the_registered_quickstart' (431) panicked at crates/alphal00p-docs-builder/src/lib.rs:9684:14:
45.54 s
gammaloop-nextest-docs> called `Result::unwrap()` on an `Err` value: failed to copy documentation asset crates/spynso3/typst/STIXTwoMath-Regular.woff2
45.54 s
gammaloop-nextest-docs>
45.54 s
gammaloop-nextest-docs> Caused by:
45.54 s
gammaloop-nextest-docs> No such file or directory (os error 2)
45.54 s
gammaloop-nextest-docs>
45.54 s
gammaloop-nextest-docs> Location:
45.54 s
gammaloop-nextest-docs> crates/alphal00p-docs-builder/src/lib.rs:2276:18
45.54 s
gammaloop-nextest-docs> stack backtrace:
45.54 s
gammaloop-nextest-docs> 0: __rustc::rust_begin_unwind
45.54 s
gammaloop-nextest-docs> 1: core::panicking::panic_fmt
45.54 s
gammaloop-nextest-docs> 2: core::result::unwrap_failed
45.54 s
gammaloop-nextest-docs> 3: alphal00p_docs_builder::tests::write_test_portal
45.54 s
gammaloop-nextest-docs> 4: alphal00p_docs_builder::tests::portal_task_chooser_routes_each_goal_to_the_registered_quickstart
45.54 s
gammaloop-nextest-docs> 5: <alphal00p_docs_builder::tests::portal_task_chooser_routes_each_goal_to_the_registered_quickstart::{closure#0} as core::ops::function::FnOnce<()>>::call_once
45.54 s
gammaloop-nextest-docs> note: Some details are omitted, run with `RUST_BACKTRACE=full` for a verbose backtrace.
45.54 s
gammaloop-nextest-docs>
45.54 s
gammaloop-nextest-docs> 5. alphal00p-docs-builder::tests::portal_and_developer_pages_use_federated_search_and_feedback
45.54 s
gammaloop-nextest-docs> failure: test failure with exit code 101
45.54 s
gammaloop-nextest-docs> thread 'tests::portal_and_developer_pages_use_federated_search_and_feedback' (425) panicked at crates/alphal00p-docs-builder/src/lib.rs:9684:14:
45.54 s
gammaloop-nextest-docs> called `Result::unwrap()` on an `Err` value: failed to copy documentation asset crates/spynso3/typst/STIXTwoMath-Regular.woff2
45.54 s
gammaloop-nextest-docs>
45.54 s
gammaloop-nextest-docs> Caused by:
45.54 s
gammaloop-nextest-docs> No such file or directory (os error 2)
45.54 s
gammaloop-nextest-docs>
45.54 s
gammaloop-nextest-docs> Location:
45.54 s
gammaloop-nextest-docs> crates/alphal00p-docs-builder/src/lib.rs:2276:18
45.54 s
gammaloop-nextest-docs> stack backtrace:
45.54 s
gammaloop-nextest-docs> 0: __rustc::rust_begin_unwind
45.54 s
gammaloop-nextest-docs> 1: core::panicking::panic_fmt
45.54 s
gammaloop-nextest-docs> 2: core::result::unwrap_failed
45.54 s
gammaloop-nextest-docs> 3: alphal00p_docs_builder::tests::write_test_portal
45.54 s
gammaloop-nextest-docs> 4: alphal00p_docs_builder::tests::portal_and_developer_pages_use_federated_search_and_feedback
45.54 s
gammaloop-nextest-docs> 5: <alphal00p_docs_builder::tests::portal_and_developer_pages_use_federated_search_and_feedback::{closure#0} as core::ops::function::FnOnce<()>>::call_once
45.54 s
gammaloop-nextest-docs> note: Some details are omitted, run with `RUST_BACKTRACE=full` for a verbose backtrace.
45.54 s
gammaloop-nextest-docs> system-out
45.54 s
gammaloop-nextest-docs> running 1 test
45.54 s
gammaloop-nextest-docs> test tests::portal_and_developer_pages_use_federated_search_and_feedback ... FAILED
45.54 s
gammaloop-nextest-docs>
45.54 s
gammaloop-nextest-docs> failures:
45.54 s
gammaloop-nextest-docs>
45.54 s
gammaloop-nextest-docs> failures:
45.54 s
gammaloop-nextest-docs> tests::portal_and_developer_pages_use_federated_search_and_feedback
45.54 s
gammaloop-nextest-docs>
45.54 s
gammaloop-nextest-docs> test result: FAILED. 0 passed; 1 failed; 0 ignored; 0 measured; 128 filtered out; finished in 0.01s
45.54 s
gammaloop-nextest-docs> system-err
45.54 s
gammaloop-nextest-docs> thread 'tests::portal_and_developer_pages_use_federated_search_and_feedback' (425) panicked at crates/alphal00p-docs-builder/src/lib.rs:9684:14:
45.54 s
gammaloop-nextest-docs> called `Result::unwrap()` on an `Err` value: failed to copy documentation asset crates/spynso3/typst/STIXTwoMath-Regular.woff2
45.54 s
gammaloop-nextest-docs>
45.54 s
gammaloop-nextest-docs> Caused by:
45.54 s
gammaloop-nextest-docs> No such file or directory (os error 2)
45.54 s
gammaloop-nextest-docs>
45.54 s
gammaloop-nextest-docs> Location:
45.54 s
gammaloop-nextest-docs> crates/alphal00p-docs-builder/src/lib.rs:2276:18
45.54 s
gammaloop-nextest-docs> stack backtrace:
45.54 s
gammaloop-nextest-docs> 0: __rustc::rust_begin_unwind
45.54 s
gammaloop-nextest-docs> 1: core::panicking::panic_fmt
45.54 s
gammaloop-nextest-docs> 2: core::result::unwrap_failed
45.54 s
gammaloop-nextest-docs> 3: alphal00p_docs_builder::tests::write_test_portal
45.54 s
gammaloop-nextest-docs> 4: alphal00p_docs_builder::tests::portal_and_developer_pages_use_federated_search_and_feedback
45.54 s
gammaloop-nextest-docs> 5: <alphal00p_docs_builder::tests::portal_and_developer_pages_use_federated_search_and_feedback::{closure#0} as core::ops::function::FnOnce<()>>::call_once
45.54 s
gammaloop-nextest-docs> note: Some details are omitted, run with `RUST_BACKTRACE=full` for a verbose backtrace.
45.54 s
gammaloop-nextest-docs>
45.54 s
gammaloop-nextest-docs> 6. alphal00p-docs-builder::tests::checked_in_registry_is_valid
45.54 s
gammaloop-nextest-docs> failure: test failure with exit code 101
45.54 s
gammaloop-nextest-docs> thread 'tests::checked_in_registry_is_valid' (187) panicked at crates/alphal00p-docs-builder/src/lib.rs:12260:50:
45.54 s
gammaloop-nextest-docs> called `Result::unwrap()` on an `Err` value: required documentation source is missing: /build/source/crates/spynso3/typst/STIXTwoMath-Regular.woff2
45.54 s
gammaloop-nextest-docs>
45.54 s
gammaloop-nextest-docs> Location:
45.54 s
gammaloop-nextest-docs> crates/alphal00p-docs-builder/src/lib.rs:5103:9
45.54 s
gammaloop-nextest-docs> stack backtrace:
45.54 s
gammaloop-nextest-docs> 0: __rustc::rust_begin_unwind
45.54 s
gammaloop-nextest-docs> 1: core::panicking::panic_fmt
45.54 s
gammaloop-nextest-docs> 2: core::result::unwrap_failed
45.54 s
gammaloop-nextest-docs> 3: alphal00p_docs_builder::tests::checked_in_registry_is_valid
45.54 s
gammaloop-nextest-docs> 4: <alphal00p_docs_builder::tests::checked_in_registry_is_valid::{closure#0} as core::ops::function::FnOnce<()>>::call_once
45.54 s
gammaloop-nextest-docs> note: Some details are omitted, run with `RUST_BACKTRACE=full` for a verbose backtrace.
45.54 s
gammaloop-nextest-docs> system-out
45.54 s
gammaloop-nextest-docs> running 1 test
45.54 s
gammaloop-nextest-docs> test tests::checked_in_registry_is_valid ... FAILED
45.54 s
gammaloop-nextest-docs>
45.54 s
gammaloop-nextest-docs> failures:
45.54 s
gammaloop-nextest-docs>
45.54 s
gammaloop-nextest-docs> failures:
45.54 s
gammaloop-nextest-docs> tests::checked_in_registry_is_valid
45.54 s
gammaloop-nextest-docs>
45.54 s
gammaloop-nextest-docs> test result: FAILED. 0 passed; 1 failed; 0 ignored; 0 measured; 128 filtered out; finished in 0.11s
45.54 s
gammaloop-nextest-docs> system-err
45.54 s
gammaloop-nextest-docs> thread 'tests::checked_in_registry_is_valid' (187) panicked at crates/alphal00p-docs-builder/src/lib.rs:12260:50:
45.54 s
gammaloop-nextest-docs> called `Result::unwrap()` on an `Err` value: required documentation source is missing: /build/source/crates/spynso3/typst/STIXTwoMath-Regular.woff2
45.54 s
gammaloop-nextest-docs>
45.54 s
gammaloop-nextest-docs> Location:
45.54 s
gammaloop-nextest-docs> crates/alphal00p-docs-builder/src/lib.rs:5103:9
45.54 s
gammaloop-nextest-docs> stack backtrace:
45.54 s
gammaloop-nextest-docs> 0: __rustc::rust_begin_unwind
45.54 s
gammaloop-nextest-docs> 1: core::panicking::panic_fmt
45.54 s
gammaloop-nextest-docs> 2: core::result::unwrap_failed
45.54 s
gammaloop-nextest-docs> 3: alphal00p_docs_builder::tests::checked_in_registry_is_valid
45.54 s
gammaloop-nextest-docs> 4: <alphal00p_docs_builder::tests::checked_in_registry_is_valid::{closure#0} as core::ops::function::FnOnce<()>>::call_once
45.54 s
gammaloop-nextest-docs> note: Some details are omitted, run with `RUST_BACKTRACE=full` for a verbose backtrace.
45.54 s
gammaloop-nextest-docs>
45.54 s
gammaloop-nextest-docs> 7. alphal00p-docs-builder::provenance_tests::each_build_captures_one_revision_before_rendering
45.54 s
gammaloop-nextest-docs> failure: test failure with exit code 101
45.54 s
gammaloop-nextest-docs> thread 'provenance_tests::each_build_captures_one_revision_before_rendering' (170) panicked at crates/alphal00p-docs-builder/src/provenance_tests.rs:274:9:
45.54 s
gammaloop-nextest-docs> assertion failed: command.status().unwrap().success()
45.54 s
gammaloop-nextest-docs> stack backtrace:
45.54 s
gammaloop-nextest-docs> 0: __rustc::rust_begin_unwind
45.54 s
gammaloop-nextest-docs> 1: core::panicking::panic_fmt
45.54 s
gammaloop-nextest-docs> 2: core::panicking::panic
45.54 s
gammaloop-nextest-docs> 3: alphal00p_docs_builder::provenance_tests::each_build_captures_one_revision_before_rendering
45.54 s
gammaloop-nextest-docs> 4: <alphal00p_docs_builder::provenance_tests::each_build_captures_one_revision_before_rendering::{closure#0} as core::ops::function::FnOnce<()>>::call_once
45.54 s
gammaloop-nextest-docs> note: Some details are omitted, run with `RUST_BACKTRACE=full` for a verbose backtrace.
45.54 s
gammaloop-nextest-docs> system-out
45.54 s
gammaloop-nextest-docs> running 1 test
45.54 s
gammaloop-nextest-docs>
45.54 s
gammaloop-nextest-docs> running 1 test
45.54 s
gammaloop-nextest-docs> test provenance_tests::each_build_captures_one_revision_before_rendering ... FAILED
45.54 s
gammaloop-nextest-docs>
45.54 s
gammaloop-nextest-docs> failures:
45.54 s
gammaloop-nextest-docs>
45.54 s
gammaloop-nextest-docs> failures:
45.54 s
gammaloop-nextest-docs> provenance_tests::each_build_captures_one_revision_before_rendering
45.54 s
gammaloop-nextest-docs>
45.54 s
gammaloop-nextest-docs> test result: FAILED. 0 passed; 1 failed; 0 ignored; 0 measured; 128 filtered out; finished in 0.10s
45.54 s
gammaloop-nextest-docs>
45.54 s
gammaloop-nextest-docs> test provenance_tests::each_build_captures_one_revision_before_rendering ... FAILED
45.54 s
gammaloop-nextest-docs>
45.54 s
gammaloop-nextest-docs> failures:
45.54 s
gammaloop-nextest-docs>
45.54 s
gammaloop-nextest-docs> failures:
45.54 s
gammaloop-nextest-docs> provenance_tests::each_build_captures_one_revision_before_rendering
45.54 s
gammaloop-nextest-docs>
45.54 s
gammaloop-nextest-docs> test result: FAILED. 0 passed; 1 failed; 0 ignored; 0 measured; 128 filtered out; finished in 0.11s
45.54 s
gammaloop-nextest-docs> system-err
45.54 s
gammaloop-nextest-docs> thread 'provenance_tests::each_build_captures_one_revision_before_rendering' (253) panicked at crates/alphal00p-docs-builder/src/provenance_tests.rs:297:14:
45.54 s
gammaloop-nextest-docs> called `Result::unwrap()` on an `Err` value: required documentation source is missing: /build/source/target/nix-ci-tmp/.tmpuiqmMo/checkout/crates/spynso3/typst/STIXTwoMath-Regular.woff2
45.54 s
gammaloop-nextest-docs>
45.54 s
gammaloop-nextest-docs> Location:
45.54 s
gammaloop-nextest-docs> crates/alphal00p-docs-builder/src/lib.rs:5103:9
45.54 s
gammaloop-nextest-docs> stack backtrace:
45.54 s
gammaloop-nextest-docs> 0: __rustc::rust_begin_unwind
45.54 s
gammaloop-nextest-docs> 1: core::panicking::panic_fmt
45.54 s
gammaloop-nextest-docs> 2: core::result::unwrap_failed
45.54 s
gammaloop-nextest-docs> 3: alphal00p_docs_builder::provenance_tests::each_build_captures_one_revision_before_rendering
45.54 s
gammaloop-nextest-docs> 4: <alphal00p_docs_builder::provenance_tests::each_build_captures_one_revision_before_rendering::{closure#0} as core::ops::function::FnOnce<()>>::call_once
45.54 s
gammaloop-nextest-docs> note: Some details are omitted, run with `RUST_BACKTRACE=full` for a verbose backtrace.
45.54 s
gammaloop-nextest-docs>
45.54 s
gammaloop-nextest-docs> thread 'provenance_tests::each_build_captures_one_revision_before_rendering' (170) panicked at crates/alphal00p-docs-builder/src/provenance_tests.rs:274:9:
45.54 s
gammaloop-nextest-docs> assertion failed: command.status().unwrap().success()
45.54 s
gammaloop-nextest-docs> stack backtrace:
45.54 s
gammaloop-nextest-docs> 0: __rustc::rust_begin_unwind
45.54 s
gammaloop-nextest-docs> 1: core::panicking::panic_fmt
45.54 s
gammaloop-nextest-docs> 2: core::panicking::panic
45.54 s
gammaloop-nextest-docs> 3: alphal00p_docs_builder::provenance_tests::each_build_captures_one_revision_before_rendering
45.54 s
gammaloop-nextest-docs> 4: <alphal00p_docs_builder::provenance_tests::each_build_captures_one_revision_before_rendering::{closure#0} as core::ops::function::FnOnce<()>>::call_once
45.54 s
gammaloop-nextest-docs> note: Some details are omitted, run with `RUST_BACKTRACE=full` for a verbose backtrace.
45.54 s
gammaloop-nextest-docs>
45.54 s
gammaloop-nextest-docs> 8. alphal00p-docs-builder::tests::site_assets_replace_read_only_generated_files
45.54 s
gammaloop-nextest-docs> failure: test failure with exit code 101
45.54 s
gammaloop-nextest-docs> thread 'tests::site_assets_replace_read_only_generated_files' (670) panicked at crates/alphal00p-docs-builder/src/lib.rs:12305:50:
45.54 s
gammaloop-nextest-docs> called `Result::unwrap()` on an `Err` value: failed to copy documentation asset crates/spynso3/typst/STIXTwoMath-Regular.woff2
45.54 s
gammaloop-nextest-docs>
45.54 s
gammaloop-nextest-docs> Caused by:
45.54 s
gammaloop-nextest-docs> No such file or directory (os error 2)
45.54 s
gammaloop-nextest-docs>
45.54 s
gammaloop-nextest-docs> Location:
45.54 s
gammaloop-nextest-docs> crates/alphal00p-docs-builder/src/lib.rs:2276:18
45.54 s
gammaloop-nextest-docs> stack backtrace:
45.54 s
gammaloop-nextest-docs> 0: __rustc::rust_begin_unwind
45.54 s
gammaloop-nextest-docs> 1: core::panicking::panic_fmt
45.54 s
gammaloop-nextest-docs> 2: core::result::unwrap_failed
45.54 s
gammaloop-nextest-docs> 3: alphal00p_docs_builder::tests::site_assets_replace_read_only_generated_files
45.54 s
gammaloop-nextest-docs> 4: <alphal00p_docs_builder::tests::site_assets_replace_read_only_generated_files::{closure#0} as core::ops::function::FnOnce<()>>::call_once
45.54 s
gammaloop-nextest-docs> note: Some details are omitted, run with `RUST_BACKTRACE=full` for a verbose backtrace.
45.54 s
gammaloop-nextest-docs> system-out
45.54 s
gammaloop-nextest-docs> running 1 test
45.54 s
gammaloop-nextest-docs> test tests::site_assets_replace_read_only_generated_files ... FAILED
45.54 s
gammaloop-nextest-docs>
45.54 s
gammaloop-nextest-docs> failures:
45.54 s
gammaloop-nextest-docs>
45.54 s
gammaloop-nextest-docs> failures:
45.54 s
gammaloop-nextest-docs> tests::site_assets_replace_read_only_generated_files
45.54 s
gammaloop-nextest-docs>
45.54 s
gammaloop-nextest-docs> test result: FAILED. 0 passed; 1 failed; 0 ignored; 0 measured; 128 filtered out; finished in 0.01s
45.54 s
gammaloop-nextest-docs> system-err
45.54 s
gammaloop-nextest-docs> thread 'tests::site_assets_replace_read_only_generated_files' (670) panicked at crates/alphal00p-docs-builder/src/lib.rs:12305:50:
45.54 s
gammaloop-nextest-docs> called `Result::unwrap()` on an `Err` value: failed to copy documentation asset crates/spynso3/typst/STIXTwoMath-Regular.woff2
45.54 s
gammaloop-nextest-docs>
45.54 s
gammaloop-nextest-docs> Caused by:
45.54 s
gammaloop-nextest-docs> No such file or directory (os error 2)
45.54 s
gammaloop-nextest-docs>
45.54 s
gammaloop-nextest-docs> Location:
45.54 s
gammaloop-nextest-docs> crates/alphal00p-docs-builder/src/lib.rs:2276:18
45.54 s
gammaloop-nextest-docs> stack backtrace:
45.54 s
gammaloop-nextest-docs> 0: __rustc::rust_begin_unwind
45.54 s
gammaloop-nextest-docs> 1: core::panicking::panic_fmt
45.54 s
gammaloop-nextest-docs> 2: core::result::unwrap_failed
45.54 s
gammaloop-nextest-docs> 3: alphal00p_docs_builder::tests::site_assets_replace_read_only_generated_files
45.54 s
gammaloop-nextest-docs> 4: <alphal00p_docs_builder::tests::site_assets_replace_read_only_generated_files::{closure#0} as core::ops::function::FnOnce<()>>::call_once
45.54 s
gammaloop-nextest-docs> note: Some details are omitted, run with `RUST_BACKTRACE=full` for a verbose backtrace.
45.54 s
gammaloop-nextest-docs>
45.54 s
gammaloop-nextest-docs> 9. alphal00p-docs-builder::tests::developer_scope_ranges_ignore_unrelated_edits_and_warn_only_while_watching
45.54 s
gammaloop-nextest-docs> failure: test failure with exit code 101
45.54 s
gammaloop-nextest-docs> thread 'tests::developer_scope_ranges_ignore_unrelated_edits_and_warn_only_while_watching' (287) panicked at crates/alphal00p-docs-builder/src/lib.rs:12350:29:
45.54 s
gammaloop-nextest-docs> called `Result::unwrap()` on an `Err` value: required documentation source is missing: /build/source/crates/spynso3/typst/STIXTwoMath-Regular.woff2
45.54 s
gammaloop-nextest-docs>
45.54 s
gammaloop-nextest-docs> Location:
45.54 s
gammaloop-nextest-docs> crates/alphal00p-docs-builder/src/lib.rs:5103:9
45.54 s
gammaloop-nextest-docs> stack backtrace:
45.54 s
gammaloop-nextest-docs> 0: __rustc::rust_begin_unwind
45.54 s
gammaloop-nextest-docs> 1: core::panicking::panic_fmt
45.54 s
gammaloop-nextest-docs> 2: core::result::unwrap_failed
45.54 s
gammaloop-nextest-docs> 3: alphal00p_docs_builder::tests::developer_scope_ranges_ignore_unrelated_edits_and_warn_only_while_watching
45.54 s
gammaloop-nextest-docs> 4: <alphal00p_docs_builder::tests::developer_scope_ranges_ignore_unrelated_edits_and_warn_only_while_watching::{closure#0} as core::ops::function::FnOnce<()>>::call_once
45.54 s
gammaloop-nextest-docs> note: Some details are omitted, run with `RUST_BACKTRACE=full` for a verbose backtrace.
45.54 s
gammaloop-nextest-docs> system-out
45.54 s
gammaloop-nextest-docs> running 1 test
45.54 s
gammaloop-nextest-docs> test tests::developer_scope_ranges_ignore_unrelated_edits_and_warn_only_while_watching ... FAILED
45.54 s
gammaloop-nextest-docs>
45.54 s
gammaloop-nextest-docs> failures:
45.54 s
gammaloop-nextest-docs>
45.54 s
gammaloop-nextest-docs> failures:
45.54 s
gammaloop-nextest-docs> tests::developer_scope_ranges_ignore_unrelated_edits_and_warn_only_while_watching
45.54 s
gammaloop-nextest-docs>
45.54 s
gammaloop-nextest-docs> test result: FAILED. 0 passed; 1 failed; 0 ignored; 0 measured; 128 filtered out; finished in 0.10s
45.54 s
gammaloop-nextest-docs> system-err
45.54 s
gammaloop-nextest-docs> thread 'tests::developer_scope_ranges_ignore_unrelated_edits_and_warn_only_while_watching' (287) panicked at crates/alphal00p-docs-builder/src/lib.rs:12350:29:
45.54 s
gammaloop-nextest-docs> called `Result::unwrap()` on an `Err` value: required documentation source is missing: /build/source/crates/spynso3/typst/STIXTwoMath-Regular.woff2
45.54 s
gammaloop-nextest-docs>
45.54 s
gammaloop-nextest-docs> Location:
45.54 s
gammaloop-nextest-docs> crates/alphal00p-docs-builder/src/lib.rs:5103:9
45.54 s
gammaloop-nextest-docs> stack backtrace:
45.54 s
gammaloop-nextest-docs> 0: __rustc::rust_begin_unwind
45.54 s
gammaloop-nextest-docs> 1: core::panicking::panic_fmt
45.54 s
gammaloop-nextest-docs> 2: core::result::unwrap_failed
45.54 s
gammaloop-nextest-docs> 3: alphal00p_docs_builder::tests::developer_scope_ranges_ignore_unrelated_edits_and_warn_only_while_watching
45.54 s
gammaloop-nextest-docs> 4: <alphal00p_docs_builder::tests::developer_scope_ranges_ignore_unrelated_edits_and_warn_only_while_watching::{closure#0} as core::ops::function::FnOnce<()>>::call_once
45.54 s
gammaloop-nextest-docs> note: Some details are omitted, run with `RUST_BACKTRACE=full` for a verbose backtrace.
45.54 s
gammaloop-nextest-docs>
45.54 s
gammaloop-nextest-docs> 10. alphal00p-docs-builder::tests::every_product_requires_a_task_chooser_and_each_supported_interface
45.54 s
gammaloop-nextest-docs> failure: test failure with exit code 101
45.54 s
gammaloop-nextest-docs> thread 'tests::every_product_requires_a_task_chooser_and_each_supported_interface' (327) panicked at crates/alphal00p-docs-builder/src/lib.rs:12274:9:
45.54 s
gammaloop-nextest-docs> assertion failed: format!("{error:#}").contains("has no quickstart page")
45.54 s
gammaloop-nextest-docs> stack backtrace:
45.54 s
gammaloop-nextest-docs> 0: __rustc::rust_begin_unwind
45.54 s
gammaloop-nextest-docs> 1: core::panicking::panic_fmt
45.54 s
gammaloop-nextest-docs> 2: core::panicking::panic
45.54 s
gammaloop-nextest-docs> 3: alphal00p_docs_builder::tests::every_product_requires_a_task_chooser_and_each_supported_interface
45.54 s
gammaloop-nextest-docs> 4: <alphal00p_docs_builder::tests::every_product_requires_a_task_chooser_and_each_supported_interface::{closure#0} as core::ops::function::FnOnce<()>>::call_once
45.54 s
gammaloop-nextest-docs> note: Some details are omitted, run with `RUST_BACKTRACE=full` for a verbose backtrace.
45.54 s
gammaloop-nextest-docs> system-out
45.54 s
gammaloop-nextest-docs> running 1 test
45.54 s
gammaloop-nextest-docs> test tests::every_product_requires_a_task_chooser_and_each_supported_interface ... FAILED
45.54 s
gammaloop-nextest-docs>
45.54 s
gammaloop-nextest-docs> failures:
45.54 s
gammaloop-nextest-docs>
45.54 s
gammaloop-nextest-docs> failures:
45.54 s
gammaloop-nextest-docs> tests::every_product_requires_a_task_chooser_and_each_supported_interface
45.54 s
gammaloop-nextest-docs>
45.54 s
gammaloop-nextest-docs> test result: FAILED. 0 passed; 1 failed; 0 ignored; 0 measured; 128 filtered out; finished in 0.12s
45.54 s
gammaloop-nextest-docs> system-err
45.54 s
gammaloop-nextest-docs> thread 'tests::every_product_requires_a_task_chooser_and_each_supported_interface' (327) panicked at crates/alphal00p-docs-builder/src/lib.rs:12274:9:
45.54 s
gammaloop-nextest-docs> assertion failed: format!("{error:#}").contains("has no quickstart page")
45.54 s
gammaloop-nextest-docs> stack backtrace:
45.54 s
gammaloop-nextest-docs> 0: __rustc::rust_begin_unwind
45.54 s
gammaloop-nextest-docs> 1: core::panicking::panic_fmt
45.54 s
gammaloop-nextest-docs> 2: core::panicking::panic
45.54 s
gammaloop-nextest-docs> 3: alphal00p_docs_builder::tests::every_product_requires_a_task_chooser_and_each_supported_interface
45.54 s
gammaloop-nextest-docs> 4: <alphal00p_docs_builder::tests::every_product_requires_a_task_chooser_and_each_supported_interface::{closure#0} as core::ops::function::FnOnce<()>>::call_once
45.54 s
gammaloop-nextest-docs> note: Some details are omitted, run with `RUST_BACKTRACE=full` for a verbose backtrace.
45.54 s
gammaloop-nextest-docs>
45.54 s
gammaloop-nextest-docs> 11. alphal00p-docs-builder::tests::pdf_manual_chapter_order_must_match_the_page_registry
45.54 s
gammaloop-nextest-docs> failure: test failure with exit code 101
45.54 s
gammaloop-nextest-docs> thread 'tests::pdf_manual_chapter_order_must_match_the_page_registry' (396) panicked at crates/alphal00p-docs-builder/src/lib.rs:12330:9:
45.54 s
gammaloop-nextest-docs> assertion failed: format!("{error:#}").contains("PDF manual chapter order differs")
45.54 s
gammaloop-nextest-docs> stack backtrace:
45.54 s
gammaloop-nextest-docs> 0: __rustc::rust_begin_unwind
45.54 s
gammaloop-nextest-docs> 1: core::panicking::panic_fmt
45.54 s
gammaloop-nextest-docs> 2: core::panicking::panic
45.54 s
gammaloop-nextest-docs> 3: alphal00p_docs_builder::tests::pdf_manual_chapter_order_must_match_the_page_registry
45.54 s
gammaloop-nextest-docs> 4: <alphal00p_docs_builder::tests::pdf_manual_chapter_order_must_match_the_page_registry::{closure#0} as core::ops::function::FnOnce<()>>::call_once
45.54 s
gammaloop-nextest-docs> note: Some details are omitted, run with `RUST_BACKTRACE=full` for a verbose backtrace.
45.54 s
gammaloop-nextest-docs> system-out
45.54 s
gammaloop-nextest-docs> running 1 test
45.54 s
gammaloop-nextest-docs> test tests::pdf_manual_chapter_order_must_match_the_page_registry ... FAILED
45.54 s
gammaloop-nextest-docs>
45.54 s
gammaloop-nextest-docs> failures:
45.54 s
gammaloop-nextest-docs>
45.54 s
gammaloop-nextest-docs> failures:
45.54 s
gammaloop-nextest-docs> tests::pdf_manual_chapter_order_must_match_the_page_registry
45.54 s
gammaloop-nextest-docs>
45.54 s
gammaloop-nextest-docs> test result: FAILED. 0 passed; 1 failed; 0 ignored; 0 measured; 128 filtered out; finished in 0.11s
45.54 s
gammaloop-nextest-docs> system-err
45.54 s
gammaloop-nextest-docs> thread 'tests::pdf_manual_chapter_order_must_match_the_page_registry' (396) panicked at crates/alphal00p-docs-builder/src/lib.rs:12330:9:
45.54 s
gammaloop-nextest-docs> assertion failed: format!("{error:#}").contains("PDF manual chapter order differs")
45.54 s
gammaloop-nextest-docs> stack backtrace:
45.54 s
gammaloop-nextest-docs> 0: __rustc::rust_begin_unwind
45.54 s
gammaloop-nextest-docs> 1: core::panicking::panic_fmt
45.54 s
gammaloop-nextest-docs> 2: core::panicking::panic
45.54 s
gammaloop-nextest-docs> 3: alphal00p_docs_builder::tests::pdf_manual_chapter_order_must_match_the_page_registry
45.54 s
gammaloop-nextest-docs> 4: <alphal00p_docs_builder::tests::pdf_manual_chapter_order_must_match_the_page_registry::{closure#0} as core::ops::function::FnOnce<()>>::call_once
45.54 s
gammaloop-nextest-docs> note: Some details are omitted, run with `RUST_BACKTRACE=full` for a verbose backtrace.
45.54 s
gammaloop-nextest-docs> =========================================
45.55 s
gammaloop-nextest-docs> Extracting 2 binaries to /build/source
45.58 s
gammaloop-nextest-docs> Extracted 5 files to /build/source in 0.03s
45.59 s
gammaloop-nextest-docs> ------------
45.59 s
gammaloop-nextest-docs> Nextest run ID 24e191ac-d1d6-4525-a290-5ce6f5184db9 with nextest profile: ci_gammaloop
45.59 s
gammaloop-nextest-docs> Starting 22 tests across 2 binaries
45.61 s
gammaloop-nextest-docs> ------------
45.61 s
gammaloop-nextest-docs> Summary [ 0.018s] 22 tests run: 22 passed , 0 skipped
45.64 s
gammaloop-nextest-docs>
45.64 s
gammaloop-nextest-docs> ========== nextest test summary ==========
45.64 s
gammaloop-nextest-docs> report: target/nextest/ci_gammaloop/junit.xml
45.64 s
gammaloop-nextest-docs> tests: 22, failures: 0, errors: 0
45.64 s
gammaloop-nextest-docs> No failing testcases found.
45.64 s
gammaloop-nextest-docs> =========================================
45.65 s
gammaloop-nextest-docs> Extracting 3 binaries (including 2 non-test binaries), 1 build script output directory, and 2 linked paths to /build/source
45.88 s
gammaloop-nextest-docs> Extracted 22 files to /build/source in 0.23s
45.88 s
gammaloop-nextest-docs> ------------
45.88 s
gammaloop-nextest-docs> Nextest run ID fcb6b418-f25c-4bf7-8e1c-fbd57dfa5fb6 with nextest profile: ci_gammaloop
45.88 s
gammaloop-nextest-docs> Starting 89 tests across 1 binary
45.92 s
gammaloop-nextest-docs> ------------
45.92 s
gammaloop-nextest-docs> Summary [ 0.041s] 89 tests run: 89 passed , 0 skipped
45.96 s
gammaloop-nextest-docs>
45.96 s
gammaloop-nextest-docs> ========== nextest test summary ==========
45.96 s
gammaloop-nextest-docs> report: target/nextest/ci_gammaloop/junit.xml
45.96 s
gammaloop-nextest-docs> tests: 89, failures: 0, errors: 0
45.96 s
gammaloop-nextest-docs> No failing testcases found.
45.96 s
gammaloop-nextest-docs> =========================================
45.97 s
gammaloop-nextest-docs> Extracting 2 binaries to /build/source
46.00 s
gammaloop-nextest-docs> Extracted 5 files to /build/source in 0.04s
46.01 s
gammaloop-nextest-docs> ------------
46.01 s
gammaloop-nextest-docs> Nextest run ID cc8a25c9-e414-4efd-8b79-788c082f5116 with nextest profile: ci_gammaloop
46.01 s
gammaloop-nextest-docs> Starting 10 tests across 2 binaries
57.11 s
gammaloop-nextest-docs> ------------
57.11 s
gammaloop-nextest-docs> Summary [ 11.100s] 10 tests run: 10 passed , 0 skipped
57.14 s
gammaloop-nextest-docs>
57.14 s
gammaloop-nextest-docs> ========== nextest test summary ==========
57.14 s
gammaloop-nextest-docs> report: target/nextest/ci_gammaloop/junit.xml
57.14 s
gammaloop-nextest-docs> tests: 10, failures: 0, errors: 0
57.14 s
gammaloop-nextest-docs> No failing testcases found.
57.14 s
gammaloop-nextest-docs> =========================================
57.15 s
gammaloop-nextest-docs> Extracting 1 binary to /build/source
57.18 s
gammaloop-nextest-docs> Extracted 4 files to /build/source in 0.03s
57.19 s
gammaloop-nextest-docs> ------------
57.19 s
gammaloop-nextest-docs> Nextest run ID 697effbe-8f91-49cb-a1a8-e8b9de70dca3 with nextest profile: ci_gammaloop
57.19 s
gammaloop-nextest-docs> Starting 0 tests across 1 binary
57.19 s
gammaloop-nextest-docs> ------------
57.19 s
gammaloop-nextest-docs> Summary [ 0.000s] 0 tests run: 0 passed , 0 skipped
57.21 s
gammaloop-nextest-docs>
57.21 s
gammaloop-nextest-docs> ========== nextest test summary ==========
57.21 s
gammaloop-nextest-docs> report: target/nextest/ci_gammaloop/junit.xml
57.21 s
gammaloop-nextest-docs> tests: 0, failures: 0, errors: 0
57.21 s
gammaloop-nextest-docs> No failing testcases found.
57.21 s
gammaloop-nextest-docs> =========================================
57.22 s
gammaloop-nextest-docs> Extracting 1 binary to /build/source
57.25 s
gammaloop-nextest-docs> Extracted 4 files to /build/source in 0.03s
57.26 s
gammaloop-nextest-docs> ------------
57.26 s
gammaloop-nextest-docs> Nextest run ID b47940d8-20d1-4c44-92b6-b4203ed58244 with nextest profile: ci_gammaloop
57.26 s
gammaloop-nextest-docs> Starting 5 tests across 1 binary
57.26 s
gammaloop-nextest-docs> ------------
57.26 s
gammaloop-nextest-docs> Summary [ 0.004s] 5 tests run: 5 passed , 0 skipped
57.29 s
gammaloop-nextest-docs>
57.29 s
gammaloop-nextest-docs> ========== nextest test summary ==========
57.29 s
gammaloop-nextest-docs> report: target/nextest/ci_gammaloop/junit.xml
57.29 s
gammaloop-nextest-docs> tests: 5, failures: 0, errors: 0
57.29 s
gammaloop-nextest-docs> No failing testcases found.
57.29 s
gammaloop-nextest-docs> =========================================
57.46 s
error: Cannot build '/nix/store/lss98va6a34sawhfmb9hflr4awgmkih4-gammaloop-nextest-docs.drv '.
57.46 s
Reason: builder failed with exit code 100 .
57.46 s
Output paths:
57.46 s
/nix/store/926njs5va6m12lpp63iqc0d8pab03bw0-gammaloop-nextest-docs
57.46 s
Last 1232 log lines:
57.46 s
> Extracting 2 binaries to /build/source
57.46 s
> Extracted 5 files to /build/source in 0.04s
57.46 s
> ------------
57.46 s
> Nextest run ID ea85f89a-f04e-473d-b29a-2b8cc1718ccd with nextest profile: ci_gammaloop
57.46 s
> Starting 129 tests across 2 binaries
57.46 s
> FAIL [ 0.014s] ( 26/129) alphal00p-docs-builder tests :: developer_architecture_is_classified_searchable_and_source_backed
57.46 s
> stdout ---
57.46 s
>
57.46 s
> running 1 test
57.46 s
> test tests::developer_architecture_is_classified_searchable_and_source_backed ... FAILED
57.46 s
>
57.46 s
> failures:
57.46 s
>
57.46 s
> failures:
57.46 s
> tests::developer_architecture_is_classified_searchable_and_source_backed
57.46 s
>
57.46 s
> test result: FAILED. 0 passed; 1 failed; 0 ignored; 0 measured; 128 filtered out; finished in 0.01s
57.46 s
>
57.46 s
> stderr ---
57.46 s
>
57.46 s
> thread 'tests::developer_architecture_is_classified_searchable_and_source_backed' (289) panicked at crates/alphal00p-docs-builder/src/lib.rs:12751:14:
57.46 s
> called `Result::unwrap()` on an `Err` value: failed to copy documentation asset crates/spynso3/typst/STIXTwoMath-Regular.woff2
57.46 s
>
57.46 s
> Caused by:
57.46 s
> No such file or directory (os error 2)
57.46 s
>
57.46 s
> Location:
57.46 s
> crates/alphal00p-docs-builder/src/lib.rs:2276:18
57.46 s
> stack backtrace:
57.46 s
> 0: __rustc::rust_begin_unwind
57.46 s
> 1: core::panicking::panic_fmt
57.46 s
> 2: core::result::unwrap_failed
57.46 s
> 3: alphal00p_docs_builder::tests::developer_architecture_is_classified_searchable_and_source_backed
57.46 s
> 4: <alphal00p_docs_builder::tests::developer_architecture_is_classified_searchable_and_source_backed::{closure#0} as core::ops::function::FnOnce<()>>::call_once
57.46 s
> note: Some details are omitted, run with `RUST_BACKTRACE=full` for a verbose backtrace.
57.46 s
>
57.46 s
> FAIL [ 0.008s] ( 28/129) alphal00p-docs-builder tests :: every_product_orients_rust_to_native_rustdoc_and_keeps_legacy_redirects
57.46 s
> stdout ---
57.46 s
>
57.46 s
> running 1 test
57.46 s
> test tests::every_product_orients_rust_to_native_rustdoc_and_keeps_legacy_redirects ... FAILED
57.46 s
>
57.46 s
> failures:
57.46 s
>
57.46 s
> failures:
57.46 s
> tests::every_product_orients_rust_to_native_rustdoc_and_keeps_legacy_redirects
57.46 s
>
57.46 s
> test result: FAILED. 0 passed; 1 failed; 0 ignored; 0 measured; 128 filtered out; finished in 0.00s
57.46 s
>
57.46 s
> stderr ---
57.46 s
>
57.46 s
> thread 'tests::every_product_orients_rust_to_native_rustdoc_and_keeps_legacy_redirects' (309) panicked at crates/alphal00p-docs-builder/src/lib.rs:12555:46:
57.46 s
> called `Result::unwrap()` on an `Err` value: failed to copy documentation asset crates/spynso3/typst/STIXTwoMath-Regular.woff2
57.46 s
>
57.46 s
> Caused by:
57.46 s
> No such file or directory (os error 2)
57.46 s
>
57.46 s
> Location:
57.46 s
> crates/alphal00p-docs-builder/src/lib.rs:2276:18
57.46 s
> stack backtrace:
57.46 s
> 0: __rustc::rust_begin_unwind
57.46 s
> 1: core::panicking::panic_fmt
57.46 s
> 2: core::result::unwrap_failed
57.46 s
> 3: alphal00p_docs_builder::tests::every_product_orients_rust_to_native_rustdoc_and_keeps_legacy_redirects
57.46 s
> 4: <alphal00p_docs_builder::tests::every_product_orients_rust_to_native_rustdoc_and_keeps_legacy_redirects::{closure#0} as core::ops::function::FnOnce<()>>::call_once
57.46 s
> note: Some details are omitted, run with `RUST_BACKTRACE=full` for a verbose backtrace.
57.46 s
>
57.46 s
> FAIL [ 0.011s] ( 54/129) alphal00p-docs-builder tests :: portal_emits_routes_and_valid_assets
57.46 s
> stdout ---
57.46 s
>
57.46 s
> running 1 test
57.46 s
> test tests::portal_emits_routes_and_valid_assets ... FAILED
57.46 s
>
57.46 s
> failures:
57.46 s
>
57.46 s
> failures:
57.46 s
> tests::portal_emits_routes_and_valid_assets
57.46 s
>
57.46 s
> test result: FAILED. 0 passed; 1 failed; 0 ignored; 0 measured; 128 filtered out; finished in 0.01s
57.46 s
>
57.46 s
> stderr ---
57.46 s
>
57.46 s
> thread 'tests::portal_emits_routes_and_valid_assets' (424) panicked at crates/alphal00p-docs-builder/src/lib.rs:9684:14:
57.46 s
> called `Result::unwrap()` on an `Err` value: failed to copy documentation asset crates/spynso3/typst/STIXTwoMath-Regular.woff2
57.46 s
>
57.46 s
> Caused by:
57.46 s
> No such file or directory (os error 2)
57.46 s
>
57.46 s
> Location:
57.46 s
> crates/alphal00p-docs-builder/src/lib.rs:2276:18
57.46 s
> stack backtrace:
57.46 s
> 0: __rustc::rust_begin_unwind
57.46 s
> 1: core::panicking::panic_fmt
57.46 s
> 2: core::result::unwrap_failed
57.46 s
> 3: alphal00p_docs_builder::tests::write_test_portal
57.46 s
> 4: alphal00p_docs_builder::tests::portal_emits_routes_and_valid_assets
57.46 s
> 5: <alphal00p_docs_builder::tests::portal_emits_routes_and_valid_assets::{closure#0} as core::ops::function::FnOnce<()>>::call_once
57.46 s
> note: Some details are omitted, run with `RUST_BACKTRACE=full` for a verbose backtrace.
57.46 s
>
57.46 s
> FAIL [ 0.010s] ( 55/129) alphal00p-docs-builder tests :: portal_task_chooser_routes_each_goal_to_the_registered_quickstart
57.46 s
> stdout ---
57.46 s
>
57.46 s
> running 1 test
57.46 s
> test tests::portal_task_chooser_routes_each_goal_to_the_registered_quickstart ... FAILED
57.46 s
>
57.46 s
> failures:
57.46 s
>
57.46 s
> failures:
57.46 s
> tests::portal_task_chooser_routes_each_goal_to_the_registered_quickstart
57.46 s
>
57.46 s
> test result: FAILED. 0 passed; 1 failed; 0 ignored; 0 measured; 128 filtered out; finished in 0.00s
57.46 s
>
57.46 s
> stderr ---
57.46 s
>
57.46 s
> thread 'tests::portal_task_chooser_routes_each_goal_to_the_registered_quickstart' (431) panicked at crates/alphal00p-docs-builder/src/lib.rs:9684:14:
57.46 s
> called `Result::unwrap()` on an `Err` value: failed to copy documentation asset crates/spynso3/typst/STIXTwoMath-Regular.woff2
57.46 s
>
57.46 s
> Caused by:
57.46 s
> No such file or directory (os error 2)
57.46 s
>
57.46 s
> Location:
57.46 s
> crates/alphal00p-docs-builder/src/lib.rs:2276:18
57.46 s
> stack backtrace:
57.46 s
> 0: __rustc::rust_begin_unwind
57.46 s
> 1: core::panicking::panic_fmt
57.46 s
> 2: core::result::unwrap_failed
57.46 s
> 3: alphal00p_docs_builder::tests::write_test_portal
57.46 s
> 4: alphal00p_docs_builder::tests::portal_task_chooser_routes_each_goal_to_the_registered_quickstart
57.46 s
> 5: <alphal00p_docs_builder::tests::portal_task_chooser_routes_each_goal_to_the_registered_quickstart::{closure#0} as core::ops::function::FnOnce<()>>::call_once
57.46 s
> note: Some details are omitted, run with `RUST_BACKTRACE=full` for a verbose backtrace.
57.46 s
>
57.46 s
> FAIL [ 0.012s] ( 56/129) alphal00p-docs-builder tests :: portal_and_developer_pages_use_federated_search_and_feedback
57.46 s
> stdout ---
57.46 s
>
57.46 s
> running 1 test
57.46 s
> test tests::portal_and_developer_pages_use_federated_search_and_feedback ... FAILED
57.46 s
>
57.46 s
> failures:
57.46 s
>
57.46 s
> failures:
57.46 s
> tests::portal_and_developer_pages_use_federated_search_and_feedback
57.46 s
>
57.46 s
> test result: FAILED. 0 passed; 1 failed; 0 ignored; 0 measured; 128 filtered out; finished in 0.01s
57.46 s
>
57.46 s
> stderr ---
57.46 s
>
57.46 s
> thread 'tests::portal_and_developer_pages_use_federated_search_and_feedback' (425) panicked at crates/alphal00p-docs-builder/src/lib.rs:9684:14:
57.46 s
> called `Result::unwrap()` on an `Err` value: failed to copy documentation asset crates/spynso3/typst/STIXTwoMath-Regular.woff2
57.46 s
>
57.46 s
> Caused by:
57.46 s
> No such file or directory (os error 2)
57.46 s
>
57.46 s
> Location:
57.46 s
> crates/alphal00p-docs-builder/src/lib.rs:2276:18
57.46 s
> stack backtrace:
57.46 s
> 0: __rustc::rust_begin_unwind
57.46 s
> 1: core::panicking::panic_fmt
57.46 s
> 2: core::result::unwrap_failed
57.46 s
> 3: alphal00p_docs_builder::tests::write_test_portal
57.46 s
> 4: alphal00p_docs_builder::tests::portal_and_developer_pages_use_federated_search_and_feedback
57.46 s
> 5: <alphal00p_docs_builder::tests::portal_and_developer_pages_use_federated_search_and_feedback::{closure#0} as core::ops::function::FnOnce<()>>::call_once
57.46 s
> note: Some details are omitted, run with `RUST_BACKTRACE=full` for a verbose backtrace.
57.46 s
>
57.46 s
> FAIL [ 0.118s] ( 86/129) alphal00p-docs-builder tests :: checked_in_registry_is_valid
57.46 s
> stdout ---
57.46 s
>
57.46 s
> running 1 test
57.46 s
> test tests::checked_in_registry_is_valid ... FAILED
57.46 s
>
57.46 s
> failures:
57.46 s
>
57.46 s
> failures:
57.46 s
> tests::checked_in_registry_is_valid
57.46 s
>
57.46 s
> test result: FAILED. 0 passed; 1 failed; 0 ignored; 0 measured; 128 filtered out; finished in 0.11s
57.46 s
>
57.46 s
> stderr ---
57.46 s
>
57.46 s
> thread 'tests::checked_in_registry_is_valid' (187) panicked at crates/alphal00p-docs-builder/src/lib.rs:12260:50:
57.46 s
> called `Result::unwrap()` on an `Err` value: required documentation source is missing: /build/source/crates/spynso3/typst/STIXTwoMath-Regular.woff2
57.46 s
>
57.46 s
> Location:
57.46 s
> crates/alphal00p-docs-builder/src/lib.rs:5103:9
57.46 s
> stack backtrace:
57.46 s
> 0: __rustc::rust_begin_unwind
57.46 s
> 1: core::panicking::panic_fmt
57.46 s
> 2: core::result::unwrap_failed
57.46 s
> 3: alphal00p_docs_builder::tests::checked_in_registry_is_valid
57.46 s
> 4: <alphal00p_docs_builder::tests::checked_in_registry_is_valid::{closure#0} as core::ops::function::FnOnce<()>>::call_once
57.46 s
> note: Some details are omitted, run with `RUST_BACKTRACE=full` for a verbose backtrace.
57.46 s
>
57.46 s
> FAIL [ 0.119s] ( 88/129) alphal00p-docs-builder provenance_tests :: each_build_captures_one_revision_before_rendering
57.46 s
> stdout ---
57.46 s
>
57.46 s
> running 1 test
57.46 s
>
57.46 s
> running 1 test
57.46 s
> test provenance_tests::each_build_captures_one_revision_before_rendering ... FAILED
57.46 s
>
57.46 s
> failures:
57.46 s
>
57.46 s
> failures:
57.46 s
> provenance_tests::each_build_captures_one_revision_before_rendering
57.46 s
>
57.46 s
> test result: FAILED. 0 passed; 1 failed; 0 ignored; 0 measured; 128 filtered out; finished in 0.10s
57.46 s
>
57.46 s
> test provenance_tests::each_build_captures_one_revision_before_rendering ... FAILED
57.46 s
>
57.46 s
> failures:
57.46 s
>
57.46 s
> failures:
57.46 s
> provenance_tests::each_build_captures_one_revision_before_rendering
57.46 s
>
57.46 s
> test result: FAILED. 0 passed; 1 failed; 0 ignored; 0 measured; 128 filtered out; finished in 0.11s
57.46 s
>
57.46 s
> stderr ---
57.46 s
>
57.46 s
> thread 'provenance_tests::each_build_captures_one_revision_before_rendering' (253) panicked at crates/alphal00p-docs-builder/src/provenance_tests.rs:297:14:
57.46 s
> called `Result::unwrap()` on an `Err` value: required documentation source is missing: /build/source/target/nix-ci-tmp/.tmpuiqmMo/checkout/crates/spynso3/typst/STIXTwoMath-Regular.woff2
57.46 s
>
57.46 s
> Location:
57.46 s
> crates/alphal00p-docs-builder/src/lib.rs:5103:9
57.46 s
> stack backtrace:
57.46 s
> 0: __rustc::rust_begin_unwind
57.46 s
> 1: core::panicking::panic_fmt
57.46 s
> 2: core::result::unwrap_failed
57.46 s
> 3: alphal00p_docs_builder::provenance_tests::each_build_captures_one_revision_before_rendering
57.46 s
> 4: <alphal00p_docs_builder::provenance_tests::each_build_captures_one_revision_before_rendering::{closure#0} as core::ops::function::FnOnce<()>>::call_once
57.46 s
> note: Some details are omitted, run with `RUST_BACKTRACE=full` for a verbose backtrace.
57.46 s
>
57.46 s
> thread 'provenance_tests::each_build_captures_one_revision_before_rendering' (170) panicked at crates/alphal00p-docs-builder/src/provenance_tests.rs:274:9:
57.46 s
> assertion failed: command.status().unwrap().success()
57.46 s
> stack backtrace:
57.46 s
> 0: __rustc::rust_begin_unwind
57.46 s
> 1: core::panicking::panic_fmt
57.46 s
> 2: core::panicking::panic
57.46 s
> 3: alphal00p_docs_builder::provenance_tests::each_build_captures_one_revision_before_rendering
57.46 s
> 4: <alphal00p_docs_builder::provenance_tests::each_build_captures_one_revision_before_rendering::{closure#0} as core::ops::function::FnOnce<()>>::call_once
57.46 s
> note: Some details are omitted, run with `RUST_BACKTRACE=full` for a verbose backtrace.
57.46 s
>
57.46 s
> FAIL [ 0.010s] ( 89/129) alphal00p-docs-builder tests :: site_assets_replace_read_only_generated_files
57.46 s
> stdout ---
57.46 s
>
57.46 s
> running 1 test
57.46 s
> test tests::site_assets_replace_read_only_generated_files ... FAILED
57.46 s
>
57.46 s
> failures:
57.46 s
>
57.46 s
> failures:
57.46 s
> tests::site_assets_replace_read_only_generated_files
57.46 s
>
57.46 s
> test result: FAILED. 0 passed; 1 failed; 0 ignored; 0 measured; 128 filtered out; finished in 0.01s
57.46 s
>
57.46 s
> stderr ---
57.46 s
>
57.46 s
> thread 'tests::site_assets_replace_read_only_generated_files' (670) panicked at crates/alphal00p-docs-builder/src/lib.rs:12305:50:
57.46 s
> called `Result::unwrap()` on an `Err` value: failed to copy documentation asset crates/spynso3/typst/STIXTwoMath-Regular.woff2
57.46 s
>
57.46 s
> Caused by:
57.46 s
> No such file or directory (os error 2)
57.46 s
>
57.46 s
> Location:
57.46 s
> crates/alphal00p-docs-builder/src/lib.rs:2276:18
57.46 s
> stack backtrace:
57.46 s
> 0: __rustc::rust_begin_unwind
57.46 s
> 1: core::panicking::panic_fmt
57.46 s
> 2: core::result::unwrap_failed
57.46 s
> 3: alphal00p_docs_builder::tests::site_assets_replace_read_only_generated_files
57.46 s
> 4: <alphal00p_docs_builder::tests::site_assets_replace_read_only_generated_files::{closure#0} as core::ops::function::FnOnce<()>>::call_once
57.46 s
> note: Some details are omitted, run with `RUST_BACKTRACE=full` for a verbose backtrace.
57.46 s
>
57.46 s
> FAIL [ 0.108s] ( 90/129) alphal00p-docs-builder tests :: developer_scope_ranges_ignore_unrelated_edits_and_warn_only_while_watching
57.46 s
> stdout ---
57.46 s
>
57.46 s
> running 1 test
57.46 s
> test tests::developer_scope_ranges_ignore_unrelated_edits_and_warn_only_while_watching ... FAILED
57.46 s
>
57.46 s
> failures:
57.46 s
>
57.46 s
> failures:
57.46 s
> tests::developer_scope_ranges_ignore_unrelated_edits_and_warn_only_while_watching
57.46 s
>
57.46 s
> test result: FAILED. 0 passed; 1 failed; 0 ignored; 0 measured; 128 filtered out; finished in 0.10s
57.46 s
>
57.46 s
> stderr ---
57.46 s
>
57.46 s
> thread 'tests::developer_scope_ranges_ignore_unrelated_edits_and_warn_only_while_watching' (287) panicked at crates/alphal00p-docs-builder/src/lib.rs:12350:29:
57.46 s
> called `Result::unwrap()` on an `Err` value: required documentation source is missing: /build/source/crates/spynso3/typst/STIXTwoMath-Regular.woff2
57.46 s
>
57.46 s
> Location:
57.46 s
> crates/alphal00p-docs-builder/src/lib.rs:5103:9
57.46 s
> stack backtrace:
57.46 s
> 0: __rustc::rust_begin_unwind
57.46 s
> 1: core::panicking::panic_fmt
57.46 s
> 2: core::result::unwrap_failed
57.46 s
> 3: alphal00p_docs_builder::tests::developer_scope_ranges_ignore_unrelated_edits_and_warn_only_while_watching
57.46 s
> 4: <alphal00p_docs_builder::tests::developer_scope_ranges_ignore_unrelated_edits_and_warn_only_while_watching::{closure#0} as core::ops::function::FnOnce<()>>::call_once
57.46 s
> note: Some details are omitted, run with `RUST_BACKTRACE=full` for a verbose backtrace.
57.46 s
>
57.46 s
> FAIL [ 0.127s] (121/129) alphal00p-docs-builder tests :: every_product_requires_a_task_chooser_and_each_supported_interface
57.46 s
> stdout ---
57.46 s
>
57.46 s
> running 1 test
57.46 s
> test tests::every_product_requires_a_task_chooser_and_each_supported_interface ... FAILED
57.46 s
>
57.46 s
> failures:
57.46 s
>
57.46 s
> failures:
57.46 s
> tests::every_product_requires_a_task_chooser_and_each_supported_interface
57.46 s
>
57.46 s
> test result: FAILED. 0 passed; 1 failed; 0 ignored; 0 measured; 128 filtered out; finished in 0.12s
57.46 s
>
57.46 s
> stderr ---
57.46 s
>
57.46 s
> thread 'tests::every_product_requires_a_task_chooser_and_each_supported_interface' (327) panicked at crates/alphal00p-docs-builder/src/lib.rs:12274:9:
57.46 s
> assertion failed: format!("{error:#}").contains("has no quickstart page")
57.46 s
> stack backtrace:
57.46 s
> 0: __rustc::rust_begin_unwind
57.46 s
> 1: core::panicking::panic_fmt
57.46 s
> 2: core::panicking::panic
57.46 s
> 3: alphal00p_docs_builder::tests::every_product_requires_a_task_chooser_and_each_supported_interface
57.46 s
> 4: <alphal00p_docs_builder::tests::every_product_requires_a_task_chooser_and_each_supported_interface::{closure#0} as core::ops::function::FnOnce<()>>::call_once
57.46 s
> note: Some details are omitted, run with `RUST_BACKTRACE=full` for a verbose backtrace.
57.46 s
>
57.46 s
> FAIL [ 0.111s] (122/129) alphal00p-docs-builder tests :: pdf_manual_chapter_order_must_match_the_page_registry
57.46 s
> stdout ---
57.46 s
>
57.46 s
> running 1 test
57.46 s
> test tests::pdf_manual_chapter_order_must_match_the_page_registry ... FAILED
57.46 s
>
57.46 s
> failures:
57.46 s
>
57.46 s
> failures:
57.46 s
> tests::pdf_manual_chapter_order_must_match_the_page_registry
57.46 s
>
57.46 s
> test result: FAILED. 0 passed; 1 failed; 0 ignored; 0 measured; 128 filtered out; finished in 0.11s
57.46 s
>
57.46 s
> stderr ---
57.46 s
>
57.46 s
> thread 'tests::pdf_manual_chapter_order_must_match_the_page_registry' (396) panicked at crates/alphal00p-docs-builder/src/lib.rs:12330:9:
57.46 s
> assertion failed: format!("{error:#}").contains("PDF manual chapter order differs")
57.46 s
> stack backtrace:
57.46 s
> 0: __rustc::rust_begin_unwind
57.46 s
> 1: core::panicking::panic_fmt
57.46 s
> 2: core::panicking::panic
57.46 s
> 3: alphal00p_docs_builder::tests::pdf_manual_chapter_order_must_match_the_page_registry
57.46 s
> 4: <alphal00p_docs_builder::tests::pdf_manual_chapter_order_must_match_the_page_registry::{closure#0} as core::ops::function::FnOnce<()>>::call_once
57.46 s
> note: Some details are omitted, run with `RUST_BACKTRACE=full` for a verbose backtrace.
57.46 s
>
57.46 s
> ------------
57.46 s
> Summary [ 10.186s] 129 tests run: 118 passed , 11 failed , 0 skipped
57.46 s
> FAIL [ 0.014s] ( 26/129) alphal00p-docs-builder tests :: developer_architecture_is_classified_searchable_and_source_backed
57.46 s
> stdout ---
57.46 s
>
57.46 s
> running 1 test
57.46 s
> test tests::developer_architecture_is_classified_searchable_and_source_backed ... FAILED
57.46 s
>
57.46 s
> failures:
57.46 s
>
57.46 s
> failures:
57.46 s
> tests::developer_architecture_is_classified_searchable_and_source_backed
57.46 s
>
57.46 s
> test result: FAILED. 0 passed; 1 failed; 0 ignored; 0 measured; 128 filtered out; finished in 0.01s
57.46 s
>
57.46 s
> stderr ---
57.46 s
>
57.46 s
> thread 'tests::developer_architecture_is_classified_searchable_and_source_backed' (289) panicked at crates/alphal00p-docs-builder/src/lib.rs:12751:14:
57.46 s
> called `Result::unwrap()` on an `Err` value: failed to copy documentation asset crates/spynso3/typst/STIXTwoMath-Regular.woff2
57.46 s
>
57.46 s
> Caused by:
57.46 s
> No such file or directory (os error 2)
57.46 s
>
57.46 s
> Location:
57.46 s
> crates/alphal00p-docs-builder/src/lib.rs:2276:18
57.46 s
> stack backtrace:
57.46 s
> 0: __rustc::rust_begin_unwind
57.46 s
> 1: core::panicking::panic_fmt
57.46 s
> 2: core::result::unwrap_failed
57.46 s
> 3: alphal00p_docs_builder::tests::developer_architecture_is_classified_searchable_and_source_backed
57.46 s
> 4: <alphal00p_docs_builder::tests::developer_architecture_is_classified_searchable_and_source_backed::{closure#0} as core::ops::function::FnOnce<()>>::call_once
57.46 s
> note: Some details are omitted, run with `RUST_BACKTRACE=full` for a verbose backtrace.
57.46 s
>
57.46 s
> FAIL [ 0.008s] ( 28/129) alphal00p-docs-builder tests :: every_product_orients_rust_to_native_rustdoc_and_keeps_legacy_redirects
57.46 s
> stdout ---
57.46 s
>
57.46 s
> running 1 test
57.46 s
> test tests::every_product_orients_rust_to_native_rustdoc_and_keeps_legacy_redirects ... FAILED
57.46 s
>
57.46 s
> failures:
57.46 s
>
57.46 s
> failures:
57.46 s
> tests::every_product_orients_rust_to_native_rustdoc_and_keeps_legacy_redirects
57.46 s
>
57.46 s
> test result: FAILED. 0 passed; 1 failed; 0 ignored; 0 measured; 128 filtered out; finished in 0.00s
57.46 s
>
57.46 s
> stderr ---
57.46 s
>
57.46 s
> thread 'tests::every_product_orients_rust_to_native_rustdoc_and_keeps_legacy_redirects' (309) panicked at crates/alphal00p-docs-builder/src/lib.rs:12555:46:
57.46 s
> called `Result::unwrap()` on an `Err` value: failed to copy documentation asset crates/spynso3/typst/STIXTwoMath-Regular.woff2
57.46 s
>
57.46 s
> Caused by:
57.46 s
> No such file or directory (os error 2)
57.46 s
>
57.46 s
> Location:
57.46 s
> crates/alphal00p-docs-builder/src/lib.rs:2276:18
57.46 s
> stack backtrace:
57.46 s
> 0: __rustc::rust_begin_unwind
57.46 s
> 1: core::panicking::panic_fmt
57.46 s
> 2: core::result::unwrap_failed
57.46 s
> 3: alphal00p_docs_builder::tests::every_product_orients_rust_to_native_rustdoc_and_keeps_legacy_redirects
57.46 s
> 4: <alphal00p_docs_builder::tests::every_product_orients_rust_to_native_rustdoc_and_keeps_legacy_redirects::{closure#0} as core::ops::function::FnOnce<()>>::call_once
57.46 s
> note: Some details are omitted, run with `RUST_BACKTRACE=full` for a verbose backtrace.
57.46 s
>
57.46 s
> FAIL [ 0.011s] ( 54/129) alphal00p-docs-builder tests :: portal_emits_routes_and_valid_assets
57.46 s
> stdout ---
57.46 s
>
57.46 s
> running 1 test
57.46 s
> test tests::portal_emits_routes_and_valid_assets ... FAILED
57.46 s
>
57.46 s
> failures:
57.46 s
>
57.46 s
> failures:
57.46 s
> tests::portal_emits_routes_and_valid_assets
57.46 s
>
57.46 s
> test result: FAILED. 0 passed; 1 failed; 0 ignored; 0 measured; 128 filtered out; finished in 0.01s
57.46 s
>
57.46 s
> stderr ---
57.46 s
>
57.46 s
> thread 'tests::portal_emits_routes_and_valid_assets' (424) panicked at crates/alphal00p-docs-builder/src/lib.rs:9684:14:
57.46 s
> called `Result::unwrap()` on an `Err` value: failed to copy documentation asset crates/spynso3/typst/STIXTwoMath-Regular.woff2
57.46 s
>
57.46 s
> Caused by:
57.46 s
> No such file or directory (os error 2)
57.46 s
>
57.46 s
> Location:
57.46 s
> crates/alphal00p-docs-builder/src/lib.rs:2276:18
57.47 s
> stack backtrace:
57.47 s
> 0: __rustc::rust_begin_unwind
57.47 s
> 1: core::panicking::panic_fmt
57.47 s
> 2: core::result::unwrap_failed
57.47 s
> 3: alphal00p_docs_builder::tests::write_test_portal
57.47 s
> 4: alphal00p_docs_builder::tests::portal_emits_routes_and_valid_assets
57.47 s
> 5: <alphal00p_docs_builder::tests::portal_emits_routes_and_valid_assets::{closure#0} as core::ops::function::FnOnce<()>>::call_once
57.47 s
> note: Some details are omitted, run with `RUST_BACKTRACE=full` for a verbose backtrace.
57.47 s
>
57.47 s
> FAIL [ 0.010s] ( 55/129) alphal00p-docs-builder tests :: portal_task_chooser_routes_each_goal_to_the_registered_quickstart
57.47 s
> stdout ---
57.47 s
>
57.47 s
> running 1 test
57.47 s
> test tests::portal_task_chooser_routes_each_goal_to_the_registered_quickstart ... FAILED
57.47 s
>
57.47 s
> failures:
57.47 s
>
57.47 s
> failures:
57.47 s
> tests::portal_task_chooser_routes_each_goal_to_the_registered_quickstart
57.47 s
>
57.47 s
> test result: FAILED. 0 passed; 1 failed; 0 ignored; 0 measured; 128 filtered out; finished in 0.00s
57.47 s
>
57.47 s
> stderr ---
57.47 s
>
57.47 s
> thread 'tests::portal_task_chooser_routes_each_goal_to_the_registered_quickstart' (431) panicked at crates/alphal00p-docs-builder/src/lib.rs:9684:14:
57.47 s
> called `Result::unwrap()` on an `Err` value: failed to copy documentation asset crates/spynso3/typst/STIXTwoMath-Regular.woff2
57.47 s
>
57.47 s
> Caused by:
57.47 s
> No such file or directory (os error 2)
57.47 s
>
57.47 s
> Location:
57.47 s
> crates/alphal00p-docs-builder/src/lib.rs:2276:18
57.47 s
> stack backtrace:
57.47 s
> 0: __rustc::rust_begin_unwind
57.47 s
> 1: core::panicking::panic_fmt
57.47 s
> 2: core::result::unwrap_failed
57.47 s
> 3: alphal00p_docs_builder::tests::write_test_portal
57.47 s
> 4: alphal00p_docs_builder::tests::portal_task_chooser_routes_each_goal_to_the_registered_quickstart
57.47 s
> 5: <alphal00p_docs_builder::tests::portal_task_chooser_routes_each_goal_to_the_registered_quickstart::{closure#0} as core::ops::function::FnOnce<()>>::call_once
57.47 s
> note: Some details are omitted, run with `RUST_BACKTRACE=full` for a verbose backtrace.
57.47 s
>
57.47 s
> FAIL [ 0.012s] ( 56/129) alphal00p-docs-builder tests :: portal_and_developer_pages_use_federated_search_and_feedback
57.47 s
> stdout ---
57.47 s
>
57.47 s
> running 1 test
57.47 s
> test tests::portal_and_developer_pages_use_federated_search_and_feedback ... FAILED
57.47 s
>
57.47 s
> failures:
57.47 s
>
57.47 s
> failures:
57.47 s
> tests::portal_and_developer_pages_use_federated_search_and_feedback
57.47 s
>
57.47 s
> test result: FAILED. 0 passed; 1 failed; 0 ignored; 0 measured; 128 filtered out; finished in 0.01s
57.47 s
>
57.47 s
> stderr ---
57.47 s
>
57.47 s
> thread 'tests::portal_and_developer_pages_use_federated_search_and_feedback' (425) panicked at crates/alphal00p-docs-builder/src/lib.rs:9684:14:
57.47 s
> called `Result::unwrap()` on an `Err` value: failed to copy documentation asset crates/spynso3/typst/STIXTwoMath-Regular.woff2
57.47 s
>
57.47 s
> Caused by:
57.47 s
> No such file or directory (os error 2)
57.47 s
>
57.47 s
> Location:
57.47 s
> crates/alphal00p-docs-builder/src/lib.rs:2276:18
57.47 s
> stack backtrace:
57.47 s
> 0: __rustc::rust_begin_unwind
57.47 s
> 1: core::panicking::panic_fmt
57.47 s
> 2: core::result::unwrap_failed
57.47 s
> 3: alphal00p_docs_builder::tests::write_test_portal
57.47 s
> 4: alphal00p_docs_builder::tests::portal_and_developer_pages_use_federated_search_and_feedback
57.47 s
> 5: <alphal00p_docs_builder::tests::portal_and_developer_pages_use_federated_search_and_feedback::{closure#0} as core::ops::function::FnOnce<()>>::call_once
57.47 s
> note: Some details are omitted, run with `RUST_BACKTRACE=full` for a verbose backtrace.
57.47 s
>
57.47 s
> FAIL [ 0.118s] ( 86/129) alphal00p-docs-builder tests :: checked_in_registry_is_valid
57.47 s
> stdout ---
57.47 s
>
57.47 s
> running 1 test
57.47 s
> test tests::checked_in_registry_is_valid ... FAILED
57.47 s
>
57.47 s
> failures:
57.47 s
>
57.47 s
> failures:
57.47 s
> tests::checked_in_registry_is_valid
57.47 s
>
57.47 s
> test result: FAILED. 0 passed; 1 failed; 0 ignored; 0 measured; 128 filtered out; finished in 0.11s
57.47 s
>
57.47 s
> stderr ---
57.47 s
>
57.47 s
> thread 'tests::checked_in_registry_is_valid' (187) panicked at crates/alphal00p-docs-builder/src/lib.rs:12260:50:
57.47 s
> called `Result::unwrap()` on an `Err` value: required documentation source is missing: /build/source/crates/spynso3/typst/STIXTwoMath-Regular.woff2
57.47 s
>
57.47 s
> Location:
57.47 s
> crates/alphal00p-docs-builder/src/lib.rs:5103:9
57.47 s
> stack backtrace:
57.47 s
> 0: __rustc::rust_begin_unwind
57.47 s
> 1: core::panicking::panic_fmt
57.47 s
> 2: core::result::unwrap_failed
57.47 s
> 3: alphal00p_docs_builder::tests::checked_in_registry_is_valid
57.47 s
> 4: <alphal00p_docs_builder::tests::checked_in_registry_is_valid::{closure#0} as core::ops::function::FnOnce<()>>::call_once
57.47 s
> note: Some details are omitted, run with `RUST_BACKTRACE=full` for a verbose backtrace.
57.47 s
>
57.47 s
> FAIL [ 0.119s] ( 88/129) alphal00p-docs-builder provenance_tests :: each_build_captures_one_revision_before_rendering
57.47 s
> stdout ---
57.47 s
>
57.47 s
> running 1 test
57.47 s
>
57.47 s
> running 1 test
57.47 s
> test provenance_tests::each_build_captures_one_revision_before_rendering ... FAILED
57.47 s
>
57.47 s
> failures:
57.47 s
>
57.47 s
> failures:
57.47 s
> provenance_tests::each_build_captures_one_revision_before_rendering
57.47 s
>
57.47 s
> test result: FAILED. 0 passed; 1 failed; 0 ignored; 0 measured; 128 filtered out; finished in 0.10s
57.47 s
>
57.47 s
> test provenance_tests::each_build_captures_one_revision_before_rendering ... FAILED
57.47 s
>
57.47 s
> failures:
57.47 s
>
57.47 s
> failures:
57.47 s
> provenance_tests::each_build_captures_one_revision_before_rendering
57.47 s
>
57.47 s
> test result: FAILED. 0 passed; 1 failed; 0 ignored; 0 measured; 128 filtered out; finished in 0.11s
57.47 s
>
57.47 s
> stderr ---
57.47 s
>
57.47 s
> thread 'provenance_tests::each_build_captures_one_revision_before_rendering' (253) panicked at crates/alphal00p-docs-builder/src/provenance_tests.rs:297:14:
57.47 s
> called `Result::unwrap()` on an `Err` value: required documentation source is missing: /build/source/target/nix-ci-tmp/.tmpuiqmMo/checkout/crates/spynso3/typst/STIXTwoMath-Regular.woff2
57.47 s
>
57.47 s
> Location:
57.47 s
> crates/alphal00p-docs-builder/src/lib.rs:5103:9
57.47 s
> stack backtrace:
57.47 s
> 0: __rustc::rust_begin_unwind
57.47 s
> 1: core::panicking::panic_fmt
57.47 s
> 2: core::result::unwrap_failed
57.47 s
> 3: alphal00p_docs_builder::provenance_tests::each_build_captures_one_revision_before_rendering
57.47 s
> 4: <alphal00p_docs_builder::provenance_tests::each_build_captures_one_revision_before_rendering::{closure#0} as core::ops::function::FnOnce<()>>::call_once
57.47 s
> note: Some details are omitted, run with `RUST_BACKTRACE=full` for a verbose backtrace.
57.47 s
>
57.47 s
> thread 'provenance_tests::each_build_captures_one_revision_before_rendering' (170) panicked at crates/alphal00p-docs-builder/src/provenance_tests.rs:274:9:
57.47 s
> assertion failed: command.status().unwrap().success()
57.47 s
> stack backtrace:
57.47 s
> 0: __rustc::rust_begin_unwind
57.47 s
> 1: core::panicking::panic_fmt
57.47 s
> 2: core::panicking::panic
57.47 s
> 3: alphal00p_docs_builder::provenance_tests::each_build_captures_one_revision_before_rendering
57.47 s
> 4: <alphal00p_docs_builder::provenance_tests::each_build_captures_one_revision_before_rendering::{closure#0} as core::ops::function::FnOnce<()>>::call_once
57.47 s
> note: Some details are omitted, run with `RUST_BACKTRACE=full` for a verbose backtrace.
57.47 s
>
57.47 s
> FAIL [ 0.010s] ( 89/129) alphal00p-docs-builder tests :: site_assets_replace_read_only_generated_files
57.47 s
> stdout ---
57.47 s
>
57.47 s
> running 1 test
57.47 s
> test tests::site_assets_replace_read_only_generated_files ... FAILED
57.47 s
>
57.47 s
> failures:
57.47 s
>
57.47 s
> failures:
57.47 s
> tests::site_assets_replace_read_only_generated_files
57.47 s
>
57.47 s
> test result: FAILED. 0 passed; 1 failed; 0 ignored; 0 measured; 128 filtered out; finished in 0.01s
57.47 s
>
57.47 s
> stderr ---
57.47 s
>
57.47 s
> thread 'tests::site_assets_replace_read_only_generated_files' (670) panicked at crates/alphal00p-docs-builder/src/lib.rs:12305:50:
57.47 s
> called `Result::unwrap()` on an `Err` value: failed to copy documentation asset crates/spynso3/typst/STIXTwoMath-Regular.woff2
57.47 s
>
57.47 s
> Caused by:
57.47 s
> No such file or directory (os error 2)
57.47 s
>
57.47 s
> Location:
57.47 s
> crates/alphal00p-docs-builder/src/lib.rs:2276:18
57.47 s
> stack backtrace:
57.47 s
> 0: __rustc::rust_begin_unwind
57.47 s
> 1: core::panicking::panic_fmt
57.47 s
> 2: core::result::unwrap_failed
57.47 s
> 3: alphal00p_docs_builder::tests::site_assets_replace_read_only_generated_files
57.47 s
> 4: <alphal00p_docs_builder::tests::site_assets_replace_read_only_generated_files::{closure#0} as core::ops::function::FnOnce<()>>::call_once
57.47 s
> note: Some details are omitted, run with `RUST_BACKTRACE=full` for a verbose backtrace.
57.47 s
>
57.47 s
> FAIL [ 0.108s] ( 90/129) alphal00p-docs-builder tests :: developer_scope_ranges_ignore_unrelated_edits_and_warn_only_while_watching
57.47 s
> stdout ---
57.47 s
>
57.47 s
> running 1 test
57.47 s
> test tests::developer_scope_ranges_ignore_unrelated_edits_and_warn_only_while_watching ... FAILED
57.47 s
>
57.47 s
> failures:
57.47 s
>
57.47 s
> failures:
57.47 s
> tests::developer_scope_ranges_ignore_unrelated_edits_and_warn_only_while_watching
57.47 s
>
57.47 s
> test result: FAILED. 0 passed; 1 failed; 0 ignored; 0 measured; 128 filtered out; finished in 0.10s
57.47 s
>
57.47 s
> stderr ---
57.47 s
>
57.47 s
> thread 'tests::developer_scope_ranges_ignore_unrelated_edits_and_warn_only_while_watching' (287) panicked at crates/alphal00p-docs-builder/src/lib.rs:12350:29:
57.47 s
> called `Result::unwrap()` on an `Err` value: required documentation source is missing: /build/source/crates/spynso3/typst/STIXTwoMath-Regular.woff2
57.47 s
>
57.47 s
> Location:
57.47 s
> crates/alphal00p-docs-builder/src/lib.rs:5103:9
57.47 s
> stack backtrace:
57.47 s
> 0: __rustc::rust_begin_unwind
57.47 s
> 1: core::panicking::panic_fmt
57.47 s
> 2: core::result::unwrap_failed
57.47 s
> 3: alphal00p_docs_builder::tests::developer_scope_ranges_ignore_unrelated_edits_and_warn_only_while_watching
57.47 s
> 4: <alphal00p_docs_builder::tests::developer_scope_ranges_ignore_unrelated_edits_and_warn_only_while_watching::{closure#0} as core::ops::function::FnOnce<()>>::call_once
57.47 s
> note: Some details are omitted, run with `RUST_BACKTRACE=full` for a verbose backtrace.
57.47 s
>
57.47 s
> FAIL [ 0.127s] (121/129) alphal00p-docs-builder tests :: every_product_requires_a_task_chooser_and_each_supported_interface
57.47 s
> stdout ---
57.47 s
>
57.47 s
> running 1 test
57.47 s
> test tests::every_product_requires_a_task_chooser_and_each_supported_interface ... FAILED
57.47 s
>
57.47 s
> failures:
57.47 s
>
57.47 s
> failures:
57.47 s
> tests::every_product_requires_a_task_chooser_and_each_supported_interface
57.47 s
>
57.47 s
> test result: FAILED. 0 passed; 1 failed; 0 ignored; 0 measured; 128 filtered out; finished in 0.12s
57.47 s
>
57.47 s
> stderr ---
57.47 s
>
57.47 s
> thread 'tests::every_product_requires_a_task_chooser_and_each_supported_interface' (327) panicked at crates/alphal00p-docs-builder/src/lib.rs:12274:9:
57.47 s
> assertion failed: format!("{error:#}").contains("has no quickstart page")
57.47 s
> stack backtrace:
57.47 s
> 0: __rustc::rust_begin_unwind
57.47 s
> 1: core::panicking::panic_fmt
57.47 s
> 2: core::panicking::panic
57.47 s
> 3: alphal00p_docs_builder::tests::every_product_requires_a_task_chooser_and_each_supported_interface
57.47 s
> 4: <alphal00p_docs_builder::tests::every_product_requires_a_task_chooser_and_each_supported_interface::{closure#0} as core::ops::function::FnOnce<()>>::call_once
57.47 s
> note: Some details are omitted, run with `RUST_BACKTRACE=full` for a verbose backtrace.
57.47 s
>
57.47 s
> FAIL [ 0.111s] (122/129) alphal00p-docs-builder tests :: pdf_manual_chapter_order_must_match_the_page_registry
57.47 s
> stdout ---
57.47 s
>
57.47 s
> running 1 test
57.47 s
> test tests::pdf_manual_chapter_order_must_match_the_page_registry ... FAILED
57.47 s
>
57.47 s
> failures:
57.47 s
>
57.47 s
> failures:
57.47 s
> tests::pdf_manual_chapter_order_must_match_the_page_registry
57.47 s
>
57.47 s
> test result: FAILED. 0 passed; 1 failed; 0 ignored; 0 measured; 128 filtered out; finished in 0.11s
57.47 s
>
57.47 s
> stderr ---
57.47 s
>
57.47 s
> thread 'tests::pdf_manual_chapter_order_must_match_the_page_registry' (396) panicked at crates/alphal00p-docs-builder/src/lib.rs:12330:9:
57.47 s
> assertion failed: format!("{error:#}").contains("PDF manual chapter order differs")
57.47 s
> stack backtrace:
57.47 s
> 0: __rustc::rust_begin_unwind
57.47 s
> 1: core::panicking::panic_fmt
57.47 s
> 2: core::panicking::panic
57.47 s
> 3: alphal00p_docs_builder::tests::pdf_manual_chapter_order_must_match_the_page_registry
57.47 s
> 4: <alphal00p_docs_builder::tests::pdf_manual_chapter_order_must_match_the_page_registry::{closure#0} as core::ops::function::FnOnce<()>>::call_once
57.47 s
> note: Some details are omitted, run with `RUST_BACKTRACE=full` for a verbose backtrace.
57.47 s
>
57.47 s
> error : test run failed
57.47 s
>
57.47 s
> ========== nextest test summary ==========
57.47 s
> report: target/nextest/ci_gammaloop/junit.xml
57.47 s
> tests: 129, failures: 11, errors: 0
57.47 s
>
57.47 s
> 1. alphal00p-docs-builder::tests::developer_architecture_is_classified_searchable_and_source_backed
57.47 s
> failure: test failure with exit code 101
57.47 s
> thread 'tests::developer_architecture_is_classified_searchable_and_source_backed' (289) panicked at crates/alphal00p-docs-builder/src/lib.rs:12751:14:
57.47 s
> called `Result::unwrap()` on an `Err` value: failed to copy documentation asset crates/spynso3/typst/STIXTwoMath-Regular.woff2
57.47 s
>
57.47 s
> Caused by:
57.47 s
> No such file or directory (os error 2)
57.47 s
>
57.47 s
> Location:
57.47 s
> crates/alphal00p-docs-builder/src/lib.rs:2276:18
57.47 s
> stack backtrace:
57.47 s
> 0: __rustc::rust_begin_unwind
57.47 s
> 1: core::panicking::panic_fmt
57.47 s
> 2: core::result::unwrap_failed
57.47 s
> 3: alphal00p_docs_builder::tests::developer_architecture_is_classified_searchable_and_source_backed
57.47 s
> 4: <alphal00p_docs_builder::tests::developer_architecture_is_classified_searchable_and_source_backed::{closure#0} as core::ops::function::FnOnce<()>>::call_once
57.47 s
> note: Some details are omitted, run with `RUST_BACKTRACE=full` for a verbose backtrace.
57.47 s
> system-out
57.47 s
> running 1 test
57.47 s
> test tests::developer_architecture_is_classified_searchable_and_source_backed ... FAILED
57.47 s
>
57.47 s
> failures:
57.47 s
>
57.47 s
> failures:
57.47 s
> tests::developer_architecture_is_classified_searchable_and_source_backed
57.47 s
>
57.47 s
> test result: FAILED. 0 passed; 1 failed; 0 ignored; 0 measured; 128 filtered out; finished in 0.01s
57.47 s
> system-err
57.47 s
> thread 'tests::developer_architecture_is_classified_searchable_and_source_backed' (289) panicked at crates/alphal00p-docs-builder/src/lib.rs:12751:14:
57.47 s
> called `Result::unwrap()` on an `Err` value: failed to copy documentation asset crates/spynso3/typst/STIXTwoMath-Regular.woff2
57.47 s
>
57.47 s
> Caused by:
57.47 s
> No such file or directory (os error 2)
57.47 s
>
57.47 s
> Location:
57.47 s
> crates/alphal00p-docs-builder/src/lib.rs:2276:18
57.47 s
> stack backtrace:
57.47 s
> 0: __rustc::rust_begin_unwind
57.47 s
> 1: core::panicking::panic_fmt
57.47 s
> 2: core::result::unwrap_failed
57.47 s
> 3: alphal00p_docs_builder::tests::developer_architecture_is_classified_searchable_and_source_backed
57.47 s
> 4: <alphal00p_docs_builder::tests::developer_architecture_is_classified_searchable_and_source_backed::{closure#0} as core::ops::function::FnOnce<()>>::call_once
57.47 s
> note: Some details are omitted, run with `RUST_BACKTRACE=full` for a verbose backtrace.
57.47 s
>
57.47 s
> 2. alphal00p-docs-builder::tests::every_product_orients_rust_to_native_rustdoc_and_keeps_legacy_redirects
57.47 s
> failure: test failure with exit code 101
57.47 s
> thread 'tests::every_product_orients_rust_to_native_rustdoc_and_keeps_legacy_redirects' (309) panicked at crates/alphal00p-docs-builder/src/lib.rs:12555:46:
57.47 s
> called `Result::unwrap()` on an `Err` value: failed to copy documentation asset crates/spynso3/typst/STIXTwoMath-Regular.woff2
57.47 s
>
57.47 s
> Caused by:
57.47 s
> No such file or directory (os error 2)
57.47 s
>
57.47 s
> Location:
57.47 s
> crates/alphal00p-docs-builder/src/lib.rs:2276:18
57.47 s
> stack backtrace:
57.47 s
> 0: __rustc::rust_begin_unwind
57.47 s
> 1: core::panicking::panic_fmt
57.47 s
> 2: core::result::unwrap_failed
57.47 s
> 3: alphal00p_docs_builder::tests::every_product_orients_rust_to_native_rustdoc_and_keeps_legacy_redirects
57.47 s
> 4: <alphal00p_docs_builder::tests::every_product_orients_rust_to_native_rustdoc_and_keeps_legacy_redirects::{closure#0} as core::ops::function::FnOnce<()>>::call_once
57.47 s
> note: Some details are omitted, run with `RUST_BACKTRACE=full` for a verbose backtrace.
57.47 s
> system-out
57.47 s
> running 1 test
57.47 s
> test tests::every_product_orients_rust_to_native_rustdoc_and_keeps_legacy_redirects ... FAILED
57.47 s
>
57.47 s
> failures:
57.47 s
>
57.47 s
> failures:
57.47 s
> tests::every_product_orients_rust_to_native_rustdoc_and_keeps_legacy_redirects
57.47 s
>
57.47 s
> test result: FAILED. 0 passed; 1 failed; 0 ignored; 0 measured; 128 filtered out; finished in 0.00s
57.47 s
> system-err
57.47 s
> thread 'tests::every_product_orients_rust_to_native_rustdoc_and_keeps_legacy_redirects' (309) panicked at crates/alphal00p-docs-builder/src/lib.rs:12555:46:
57.47 s
> called `Result::unwrap()` on an `Err` value: failed to copy documentation asset crates/spynso3/typst/STIXTwoMath-Regular.woff2
57.47 s
>
57.47 s
> Caused by:
57.47 s
> No such file or directory (os error 2)
57.47 s
>
57.47 s
> Location:
57.47 s
> crates/alphal00p-docs-builder/src/lib.rs:2276:18
57.47 s
> stack backtrace:
57.47 s
> 0: __rustc::rust_begin_unwind
57.47 s
> 1: core::panicking::panic_fmt
57.47 s
> 2: core::result::unwrap_failed
57.47 s
> 3: alphal00p_docs_builder::tests::every_product_orients_rust_to_native_rustdoc_and_keeps_legacy_redirects
57.47 s
> 4: <alphal00p_docs_builder::tests::every_product_orients_rust_to_native_rustdoc_and_keeps_legacy_redirects::{closure#0} as core::ops::function::FnOnce<()>>::call_once
57.47 s
> note: Some details are omitted, run with `RUST_BACKTRACE=full` for a verbose backtrace.
57.47 s
>
57.47 s
> 3. alphal00p-docs-builder::tests::portal_emits_routes_and_valid_assets
57.47 s
> failure: test failure with exit code 101
57.47 s
> thread 'tests::portal_emits_routes_and_valid_assets' (424) panicked at crates/alphal00p-docs-builder/src/lib.rs:9684:14:
57.47 s
> called `Result::unwrap()` on an `Err` value: failed to copy documentation asset crates/spynso3/typst/STIXTwoMath-Regular.woff2
57.47 s
>
57.47 s
> Caused by:
57.47 s
> No such file or directory (os error 2)
57.47 s
>
57.47 s
> Location:
57.47 s
> crates/alphal00p-docs-builder/src/lib.rs:2276:18
57.47 s
> stack backtrace:
57.47 s
> 0: __rustc::rust_begin_unwind
57.47 s
> 1: core::panicking::panic_fmt
57.47 s
> 2: core::result::unwrap_failed
57.47 s
> 3: alphal00p_docs_builder::tests::write_test_portal
57.47 s
> 4: alphal00p_docs_builder::tests::portal_emits_routes_and_valid_assets
57.47 s
> 5: <alphal00p_docs_builder::tests::portal_emits_routes_and_valid_assets::{closure#0} as core::ops::function::FnOnce<()>>::call_once
57.47 s
> note: Some details are omitted, run with `RUST_BACKTRACE=full` for a verbose backtrace.
57.47 s
> system-out
57.47 s
> running 1 test
57.47 s
> test tests::portal_emits_routes_and_valid_assets ... FAILED
57.47 s
>
57.47 s
> failures:
57.47 s
>
57.47 s
> failures:
57.47 s
> tests::portal_emits_routes_and_valid_assets
57.47 s
>
57.47 s
> test result: FAILED. 0 passed; 1 failed; 0 ignored; 0 measured; 128 filtered out; finished in 0.01s
57.47 s
> system-err
57.47 s
> thread 'tests::portal_emits_routes_and_valid_assets' (424) panicked at crates/alphal00p-docs-builder/src/lib.rs:9684:14:
57.47 s
> called `Result::unwrap()` on an `Err` value: failed to copy documentation asset crates/spynso3/typst/STIXTwoMath-Regular.woff2
57.47 s
>
57.47 s
> Caused by:
57.47 s
> No such file or directory (os error 2)
57.47 s
>
57.47 s
> Location:
57.47 s
> crates/alphal00p-docs-builder/src/lib.rs:2276:18
57.47 s
> stack backtrace:
57.47 s
> 0: __rustc::rust_begin_unwind
57.47 s
> 1: core::panicking::panic_fmt
57.47 s
> 2: core::result::unwrap_failed
57.47 s
> 3: alphal00p_docs_builder::tests::write_test_portal
57.47 s
> 4: alphal00p_docs_builder::tests::portal_emits_routes_and_valid_assets
57.47 s
> 5: <alphal00p_docs_builder::tests::portal_emits_routes_and_valid_assets::{closure#0} as core::ops::function::FnOnce<()>>::call_once
57.47 s
> note: Some details are omitted, run with `RUST_BACKTRACE=full` for a verbose backtrace.
57.47 s
>
57.47 s
> 4. alphal00p-docs-builder::tests::portal_task_chooser_routes_each_goal_to_the_registered_quickstart
57.47 s
> failure: test failure with exit code 101
57.47 s
> thread 'tests::portal_task_chooser_routes_each_goal_to_the_registered_quickstart' (431) panicked at crates/alphal00p-docs-builder/src/lib.rs:9684:14:
57.47 s
> called `Result::unwrap()` on an `Err` value: failed to copy documentation asset crates/spynso3/typst/STIXTwoMath-Regular.woff2
57.47 s
>
57.47 s
> Caused by:
57.47 s
> No such file or directory (os error 2)
57.47 s
>
57.47 s
> Location:
57.47 s
> crates/alphal00p-docs-builder/src/lib.rs:2276:18
57.47 s
> stack backtrace:
57.47 s
> 0: __rustc::rust_begin_unwind
57.47 s
> 1: core::panicking::panic_fmt
57.47 s
> 2: core::result::unwrap_failed
57.47 s
> 3: alphal00p_docs_builder::tests::write_test_portal
57.47 s
> 4: alphal00p_docs_builder::tests::portal_task_chooser_routes_each_goal_to_the_registered_quickstart
57.47 s
> 5: <alphal00p_docs_builder::tests::portal_task_chooser_routes_each_goal_to_the_registered_quickstart::{closure#0} as core::ops::function::FnOnce<()>>::call_once
57.47 s
> note: Some details are omitted, run with `RUST_BACKTRACE=full` for a verbose backtrace.
57.47 s
> system-out
57.47 s
> running 1 test
57.47 s
> test tests::portal_task_chooser_routes_each_goal_to_the_registered_quickstart ... FAILED
57.47 s
>
57.47 s
> failures:
57.47 s
>
57.47 s
> failures:
57.47 s
> tests::portal_task_chooser_routes_each_goal_to_the_registered_quickstart
57.47 s
>
57.47 s
> test result: FAILED. 0 passed; 1 failed; 0 ignored; 0 measured; 128 filtered out; finished in 0.00s
57.47 s
> system-err
57.47 s
> thread 'tests::portal_task_chooser_routes_each_goal_to_the_registered_quickstart' (431) panicked at crates/alphal00p-docs-builder/src/lib.rs:9684:14:
57.47 s
> called `Result::unwrap()` on an `Err` value: failed to copy documentation asset crates/spynso3/typst/STIXTwoMath-Regular.woff2
57.47 s
>
57.47 s
> Caused by:
57.47 s
> No such file or directory (os error 2)
57.47 s
>
57.47 s
> Location:
57.47 s
> crates/alphal00p-docs-builder/src/lib.rs:2276:18
57.47 s
> stack backtrace:
57.47 s
> 0: __rustc::rust_begin_unwind
57.47 s
> 1: core::panicking::panic_fmt
57.47 s
> 2: core::result::unwrap_failed
57.47 s
> 3: alphal00p_docs_builder::tests::write_test_portal
57.47 s
> 4: alphal00p_docs_builder::tests::portal_task_chooser_routes_each_goal_to_the_registered_quickstart
57.47 s
> 5: <alphal00p_docs_builder::tests::portal_task_chooser_routes_each_goal_to_the_registered_quickstart::{closure#0} as core::ops::function::FnOnce<()>>::call_once
57.47 s
> note: Some details are omitted, run with `RUST_BACKTRACE=full` for a verbose backtrace.
57.47 s
>
57.47 s
> 5. alphal00p-docs-builder::tests::portal_and_developer_pages_use_federated_search_and_feedback
57.47 s
> failure: test failure with exit code 101
57.47 s
> thread 'tests::portal_and_developer_pages_use_federated_search_and_feedback' (425) panicked at crates/alphal00p-docs-builder/src/lib.rs:9684:14:
57.47 s
> called `Result::unwrap()` on an `Err` value: failed to copy documentation asset crates/spynso3/typst/STIXTwoMath-Regular.woff2
57.47 s
>
57.47 s
> Caused by:
57.47 s
> No such file or directory (os error 2)
57.47 s
>
57.47 s
> Location:
57.47 s
> crates/alphal00p-docs-builder/src/lib.rs:2276:18
57.47 s
> stack backtrace:
57.47 s
> 0: __rustc::rust_begin_unwind
57.47 s
> 1: core::panicking::panic_fmt
57.47 s
> 2: core::result::unwrap_failed
57.47 s
> 3: alphal00p_docs_builder::tests::write_test_portal
57.47 s
> 4: alphal00p_docs_builder::tests::portal_and_developer_pages_use_federated_search_and_feedback
57.47 s
> 5: <alphal00p_docs_builder::tests::portal_and_developer_pages_use_federated_search_and_feedback::{closure#0} as core::ops::function::FnOnce<()>>::call_once
57.47 s
> note: Some details are omitted, run with `RUST_BACKTRACE=full` for a verbose backtrace.
57.47 s
> system-out
57.47 s
> running 1 test
57.47 s
> test tests::portal_and_developer_pages_use_federated_search_and_feedback ... FAILED
57.47 s
>
57.47 s
> failures:
57.47 s
>
57.47 s
> failures:
57.47 s
> tests::portal_and_developer_pages_use_federated_search_and_feedback
57.47 s
>
57.47 s
> test result: FAILED. 0 passed; 1 failed; 0 ignored; 0 measured; 128 filtered out; finished in 0.01s
57.47 s
> system-err
57.47 s
> thread 'tests::portal_and_developer_pages_use_federated_search_and_feedback' (425) panicked at crates/alphal00p-docs-builder/src/lib.rs:9684:14:
57.47 s
> called `Result::unwrap()` on an `Err` value: failed to copy documentation asset crates/spynso3/typst/STIXTwoMath-Regular.woff2
57.47 s
>
57.47 s
> Caused by:
57.47 s
> No such file or directory (os error 2)
57.47 s
>
57.47 s
> Location:
57.47 s
> crates/alphal00p-docs-builder/src/lib.rs:2276:18
57.47 s
> stack backtrace:
57.47 s
> 0: __rustc::rust_begin_unwind
57.47 s
> 1: core::panicking::panic_fmt
57.47 s
> 2: core::result::unwrap_failed
57.47 s
> 3: alphal00p_docs_builder::tests::write_test_portal
57.47 s
> 4: alphal00p_docs_builder::tests::portal_and_developer_pages_use_federated_search_and_feedback
57.47 s
> 5: <alphal00p_docs_builder::tests::portal_and_developer_pages_use_federated_search_and_feedback::{closure#0} as core::ops::function::FnOnce<()>>::call_once
57.47 s
> note: Some details are omitted, run with `RUST_BACKTRACE=full` for a verbose backtrace.
57.47 s
>
57.47 s
> 6. alphal00p-docs-builder::tests::checked_in_registry_is_valid
57.47 s
> failure: test failure with exit code 101
57.47 s
> thread 'tests::checked_in_registry_is_valid' (187) panicked at crates/alphal00p-docs-builder/src/lib.rs:12260:50:
57.47 s
> called `Result::unwrap()` on an `Err` value: required documentation source is missing: /build/source/crates/spynso3/typst/STIXTwoMath-Regular.woff2
57.47 s
>
57.47 s
> Location:
57.47 s
> crates/alphal00p-docs-builder/src/lib.rs:5103:9
57.47 s
> stack backtrace:
57.47 s
> 0: __rustc::rust_begin_unwind
57.47 s
> 1: core::panicking::panic_fmt
57.47 s
> 2: core::result::unwrap_failed
57.47 s
> 3: alphal00p_docs_builder::tests::checked_in_registry_is_valid
57.47 s
> 4: <alphal00p_docs_builder::tests::checked_in_registry_is_valid::{closure#0} as core::ops::function::FnOnce<()>>::call_once
57.47 s
> note: Some details are omitted, run with `RUST_BACKTRACE=full` for a verbose backtrace.
57.47 s
> system-out
57.47 s
> running 1 test
57.47 s
> test tests::checked_in_registry_is_valid ... FAILED
57.47 s
>
57.47 s
> failures:
57.47 s
>
57.47 s
> failures:
57.47 s
> tests::checked_in_registry_is_valid
57.47 s
>
57.47 s
> test result: FAILED. 0 passed; 1 failed; 0 ignored; 0 measured; 128 filtered out; finished in 0.11s
57.47 s
> system-err
57.47 s
> thread 'tests::checked_in_registry_is_valid' (187) panicked at crates/alphal00p-docs-builder/src/lib.rs:12260:50:
57.47 s
> called `Result::unwrap()` on an `Err` value: required documentation source is missing: /build/source/crates/spynso3/typst/STIXTwoMath-Regular.woff2
57.47 s
>
57.47 s
> Location:
57.47 s
> crates/alphal00p-docs-builder/src/lib.rs:5103:9
57.47 s
> stack backtrace:
57.47 s
> 0: __rustc::rust_begin_unwind
57.47 s
> 1: core::panicking::panic_fmt
57.47 s
> 2: core::result::unwrap_failed
57.47 s
> 3: alphal00p_docs_builder::tests::checked_in_registry_is_valid
57.47 s
> 4: <alphal00p_docs_builder::tests::checked_in_registry_is_valid::{closure#0} as core::ops::function::FnOnce<()>>::call_once
57.47 s
> note: Some details are omitted, run with `RUST_BACKTRACE=full` for a verbose backtrace.
57.47 s
>
57.47 s
> 7. alphal00p-docs-builder::provenance_tests::each_build_captures_one_revision_before_rendering
57.47 s
> failure: test failure with exit code 101
57.47 s
> thread 'provenance_tests::each_build_captures_one_revision_before_rendering' (170) panicked at crates/alphal00p-docs-builder/src/provenance_tests.rs:274:9:
57.47 s
> assertion failed: command.status().unwrap().success()
57.47 s
> stack backtrace:
57.47 s
> 0: __rustc::rust_begin_unwind
57.47 s
> 1: core::panicking::panic_fmt
57.47 s
> 2: core::panicking::panic
57.47 s
> 3: alphal00p_docs_builder::provenance_tests::each_build_captures_one_revision_before_rendering
57.47 s
> 4: <alphal00p_docs_builder::provenance_tests::each_build_captures_one_revision_before_rendering::{closure#0} as core::ops::function::FnOnce<()>>::call_once
57.47 s
> note: Some details are omitted, run with `RUST_BACKTRACE=full` for a verbose backtrace.
57.47 s
> system-out
57.47 s
> running 1 test
57.47 s
>
57.47 s
> running 1 test
57.47 s
> test provenance_tests::each_build_captures_one_revision_before_rendering ... FAILED
57.47 s
>
57.47 s
> failures:
57.47 s
>
57.47 s
> failures:
57.47 s
> provenance_tests::each_build_captures_one_revision_before_rendering
57.47 s
>
57.47 s
> test result: FAILED. 0 passed; 1 failed; 0 ignored; 0 measured; 128 filtered out; finished in 0.10s
57.47 s
>
57.47 s
> test provenance_tests::each_build_captures_one_revision_before_rendering ... FAILED
57.47 s
>
57.47 s
> failures:
57.47 s
>
57.47 s
> failures:
57.47 s
> provenance_tests::each_build_captures_one_revision_before_rendering
57.47 s
>
57.47 s
> test result: FAILED. 0 passed; 1 failed; 0 ignored; 0 measured; 128 filtered out; finished in 0.11s
57.47 s
> system-err
57.47 s
> thread 'provenance_tests::each_build_captures_one_revision_before_rendering' (253) panicked at crates/alphal00p-docs-builder/src/provenance_tests.rs:297:14:
57.47 s
> called `Result::unwrap()` on an `Err` value: required documentation source is missing: /build/source/target/nix-ci-tmp/.tmpuiqmMo/checkout/crates/spynso3/typst/STIXTwoMath-Regular.woff2
57.47 s
>
57.47 s
> Location:
57.47 s
> crates/alphal00p-docs-builder/src/lib.rs:5103:9
57.47 s
> stack backtrace:
57.47 s
> 0: __rustc::rust_begin_unwind
57.47 s
> 1: core::panicking::panic_fmt
57.47 s
> 2: core::result::unwrap_failed
57.47 s
> 3: alphal00p_docs_builder::provenance_tests::each_build_captures_one_revision_before_rendering
57.47 s
> 4: <alphal00p_docs_builder::provenance_tests::each_build_captures_one_revision_before_rendering::{closure#0} as core::ops::function::FnOnce<()>>::call_once
57.47 s
> note: Some details are omitted, run with `RUST_BACKTRACE=full` for a verbose backtrace.
57.47 s
>
57.47 s
> thread 'provenance_tests::each_build_captures_one_revision_before_rendering' (170) panicked at crates/alphal00p-docs-builder/src/provenance_tests.rs:274:9:
57.47 s
> assertion failed: command.status().unwrap().success()
57.47 s
> stack backtrace:
57.47 s
> 0: __rustc::rust_begin_unwind
57.47 s
> 1: core::panicking::panic_fmt
57.47 s
> 2: core::panicking::panic
57.47 s
> 3: alphal00p_docs_builder::provenance_tests::each_build_captures_one_revision_before_rendering
57.47 s
> 4: <alphal00p_docs_builder::provenance_tests::each_build_captures_one_revision_before_rendering::{closure#0} as core::ops::function::FnOnce<()>>::call_once
57.47 s
> note: Some details are omitted, run with `RUST_BACKTRACE=full` for a verbose backtrace.
57.47 s
>
57.47 s
> 8. alphal00p-docs-builder::tests::site_assets_replace_read_only_generated_files
57.47 s
> failure: test failure with exit code 101
57.47 s
> thread 'tests::site_assets_replace_read_only_generated_files' (670) panicked at crates/alphal00p-docs-builder/src/lib.rs:12305:50:
57.47 s
> called `Result::unwrap()` on an `Err` value: failed to copy documentation asset crates/spynso3/typst/STIXTwoMath-Regular.woff2
57.47 s
>
57.47 s
> Caused by:
57.47 s
> No such file or directory (os error 2)
57.47 s
>
57.47 s
> Location:
57.47 s
> crates/alphal00p-docs-builder/src/lib.rs:2276:18
57.47 s
> stack backtrace:
57.47 s
> 0: __rustc::rust_begin_unwind
57.47 s
> 1: core::panicking::panic_fmt
57.47 s
> 2: core::result::unwrap_failed
57.47 s
> 3: alphal00p_docs_builder::tests::site_assets_replace_read_only_generated_files
57.47 s
> 4: <alphal00p_docs_builder::tests::site_assets_replace_read_only_generated_files::{closure#0} as core::ops::function::FnOnce<()>>::call_once
57.47 s
> note: Some details are omitted, run with `RUST_BACKTRACE=full` for a verbose backtrace.
57.47 s
> system-out
57.47 s
> running 1 test
57.47 s
> test tests::site_assets_replace_read_only_generated_files ... FAILED
57.47 s
>
57.47 s
> failures:
57.47 s
>
57.47 s
> failures:
57.47 s
> tests::site_assets_replace_read_only_generated_files
57.47 s
>
57.47 s
> test result: FAILED. 0 passed; 1 failed; 0 ignored; 0 measured; 128 filtered out; finished in 0.01s
57.47 s
> system-err
57.47 s
> thread 'tests::site_assets_replace_read_only_generated_files' (670) panicked at crates/alphal00p-docs-builder/src/lib.rs:12305:50:
57.47 s
> called `Result::unwrap()` on an `Err` value: failed to copy documentation asset crates/spynso3/typst/STIXTwoMath-Regular.woff2
57.47 s
>
57.47 s
> Caused by:
57.47 s
> No such file or directory (os error 2)
57.47 s
>
57.47 s
> Location:
57.47 s
> crates/alphal00p-docs-builder/src/lib.rs:2276:18
57.47 s
> stack backtrace:
57.47 s
> 0: __rustc::rust_begin_unwind
57.47 s
> 1: core::panicking::panic_fmt
57.47 s
> 2: core::result::unwrap_failed
57.47 s
> 3: alphal00p_docs_builder::tests::site_assets_replace_read_only_generated_files
57.47 s
> 4: <alphal00p_docs_builder::tests::site_assets_replace_read_only_generated_files::{closure#0} as core::ops::function::FnOnce<()>>::call_once
57.47 s
> note: Some details are omitted, run with `RUST_BACKTRACE=full` for a verbose backtrace.
57.47 s
>
57.47 s
> 9. alphal00p-docs-builder::tests::developer_scope_ranges_ignore_unrelated_edits_and_warn_only_while_watching
57.47 s
> failure: test failure with exit code 101
57.47 s
> thread 'tests::developer_scope_ranges_ignore_unrelated_edits_and_warn_only_while_watching' (287) panicked at crates/alphal00p-docs-builder/src/lib.rs:12350:29:
57.47 s
> called `Result::unwrap()` on an `Err` value: required documentation source is missing: /build/source/crates/spynso3/typst/STIXTwoMath-Regular.woff2
57.47 s
>
57.47 s
> Location:
57.47 s
> crates/alphal00p-docs-builder/src/lib.rs:5103:9
57.47 s
> stack backtrace:
57.47 s
> 0: __rustc::rust_begin_unwind
57.47 s
> 1: core::panicking::panic_fmt
57.47 s
> 2: core::result::unwrap_failed
57.47 s
> 3: alphal00p_docs_builder::tests::developer_scope_ranges_ignore_unrelated_edits_and_warn_only_while_watching
57.47 s
> 4: <alphal00p_docs_builder::tests::developer_scope_ranges_ignore_unrelated_edits_and_warn_only_while_watching::{closure#0} as core::ops::function::FnOnce<()>>::call_once
57.47 s
> note: Some details are omitted, run with `RUST_BACKTRACE=full` for a verbose backtrace.
57.47 s
> system-out
57.47 s
> running 1 test
57.47 s
> test tests::developer_scope_ranges_ignore_unrelated_edits_and_warn_only_while_watching ... FAILED
57.47 s
>
57.47 s
> failures:
57.47 s
>
57.47 s
> failures:
57.47 s
> tests::developer_scope_ranges_ignore_unrelated_edits_and_warn_only_while_watching
57.47 s
>
57.47 s
> test result: FAILED. 0 passed; 1 failed; 0 ignored; 0 measured; 128 filtered out; finished in 0.10s
57.47 s
> system-err
57.47 s
> thread 'tests::developer_scope_ranges_ignore_unrelated_edits_and_warn_only_while_watching' (287) panicked at crates/alphal00p-docs-builder/src/lib.rs:12350:29:
57.47 s
> called `Result::unwrap()` on an `Err` value: required documentation source is missing: /build/source/crates/spynso3/typst/STIXTwoMath-Regular.woff2
57.47 s
>
57.47 s
> Location:
57.47 s
> crates/alphal00p-docs-builder/src/lib.rs:5103:9
57.47 s
> stack backtrace:
57.47 s
> 0: __rustc::rust_begin_unwind
57.47 s
> 1: core::panicking::panic_fmt
57.47 s
> 2: core::result::unwrap_failed
57.47 s
> 3: alphal00p_docs_builder::tests::developer_scope_ranges_ignore_unrelated_edits_and_warn_only_while_watching
57.47 s
> 4: <alphal00p_docs_builder::tests::developer_scope_ranges_ignore_unrelated_edits_and_warn_only_while_watching::{closure#0} as core::ops::function::FnOnce<()>>::call_once
57.47 s
> note: Some details are omitted, run with `RUST_BACKTRACE=full` for a verbose backtrace.
57.47 s
>
57.47 s
> 10. alphal00p-docs-builder::tests::every_product_requires_a_task_chooser_and_each_supported_interface
57.47 s
> failure: test failure with exit code 101
57.47 s
> thread 'tests::every_product_requires_a_task_chooser_and_each_supported_interface' (327) panicked at crates/alphal00p-docs-builder/src/lib.rs:12274:9:
57.47 s
> assertion failed: format!("{error:#}").contains("has no quickstart page")
57.47 s
> stack backtrace:
57.47 s
> 0: __rustc::rust_begin_unwind
57.47 s
> 1: core::panicking::panic_fmt
57.47 s
> 2: core::panicking::panic
57.47 s
> 3: alphal00p_docs_builder::tests::every_product_requires_a_task_chooser_and_each_supported_interface
57.47 s
> 4: <alphal00p_docs_builder::tests::every_product_requires_a_task_chooser_and_each_supported_interface::{closure#0} as core::ops::function::FnOnce<()>>::call_once
57.47 s
> note: Some details are omitted, run with `RUST_BACKTRACE=full` for a verbose backtrace.
57.47 s
> system-out
57.47 s
> running 1 test
57.47 s
> test tests::every_product_requires_a_task_chooser_and_each_supported_interface ... FAILED
57.47 s
>
57.47 s
> failures:
57.47 s
>
57.47 s
> failures:
57.47 s
> tests::every_product_requires_a_task_chooser_and_each_supported_interface
57.47 s
>
57.47 s
> test result: FAILED. 0 passed; 1 failed; 0 ignored; 0 measured; 128 filtered out; finished in 0.12s
57.47 s
> system-err
57.47 s
> thread 'tests::every_product_requires_a_task_chooser_and_each_supported_interface' (327) panicked at crates/alphal00p-docs-builder/src/lib.rs:12274:9:
57.47 s
> assertion failed: format!("{error:#}").contains("has no quickstart page")
57.47 s
> stack backtrace:
57.47 s
> 0: __rustc::rust_begin_unwind
57.47 s
> 1: core::panicking::panic_fmt
57.47 s
> 2: core::panicking::panic
57.47 s
> 3: alphal00p_docs_builder::tests::every_product_requires_a_task_chooser_and_each_supported_interface
57.47 s
> 4: <alphal00p_docs_builder::tests::every_product_requires_a_task_chooser_and_each_supported_interface::{closure#0} as core::ops::function::FnOnce<()>>::call_once
57.47 s
> note: Some details are omitted, run with `RUST_BACKTRACE=full` for a verbose backtrace.
57.47 s
>
57.47 s
> 11. alphal00p-docs-builder::tests::pdf_manual_chapter_order_must_match_the_page_registry
57.47 s
> failure: test failure with exit code 101
57.47 s
> thread 'tests::pdf_manual_chapter_order_must_match_the_page_registry' (396) panicked at crates/alphal00p-docs-builder/src/lib.rs:12330:9:
57.47 s
> assertion failed: format!("{error:#}").contains("PDF manual chapter order differs")
57.47 s
> stack backtrace:
57.47 s
> 0: __rustc::rust_begin_unwind
57.47 s
> 1: core::panicking::panic_fmt
57.47 s
> 2: core::panicking::panic
57.47 s
> 3: alphal00p_docs_builder::tests::pdf_manual_chapter_order_must_match_the_page_registry
57.47 s
> 4: <alphal00p_docs_builder::tests::pdf_manual_chapter_order_must_match_the_page_registry::{closure#0} as core::ops::function::FnOnce<()>>::call_once
57.47 s
> note: Some details are omitted, run with `RUST_BACKTRACE=full` for a verbose backtrace.
57.47 s
> system-out
57.47 s
> running 1 test
57.47 s
> test tests::pdf_manual_chapter_order_must_match_the_page_registry ... FAILED
57.47 s
>
57.47 s
> failures:
57.47 s
>
57.47 s
> failures:
57.47 s
> tests::pdf_manual_chapter_order_must_match_the_page_registry
57.47 s
>
57.47 s
> test result: FAILED. 0 passed; 1 failed; 0 ignored; 0 measured; 128 filtered out; finished in 0.11s
57.47 s
> system-err
57.47 s
> thread 'tests::pdf_manual_chapter_order_must_match_the_page_registry' (396) panicked at crates/alphal00p-docs-builder/src/lib.rs:12330:9:
57.47 s
> assertion failed: format!("{error:#}").contains("PDF manual chapter order differs")
57.47 s
> stack backtrace:
57.47 s
> 0: __rustc::rust_begin_unwind
57.47 s
> 1: core::panicking::panic_fmt
57.47 s
> 2: core::panicking::panic
57.47 s
> 3: alphal00p_docs_builder::tests::pdf_manual_chapter_order_must_match_the_page_registry
57.47 s
> 4: <alphal00p_docs_builder::tests::pdf_manual_chapter_order_must_match_the_page_registry::{closure#0} as core::ops::function::FnOnce<()>>::call_once
57.47 s
> note: Some details are omitted, run with `RUST_BACKTRACE=full` for a verbose backtrace.
57.47 s
> =========================================
57.47 s
> Extracting 2 binaries to /build/source
57.47 s
> Extracted 5 files to /build/source in 0.03s
57.47 s
> ------------
57.47 s
> Nextest run ID 24e191ac-d1d6-4525-a290-5ce6f5184db9 with nextest profile: ci_gammaloop
57.47 s
> Starting 22 tests across 2 binaries
57.47 s
> ------------
57.47 s
> Summary [ 0.018s] 22 tests run: 22 passed , 0 skipped
57.47 s
>
57.47 s
> ========== nextest test summary ==========
57.47 s
> report: target/nextest/ci_gammaloop/junit.xml
57.47 s
> tests: 22, failures: 0, errors: 0
57.47 s
> No failing testcases found.
57.47 s
> =========================================
57.47 s
> Extracting 3 binaries (including 2 non-test binaries), 1 build script output directory, and 2 linked paths to /build/source
57.47 s
> Extracted 22 files to /build/source in 0.23s
57.47 s
> ------------
57.47 s
> Nextest run ID fcb6b418-f25c-4bf7-8e1c-fbd57dfa5fb6 with nextest profile: ci_gammaloop
57.47 s
> Starting 89 tests across 1 binary
57.47 s
> ------------
57.47 s
> Summary [ 0.041s] 89 tests run: 89 passed , 0 skipped
57.47 s
>
57.47 s
> ========== nextest test summary ==========
57.47 s
> report: target/nextest/ci_gammaloop/junit.xml
57.47 s
> tests: 89, failures: 0, errors: 0
57.47 s
> No failing testcases found.
57.47 s
> =========================================
57.47 s
> Extracting 2 binaries to /build/source
57.47 s
> Extracted 5 files to /build/source in 0.04s
57.47 s
> ------------
57.47 s
> Nextest run ID cc8a25c9-e414-4efd-8b79-788c082f5116 with nextest profile: ci_gammaloop
57.47 s
> Starting 10 tests across 2 binaries
57.47 s
> ------------
57.47 s
> Summary [ 11.100s] 10 tests run: 10 passed , 0 skipped
57.47 s
>
57.47 s
> ========== nextest test summary ==========
57.47 s
> report: target/nextest/ci_gammaloop/junit.xml
57.47 s
> tests: 10, failures: 0, errors: 0
57.47 s
> No failing testcases found.
57.47 s
> =========================================
57.47 s
> Extracting 1 binary to /build/source
57.47 s
> Extracted 4 files to /build/source in 0.03s
57.47 s
> ------------
57.47 s
> Nextest run ID 697effbe-8f91-49cb-a1a8-e8b9de70dca3 with nextest profile: ci_gammaloop
57.47 s
> Starting 0 tests across 1 binary
57.47 s
> ------------
57.47 s
> Summary [ 0.000s] 0 tests run: 0 passed , 0 skipped
57.47 s
>
57.47 s
> ========== nextest test summary ==========
57.47 s
> report: target/nextest/ci_gammaloop/junit.xml
57.47 s
> tests: 0, failures: 0, errors: 0
57.47 s
> No failing testcases found.
57.47 s
> =========================================
57.47 s
> Extracting 1 binary to /build/source
57.47 s
> Extracted 4 files to /build/source in 0.03s
57.47 s
> ------------
57.47 s
> Nextest run ID b47940d8-20d1-4c44-92b6-b4203ed58244 with nextest profile: ci_gammaloop
57.47 s
> Starting 5 tests across 1 binary
57.47 s
> ------------
57.47 s
> Summary [ 0.004s] 5 tests run: 5 passed , 0 skipped
57.47 s
>
57.47 s
> ========== nextest test summary ==========
57.47 s
> report: target/nextest/ci_gammaloop/junit.xml
57.47 s
> tests: 5, failures: 0, errors: 0
57.47 s
> No failing testcases found.
57.47 s
> =========================================
57.47 s
For full logs, run:
57.47 s
nix log /nix/store/lss98va6a34sawhfmb9hflr4awgmkih4-gammaloop-nextest-docs.drv
57.63 s
[2 built (1 failed ), 103 Run failed.