1. 0.00 s $ /nix/store/61685rbaxmpigwi3z23i33sv3jyfl70q-coreutils-9.11/bin/timeout --kill-after=15s 7200s /nix/store/wknkybkzrc16r11vk5vrykh4wmw7a353-nix-2.34.8/bin/nix --extra-experimental-features nix-command --extra-experimental-features flakes flake clone git+https://github.com/alphal00p/gammaloop --dest /tmp/nix-ci-worker/stable-pwd/repo/
  2. 0.06 s Cloning into '/tmp/nix-ci-worker/stable-pwd/repo'...
  3. 0.82 s remote: Enumerating objects: 103497, done.
  4. 0.95 s remote: Counting objects: 0% (1/10120) remote: Counting objects: 1% (102/10120) remote: Counting objects: 2% (203/10120) remote: Counting objects: 3% (304/10120) remote: Counting objects: 4% (405/10120) remote: Counting objects: 5% (506/10120) remote: Counting objects: 6% (608/10120) remote: Counting objects: 7% (709/10120) remote: Counting objects: 8% (810/10120) remote: Counting objects: 9% (911/10120) remote: Counting objects: 10% (1012/10120) remote: Counting objects: 11% (1114/10120) remote: Counting objects: 12% (1215/10120) remote: Counting objects: 13% (1316/10120) remote: Counting objects: 14% (1417/10120) remote: Counting objects: 15% (1518/10120) remote: Counting objects: 16% (1620/10120) remote: Counting objects: 17% (1721/10120) remote: Counting objects: 18% (1822/10120) remote: Counting objects: 19% (1923/10120) remote: Counting objects: 20% (2024/10120) remote: Counting objects: 21% (2126/10120) remote: Counting objects: 22% (2227/10120) remote: Counting objects: 23% (2328/10120) remote: Counting objects: 24% (2429/10120) remote: Counting objects: 25% (2530/10120) remote: Counting objects: 26% (2632/10120) remote: Counting objects: 27% (2733/10120) remote: Counting objects: 28% (2834/10120) remote: Counting objects: 29% (2935/10120) remote: Counting objects: 30% (3036/10120) remote: Counting objects: 31% (3138/10120) remote: Counting objects: 32% (3239/10120) remote: Counting objects: 33% (3340/10120) remote: Counting objects: 34% (3441/10120) remote: Counting objects: 35% (3542/10120) remote: Counting objects: 36% (3644/10120) remote: Counting objects: 37% (3745/10120) remote: Counting objects: 38% (3846/10120) remote: Counting objects: 39% (3947/10120) remote: Counting objects: 40% (4048/10120) remote: Counting objects: 41% (4150/10120) remote: Counting objects: 42% (4251/10120) remote: Counting objects: 43% (4352/10120) remote: Counting objects: 44% (4453/10120) remote: Counting objects: 45% (4554/10120) remote: Counting objects: 46% (4656/10120) remote: Counting objects: 47% (4757/10120) remote: Counting objects: 48% (4858/10120) remote: Counting objects: 49% (4959/10120) remote: Counting objects: 50% (5060/10120) remote: Counting objects: 51% (5162/10120) remote: Counting objects: 52% (5263/10120) remote: Counting objects: 53% (5364/10120) remote: Counting objects: 54% (5465/10120) remote: Counting objects: 55% (5566/10120) remote: Counting objects: 56% (5668/10120) remote: Counting objects: 57% (5769/10120) remote: Counting objects: 58% (5870/10120) remote: Counting objects: 59% (5971/10120) remote: Counting objects: 60% (6072/10120) remote: Counting objects: 61% (6174/10120) remote: Counting objects: 62% (6275/10120) remote: Counting objects: 63% (6376/10120) remote: Counting objects: 64% (6477/10120) remote: Counting objects: 65% (6578/10120) remote: Counting objects: 66% (6680/10120) remote: Counting objects: 67% (6781/10120) remote: Counting objects: 68% (6882/10120) remote: Counting objects: 69% (6983/10120) remote: Counting objects: 70% (7084/10120) remote: Counting objects: 71% (7186/10120) remote: Counting objects: 72% (7287/10120) remote: Counting objects: 73% (7388/10120) remote: Counting objects: 74% (7489/10120) remote: Counting objects: 75% (7590/10120) remote: Counting objects: 76% (7692/10120) remote: Counting objects: 77% (7793/10120) remote: Counting objects: 78% (7894/10120) remote: Counting objects: 79% (7995/10120) remote: Counting objects: 80% (8096/10120) remote: Counting objects: 81% (8198/10120) remote: Counting objects: 82% (8299/10120) remote: Counting objects: 83% (8400/10120) remote: Counting objects: 84% (8501/10120) remote: Counting objects: 85% (8602/10120) remote: Counting objects: 86% (8704/10120) remote: Counting objects: 87% (8805/10120) remote: Counting objects: 88% (8906/10120) remote: Counting objects: 89% (9007/10120) remote: Counting objects: 90% (9108/10120) remote: Counting objects: 91% (9210/10120) remote: Counting objects: 92% (9311/10120) remote: Counting objects: 93% (9412/10120) remote: Counting objects: 94% (9513/10120) remote: Counting objects: 95% (9614/10120) remote: Counting objects: 96% (9716/10120) remote: Counting objects: 97% (9817/10120) remote: Counting objects: 98% (9918/10120) remote: Counting objects: 99% (10019/10120) remote: Counting objects: 100% (10120/10120) remote: Counting objects: 100% (10120/10120), done.
  5. 3.08 s remote: Compressing objects: 0% (1/2291) remote: Compressing objects: 1% (23/2291) remote: Compressing objects: 2% (46/2291) remote: Compressing objects: 3% (69/2291) remote: Compressing objects: 4% (92/2291) remote: Compressing objects: 5% (115/2291) remote: Compressing objects: 6% (138/2291) remote: Compressing objects: 7% (161/2291) remote: Compressing objects: 8% (184/2291) remote: Compressing objects: 9% (207/2291) remote: Compressing objects: 10% (230/2291) remote: Compressing objects: 10% (238/2291) remote: Compressing objects: 11% (253/2291) remote: Compressing objects: 12% (275/2291) remote: Compressing objects: 13% (298/2291) remote: Compressing objects: 14% (321/2291) remote: Compressing objects: 15% (344/2291) remote: Compressing objects: 16% (367/2291) remote: Compressing objects: 17% (390/2291) remote: Compressing objects: 18% (413/2291) remote: Compressing objects: 19% (436/2291) remote: Compressing objects: 20% (459/2291) remote: Compressing objects: 21% (482/2291) remote: Compressing objects: 22% (505/2291) remote: Compressing objects: 23% (527/2291) remote: Compressing objects: 23% (545/2291) remote: Compressing objects: 24% (550/2291) remote: Compressing objects: 25% (573/2291) remote: Compressing objects: 26% (596/2291) remote: Compressing objects: 27% (619/2291) remote: Compressing objects: 28% (642/2291) remote: Compressing objects: 29% (665/2291) remote: Compressing objects: 30% (688/2291) remote: Compressing objects: 31% (711/2291) remote: Compressing objects: 32% (734/2291) remote: Compressing objects: 33% (757/2291) remote: Compressing objects: 34% (779/2291) remote: Compressing objects: 35% (802/2291) remote: Compressing objects: 36% (825/2291) remote: Compressing objects: 37% (848/2291) remote: Compressing objects: 38% (871/2291) remote: Compressing objects: 39% (894/2291) remote: Compressing objects: 40% (917/2291) remote: Compressing objects: 41% (940/2291) remote: Compressing objects: 42% (963/2291) remote: Compressing objects: 43% (986/2291) remote: Compressing objects: 44% (1009/2291) remote: Compressing objects: 45% (1031/2291) remote: Compressing objects: 46% (1054/2291) remote: Compressing objects: 47% (1077/2291) remote: Compressing objects: 48% (1100/2291) remote: Compressing objects: 49% (1123/2291) remote: Compressing objects: 50% (1146/2291) remote: Compressing objects: 51% (1169/2291) remote: Compressing objects: 52% (1192/2291) remote: Compressing objects: 53% (1215/2291) remote: Compressing objects: 54% (1238/2291) remote: Compressing objects: 55% (1261/2291) remote: Compressing objects: 56% (1283/2291) remote: Compressing objects: 57% (1306/2291) remote: Compressing objects: 58% (1329/2291) remote: Compressing objects: 59% (1352/2291) remote: Compressing objects: 60% (1375/2291) remote: Compressing objects: 61% (1398/2291) remote: Compressing objects: 62% (1421/2291) remote: Compressing objects: 63% (1444/2291) remote: Compressing objects: 64% (1467/2291) remote: Compressing objects: 65% (1490/2291) remote: Compressing objects: 66% (1513/2291) remote: Compressing objects: 67% (1535/2291) remote: Compressing objects: 68% (1558/2291) remote: Compressing objects: 69% (1581/2291) remote: Compressing objects: 70% (1604/2291) remote: Compressing objects: 71% (1627/2291) remote: Compressing objects: 72% (1650/2291) remote: Compressing objects: 73% (1673/2291) remote: Compressing objects: 74% (1696/2291) remote: Compressing objects: 75% (1719/2291) remote: Compressing objects: 76% (1742/2291) remote: Compressing objects: 77% (1765/2291) remote: Compressing objects: 78% (1787/2291) remote: Compressing objects: 79% (1810/2291) remote: Compressing objects: 80% (1833/2291) remote: Compressing objects: 81% (1856/2291) remote: Compressing objects: 82% (1879/2291) remote: Compressing objects: 83% (1902/2291) remote: Compressing objects: 84% (1925/2291) remote: Compressing objects: 85% (1948/2291) remote: Compressing objects: 86% (1971/2291) remote: Compressing objects: 87% (1994/2291) remote: Compressing objects: 88% (2017/2291) remote: Compressing objects: 89% (2039/2291) remote: Compressing objects: 90% (2062/2291) remote: Compressing objects: 91% (2085/2291) remote: Compressing objects: 92% (2108/2291) remote: Compressing objects: 93% (2131/2291) remote: Compressing objects: 94% (2154/2291) remote: Compressing objects: 95% (2177/2291) remote: Compressing objects: 96% (2200/2291) remote: Compressing objects: 97% (2223/2291) remote: Compressing objects: 98% (2246/2291) remote: Compressing objects: 99% (2269/2291) remote: Compressing objects: 100% (2291/2291) remote: Compressing objects: 100% (2291/2291), done.
  6. 15.98 s Receiving objects: 0% (1/103497) Receiving objects: 1% (1035/103497) Receiving objects: 2% (2070/103497) Receiving objects: 3% (3105/103497) Receiving objects: 4% (4140/103497) Receiving objects: 5% (5175/103497), 9.20 MiB | 18.42 MiB/s Receiving objects: 6% (6210/103497), 9.20 MiB | 18.42 MiB/s Receiving objects: 7% (7245/103497), 9.20 MiB | 18.42 MiB/s Receiving objects: 8% (8280/103497), 9.20 MiB | 18.42 MiB/s Receiving objects: 9% (9315/103497), 9.20 MiB | 18.42 MiB/s Receiving objects: 10% (10350/103497), 9.20 MiB | 18.42 MiB/s Receiving objects: 11% (11385/103497), 9.20 MiB | 18.42 MiB/s Receiving objects: 12% (12420/103497), 9.20 MiB | 18.42 MiB/s Receiving objects: 13% (13455/103497), 9.20 MiB | 18.42 MiB/s Receiving objects: 14% (14490/103497), 9.20 MiB | 18.42 MiB/s Receiving objects: 15% (15525/103497), 9.20 MiB | 18.42 MiB/s Receiving objects: 16% (16560/103497), 9.20 MiB | 18.42 MiB/s Receiving objects: 17% (17595/103497), 9.20 MiB | 18.42 MiB/s Receiving objects: 18% (18630/103497), 9.20 MiB | 18.42 MiB/s Receiving objects: 19% (19665/103497), 9.20 MiB | 18.42 MiB/s Receiving objects: 20% (20700/103497), 9.20 MiB | 18.42 MiB/s Receiving objects: 21% (21735/103497), 9.20 MiB | 18.42 MiB/s Receiving objects: 22% (22770/103497), 9.20 MiB | 18.42 MiB/s Receiving objects: 23% (23805/103497), 9.20 MiB | 18.42 MiB/s Receiving objects: 24% (24840/103497), 9.20 MiB | 18.42 MiB/s Receiving objects: 25% (25875/103497), 9.20 MiB | 18.42 MiB/s Receiving objects: 26% (26910/103497), 9.20 MiB | 18.42 MiB/s Receiving objects: 27% (27945/103497), 9.20 MiB | 18.42 MiB/s Receiving objects: 28% (28980/103497), 9.20 MiB | 18.42 MiB/s Receiving objects: 29% (30015/103497), 9.20 MiB | 18.42 MiB/s Receiving objects: 30% (31050/103497), 9.20 MiB | 18.42 MiB/s Receiving objects: 30% (31426/103497), 27.68 MiB | 27.72 MiB/s Receiving objects: 31% (32085/103497), 27.68 MiB | 27.72 MiB/s Receiving objects: 32% (33120/103497), 27.68 MiB | 27.72 MiB/s Receiving objects: 33% (34155/103497), 27.68 MiB | 27.72 MiB/s Receiving objects: 34% (35189/103497), 27.68 MiB | 27.72 MiB/s Receiving objects: 35% (36224/103497), 27.68 MiB | 27.72 MiB/s Receiving objects: 36% (37259/103497), 27.68 MiB | 27.72 MiB/s Receiving objects: 37% (38294/103497), 42.50 MiB | 28.33 MiB/s Receiving objects: 38% (39329/103497), 42.50 MiB | 28.33 MiB/s Receiving objects: 39% (40364/103497), 42.50 MiB | 28.33 MiB/s Receiving objects: 40% (41399/103497), 42.50 MiB | 28.33 MiB/s Receiving objects: 41% (42434/103497), 42.50 MiB | 28.33 MiB/s Receiving objects: 42% (43469/103497), 42.50 MiB | 28.33 MiB/s Receiving objects: 43% (44504/103497), 42.50 MiB | 28.33 MiB/s Receiving objects: 44% (45539/103497), 42.50 MiB | 28.33 MiB/s Receiving objects: 44% (46418/103497), 57.82 MiB | 28.87 MiB/s Receiving objects: 45% (46574/103497), 57.82 MiB | 28.87 MiB/s Receiving objects: 46% (47609/103497), 57.82 MiB | 28.87 MiB/s Receiving objects: 47% (48644/103497), 57.82 MiB | 28.87 MiB/s Receiving objects: 48% (49679/103497), 57.82 MiB | 28.87 MiB/s Receiving objects: 49% (50714/103497), 57.82 MiB | 28.87 MiB/s Receiving objects: 50% (51749/103497), 72.96 MiB | 29.11 MiB/s Receiving objects: 51% (52784/103497), 72.96 MiB | 29.11 MiB/s Receiving objects: 52% (53819/103497), 72.96 MiB | 29.11 MiB/s Receiving objects: 53% (54854/103497), 72.96 MiB | 29.11 MiB/s Receiving objects: 54% (55889/103497), 72.96 MiB | 29.11 MiB/s Receiving objects: 55% (56924/103497), 72.96 MiB | 29.11 MiB/s Receiving objects: 55% (57056/103497), 72.96 MiB | 29.11 MiB/s Receiving objects: 55% (57103/103497), 103.92 MiB | 29.55 MiB/s Receiving objects: 55% (57227/103497), 149.76 MiB | 31.09 MiB/s Receiving objects: 56% (57959/103497), 149.76 MiB | 31.09 MiB/s Receiving objects: 57% (58994/103497), 165.19 MiB | 30.39 MiB/s Receiving objects: 58% (60029/103497), 165.19 MiB | 30.39 MiB/s Receiving objects: 59% (61064/103497), 165.19 MiB | 30.39 MiB/s Receiving objects: 60% (62099/103497), 165.19 MiB | 30.39 MiB/s Receiving objects: 61% (63134/103497), 165.19 MiB | 30.39 MiB/s Receiving objects: 61% (63767/103497), 165.19 MiB | 30.39 MiB/s Receiving objects: 62% (64169/103497), 165.19 MiB | 30.39 MiB/s Receiving objects: 63% (65204/103497), 180.75 MiB | 30.54 MiB/s Receiving objects: 64% (66239/103497), 180.75 MiB | 30.54 MiB/s Receiving objects: 65% (67274/103497), 180.75 MiB | 30.54 MiB/s Receiving objects: 66% (68309/103497), 180.75 MiB | 30.54 MiB/s Receiving objects: 67% (69343/103497), 180.75 MiB | 30.54 MiB/s Receiving objects: 68% (70378/103497), 180.75 MiB | 30.54 MiB/s Receiving objects: 69% (71413/103497), 180.75 MiB | 30.54 MiB/s Receiving objects: 70% (72448/103497), 180.75 MiB | 30.54 MiB/s Receiving objects: 71% (73483/103497), 196.21 MiB | 30.57 MiB/s Receiving objects: 72% (74518/103497), 196.21 MiB | 30.57 MiB/s Receiving objects: 73% (75553/103497), 196.21 MiB | 30.57 MiB/s Receiving objects: 73% (75885/103497), 196.21 MiB | 30.57 MiB/s Receiving objects: 74% (76588/103497), 211.64 MiB | 30.64 MiB/s Receiving objects: 75% (77623/103497), 227.19 MiB | 30.69 MiB/s Receiving objects: 76% (78658/103497), 227.19 MiB | 30.69 MiB/s Receiving objects: 77% (79693/103497), 227.19 MiB | 30.69 MiB/s Receiving objects: 77% (80685/103497), 227.19 MiB | 30.69 MiB/s Receiving objects: 78% (80728/103497), 227.19 MiB | 30.69 MiB/s Receiving objects: 79% (81763/103497), 242.78 MiB | 30.72 MiB/s Receiving objects: 80% (82798/103497), 242.78 MiB | 30.72 MiB/s Receiving objects: 81% (83833/103497), 242.78 MiB | 30.72 MiB/s Receiving objects: 81% (84190/103497), 258.32 MiB | 30.74 MiB/s Receiving objects: 81% (84515/103497), 304.49 MiB | 30.84 MiB/s Receiving objects: 82% (84868/103497), 304.49 MiB | 30.84 MiB/s Receiving objects: 83% (85903/103497), 319.86 MiB | 30.82 MiB/s Receiving objects: 84% (86938/103497), 319.86 MiB | 30.82 MiB/s Receiving objects: 84% (87968/103497), 335.26 MiB | 30.83 MiB/s Receiving objects: 85% (87973/103497), 335.26 MiB | 30.83 MiB/s Receiving objects: 86% (89008/103497), 335.26 MiB | 30.83 MiB/s Receiving objects: 87% (90043/103497), 335.26 MiB | 30.83 MiB/s Receiving objects: 88% (91078/103497), 335.26 MiB | 30.83 MiB/s Receiving objects: 88% (91430/103497), 350.84 MiB | 30.88 MiB/s Receiving objects: 89% (92113/103497), 366.48 MiB | 30.91 MiB/s Receiving objects: 90% (93148/103497), 381.83 MiB | 30.85 MiB/s Receiving objects: 91% (94183/103497), 381.83 MiB | 30.85 MiB/s Receiving objects: 92% (95218/103497), 381.83 MiB | 30.85 MiB/s Receiving objects: 93% (96253/103497), 381.83 MiB | 30.85 MiB/s Receiving objects: 94% (97288/103497), 381.83 MiB | 30.85 MiB/s Receiving objects: 95% (98323/103497), 381.83 MiB | 30.85 MiB/s Receiving objects: 96% (99358/103497), 381.83 MiB | 30.85 MiB/s Receiving objects: 97% (100393/103497), 381.83 MiB | 30.85 MiB/s Receiving objects: 98% (101428/103497), 381.83 MiB | 30.85 MiB/s Receiving objects: 99% (102463/103497), 381.83 MiB | 30.85 MiB/s remote: Total 103497 (delta 8623), reused 8045 (delta 7804), pack-reused 93377 (from 4)
  7. 15.98 s Receiving objects: 100% (103497/103497), 381.83 MiB | 30.85 MiB/s Receiving objects: 100% (103497/103497), 391.99 MiB | 30.44 MiB/s, done.
  8. 17.07 s Resolving deltas: 0% (0/67811) Resolving deltas: 1% (679/67811) Resolving deltas: 2% (1357/67811) Resolving deltas: 3% (2035/67811) Resolving deltas: 4% (2713/67811) Resolving deltas: 5% (3391/67811) Resolving deltas: 6% (4069/67811) Resolving deltas: 7% (4747/67811) Resolving deltas: 8% (5425/67811) Resolving deltas: 9% (6105/67811) Resolving deltas: 10% (6782/67811) Resolving deltas: 11% (7461/67811) Resolving deltas: 12% (8138/67811) Resolving deltas: 13% (8816/67811) Resolving deltas: 14% (9494/67811) Resolving deltas: 15% (10172/67811) Resolving deltas: 16% (10850/67811) Resolving deltas: 17% (11529/67811) Resolving deltas: 18% (12206/67811) Resolving deltas: 19% (12885/67811) Resolving deltas: 20% (13563/67811) Resolving deltas: 21% (14241/67811) Resolving deltas: 22% (14919/67811) Resolving deltas: 23% (15597/67811) Resolving deltas: 24% (16275/67811) Resolving deltas: 25% (16954/67811) Resolving deltas: 26% (17631/67811) Resolving deltas: 27% (18310/67811) Resolving deltas: 28% (18988/67811) Resolving deltas: 29% (19666/67811) Resolving deltas: 30% (20344/67811) Resolving deltas: 31% (21022/67811) Resolving deltas: 32% (21700/67811) Resolving deltas: 33% (22378/67811) Resolving deltas: 34% (23057/67811) Resolving deltas: 35% (23734/67811) Resolving deltas: 36% (24412/67811) Resolving deltas: 37% (25091/67811) Resolving deltas: 38% (25769/67811) Resolving deltas: 39% (26447/67811) Resolving deltas: 40% (27125/67811) Resolving deltas: 41% (27804/67811) Resolving deltas: 42% (28482/67811) Resolving deltas: 43% (29159/67811) Resolving deltas: 44% (29837/67811) Resolving deltas: 45% (30515/67811) Resolving deltas: 46% (31195/67811) Resolving deltas: 47% (31872/67811) Resolving deltas: 48% (32550/67811) Resolving deltas: 49% (33228/67811) Resolving deltas: 50% (33907/67811) Resolving deltas: 51% (34589/67811) Resolving deltas: 52% (35262/67811) Resolving deltas: 53% (35940/67811) Resolving deltas: 54% (36620/67811) Resolving deltas: 55% (37297/67811) Resolving deltas: 56% (37975/67811) Resolving deltas: 57% (38653/67811) Resolving deltas: 58% (39331/67811) Resolving deltas: 59% (40009/67811) Resolving deltas: 60% (40687/67811) Resolving deltas: 61% (41365/67811) Resolving deltas: 62% (42045/67811) Resolving deltas: 63% (42721/67811) Resolving deltas: 64% (43401/67811) Resolving deltas: 65% (44078/67811) Resolving deltas: 66% (44756/67811) Resolving deltas: 67% (45434/67811) Resolving deltas: 68% (46112/67811) Resolving deltas: 69% (46790/67811) Resolving deltas: 70% (47468/67811) Resolving deltas: 71% (48146/67811) Resolving deltas: 72% (48824/67811) Resolving deltas: 73% (49503/67811) Resolving deltas: 74% (50181/67811) Resolving deltas: 75% (50860/67811) Resolving deltas: 76% (51537/67811) Resolving deltas: 77% (52215/67811) Resolving deltas: 78% (52893/67811) Resolving deltas: 79% (53571/67811) Resolving deltas: 80% (54249/67811) Resolving deltas: 81% (54927/67811) Resolving deltas: 82% (55606/67811) Resolving deltas: 83% (56284/67811) Resolving deltas: 84% (56962/67811) Resolving deltas: 85% (57643/67811) Resolving deltas: 86% (58318/67811) Resolving deltas: 87% (58996/67811) Resolving deltas: 88% (59674/67811) Resolving deltas: 88% (59812/67811) Resolving deltas: 89% (60352/67811) Resolving deltas: 90% (61030/67811) Resolving deltas: 91% (61709/67811) Resolving deltas: 92% (62387/67811) Resolving deltas: 93% (63065/67811) Resolving deltas: 94% (63743/67811) Resolving deltas: 95% (64421/67811) Resolving deltas: 96% (65099/67811) Resolving deltas: 97% (65777/67811) Resolving deltas: 98% (66455/67811) Resolving deltas: 99% (67133/67811) Resolving deltas: 100% (67811/67811) Resolving deltas: 100% (67811/67811), done.
  9. 17.57 s Fetching commit 13c9bb203f1daef2670356779366ed6afc72bc51 for feynkit ...
  10. 17.57 s $ /nix/store/5vpcfsdx1lcnlb2y4k7xyc74shp5qwbh-git-2.54.0/bin/git fetch origin 13c9bb203f1daef2670356779366ed6afc72bc51
  11. 18.05 s From https://github.com/alphal00p/gammaloop
  12. 18.05 s * branch 13c9bb203f1daef2670356779366ed6afc72bc51 -> FETCH_HEAD
  13. 18.06 s $ /nix/store/61685rbaxmpigwi3z23i33sv3jyfl70q-coreutils-9.11/bin/timeout --kill-after=15s 7200s /nix/store/5vpcfsdx1lcnlb2y4k7xyc74shp5qwbh-git-2.54.0/bin/git -c advice.detachedHead=false checkout 13c9bb203f1daef2670356779366ed6afc72bc51
  14. 18.28 s HEAD is now at 13c9bb203 bundle readable math typography in notebook HTML
  15. 18.28 s $ /nix/store/61685rbaxmpigwi3z23i33sv3jyfl70q-coreutils-9.11/bin/timeout --kill-after=15s 7200s /nix/store/wknkybkzrc16r11vk5vrykh4wmw7a353-nix-2.34.8/bin/nix --extra-experimental-features nix-command --extra-experimental-features flakes --log-format internal-json run .#packages.x86_64-linux.nix-ci-check-gammaloop-nextest-docs --print-build-logs
  16. 18.38 s warning: ignoring untrusted flake configuration setting 'extra-substituters'.
  17. 18.38 s Pass '--accept-flake-config' to trust it
  18. 18.38 s warning: ignoring untrusted flake configuration setting 'extra-trusted-public-keys'.
  19. 18.38 s Pass '--accept-flake-config' to trust it
  20. 23.19 s
  21. 23.34 s Downloading cached nix-ci-check-gammaloop-nextest-docs from https://cache.nix-ci.com
  22. 23.38 s Downloaded cached nix-ci-check-gammaloop-nextest-docs (1128 B) in 38ms
  23. 23.38 s Progress: 0 of 1 built, 1 of 1 downloaded from cache
  24. 23.48 s do you want to allow configuration setting 'extra-substituters' to be set to 'https://cache.nix-ci.com' (y/N)? do you want to permanently mark this value as untrusted (y/N)? warning: ignoring untrusted flake configuration setting 'extra-substituters'.
  25. 23.48 s Pass '--accept-flake-config' to trust it
  26. 23.48 s evaluating derivation 'gdo you want to allow configuration setting 'extra-trusted-public-keys' to be set to 'nix-ci:g3xV5BDTLtIBZr/A00IU1x0EtKKlb7YLgBN2SgYgM6A=' (y/N)? do you want to permanently mark this value as untrusted (y/N)? warning: ignoring untrusted flake configuration setting 'extra-trusted-public-keys'.
  27. 23.48 s Pass '--accept-flake-config' to trust it
  28. 31.76 s copying '/nix/store/hc7a evaluating derivation 'g copying '/nix/store/hc7a evaluating derivation 'g copying '/nix/store/hc7a evaluating derivation 'g copying '/nix/store/hc7a evaluating derivation 'g querying gammaloop-nexte querying info about miss querying gammaloop-nexte [2.9 KiB DL] querying st [14.2 KiB DL] querying c [35.2 KiB DL] querying p [64.2/63.6 KiB DL] query [78.8 KiB DL] querying b [0/15 built, 16/0/103 co [0/14 built, 16/2/103 co [0/14 built, 16/14/103 c [0/14 built, 16/19/103 c [0/14 built, 16/26/103 c [0/13 built, 16/32/103 c [0/11 built, 9/41/103 co [0/11 built, 6/47/103 co [0/10 built, 4/49/103 co [0/10 built, 7/50/103 co [0/10 built, 5/54/103 co [0/10 built, 4/56/103 co [0/10 built, 3/57/103 co [0/10 built, 16/58/103 c [0/9 built, 16/65/103 co [0/9 built, 14/69/103 co [0/9 built, 12/78/103 co [0/9 built, 11/81/103 co [0/9 built, 8/87/103 cop [0/9 built, 7/88/103 cop [0/9 built, 8/91/103 cop [0/9 built, 7/92/103 cop [0/9 built, 7/93/103 cop [0/8 built, 6/94/103 copbuilder.pl> Running phase: patchPhase
  29. 31.76 s [1/0/7 built, 5/95/103 cbuilder.pl> Running phase: updateAutotoolsGnuConfigScriptsPhase
  30. 31.77 s builder.pl> Running phase: configurePhase
  31. 31.78 s builder.pl> no configure script, doing nothing
  32. 31.78 s builder.pl> Running phase: buildPhase
  33. 31.78 s builder.pl> Running phase: checkPhase
  34. 31.79 s [1/0/6 built, 4/96/103 cbuilder.pl> Running phase: installPhase
  35. 31.79 s builder.pl> no Makefile or custom installPhase, doing nothing
  36. 31.79 s builder.pl> Running phase: fixupPhase
  37. 31.80 s builder.pl> shrinking RPATHs of ELF executables and libraries in /nix/store/zzmspl8wdn2a3ancrz8dg3kci887nw6d-builder.pl
  38. 31.81 s builder.pl> checking for references to /build/ in /nix/store/zzmspl8wdn2a3ancrz8dg3kci887nw6d-builder.pl...
  39. 31.81 s builder.pl> patching script interpreter paths in /nix/store/zzmspl8wdn2a3ancrz8dg3kci887nw6d-builder.pl
  40. 31.84 s builder.pl (post)> Uploading to the NixCI cache: /nix/store/zzmspl8wdn2a3ancrz8dg3kci887nw6d-builder.pl
  41. 31.88 s builder.pl (post)> warning: 'warn-short-path-literals' is deprecated, use 'lint-short-path-literals = ignore' instead
  42. 32.00 s builder.pl (post)> copying 0 paths...
  43. 32.05 s builder.pl (post)> warning: 'warn-short-path-literals' is deprecated, use 'lint-short-path-literals = ignore' instead
  44. 32.51 s builder.pl (post)> copying 0 paths...
  45. 34.08 s [1/5 built, 3/98/103 cop [1/5 built, 2/99/103 cop [1/4 built, 1/100/103 co [1/4 built, 1/101/103 co [1/4 built, 1/102/103 co [1/3 built, 103 copied (typst> structuredAttrs is enabled
  46. 34.13 s [1/1/3 built, 103 copiedtypst> created 4 symlinks in user environment
  47. 34.21 s typst (post)> Uploading to the NixCI cache: /nix/store/yc93gbspdkf53nwjsf1mbydbsaq9snxl-typst-0.15.1-env
  48. 34.24 s typst (post)> warning: 'warn-short-path-literals' is deprecated, use 'lint-short-path-literals = ignore' instead
  49. 34.37 s typst (post)> copying 0 paths...
  50. 34.41 s typst (post)> warning: 'warn-short-path-literals' is deprecated, use 'lint-short-path-literals = ignore' instead
  51. 34.90 s typst (post)> copying 0 paths...
  52. 35.27 s [2/4 built, 103 copied ( [1/2/3 built, 103 copiedgammaloop-nextest-docs> Extracting 2 binaries to /build/source
  53. 35.31 s gammaloop-nextest-docs> Extracted 5 files to /build/source in 0.04s
  54. 35.32 s gammaloop-nextest-docs> ------------
  55. 35.32 s gammaloop-nextest-docs> Nextest run ID ea85f89a-f04e-473d-b29a-2b8cc1718ccd with nextest profile: ci_gammaloop
  56. 35.32 s gammaloop-nextest-docs> Starting 129 tests across 2 binaries
  57. 35.35 s gammaloop-nextest-docs> FAIL [ 0.014s] ( 26/129) alphal00p-docs-builder tests::developer_architecture_is_classified_searchable_and_source_backed
  58. 35.35 s gammaloop-nextest-docs> stdout ---
  59. 35.35 s gammaloop-nextest-docs>
  60. 35.35 s gammaloop-nextest-docs> running 1 test
  61. 35.35 s gammaloop-nextest-docs> test tests::developer_architecture_is_classified_searchable_and_source_backed ... FAILED
  62. 35.35 s gammaloop-nextest-docs>
  63. 35.35 s gammaloop-nextest-docs> failures:
  64. 35.35 s gammaloop-nextest-docs>
  65. 35.35 s gammaloop-nextest-docs> failures:
  66. 35.35 s gammaloop-nextest-docs> tests::developer_architecture_is_classified_searchable_and_source_backed
  67. 35.35 s gammaloop-nextest-docs>
  68. 35.35 s gammaloop-nextest-docs> test result: FAILED. 0 passed; 1 failed; 0 ignored; 0 measured; 128 filtered out; finished in 0.01s
  69. 35.35 s gammaloop-nextest-docs>
  70. 35.35 s gammaloop-nextest-docs> stderr ---
  71. 35.35 s gammaloop-nextest-docs>
  72. 35.35 s gammaloop-nextest-docs> thread 'tests::developer_architecture_is_classified_searchable_and_source_backed' (289) panicked at crates/alphal00p-docs-builder/src/lib.rs:12751:14:
  73. 35.35 s gammaloop-nextest-docs> called `Result::unwrap()` on an `Err` value: failed to copy documentation asset crates/spynso3/typst/STIXTwoMath-Regular.woff2
  74. 35.35 s gammaloop-nextest-docs>
  75. 35.35 s gammaloop-nextest-docs> Caused by:
  76. 35.35 s gammaloop-nextest-docs> No such file or directory (os error 2)
  77. 35.35 s gammaloop-nextest-docs>
  78. 35.35 s gammaloop-nextest-docs> Location:
  79. 35.35 s gammaloop-nextest-docs> crates/alphal00p-docs-builder/src/lib.rs:2276:18
  80. 35.35 s gammaloop-nextest-docs> stack backtrace:
  81. 35.35 s gammaloop-nextest-docs> 0: __rustc::rust_begin_unwind
  82. 35.35 s gammaloop-nextest-docs> 1: core::panicking::panic_fmt
  83. 35.35 s gammaloop-nextest-docs> 2: core::result::unwrap_failed
  84. 35.35 s gammaloop-nextest-docs> 3: alphal00p_docs_builder::tests::developer_architecture_is_classified_searchable_and_source_backed
  85. 35.35 s gammaloop-nextest-docs> 4: <alphal00p_docs_builder::tests::developer_architecture_is_classified_searchable_and_source_backed::{closure#0} as core::ops::function::FnOnce<()>>::call_once
  86. 35.35 s gammaloop-nextest-docs> note: Some details are omitted, run with `RUST_BACKTRACE=full` for a verbose backtrace.
  87. 35.35 s gammaloop-nextest-docs>
  88. 35.35 s gammaloop-nextest-docs> FAIL [ 0.008s] ( 28/129) alphal00p-docs-builder tests::every_product_orients_rust_to_native_rustdoc_and_keeps_legacy_redirects
  89. 35.35 s gammaloop-nextest-docs> stdout ---
  90. 35.35 s gammaloop-nextest-docs>
  91. 35.35 s gammaloop-nextest-docs> running 1 test
  92. 35.35 s gammaloop-nextest-docs> test tests::every_product_orients_rust_to_native_rustdoc_and_keeps_legacy_redirects ... FAILED
  93. 35.35 s gammaloop-nextest-docs>
  94. 35.35 s gammaloop-nextest-docs> failures:
  95. 35.35 s gammaloop-nextest-docs>
  96. 35.35 s gammaloop-nextest-docs> failures:
  97. 35.35 s gammaloop-nextest-docs> tests::every_product_orients_rust_to_native_rustdoc_and_keeps_legacy_redirects
  98. 35.35 s gammaloop-nextest-docs>
  99. 35.35 s gammaloop-nextest-docs> test result: FAILED. 0 passed; 1 failed; 0 ignored; 0 measured; 128 filtered out; finished in 0.00s
  100. 35.35 s gammaloop-nextest-docs>
  101. 35.35 s gammaloop-nextest-docs> stderr ---
  102. 35.35 s gammaloop-nextest-docs>
  103. 35.35 s gammaloop-nextest-docs> thread 'tests::every_product_orients_rust_to_native_rustdoc_and_keeps_legacy_redirects' (309) panicked at crates/alphal00p-docs-builder/src/lib.rs:12555:46:
  104. 35.35 s gammaloop-nextest-docs> called `Result::unwrap()` on an `Err` value: failed to copy documentation asset crates/spynso3/typst/STIXTwoMath-Regular.woff2
  105. 35.35 s gammaloop-nextest-docs>
  106. 35.35 s gammaloop-nextest-docs> Caused by:
  107. 35.35 s gammaloop-nextest-docs> No such file or directory (os error 2)
  108. 35.35 s gammaloop-nextest-docs>
  109. 35.35 s gammaloop-nextest-docs> Location:
  110. 35.35 s gammaloop-nextest-docs> crates/alphal00p-docs-builder/src/lib.rs:2276:18
  111. 35.35 s gammaloop-nextest-docs> stack backtrace:
  112. 35.35 s gammaloop-nextest-docs> 0: __rustc::rust_begin_unwind
  113. 35.35 s gammaloop-nextest-docs> 1: core::panicking::panic_fmt
  114. 35.35 s gammaloop-nextest-docs> 2: core::result::unwrap_failed
  115. 35.35 s gammaloop-nextest-docs> 3: alphal00p_docs_builder::tests::every_product_orients_rust_to_native_rustdoc_and_keeps_legacy_redirects
  116. 35.35 s gammaloop-nextest-docs> 4: <alphal00p_docs_builder::tests::every_product_orients_rust_to_native_rustdoc_and_keeps_legacy_redirects::{closure#0} as core::ops::function::FnOnce<()>>::call_once
  117. 35.35 s gammaloop-nextest-docs> note: Some details are omitted, run with `RUST_BACKTRACE=full` for a verbose backtrace.
  118. 35.35 s gammaloop-nextest-docs>
  119. 35.39 s gammaloop-nextest-docs> FAIL [ 0.011s] ( 54/129) alphal00p-docs-builder tests::portal_emits_routes_and_valid_assets
  120. 35.39 s gammaloop-nextest-docs> stdout ---
  121. 35.39 s gammaloop-nextest-docs>
  122. 35.39 s gammaloop-nextest-docs> running 1 test
  123. 35.39 s gammaloop-nextest-docs> test tests::portal_emits_routes_and_valid_assets ... FAILED
  124. 35.39 s gammaloop-nextest-docs>
  125. 35.39 s gammaloop-nextest-docs> failures:
  126. 35.39 s gammaloop-nextest-docs>
  127. 35.39 s gammaloop-nextest-docs> failures:
  128. 35.39 s gammaloop-nextest-docs> tests::portal_emits_routes_and_valid_assets
  129. 35.39 s gammaloop-nextest-docs>
  130. 35.39 s gammaloop-nextest-docs> test result: FAILED. 0 passed; 1 failed; 0 ignored; 0 measured; 128 filtered out; finished in 0.01s
  131. 35.39 s gammaloop-nextest-docs>
  132. 35.39 s gammaloop-nextest-docs> stderr ---
  133. 35.39 s gammaloop-nextest-docs>
  134. 35.39 s gammaloop-nextest-docs> thread 'tests::portal_emits_routes_and_valid_assets' (424) panicked at crates/alphal00p-docs-builder/src/lib.rs:9684:14:
  135. 35.39 s gammaloop-nextest-docs> called `Result::unwrap()` on an `Err` value: failed to copy documentation asset crates/spynso3/typst/STIXTwoMath-Regular.woff2
  136. 35.39 s gammaloop-nextest-docs>
  137. 35.39 s gammaloop-nextest-docs> Caused by:
  138. 35.39 s gammaloop-nextest-docs> No such file or directory (os error 2)
  139. 35.39 s gammaloop-nextest-docs>
  140. 35.39 s gammaloop-nextest-docs> Location:
  141. 35.39 s gammaloop-nextest-docs> crates/alphal00p-docs-builder/src/lib.rs:2276:18
  142. 35.39 s gammaloop-nextest-docs> stack backtrace:
  143. 35.39 s gammaloop-nextest-docs> 0: __rustc::rust_begin_unwind
  144. 35.39 s gammaloop-nextest-docs> 1: core::panicking::panic_fmt
  145. 35.39 s gammaloop-nextest-docs> 2: core::result::unwrap_failed
  146. 35.39 s gammaloop-nextest-docs> 3: alphal00p_docs_builder::tests::write_test_portal
  147. 35.39 s gammaloop-nextest-docs> 4: alphal00p_docs_builder::tests::portal_emits_routes_and_valid_assets
  148. 35.39 s gammaloop-nextest-docs> 5: <alphal00p_docs_builder::tests::portal_emits_routes_and_valid_assets::{closure#0} as core::ops::function::FnOnce<()>>::call_once
  149. 35.39 s gammaloop-nextest-docs> note: Some details are omitted, run with `RUST_BACKTRACE=full` for a verbose backtrace.
  150. 35.39 s gammaloop-nextest-docs>
  151. 35.39 s gammaloop-nextest-docs> FAIL [ 0.010s] ( 55/129) alphal00p-docs-builder tests::portal_task_chooser_routes_each_goal_to_the_registered_quickstart
  152. 35.39 s gammaloop-nextest-docs> stdout ---
  153. 35.39 s gammaloop-nextest-docs>
  154. 35.39 s gammaloop-nextest-docs> running 1 test
  155. 35.39 s gammaloop-nextest-docs> test tests::portal_task_chooser_routes_each_goal_to_the_registered_quickstart ... FAILED
  156. 35.39 s gammaloop-nextest-docs>
  157. 35.39 s gammaloop-nextest-docs> failures:
  158. 35.39 s gammaloop-nextest-docs>
  159. 35.39 s gammaloop-nextest-docs> failures:
  160. 35.39 s gammaloop-nextest-docs> tests::portal_task_chooser_routes_each_goal_to_the_registered_quickstart
  161. 35.39 s gammaloop-nextest-docs>
  162. 35.39 s gammaloop-nextest-docs> test result: FAILED. 0 passed; 1 failed; 0 ignored; 0 measured; 128 filtered out; finished in 0.00s
  163. 35.39 s gammaloop-nextest-docs>
  164. 35.39 s gammaloop-nextest-docs> stderr ---
  165. 35.39 s gammaloop-nextest-docs>
  166. 35.39 s gammaloop-nextest-docs> thread 'tests::portal_task_chooser_routes_each_goal_to_the_registered_quickstart' (431) panicked at crates/alphal00p-docs-builder/src/lib.rs:9684:14:
  167. 35.39 s gammaloop-nextest-docs> called `Result::unwrap()` on an `Err` value: failed to copy documentation asset crates/spynso3/typst/STIXTwoMath-Regular.woff2
  168. 35.39 s gammaloop-nextest-docs>
  169. 35.39 s gammaloop-nextest-docs> Caused by:
  170. 35.39 s gammaloop-nextest-docs> No such file or directory (os error 2)
  171. 35.39 s gammaloop-nextest-docs>
  172. 35.39 s gammaloop-nextest-docs> Location:
  173. 35.39 s gammaloop-nextest-docs> crates/alphal00p-docs-builder/src/lib.rs:2276:18
  174. 35.39 s gammaloop-nextest-docs> stack backtrace:
  175. 35.39 s gammaloop-nextest-docs> 0: __rustc::rust_begin_unwind
  176. 35.39 s gammaloop-nextest-docs> 1: core::panicking::panic_fmt
  177. 35.39 s gammaloop-nextest-docs> 2: core::result::unwrap_failed
  178. 35.39 s gammaloop-nextest-docs> 3: alphal00p_docs_builder::tests::write_test_portal
  179. 35.39 s gammaloop-nextest-docs> 4: alphal00p_docs_builder::tests::portal_task_chooser_routes_each_goal_to_the_registered_quickstart
  180. 35.39 s gammaloop-nextest-docs> 5: <alphal00p_docs_builder::tests::portal_task_chooser_routes_each_goal_to_the_registered_quickstart::{closure#0} as core::ops::function::FnOnce<()>>::call_once
  181. 35.39 s gammaloop-nextest-docs> note: Some details are omitted, run with `RUST_BACKTRACE=full` for a verbose backtrace.
  182. 35.39 s gammaloop-nextest-docs>
  183. 35.39 s gammaloop-nextest-docs> FAIL [ 0.012s] ( 56/129) alphal00p-docs-builder tests::portal_and_developer_pages_use_federated_search_and_feedback
  184. 35.39 s gammaloop-nextest-docs> stdout ---
  185. 35.39 s gammaloop-nextest-docs>
  186. 35.39 s gammaloop-nextest-docs> running 1 test
  187. 35.39 s gammaloop-nextest-docs> test tests::portal_and_developer_pages_use_federated_search_and_feedback ... FAILED
  188. 35.39 s gammaloop-nextest-docs>
  189. 35.39 s gammaloop-nextest-docs> failures:
  190. 35.39 s gammaloop-nextest-docs>
  191. 35.39 s gammaloop-nextest-docs> failures:
  192. 35.39 s gammaloop-nextest-docs> tests::portal_and_developer_pages_use_federated_search_and_feedback
  193. 35.39 s gammaloop-nextest-docs>
  194. 35.39 s gammaloop-nextest-docs> test result: FAILED. 0 passed; 1 failed; 0 ignored; 0 measured; 128 filtered out; finished in 0.01s
  195. 35.39 s gammaloop-nextest-docs>
  196. 35.39 s gammaloop-nextest-docs> stderr ---
  197. 35.39 s gammaloop-nextest-docs>
  198. 35.39 s gammaloop-nextest-docs> thread 'tests::portal_and_developer_pages_use_federated_search_and_feedback' (425) panicked at crates/alphal00p-docs-builder/src/lib.rs:9684:14:
  199. 35.39 s gammaloop-nextest-docs> called `Result::unwrap()` on an `Err` value: failed to copy documentation asset crates/spynso3/typst/STIXTwoMath-Regular.woff2
  200. 35.39 s gammaloop-nextest-docs>
  201. 35.39 s gammaloop-nextest-docs> Caused by:
  202. 35.39 s gammaloop-nextest-docs> No such file or directory (os error 2)
  203. 35.39 s gammaloop-nextest-docs>
  204. 35.39 s gammaloop-nextest-docs> Location:
  205. 35.39 s gammaloop-nextest-docs> crates/alphal00p-docs-builder/src/lib.rs:2276:18
  206. 35.39 s gammaloop-nextest-docs> stack backtrace:
  207. 35.39 s gammaloop-nextest-docs> 0: __rustc::rust_begin_unwind
  208. 35.39 s gammaloop-nextest-docs> 1: core::panicking::panic_fmt
  209. 35.39 s gammaloop-nextest-docs> 2: core::result::unwrap_failed
  210. 35.39 s gammaloop-nextest-docs> 3: alphal00p_docs_builder::tests::write_test_portal
  211. 35.39 s gammaloop-nextest-docs> 4: alphal00p_docs_builder::tests::portal_and_developer_pages_use_federated_search_and_feedback
  212. 35.39 s gammaloop-nextest-docs> 5: <alphal00p_docs_builder::tests::portal_and_developer_pages_use_federated_search_and_feedback::{closure#0} as core::ops::function::FnOnce<()>>::call_once
  213. 35.39 s gammaloop-nextest-docs> note: Some details are omitted, run with `RUST_BACKTRACE=full` for a verbose backtrace.
  214. 35.39 s gammaloop-nextest-docs>
  215. 35.44 s gammaloop-nextest-docs> FAIL [ 0.118s] ( 86/129) alphal00p-docs-builder tests::checked_in_registry_is_valid
  216. 35.44 s gammaloop-nextest-docs> stdout ---
  217. 35.44 s gammaloop-nextest-docs>
  218. 35.44 s gammaloop-nextest-docs> running 1 test
  219. 35.44 s gammaloop-nextest-docs> test tests::checked_in_registry_is_valid ... FAILED
  220. 35.44 s gammaloop-nextest-docs>
  221. 35.44 s gammaloop-nextest-docs> failures:
  222. 35.44 s gammaloop-nextest-docs>
  223. 35.44 s gammaloop-nextest-docs> failures:
  224. 35.44 s gammaloop-nextest-docs> tests::checked_in_registry_is_valid
  225. 35.44 s gammaloop-nextest-docs>
  226. 35.44 s gammaloop-nextest-docs> test result: FAILED. 0 passed; 1 failed; 0 ignored; 0 measured; 128 filtered out; finished in 0.11s
  227. 35.44 s gammaloop-nextest-docs>
  228. 35.44 s gammaloop-nextest-docs> stderr ---
  229. 35.44 s gammaloop-nextest-docs>
  230. 35.44 s gammaloop-nextest-docs> thread 'tests::checked_in_registry_is_valid' (187) panicked at crates/alphal00p-docs-builder/src/lib.rs:12260:50:
  231. 35.44 s gammaloop-nextest-docs> called `Result::unwrap()` on an `Err` value: required documentation source is missing: /build/source/crates/spynso3/typst/STIXTwoMath-Regular.woff2
  232. 35.44 s gammaloop-nextest-docs>
  233. 35.44 s gammaloop-nextest-docs> Location:
  234. 35.44 s gammaloop-nextest-docs> crates/alphal00p-docs-builder/src/lib.rs:5103:9
  235. 35.44 s gammaloop-nextest-docs> stack backtrace:
  236. 35.44 s gammaloop-nextest-docs> 0: __rustc::rust_begin_unwind
  237. 35.44 s gammaloop-nextest-docs> 1: core::panicking::panic_fmt
  238. 35.44 s gammaloop-nextest-docs> 2: core::result::unwrap_failed
  239. 35.44 s gammaloop-nextest-docs> 3: alphal00p_docs_builder::tests::checked_in_registry_is_valid
  240. 35.44 s gammaloop-nextest-docs> 4: <alphal00p_docs_builder::tests::checked_in_registry_is_valid::{closure#0} as core::ops::function::FnOnce<()>>::call_once
  241. 35.44 s gammaloop-nextest-docs> note: Some details are omitted, run with `RUST_BACKTRACE=full` for a verbose backtrace.
  242. 35.44 s gammaloop-nextest-docs>
  243. 35.44 s gammaloop-nextest-docs> FAIL [ 0.119s] ( 88/129) alphal00p-docs-builder provenance_tests::each_build_captures_one_revision_before_rendering
  244. 35.44 s gammaloop-nextest-docs> stdout ---
  245. 35.44 s gammaloop-nextest-docs>
  246. 35.44 s gammaloop-nextest-docs> running 1 test
  247. 35.44 s gammaloop-nextest-docs>
  248. 35.44 s gammaloop-nextest-docs> running 1 test
  249. 35.44 s gammaloop-nextest-docs> test provenance_tests::each_build_captures_one_revision_before_rendering ... FAILED
  250. 35.44 s gammaloop-nextest-docs>
  251. 35.44 s gammaloop-nextest-docs> failures:
  252. 35.44 s gammaloop-nextest-docs>
  253. 35.44 s gammaloop-nextest-docs> failures:
  254. 35.44 s gammaloop-nextest-docs> provenance_tests::each_build_captures_one_revision_before_rendering
  255. 35.44 s gammaloop-nextest-docs>
  256. 35.44 s gammaloop-nextest-docs> test result: FAILED. 0 passed; 1 failed; 0 ignored; 0 measured; 128 filtered out; finished in 0.10s
  257. 35.44 s gammaloop-nextest-docs>
  258. 35.44 s gammaloop-nextest-docs> test provenance_tests::each_build_captures_one_revision_before_rendering ... FAILED
  259. 35.44 s gammaloop-nextest-docs>
  260. 35.44 s gammaloop-nextest-docs> failures:
  261. 35.44 s gammaloop-nextest-docs>
  262. 35.44 s gammaloop-nextest-docs> failures:
  263. 35.44 s gammaloop-nextest-docs> provenance_tests::each_build_captures_one_revision_before_rendering
  264. 35.44 s gammaloop-nextest-docs>
  265. 35.44 s gammaloop-nextest-docs> test result: FAILED. 0 passed; 1 failed; 0 ignored; 0 measured; 128 filtered out; finished in 0.11s
  266. 35.44 s gammaloop-nextest-docs>
  267. 35.44 s gammaloop-nextest-docs> stderr ---
  268. 35.44 s gammaloop-nextest-docs>
  269. 35.44 s gammaloop-nextest-docs> thread 'provenance_tests::each_build_captures_one_revision_before_rendering' (253) panicked at crates/alphal00p-docs-builder/src/provenance_tests.rs:297:14:
  270. 35.44 s gammaloop-nextest-docs> called `Result::unwrap()` on an `Err` value: required documentation source is missing: /build/source/target/nix-ci-tmp/.tmpuiqmMo/checkout/crates/spynso3/typst/STIXTwoMath-Regular.woff2
  271. 35.44 s gammaloop-nextest-docs>
  272. 35.44 s gammaloop-nextest-docs> Location:
  273. 35.44 s gammaloop-nextest-docs> crates/alphal00p-docs-builder/src/lib.rs:5103:9
  274. 35.44 s gammaloop-nextest-docs> stack backtrace:
  275. 35.44 s gammaloop-nextest-docs> 0: __rustc::rust_begin_unwind
  276. 35.44 s gammaloop-nextest-docs> 1: core::panicking::panic_fmt
  277. 35.44 s gammaloop-nextest-docs> 2: core::result::unwrap_failed
  278. 35.44 s gammaloop-nextest-docs> 3: alphal00p_docs_builder::provenance_tests::each_build_captures_one_revision_before_rendering
  279. 35.44 s gammaloop-nextest-docs> 4: <alphal00p_docs_builder::provenance_tests::each_build_captures_one_revision_before_rendering::{closure#0} as core::ops::function::FnOnce<()>>::call_once
  280. 35.44 s gammaloop-nextest-docs> note: Some details are omitted, run with `RUST_BACKTRACE=full` for a verbose backtrace.
  281. 35.44 s gammaloop-nextest-docs>
  282. 35.44 s gammaloop-nextest-docs> thread 'provenance_tests::each_build_captures_one_revision_before_rendering' (170) panicked at crates/alphal00p-docs-builder/src/provenance_tests.rs:274:9:
  283. 35.44 s gammaloop-nextest-docs> assertion failed: command.status().unwrap().success()
  284. 35.44 s gammaloop-nextest-docs> stack backtrace:
  285. 35.44 s gammaloop-nextest-docs> 0: __rustc::rust_begin_unwind
  286. 35.44 s gammaloop-nextest-docs> 1: core::panicking::panic_fmt
  287. 35.44 s gammaloop-nextest-docs> 2: core::panicking::panic
  288. 35.44 s gammaloop-nextest-docs> 3: alphal00p_docs_builder::provenance_tests::each_build_captures_one_revision_before_rendering
  289. 35.44 s gammaloop-nextest-docs> 4: <alphal00p_docs_builder::provenance_tests::each_build_captures_one_revision_before_rendering::{closure#0} as core::ops::function::FnOnce<()>>::call_once
  290. 35.44 s gammaloop-nextest-docs> note: Some details are omitted, run with `RUST_BACKTRACE=full` for a verbose backtrace.
  291. 35.44 s gammaloop-nextest-docs>
  292. 35.44 s gammaloop-nextest-docs> FAIL [ 0.010s] ( 89/129) alphal00p-docs-builder tests::site_assets_replace_read_only_generated_files
  293. 35.44 s gammaloop-nextest-docs> stdout ---
  294. 35.44 s gammaloop-nextest-docs>
  295. 35.44 s gammaloop-nextest-docs> running 1 test
  296. 35.44 s gammaloop-nextest-docs> test tests::site_assets_replace_read_only_generated_files ... FAILED
  297. 35.44 s gammaloop-nextest-docs>
  298. 35.44 s gammaloop-nextest-docs> failures:
  299. 35.44 s gammaloop-nextest-docs>
  300. 35.44 s gammaloop-nextest-docs> failures:
  301. 35.44 s gammaloop-nextest-docs> tests::site_assets_replace_read_only_generated_files
  302. 35.44 s gammaloop-nextest-docs>
  303. 35.44 s gammaloop-nextest-docs> test result: FAILED. 0 passed; 1 failed; 0 ignored; 0 measured; 128 filtered out; finished in 0.01s
  304. 35.44 s gammaloop-nextest-docs>
  305. 35.44 s gammaloop-nextest-docs> stderr ---
  306. 35.44 s gammaloop-nextest-docs>
  307. 35.44 s gammaloop-nextest-docs> thread 'tests::site_assets_replace_read_only_generated_files' (670) panicked at crates/alphal00p-docs-builder/src/lib.rs:12305:50:
  308. 35.44 s gammaloop-nextest-docs> called `Result::unwrap()` on an `Err` value: failed to copy documentation asset crates/spynso3/typst/STIXTwoMath-Regular.woff2
  309. 35.44 s gammaloop-nextest-docs>
  310. 35.44 s gammaloop-nextest-docs> Caused by:
  311. 35.44 s gammaloop-nextest-docs> No such file or directory (os error 2)
  312. 35.44 s gammaloop-nextest-docs>
  313. 35.44 s gammaloop-nextest-docs> Location:
  314. 35.44 s gammaloop-nextest-docs> crates/alphal00p-docs-builder/src/lib.rs:2276:18
  315. 35.44 s gammaloop-nextest-docs> stack backtrace:
  316. 35.44 s gammaloop-nextest-docs> 0: __rustc::rust_begin_unwind
  317. 35.44 s gammaloop-nextest-docs> 1: core::panicking::panic_fmt
  318. 35.44 s gammaloop-nextest-docs> 2: core::result::unwrap_failed
  319. 35.44 s gammaloop-nextest-docs> 3: alphal00p_docs_builder::tests::site_assets_replace_read_only_generated_files
  320. 35.44 s gammaloop-nextest-docs> 4: <alphal00p_docs_builder::tests::site_assets_replace_read_only_generated_files::{closure#0} as core::ops::function::FnOnce<()>>::call_once
  321. 35.44 s gammaloop-nextest-docs> note: Some details are omitted, run with `RUST_BACKTRACE=full` for a verbose backtrace.
  322. 35.44 s gammaloop-nextest-docs>
  323. 35.44 s gammaloop-nextest-docs> FAIL [ 0.108s] ( 90/129) alphal00p-docs-builder tests::developer_scope_ranges_ignore_unrelated_edits_and_warn_only_while_watching
  324. 35.44 s gammaloop-nextest-docs> stdout ---
  325. 35.44 s gammaloop-nextest-docs>
  326. 35.44 s gammaloop-nextest-docs> running 1 test
  327. 35.44 s gammaloop-nextest-docs> test tests::developer_scope_ranges_ignore_unrelated_edits_and_warn_only_while_watching ... FAILED
  328. 35.44 s gammaloop-nextest-docs>
  329. 35.44 s gammaloop-nextest-docs> failures:
  330. 35.44 s gammaloop-nextest-docs>
  331. 35.44 s gammaloop-nextest-docs> failures:
  332. 35.44 s gammaloop-nextest-docs> tests::developer_scope_ranges_ignore_unrelated_edits_and_warn_only_while_watching
  333. 35.44 s gammaloop-nextest-docs>
  334. 35.44 s gammaloop-nextest-docs> test result: FAILED. 0 passed; 1 failed; 0 ignored; 0 measured; 128 filtered out; finished in 0.10s
  335. 35.44 s gammaloop-nextest-docs>
  336. 35.44 s gammaloop-nextest-docs> stderr ---
  337. 35.44 s gammaloop-nextest-docs>
  338. 35.44 s gammaloop-nextest-docs> thread 'tests::developer_scope_ranges_ignore_unrelated_edits_and_warn_only_while_watching' (287) panicked at crates/alphal00p-docs-builder/src/lib.rs:12350:29:
  339. 35.44 s gammaloop-nextest-docs> called `Result::unwrap()` on an `Err` value: required documentation source is missing: /build/source/crates/spynso3/typst/STIXTwoMath-Regular.woff2
  340. 35.44 s gammaloop-nextest-docs>
  341. 35.44 s gammaloop-nextest-docs> Location:
  342. 35.44 s gammaloop-nextest-docs> crates/alphal00p-docs-builder/src/lib.rs:5103:9
  343. 35.44 s gammaloop-nextest-docs> stack backtrace:
  344. 35.44 s gammaloop-nextest-docs> 0: __rustc::rust_begin_unwind
  345. 35.44 s gammaloop-nextest-docs> 1: core::panicking::panic_fmt
  346. 35.44 s gammaloop-nextest-docs> 2: core::result::unwrap_failed
  347. 35.44 s gammaloop-nextest-docs> 3: alphal00p_docs_builder::tests::developer_scope_ranges_ignore_unrelated_edits_and_warn_only_while_watching
  348. 35.44 s gammaloop-nextest-docs> 4: <alphal00p_docs_builder::tests::developer_scope_ranges_ignore_unrelated_edits_and_warn_only_while_watching::{closure#0} as core::ops::function::FnOnce<()>>::call_once
  349. 35.44 s gammaloop-nextest-docs> note: Some details are omitted, run with `RUST_BACKTRACE=full` for a verbose backtrace.
  350. 35.44 s gammaloop-nextest-docs>
  351. 35.47 s gammaloop-nextest-docs> FAIL [ 0.127s] (121/129) alphal00p-docs-builder tests::every_product_requires_a_task_chooser_and_each_supported_interface
  352. 35.47 s gammaloop-nextest-docs> stdout ---
  353. 35.47 s gammaloop-nextest-docs>
  354. 35.47 s gammaloop-nextest-docs> running 1 test
  355. 35.47 s gammaloop-nextest-docs> test tests::every_product_requires_a_task_chooser_and_each_supported_interface ... FAILED
  356. 35.47 s gammaloop-nextest-docs>
  357. 35.47 s gammaloop-nextest-docs> failures:
  358. 35.47 s gammaloop-nextest-docs>
  359. 35.47 s gammaloop-nextest-docs> failures:
  360. 35.47 s gammaloop-nextest-docs> tests::every_product_requires_a_task_chooser_and_each_supported_interface
  361. 35.47 s gammaloop-nextest-docs>
  362. 35.47 s gammaloop-nextest-docs> test result: FAILED. 0 passed; 1 failed; 0 ignored; 0 measured; 128 filtered out; finished in 0.12s
  363. 35.47 s gammaloop-nextest-docs>
  364. 35.47 s gammaloop-nextest-docs> stderr ---
  365. 35.47 s gammaloop-nextest-docs>
  366. 35.47 s gammaloop-nextest-docs> thread 'tests::every_product_requires_a_task_chooser_and_each_supported_interface' (327) panicked at crates/alphal00p-docs-builder/src/lib.rs:12274:9:
  367. 35.47 s gammaloop-nextest-docs> assertion failed: format!("{error:#}").contains("has no quickstart page")
  368. 35.47 s gammaloop-nextest-docs> stack backtrace:
  369. 35.47 s gammaloop-nextest-docs> 0: __rustc::rust_begin_unwind
  370. 35.47 s gammaloop-nextest-docs> 1: core::panicking::panic_fmt
  371. 35.47 s gammaloop-nextest-docs> 2: core::panicking::panic
  372. 35.47 s gammaloop-nextest-docs> 3: alphal00p_docs_builder::tests::every_product_requires_a_task_chooser_and_each_supported_interface
  373. 35.47 s gammaloop-nextest-docs> 4: <alphal00p_docs_builder::tests::every_product_requires_a_task_chooser_and_each_supported_interface::{closure#0} as core::ops::function::FnOnce<()>>::call_once
  374. 35.47 s gammaloop-nextest-docs> note: Some details are omitted, run with `RUST_BACKTRACE=full` for a verbose backtrace.
  375. 35.47 s gammaloop-nextest-docs>
  376. 35.48 s gammaloop-nextest-docs> FAIL [ 0.111s] (122/129) alphal00p-docs-builder tests::pdf_manual_chapter_order_must_match_the_page_registry
  377. 35.48 s gammaloop-nextest-docs> stdout ---
  378. 35.48 s gammaloop-nextest-docs>
  379. 35.48 s gammaloop-nextest-docs> running 1 test
  380. 35.48 s gammaloop-nextest-docs> test tests::pdf_manual_chapter_order_must_match_the_page_registry ... FAILED
  381. 35.48 s gammaloop-nextest-docs>
  382. 35.48 s gammaloop-nextest-docs> failures:
  383. 35.48 s gammaloop-nextest-docs>
  384. 35.48 s gammaloop-nextest-docs> failures:
  385. 35.48 s gammaloop-nextest-docs> tests::pdf_manual_chapter_order_must_match_the_page_registry
  386. 35.48 s gammaloop-nextest-docs>
  387. 35.48 s gammaloop-nextest-docs> test result: FAILED. 0 passed; 1 failed; 0 ignored; 0 measured; 128 filtered out; finished in 0.11s
  388. 35.48 s gammaloop-nextest-docs>
  389. 35.48 s gammaloop-nextest-docs> stderr ---
  390. 35.48 s gammaloop-nextest-docs>
  391. 35.48 s gammaloop-nextest-docs> thread 'tests::pdf_manual_chapter_order_must_match_the_page_registry' (396) panicked at crates/alphal00p-docs-builder/src/lib.rs:12330:9:
  392. 35.48 s gammaloop-nextest-docs> assertion failed: format!("{error:#}").contains("PDF manual chapter order differs")
  393. 35.48 s gammaloop-nextest-docs> stack backtrace:
  394. 35.48 s gammaloop-nextest-docs> 0: __rustc::rust_begin_unwind
  395. 35.48 s gammaloop-nextest-docs> 1: core::panicking::panic_fmt
  396. 35.48 s gammaloop-nextest-docs> 2: core::panicking::panic
  397. 35.48 s gammaloop-nextest-docs> 3: alphal00p_docs_builder::tests::pdf_manual_chapter_order_must_match_the_page_registry
  398. 35.48 s gammaloop-nextest-docs> 4: <alphal00p_docs_builder::tests::pdf_manual_chapter_order_must_match_the_page_registry::{closure#0} as core::ops::function::FnOnce<()>>::call_once
  399. 35.48 s gammaloop-nextest-docs> note: Some details are omitted, run with `RUST_BACKTRACE=full` for a verbose backtrace.
  400. 35.48 s gammaloop-nextest-docs>
  401. 45.51 s gammaloop-nextest-docs> ------------
  402. 45.51 s gammaloop-nextest-docs> Summary [ 10.186s] 129 tests run: 118 passed, 11 failed, 0 skipped
  403. 45.51 s gammaloop-nextest-docs> FAIL [ 0.014s] ( 26/129) alphal00p-docs-builder tests::developer_architecture_is_classified_searchable_and_source_backed
  404. 45.51 s gammaloop-nextest-docs> stdout ---
  405. 45.51 s gammaloop-nextest-docs>
  406. 45.51 s gammaloop-nextest-docs> running 1 test
  407. 45.51 s gammaloop-nextest-docs> test tests::developer_architecture_is_classified_searchable_and_source_backed ... FAILED
  408. 45.51 s gammaloop-nextest-docs>
  409. 45.51 s gammaloop-nextest-docs> failures:
  410. 45.51 s gammaloop-nextest-docs>
  411. 45.51 s gammaloop-nextest-docs> failures:
  412. 45.51 s gammaloop-nextest-docs> tests::developer_architecture_is_classified_searchable_and_source_backed
  413. 45.51 s gammaloop-nextest-docs>
  414. 45.51 s gammaloop-nextest-docs> test result: FAILED. 0 passed; 1 failed; 0 ignored; 0 measured; 128 filtered out; finished in 0.01s
  415. 45.51 s gammaloop-nextest-docs>
  416. 45.51 s gammaloop-nextest-docs> stderr ---
  417. 45.51 s gammaloop-nextest-docs>
  418. 45.51 s gammaloop-nextest-docs> thread 'tests::developer_architecture_is_classified_searchable_and_source_backed' (289) panicked at crates/alphal00p-docs-builder/src/lib.rs:12751:14:
  419. 45.51 s gammaloop-nextest-docs> called `Result::unwrap()` on an `Err` value: failed to copy documentation asset crates/spynso3/typst/STIXTwoMath-Regular.woff2
  420. 45.51 s gammaloop-nextest-docs>
  421. 45.51 s gammaloop-nextest-docs> Caused by:
  422. 45.51 s gammaloop-nextest-docs> No such file or directory (os error 2)
  423. 45.51 s gammaloop-nextest-docs>
  424. 45.51 s gammaloop-nextest-docs> Location:
  425. 45.51 s gammaloop-nextest-docs> crates/alphal00p-docs-builder/src/lib.rs:2276:18
  426. 45.51 s gammaloop-nextest-docs> stack backtrace:
  427. 45.51 s gammaloop-nextest-docs> 0: __rustc::rust_begin_unwind
  428. 45.51 s gammaloop-nextest-docs> 1: core::panicking::panic_fmt
  429. 45.51 s gammaloop-nextest-docs> 2: core::result::unwrap_failed
  430. 45.51 s gammaloop-nextest-docs> 3: alphal00p_docs_builder::tests::developer_architecture_is_classified_searchable_and_source_backed
  431. 45.51 s gammaloop-nextest-docs> 4: <alphal00p_docs_builder::tests::developer_architecture_is_classified_searchable_and_source_backed::{closure#0} as core::ops::function::FnOnce<()>>::call_once
  432. 45.51 s gammaloop-nextest-docs> note: Some details are omitted, run with `RUST_BACKTRACE=full` for a verbose backtrace.
  433. 45.51 s gammaloop-nextest-docs>
  434. 45.51 s gammaloop-nextest-docs> FAIL [ 0.008s] ( 28/129) alphal00p-docs-builder tests::every_product_orients_rust_to_native_rustdoc_and_keeps_legacy_redirects
  435. 45.51 s gammaloop-nextest-docs> stdout ---
  436. 45.51 s gammaloop-nextest-docs>
  437. 45.51 s gammaloop-nextest-docs> running 1 test
  438. 45.51 s gammaloop-nextest-docs> test tests::every_product_orients_rust_to_native_rustdoc_and_keeps_legacy_redirects ... FAILED
  439. 45.51 s gammaloop-nextest-docs>
  440. 45.51 s gammaloop-nextest-docs> failures:
  441. 45.51 s gammaloop-nextest-docs>
  442. 45.51 s gammaloop-nextest-docs> failures:
  443. 45.51 s gammaloop-nextest-docs> tests::every_product_orients_rust_to_native_rustdoc_and_keeps_legacy_redirects
  444. 45.51 s gammaloop-nextest-docs>
  445. 45.51 s gammaloop-nextest-docs> test result: FAILED. 0 passed; 1 failed; 0 ignored; 0 measured; 128 filtered out; finished in 0.00s
  446. 45.51 s gammaloop-nextest-docs>
  447. 45.51 s gammaloop-nextest-docs> stderr ---
  448. 45.51 s gammaloop-nextest-docs>
  449. 45.51 s gammaloop-nextest-docs> thread 'tests::every_product_orients_rust_to_native_rustdoc_and_keeps_legacy_redirects' (309) panicked at crates/alphal00p-docs-builder/src/lib.rs:12555:46:
  450. 45.51 s gammaloop-nextest-docs> called `Result::unwrap()` on an `Err` value: failed to copy documentation asset crates/spynso3/typst/STIXTwoMath-Regular.woff2
  451. 45.51 s gammaloop-nextest-docs>
  452. 45.51 s gammaloop-nextest-docs> Caused by:
  453. 45.51 s gammaloop-nextest-docs> No such file or directory (os error 2)
  454. 45.51 s gammaloop-nextest-docs>
  455. 45.51 s gammaloop-nextest-docs> Location:
  456. 45.51 s gammaloop-nextest-docs> crates/alphal00p-docs-builder/src/lib.rs:2276:18
  457. 45.51 s gammaloop-nextest-docs> stack backtrace:
  458. 45.51 s gammaloop-nextest-docs> 0: __rustc::rust_begin_unwind
  459. 45.51 s gammaloop-nextest-docs> 1: core::panicking::panic_fmt
  460. 45.51 s gammaloop-nextest-docs> 2: core::result::unwrap_failed
  461. 45.51 s gammaloop-nextest-docs> 3: alphal00p_docs_builder::tests::every_product_orients_rust_to_native_rustdoc_and_keeps_legacy_redirects
  462. 45.51 s gammaloop-nextest-docs> 4: <alphal00p_docs_builder::tests::every_product_orients_rust_to_native_rustdoc_and_keeps_legacy_redirects::{closure#0} as core::ops::function::FnOnce<()>>::call_once
  463. 45.51 s gammaloop-nextest-docs> note: Some details are omitted, run with `RUST_BACKTRACE=full` for a verbose backtrace.
  464. 45.51 s gammaloop-nextest-docs>
  465. 45.51 s gammaloop-nextest-docs> FAIL [ 0.011s] ( 54/129) alphal00p-docs-builder tests::portal_emits_routes_and_valid_assets
  466. 45.51 s gammaloop-nextest-docs> stdout ---
  467. 45.51 s gammaloop-nextest-docs>
  468. 45.51 s gammaloop-nextest-docs> running 1 test
  469. 45.51 s gammaloop-nextest-docs> test tests::portal_emits_routes_and_valid_assets ... FAILED
  470. 45.51 s gammaloop-nextest-docs>
  471. 45.51 s gammaloop-nextest-docs> failures:
  472. 45.51 s gammaloop-nextest-docs>
  473. 45.51 s gammaloop-nextest-docs> failures:
  474. 45.51 s gammaloop-nextest-docs> tests::portal_emits_routes_and_valid_assets
  475. 45.51 s gammaloop-nextest-docs>
  476. 45.51 s gammaloop-nextest-docs> test result: FAILED. 0 passed; 1 failed; 0 ignored; 0 measured; 128 filtered out; finished in 0.01s
  477. 45.51 s gammaloop-nextest-docs>
  478. 45.51 s gammaloop-nextest-docs> stderr ---
  479. 45.51 s gammaloop-nextest-docs>
  480. 45.51 s gammaloop-nextest-docs> thread 'tests::portal_emits_routes_and_valid_assets' (424) panicked at crates/alphal00p-docs-builder/src/lib.rs:9684:14:
  481. 45.51 s gammaloop-nextest-docs> called `Result::unwrap()` on an `Err` value: failed to copy documentation asset crates/spynso3/typst/STIXTwoMath-Regular.woff2
  482. 45.51 s gammaloop-nextest-docs>
  483. 45.51 s gammaloop-nextest-docs> Caused by:
  484. 45.51 s gammaloop-nextest-docs> No such file or directory (os error 2)
  485. 45.51 s gammaloop-nextest-docs>
  486. 45.51 s gammaloop-nextest-docs> Location:
  487. 45.51 s gammaloop-nextest-docs> crates/alphal00p-docs-builder/src/lib.rs:2276:18
  488. 45.51 s gammaloop-nextest-docs> stack backtrace:
  489. 45.51 s gammaloop-nextest-docs> 0: __rustc::rust_begin_unwind
  490. 45.51 s gammaloop-nextest-docs> 1: core::panicking::panic_fmt
  491. 45.51 s gammaloop-nextest-docs> 2: core::result::unwrap_failed
  492. 45.51 s gammaloop-nextest-docs> 3: alphal00p_docs_builder::tests::write_test_portal
  493. 45.51 s gammaloop-nextest-docs> 4: alphal00p_docs_builder::tests::portal_emits_routes_and_valid_assets
  494. 45.51 s gammaloop-nextest-docs> 5: <alphal00p_docs_builder::tests::portal_emits_routes_and_valid_assets::{closure#0} as core::ops::function::FnOnce<()>>::call_once
  495. 45.51 s gammaloop-nextest-docs> note: Some details are omitted, run with `RUST_BACKTRACE=full` for a verbose backtrace.
  496. 45.51 s gammaloop-nextest-docs>
  497. 45.51 s gammaloop-nextest-docs> FAIL [ 0.010s] ( 55/129) alphal00p-docs-builder tests::portal_task_chooser_routes_each_goal_to_the_registered_quickstart
  498. 45.51 s gammaloop-nextest-docs> stdout ---
  499. 45.51 s gammaloop-nextest-docs>
  500. 45.51 s gammaloop-nextest-docs> running 1 test
  501. 45.51 s gammaloop-nextest-docs> test tests::portal_task_chooser_routes_each_goal_to_the_registered_quickstart ... FAILED
  502. 45.51 s gammaloop-nextest-docs>
  503. 45.51 s gammaloop-nextest-docs> failures:
  504. 45.51 s gammaloop-nextest-docs>
  505. 45.51 s gammaloop-nextest-docs> failures:
  506. 45.51 s gammaloop-nextest-docs> tests::portal_task_chooser_routes_each_goal_to_the_registered_quickstart
  507. 45.51 s gammaloop-nextest-docs>
  508. 45.51 s gammaloop-nextest-docs> test result: FAILED. 0 passed; 1 failed; 0 ignored; 0 measured; 128 filtered out; finished in 0.00s
  509. 45.51 s gammaloop-nextest-docs>
  510. 45.51 s gammaloop-nextest-docs> stderr ---
  511. 45.51 s gammaloop-nextest-docs>
  512. 45.51 s gammaloop-nextest-docs> thread 'tests::portal_task_chooser_routes_each_goal_to_the_registered_quickstart' (431) panicked at crates/alphal00p-docs-builder/src/lib.rs:9684:14:
  513. 45.51 s gammaloop-nextest-docs> called `Result::unwrap()` on an `Err` value: failed to copy documentation asset crates/spynso3/typst/STIXTwoMath-Regular.woff2
  514. 45.51 s gammaloop-nextest-docs>
  515. 45.51 s gammaloop-nextest-docs> Caused by:
  516. 45.51 s gammaloop-nextest-docs> No such file or directory (os error 2)
  517. 45.51 s gammaloop-nextest-docs>
  518. 45.51 s gammaloop-nextest-docs> Location:
  519. 45.51 s gammaloop-nextest-docs> crates/alphal00p-docs-builder/src/lib.rs:2276:18
  520. 45.51 s gammaloop-nextest-docs> stack backtrace:
  521. 45.51 s gammaloop-nextest-docs> 0: __rustc::rust_begin_unwind
  522. 45.51 s gammaloop-nextest-docs> 1: core::panicking::panic_fmt
  523. 45.51 s gammaloop-nextest-docs> 2: core::result::unwrap_failed
  524. 45.51 s gammaloop-nextest-docs> 3: alphal00p_docs_builder::tests::write_test_portal
  525. 45.51 s gammaloop-nextest-docs> 4: alphal00p_docs_builder::tests::portal_task_chooser_routes_each_goal_to_the_registered_quickstart
  526. 45.51 s gammaloop-nextest-docs> 5: <alphal00p_docs_builder::tests::portal_task_chooser_routes_each_goal_to_the_registered_quickstart::{closure#0} as core::ops::function::FnOnce<()>>::call_once
  527. 45.51 s gammaloop-nextest-docs> note: Some details are omitted, run with `RUST_BACKTRACE=full` for a verbose backtrace.
  528. 45.51 s gammaloop-nextest-docs>
  529. 45.51 s gammaloop-nextest-docs> FAIL [ 0.012s] ( 56/129) alphal00p-docs-builder tests::portal_and_developer_pages_use_federated_search_and_feedback
  530. 45.51 s gammaloop-nextest-docs> stdout ---
  531. 45.51 s gammaloop-nextest-docs>
  532. 45.51 s gammaloop-nextest-docs> running 1 test
  533. 45.51 s gammaloop-nextest-docs> test tests::portal_and_developer_pages_use_federated_search_and_feedback ... FAILED
  534. 45.51 s gammaloop-nextest-docs>
  535. 45.51 s gammaloop-nextest-docs> failures:
  536. 45.51 s gammaloop-nextest-docs>
  537. 45.51 s gammaloop-nextest-docs> failures:
  538. 45.51 s gammaloop-nextest-docs> tests::portal_and_developer_pages_use_federated_search_and_feedback
  539. 45.51 s gammaloop-nextest-docs>
  540. 45.51 s gammaloop-nextest-docs> test result: FAILED. 0 passed; 1 failed; 0 ignored; 0 measured; 128 filtered out; finished in 0.01s
  541. 45.51 s gammaloop-nextest-docs>
  542. 45.51 s gammaloop-nextest-docs> stderr ---
  543. 45.51 s gammaloop-nextest-docs>
  544. 45.51 s gammaloop-nextest-docs> thread 'tests::portal_and_developer_pages_use_federated_search_and_feedback' (425) panicked at crates/alphal00p-docs-builder/src/lib.rs:9684:14:
  545. 45.51 s gammaloop-nextest-docs> called `Result::unwrap()` on an `Err` value: failed to copy documentation asset crates/spynso3/typst/STIXTwoMath-Regular.woff2
  546. 45.51 s gammaloop-nextest-docs>
  547. 45.51 s gammaloop-nextest-docs> Caused by:
  548. 45.51 s gammaloop-nextest-docs> No such file or directory (os error 2)
  549. 45.51 s gammaloop-nextest-docs>
  550. 45.51 s gammaloop-nextest-docs> Location:
  551. 45.51 s gammaloop-nextest-docs> crates/alphal00p-docs-builder/src/lib.rs:2276:18
  552. 45.51 s gammaloop-nextest-docs> stack backtrace:
  553. 45.51 s gammaloop-nextest-docs> 0: __rustc::rust_begin_unwind
  554. 45.51 s gammaloop-nextest-docs> 1: core::panicking::panic_fmt
  555. 45.51 s gammaloop-nextest-docs> 2: core::result::unwrap_failed
  556. 45.51 s gammaloop-nextest-docs> 3: alphal00p_docs_builder::tests::write_test_portal
  557. 45.51 s gammaloop-nextest-docs> 4: alphal00p_docs_builder::tests::portal_and_developer_pages_use_federated_search_and_feedback
  558. 45.51 s gammaloop-nextest-docs> 5: <alphal00p_docs_builder::tests::portal_and_developer_pages_use_federated_search_and_feedback::{closure#0} as core::ops::function::FnOnce<()>>::call_once
  559. 45.51 s gammaloop-nextest-docs> note: Some details are omitted, run with `RUST_BACKTRACE=full` for a verbose backtrace.
  560. 45.51 s gammaloop-nextest-docs>
  561. 45.51 s gammaloop-nextest-docs> FAIL [ 0.118s] ( 86/129) alphal00p-docs-builder tests::checked_in_registry_is_valid
  562. 45.51 s gammaloop-nextest-docs> stdout ---
  563. 45.51 s gammaloop-nextest-docs>
  564. 45.51 s gammaloop-nextest-docs> running 1 test
  565. 45.51 s gammaloop-nextest-docs> test tests::checked_in_registry_is_valid ... FAILED
  566. 45.51 s gammaloop-nextest-docs>
  567. 45.51 s gammaloop-nextest-docs> failures:
  568. 45.51 s gammaloop-nextest-docs>
  569. 45.51 s gammaloop-nextest-docs> failures:
  570. 45.51 s gammaloop-nextest-docs> tests::checked_in_registry_is_valid
  571. 45.51 s gammaloop-nextest-docs>
  572. 45.51 s gammaloop-nextest-docs> test result: FAILED. 0 passed; 1 failed; 0 ignored; 0 measured; 128 filtered out; finished in 0.11s
  573. 45.51 s gammaloop-nextest-docs>
  574. 45.51 s gammaloop-nextest-docs> stderr ---
  575. 45.51 s gammaloop-nextest-docs>
  576. 45.51 s gammaloop-nextest-docs> thread 'tests::checked_in_registry_is_valid' (187) panicked at crates/alphal00p-docs-builder/src/lib.rs:12260:50:
  577. 45.51 s gammaloop-nextest-docs> called `Result::unwrap()` on an `Err` value: required documentation source is missing: /build/source/crates/spynso3/typst/STIXTwoMath-Regular.woff2
  578. 45.51 s gammaloop-nextest-docs>
  579. 45.51 s gammaloop-nextest-docs> Location:
  580. 45.51 s gammaloop-nextest-docs> crates/alphal00p-docs-builder/src/lib.rs:5103:9
  581. 45.51 s gammaloop-nextest-docs> stack backtrace:
  582. 45.51 s gammaloop-nextest-docs> 0: __rustc::rust_begin_unwind
  583. 45.51 s gammaloop-nextest-docs> 1: core::panicking::panic_fmt
  584. 45.51 s gammaloop-nextest-docs> 2: core::result::unwrap_failed
  585. 45.51 s gammaloop-nextest-docs> 3: alphal00p_docs_builder::tests::checked_in_registry_is_valid
  586. 45.51 s gammaloop-nextest-docs> 4: <alphal00p_docs_builder::tests::checked_in_registry_is_valid::{closure#0} as core::ops::function::FnOnce<()>>::call_once
  587. 45.51 s gammaloop-nextest-docs> note: Some details are omitted, run with `RUST_BACKTRACE=full` for a verbose backtrace.
  588. 45.51 s gammaloop-nextest-docs>
  589. 45.51 s gammaloop-nextest-docs> FAIL [ 0.119s] ( 88/129) alphal00p-docs-builder provenance_tests::each_build_captures_one_revision_before_rendering
  590. 45.51 s gammaloop-nextest-docs> stdout ---
  591. 45.51 s gammaloop-nextest-docs>
  592. 45.51 s gammaloop-nextest-docs> running 1 test
  593. 45.51 s gammaloop-nextest-docs>
  594. 45.51 s gammaloop-nextest-docs> running 1 test
  595. 45.51 s gammaloop-nextest-docs> test provenance_tests::each_build_captures_one_revision_before_rendering ... FAILED
  596. 45.51 s gammaloop-nextest-docs>
  597. 45.51 s gammaloop-nextest-docs> failures:
  598. 45.51 s gammaloop-nextest-docs>
  599. 45.51 s gammaloop-nextest-docs> failures:
  600. 45.51 s gammaloop-nextest-docs> provenance_tests::each_build_captures_one_revision_before_rendering
  601. 45.51 s gammaloop-nextest-docs>
  602. 45.51 s gammaloop-nextest-docs> test result: FAILED. 0 passed; 1 failed; 0 ignored; 0 measured; 128 filtered out; finished in 0.10s
  603. 45.51 s gammaloop-nextest-docs>
  604. 45.51 s gammaloop-nextest-docs> test provenance_tests::each_build_captures_one_revision_before_rendering ... FAILED
  605. 45.51 s gammaloop-nextest-docs>
  606. 45.51 s gammaloop-nextest-docs> failures:
  607. 45.51 s gammaloop-nextest-docs>
  608. 45.51 s gammaloop-nextest-docs> failures:
  609. 45.51 s gammaloop-nextest-docs> provenance_tests::each_build_captures_one_revision_before_rendering
  610. 45.51 s gammaloop-nextest-docs>
  611. 45.51 s gammaloop-nextest-docs> test result: FAILED. 0 passed; 1 failed; 0 ignored; 0 measured; 128 filtered out; finished in 0.11s
  612. 45.51 s gammaloop-nextest-docs>
  613. 45.51 s gammaloop-nextest-docs> stderr ---
  614. 45.51 s gammaloop-nextest-docs>
  615. 45.51 s gammaloop-nextest-docs> thread 'provenance_tests::each_build_captures_one_revision_before_rendering' (253) panicked at crates/alphal00p-docs-builder/src/provenance_tests.rs:297:14:
  616. 45.51 s gammaloop-nextest-docs> called `Result::unwrap()` on an `Err` value: required documentation source is missing: /build/source/target/nix-ci-tmp/.tmpuiqmMo/checkout/crates/spynso3/typst/STIXTwoMath-Regular.woff2
  617. 45.51 s gammaloop-nextest-docs>
  618. 45.51 s gammaloop-nextest-docs> Location:
  619. 45.51 s gammaloop-nextest-docs> crates/alphal00p-docs-builder/src/lib.rs:5103:9
  620. 45.51 s gammaloop-nextest-docs> stack backtrace:
  621. 45.51 s gammaloop-nextest-docs> 0: __rustc::rust_begin_unwind
  622. 45.51 s gammaloop-nextest-docs> 1: core::panicking::panic_fmt
  623. 45.51 s gammaloop-nextest-docs> 2: core::result::unwrap_failed
  624. 45.51 s gammaloop-nextest-docs> 3: alphal00p_docs_builder::provenance_tests::each_build_captures_one_revision_before_rendering
  625. 45.51 s gammaloop-nextest-docs> 4: <alphal00p_docs_builder::provenance_tests::each_build_captures_one_revision_before_rendering::{closure#0} as core::ops::function::FnOnce<()>>::call_once
  626. 45.51 s gammaloop-nextest-docs> note: Some details are omitted, run with `RUST_BACKTRACE=full` for a verbose backtrace.
  627. 45.51 s gammaloop-nextest-docs>
  628. 45.51 s gammaloop-nextest-docs> thread 'provenance_tests::each_build_captures_one_revision_before_rendering' (170) panicked at crates/alphal00p-docs-builder/src/provenance_tests.rs:274:9:
  629. 45.51 s gammaloop-nextest-docs> assertion failed: command.status().unwrap().success()
  630. 45.51 s gammaloop-nextest-docs> stack backtrace:
  631. 45.51 s gammaloop-nextest-docs> 0: __rustc::rust_begin_unwind
  632. 45.51 s gammaloop-nextest-docs> 1: core::panicking::panic_fmt
  633. 45.51 s gammaloop-nextest-docs> 2: core::panicking::panic
  634. 45.51 s gammaloop-nextest-docs> 3: alphal00p_docs_builder::provenance_tests::each_build_captures_one_revision_before_rendering
  635. 45.51 s gammaloop-nextest-docs> 4: <alphal00p_docs_builder::provenance_tests::each_build_captures_one_revision_before_rendering::{closure#0} as core::ops::function::FnOnce<()>>::call_once
  636. 45.51 s gammaloop-nextest-docs> note: Some details are omitted, run with `RUST_BACKTRACE=full` for a verbose backtrace.
  637. 45.51 s gammaloop-nextest-docs>
  638. 45.51 s gammaloop-nextest-docs> FAIL [ 0.010s] ( 89/129) alphal00p-docs-builder tests::site_assets_replace_read_only_generated_files
  639. 45.51 s gammaloop-nextest-docs> stdout ---
  640. 45.51 s gammaloop-nextest-docs>
  641. 45.51 s gammaloop-nextest-docs> running 1 test
  642. 45.51 s gammaloop-nextest-docs> test tests::site_assets_replace_read_only_generated_files ... FAILED
  643. 45.51 s gammaloop-nextest-docs>
  644. 45.51 s gammaloop-nextest-docs> failures:
  645. 45.51 s gammaloop-nextest-docs>
  646. 45.51 s gammaloop-nextest-docs> failures:
  647. 45.51 s gammaloop-nextest-docs> tests::site_assets_replace_read_only_generated_files
  648. 45.51 s gammaloop-nextest-docs>
  649. 45.51 s gammaloop-nextest-docs> test result: FAILED. 0 passed; 1 failed; 0 ignored; 0 measured; 128 filtered out; finished in 0.01s
  650. 45.51 s gammaloop-nextest-docs>
  651. 45.51 s gammaloop-nextest-docs> stderr ---
  652. 45.51 s gammaloop-nextest-docs>
  653. 45.51 s gammaloop-nextest-docs> thread 'tests::site_assets_replace_read_only_generated_files' (670) panicked at crates/alphal00p-docs-builder/src/lib.rs:12305:50:
  654. 45.51 s gammaloop-nextest-docs> called `Result::unwrap()` on an `Err` value: failed to copy documentation asset crates/spynso3/typst/STIXTwoMath-Regular.woff2
  655. 45.51 s gammaloop-nextest-docs>
  656. 45.51 s gammaloop-nextest-docs> Caused by:
  657. 45.51 s gammaloop-nextest-docs> No such file or directory (os error 2)
  658. 45.51 s gammaloop-nextest-docs>
  659. 45.51 s gammaloop-nextest-docs> Location:
  660. 45.51 s gammaloop-nextest-docs> crates/alphal00p-docs-builder/src/lib.rs:2276:18
  661. 45.51 s gammaloop-nextest-docs> stack backtrace:
  662. 45.51 s gammaloop-nextest-docs> 0: __rustc::rust_begin_unwind
  663. 45.51 s gammaloop-nextest-docs> 1: core::panicking::panic_fmt
  664. 45.51 s gammaloop-nextest-docs> 2: core::result::unwrap_failed
  665. 45.51 s gammaloop-nextest-docs> 3: alphal00p_docs_builder::tests::site_assets_replace_read_only_generated_files
  666. 45.51 s gammaloop-nextest-docs> 4: <alphal00p_docs_builder::tests::site_assets_replace_read_only_generated_files::{closure#0} as core::ops::function::FnOnce<()>>::call_once
  667. 45.51 s gammaloop-nextest-docs> note: Some details are omitted, run with `RUST_BACKTRACE=full` for a verbose backtrace.
  668. 45.51 s gammaloop-nextest-docs>
  669. 45.51 s gammaloop-nextest-docs> FAIL [ 0.108s] ( 90/129) alphal00p-docs-builder tests::developer_scope_ranges_ignore_unrelated_edits_and_warn_only_while_watching
  670. 45.51 s gammaloop-nextest-docs> stdout ---
  671. 45.51 s gammaloop-nextest-docs>
  672. 45.51 s gammaloop-nextest-docs> running 1 test
  673. 45.51 s gammaloop-nextest-docs> test tests::developer_scope_ranges_ignore_unrelated_edits_and_warn_only_while_watching ... FAILED
  674. 45.51 s gammaloop-nextest-docs>
  675. 45.51 s gammaloop-nextest-docs> failures:
  676. 45.51 s gammaloop-nextest-docs>
  677. 45.51 s gammaloop-nextest-docs> failures:
  678. 45.51 s gammaloop-nextest-docs> tests::developer_scope_ranges_ignore_unrelated_edits_and_warn_only_while_watching
  679. 45.51 s gammaloop-nextest-docs>
  680. 45.51 s gammaloop-nextest-docs> test result: FAILED. 0 passed; 1 failed; 0 ignored; 0 measured; 128 filtered out; finished in 0.10s
  681. 45.51 s gammaloop-nextest-docs>
  682. 45.51 s gammaloop-nextest-docs> stderr ---
  683. 45.51 s gammaloop-nextest-docs>
  684. 45.51 s gammaloop-nextest-docs> thread 'tests::developer_scope_ranges_ignore_unrelated_edits_and_warn_only_while_watching' (287) panicked at crates/alphal00p-docs-builder/src/lib.rs:12350:29:
  685. 45.51 s gammaloop-nextest-docs> called `Result::unwrap()` on an `Err` value: required documentation source is missing: /build/source/crates/spynso3/typst/STIXTwoMath-Regular.woff2
  686. 45.51 s gammaloop-nextest-docs>
  687. 45.51 s gammaloop-nextest-docs> Location:
  688. 45.51 s gammaloop-nextest-docs> crates/alphal00p-docs-builder/src/lib.rs:5103:9
  689. 45.51 s gammaloop-nextest-docs> stack backtrace:
  690. 45.51 s gammaloop-nextest-docs> 0: __rustc::rust_begin_unwind
  691. 45.51 s gammaloop-nextest-docs> 1: core::panicking::panic_fmt
  692. 45.51 s gammaloop-nextest-docs> 2: core::result::unwrap_failed
  693. 45.51 s gammaloop-nextest-docs> 3: alphal00p_docs_builder::tests::developer_scope_ranges_ignore_unrelated_edits_and_warn_only_while_watching
  694. 45.51 s gammaloop-nextest-docs> 4: <alphal00p_docs_builder::tests::developer_scope_ranges_ignore_unrelated_edits_and_warn_only_while_watching::{closure#0} as core::ops::function::FnOnce<()>>::call_once
  695. 45.51 s gammaloop-nextest-docs> note: Some details are omitted, run with `RUST_BACKTRACE=full` for a verbose backtrace.
  696. 45.51 s gammaloop-nextest-docs>
  697. 45.51 s gammaloop-nextest-docs> FAIL [ 0.127s] (121/129) alphal00p-docs-builder tests::every_product_requires_a_task_chooser_and_each_supported_interface
  698. 45.51 s gammaloop-nextest-docs> stdout ---
  699. 45.51 s gammaloop-nextest-docs>
  700. 45.51 s gammaloop-nextest-docs> running 1 test
  701. 45.51 s gammaloop-nextest-docs> test tests::every_product_requires_a_task_chooser_and_each_supported_interface ... FAILED
  702. 45.51 s gammaloop-nextest-docs>
  703. 45.51 s gammaloop-nextest-docs> failures:
  704. 45.51 s gammaloop-nextest-docs>
  705. 45.51 s gammaloop-nextest-docs> failures:
  706. 45.51 s gammaloop-nextest-docs> tests::every_product_requires_a_task_chooser_and_each_supported_interface
  707. 45.51 s gammaloop-nextest-docs>
  708. 45.51 s gammaloop-nextest-docs> test result: FAILED. 0 passed; 1 failed; 0 ignored; 0 measured; 128 filtered out; finished in 0.12s
  709. 45.51 s gammaloop-nextest-docs>
  710. 45.51 s gammaloop-nextest-docs> stderr ---
  711. 45.51 s gammaloop-nextest-docs>
  712. 45.51 s gammaloop-nextest-docs> thread 'tests::every_product_requires_a_task_chooser_and_each_supported_interface' (327) panicked at crates/alphal00p-docs-builder/src/lib.rs:12274:9:
  713. 45.51 s gammaloop-nextest-docs> assertion failed: format!("{error:#}").contains("has no quickstart page")
  714. 45.51 s gammaloop-nextest-docs> stack backtrace:
  715. 45.51 s gammaloop-nextest-docs> 0: __rustc::rust_begin_unwind
  716. 45.51 s gammaloop-nextest-docs> 1: core::panicking::panic_fmt
  717. 45.51 s gammaloop-nextest-docs> 2: core::panicking::panic
  718. 45.51 s gammaloop-nextest-docs> 3: alphal00p_docs_builder::tests::every_product_requires_a_task_chooser_and_each_supported_interface
  719. 45.51 s gammaloop-nextest-docs> 4: <alphal00p_docs_builder::tests::every_product_requires_a_task_chooser_and_each_supported_interface::{closure#0} as core::ops::function::FnOnce<()>>::call_once
  720. 45.51 s gammaloop-nextest-docs> note: Some details are omitted, run with `RUST_BACKTRACE=full` for a verbose backtrace.
  721. 45.51 s gammaloop-nextest-docs>
  722. 45.51 s gammaloop-nextest-docs> FAIL [ 0.111s] (122/129) alphal00p-docs-builder tests::pdf_manual_chapter_order_must_match_the_page_registry
  723. 45.51 s gammaloop-nextest-docs> stdout ---
  724. 45.51 s gammaloop-nextest-docs>
  725. 45.51 s gammaloop-nextest-docs> running 1 test
  726. 45.51 s gammaloop-nextest-docs> test tests::pdf_manual_chapter_order_must_match_the_page_registry ... FAILED
  727. 45.51 s gammaloop-nextest-docs>
  728. 45.51 s gammaloop-nextest-docs> failures:
  729. 45.51 s gammaloop-nextest-docs>
  730. 45.51 s gammaloop-nextest-docs> failures:
  731. 45.51 s gammaloop-nextest-docs> tests::pdf_manual_chapter_order_must_match_the_page_registry
  732. 45.51 s gammaloop-nextest-docs>
  733. 45.51 s gammaloop-nextest-docs> test result: FAILED. 0 passed; 1 failed; 0 ignored; 0 measured; 128 filtered out; finished in 0.11s
  734. 45.51 s gammaloop-nextest-docs>
  735. 45.51 s gammaloop-nextest-docs> stderr ---
  736. 45.51 s gammaloop-nextest-docs>
  737. 45.51 s gammaloop-nextest-docs> thread 'tests::pdf_manual_chapter_order_must_match_the_page_registry' (396) panicked at crates/alphal00p-docs-builder/src/lib.rs:12330:9:
  738. 45.51 s gammaloop-nextest-docs> assertion failed: format!("{error:#}").contains("PDF manual chapter order differs")
  739. 45.51 s gammaloop-nextest-docs> stack backtrace:
  740. 45.51 s gammaloop-nextest-docs> 0: __rustc::rust_begin_unwind
  741. 45.51 s gammaloop-nextest-docs> 1: core::panicking::panic_fmt
  742. 45.51 s gammaloop-nextest-docs> 2: core::panicking::panic
  743. 45.51 s gammaloop-nextest-docs> 3: alphal00p_docs_builder::tests::pdf_manual_chapter_order_must_match_the_page_registry
  744. 45.51 s gammaloop-nextest-docs> 4: <alphal00p_docs_builder::tests::pdf_manual_chapter_order_must_match_the_page_registry::{closure#0} as core::ops::function::FnOnce<()>>::call_once
  745. 45.51 s gammaloop-nextest-docs> note: Some details are omitted, run with `RUST_BACKTRACE=full` for a verbose backtrace.
  746. 45.51 s gammaloop-nextest-docs>
  747. 45.51 s gammaloop-nextest-docs> error: test run failed
  748. 45.54 s gammaloop-nextest-docs>
  749. 45.54 s gammaloop-nextest-docs> ========== nextest test summary ==========
  750. 45.54 s gammaloop-nextest-docs> report: target/nextest/ci_gammaloop/junit.xml
  751. 45.54 s gammaloop-nextest-docs> tests: 129, failures: 11, errors: 0
  752. 45.54 s gammaloop-nextest-docs>
  753. 45.54 s gammaloop-nextest-docs> 1. alphal00p-docs-builder::tests::developer_architecture_is_classified_searchable_and_source_backed
  754. 45.54 s gammaloop-nextest-docs> failure: test failure with exit code 101
  755. 45.54 s gammaloop-nextest-docs> thread 'tests::developer_architecture_is_classified_searchable_and_source_backed' (289) panicked at crates/alphal00p-docs-builder/src/lib.rs:12751:14:
  756. 45.54 s gammaloop-nextest-docs> called `Result::unwrap()` on an `Err` value: failed to copy documentation asset crates/spynso3/typst/STIXTwoMath-Regular.woff2
  757. 45.54 s gammaloop-nextest-docs>
  758. 45.54 s gammaloop-nextest-docs> Caused by:
  759. 45.54 s gammaloop-nextest-docs> No such file or directory (os error 2)
  760. 45.54 s gammaloop-nextest-docs>
  761. 45.54 s gammaloop-nextest-docs> Location:
  762. 45.54 s gammaloop-nextest-docs> crates/alphal00p-docs-builder/src/lib.rs:2276:18
  763. 45.54 s gammaloop-nextest-docs> stack backtrace:
  764. 45.54 s gammaloop-nextest-docs> 0: __rustc::rust_begin_unwind
  765. 45.54 s gammaloop-nextest-docs> 1: core::panicking::panic_fmt
  766. 45.54 s gammaloop-nextest-docs> 2: core::result::unwrap_failed
  767. 45.54 s gammaloop-nextest-docs> 3: alphal00p_docs_builder::tests::developer_architecture_is_classified_searchable_and_source_backed
  768. 45.54 s gammaloop-nextest-docs> 4: <alphal00p_docs_builder::tests::developer_architecture_is_classified_searchable_and_source_backed::{closure#0} as core::ops::function::FnOnce<()>>::call_once
  769. 45.54 s gammaloop-nextest-docs> note: Some details are omitted, run with `RUST_BACKTRACE=full` for a verbose backtrace.
  770. 45.54 s gammaloop-nextest-docs> system-out
  771. 45.54 s gammaloop-nextest-docs> running 1 test
  772. 45.54 s gammaloop-nextest-docs> test tests::developer_architecture_is_classified_searchable_and_source_backed ... FAILED
  773. 45.54 s gammaloop-nextest-docs>
  774. 45.54 s gammaloop-nextest-docs> failures:
  775. 45.54 s gammaloop-nextest-docs>
  776. 45.54 s gammaloop-nextest-docs> failures:
  777. 45.54 s gammaloop-nextest-docs> tests::developer_architecture_is_classified_searchable_and_source_backed
  778. 45.54 s gammaloop-nextest-docs>
  779. 45.54 s gammaloop-nextest-docs> test result: FAILED. 0 passed; 1 failed; 0 ignored; 0 measured; 128 filtered out; finished in 0.01s
  780. 45.54 s gammaloop-nextest-docs> system-err
  781. 45.54 s gammaloop-nextest-docs> thread 'tests::developer_architecture_is_classified_searchable_and_source_backed' (289) panicked at crates/alphal00p-docs-builder/src/lib.rs:12751:14:
  782. 45.54 s gammaloop-nextest-docs> called `Result::unwrap()` on an `Err` value: failed to copy documentation asset crates/spynso3/typst/STIXTwoMath-Regular.woff2
  783. 45.54 s gammaloop-nextest-docs>
  784. 45.54 s gammaloop-nextest-docs> Caused by:
  785. 45.54 s gammaloop-nextest-docs> No such file or directory (os error 2)
  786. 45.54 s gammaloop-nextest-docs>
  787. 45.54 s gammaloop-nextest-docs> Location:
  788. 45.54 s gammaloop-nextest-docs> crates/alphal00p-docs-builder/src/lib.rs:2276:18
  789. 45.54 s gammaloop-nextest-docs> stack backtrace:
  790. 45.54 s gammaloop-nextest-docs> 0: __rustc::rust_begin_unwind
  791. 45.54 s gammaloop-nextest-docs> 1: core::panicking::panic_fmt
  792. 45.54 s gammaloop-nextest-docs> 2: core::result::unwrap_failed
  793. 45.54 s gammaloop-nextest-docs> 3: alphal00p_docs_builder::tests::developer_architecture_is_classified_searchable_and_source_backed
  794. 45.54 s gammaloop-nextest-docs> 4: <alphal00p_docs_builder::tests::developer_architecture_is_classified_searchable_and_source_backed::{closure#0} as core::ops::function::FnOnce<()>>::call_once
  795. 45.54 s gammaloop-nextest-docs> note: Some details are omitted, run with `RUST_BACKTRACE=full` for a verbose backtrace.
  796. 45.54 s gammaloop-nextest-docs>
  797. 45.54 s gammaloop-nextest-docs> 2. alphal00p-docs-builder::tests::every_product_orients_rust_to_native_rustdoc_and_keeps_legacy_redirects
  798. 45.54 s gammaloop-nextest-docs> failure: test failure with exit code 101
  799. 45.54 s gammaloop-nextest-docs> thread 'tests::every_product_orients_rust_to_native_rustdoc_and_keeps_legacy_redirects' (309) panicked at crates/alphal00p-docs-builder/src/lib.rs:12555:46:
  800. 45.54 s gammaloop-nextest-docs> called `Result::unwrap()` on an `Err` value: failed to copy documentation asset crates/spynso3/typst/STIXTwoMath-Regular.woff2
  801. 45.54 s gammaloop-nextest-docs>
  802. 45.54 s gammaloop-nextest-docs> Caused by:
  803. 45.54 s gammaloop-nextest-docs> No such file or directory (os error 2)
  804. 45.54 s gammaloop-nextest-docs>
  805. 45.54 s gammaloop-nextest-docs> Location:
  806. 45.54 s gammaloop-nextest-docs> crates/alphal00p-docs-builder/src/lib.rs:2276:18
  807. 45.54 s gammaloop-nextest-docs> stack backtrace:
  808. 45.54 s gammaloop-nextest-docs> 0: __rustc::rust_begin_unwind
  809. 45.54 s gammaloop-nextest-docs> 1: core::panicking::panic_fmt
  810. 45.54 s gammaloop-nextest-docs> 2: core::result::unwrap_failed
  811. 45.54 s gammaloop-nextest-docs> 3: alphal00p_docs_builder::tests::every_product_orients_rust_to_native_rustdoc_and_keeps_legacy_redirects
  812. 45.54 s gammaloop-nextest-docs> 4: <alphal00p_docs_builder::tests::every_product_orients_rust_to_native_rustdoc_and_keeps_legacy_redirects::{closure#0} as core::ops::function::FnOnce<()>>::call_once
  813. 45.54 s gammaloop-nextest-docs> note: Some details are omitted, run with `RUST_BACKTRACE=full` for a verbose backtrace.
  814. 45.54 s gammaloop-nextest-docs> system-out
  815. 45.54 s gammaloop-nextest-docs> running 1 test
  816. 45.54 s gammaloop-nextest-docs> test tests::every_product_orients_rust_to_native_rustdoc_and_keeps_legacy_redirects ... FAILED
  817. 45.54 s gammaloop-nextest-docs>
  818. 45.54 s gammaloop-nextest-docs> failures:
  819. 45.54 s gammaloop-nextest-docs>
  820. 45.54 s gammaloop-nextest-docs> failures:
  821. 45.54 s gammaloop-nextest-docs> tests::every_product_orients_rust_to_native_rustdoc_and_keeps_legacy_redirects
  822. 45.54 s gammaloop-nextest-docs>
  823. 45.54 s gammaloop-nextest-docs> test result: FAILED. 0 passed; 1 failed; 0 ignored; 0 measured; 128 filtered out; finished in 0.00s
  824. 45.54 s gammaloop-nextest-docs> system-err
  825. 45.54 s gammaloop-nextest-docs> thread 'tests::every_product_orients_rust_to_native_rustdoc_and_keeps_legacy_redirects' (309) panicked at crates/alphal00p-docs-builder/src/lib.rs:12555:46:
  826. 45.54 s gammaloop-nextest-docs> called `Result::unwrap()` on an `Err` value: failed to copy documentation asset crates/spynso3/typst/STIXTwoMath-Regular.woff2
  827. 45.54 s gammaloop-nextest-docs>
  828. 45.54 s gammaloop-nextest-docs> Caused by:
  829. 45.54 s gammaloop-nextest-docs> No such file or directory (os error 2)
  830. 45.54 s gammaloop-nextest-docs>
  831. 45.54 s gammaloop-nextest-docs> Location:
  832. 45.54 s gammaloop-nextest-docs> crates/alphal00p-docs-builder/src/lib.rs:2276:18
  833. 45.54 s gammaloop-nextest-docs> stack backtrace:
  834. 45.54 s gammaloop-nextest-docs> 0: __rustc::rust_begin_unwind
  835. 45.54 s gammaloop-nextest-docs> 1: core::panicking::panic_fmt
  836. 45.54 s gammaloop-nextest-docs> 2: core::result::unwrap_failed
  837. 45.54 s gammaloop-nextest-docs> 3: alphal00p_docs_builder::tests::every_product_orients_rust_to_native_rustdoc_and_keeps_legacy_redirects
  838. 45.54 s gammaloop-nextest-docs> 4: <alphal00p_docs_builder::tests::every_product_orients_rust_to_native_rustdoc_and_keeps_legacy_redirects::{closure#0} as core::ops::function::FnOnce<()>>::call_once
  839. 45.54 s gammaloop-nextest-docs> note: Some details are omitted, run with `RUST_BACKTRACE=full` for a verbose backtrace.
  840. 45.54 s gammaloop-nextest-docs>
  841. 45.54 s gammaloop-nextest-docs> 3. alphal00p-docs-builder::tests::portal_emits_routes_and_valid_assets
  842. 45.54 s gammaloop-nextest-docs> failure: test failure with exit code 101
  843. 45.54 s gammaloop-nextest-docs> thread 'tests::portal_emits_routes_and_valid_assets' (424) panicked at crates/alphal00p-docs-builder/src/lib.rs:9684:14:
  844. 45.54 s gammaloop-nextest-docs> called `Result::unwrap()` on an `Err` value: failed to copy documentation asset crates/spynso3/typst/STIXTwoMath-Regular.woff2
  845. 45.54 s gammaloop-nextest-docs>
  846. 45.54 s gammaloop-nextest-docs> Caused by:
  847. 45.54 s gammaloop-nextest-docs> No such file or directory (os error 2)
  848. 45.54 s gammaloop-nextest-docs>
  849. 45.54 s gammaloop-nextest-docs> Location:
  850. 45.54 s gammaloop-nextest-docs> crates/alphal00p-docs-builder/src/lib.rs:2276:18
  851. 45.54 s gammaloop-nextest-docs> stack backtrace:
  852. 45.54 s gammaloop-nextest-docs> 0: __rustc::rust_begin_unwind
  853. 45.54 s gammaloop-nextest-docs> 1: core::panicking::panic_fmt
  854. 45.54 s gammaloop-nextest-docs> 2: core::result::unwrap_failed
  855. 45.54 s gammaloop-nextest-docs> 3: alphal00p_docs_builder::tests::write_test_portal
  856. 45.54 s gammaloop-nextest-docs> 4: alphal00p_docs_builder::tests::portal_emits_routes_and_valid_assets
  857. 45.54 s gammaloop-nextest-docs> 5: <alphal00p_docs_builder::tests::portal_emits_routes_and_valid_assets::{closure#0} as core::ops::function::FnOnce<()>>::call_once
  858. 45.54 s gammaloop-nextest-docs> note: Some details are omitted, run with `RUST_BACKTRACE=full` for a verbose backtrace.
  859. 45.54 s gammaloop-nextest-docs> system-out
  860. 45.54 s gammaloop-nextest-docs> running 1 test
  861. 45.54 s gammaloop-nextest-docs> test tests::portal_emits_routes_and_valid_assets ... FAILED
  862. 45.54 s gammaloop-nextest-docs>
  863. 45.54 s gammaloop-nextest-docs> failures:
  864. 45.54 s gammaloop-nextest-docs>
  865. 45.54 s gammaloop-nextest-docs> failures:
  866. 45.54 s gammaloop-nextest-docs> tests::portal_emits_routes_and_valid_assets
  867. 45.54 s gammaloop-nextest-docs>
  868. 45.54 s gammaloop-nextest-docs> test result: FAILED. 0 passed; 1 failed; 0 ignored; 0 measured; 128 filtered out; finished in 0.01s
  869. 45.54 s gammaloop-nextest-docs> system-err
  870. 45.54 s gammaloop-nextest-docs> thread 'tests::portal_emits_routes_and_valid_assets' (424) panicked at crates/alphal00p-docs-builder/src/lib.rs:9684:14:
  871. 45.54 s gammaloop-nextest-docs> called `Result::unwrap()` on an `Err` value: failed to copy documentation asset crates/spynso3/typst/STIXTwoMath-Regular.woff2
  872. 45.54 s gammaloop-nextest-docs>
  873. 45.54 s gammaloop-nextest-docs> Caused by:
  874. 45.54 s gammaloop-nextest-docs> No such file or directory (os error 2)
  875. 45.54 s gammaloop-nextest-docs>
  876. 45.54 s gammaloop-nextest-docs> Location:
  877. 45.54 s gammaloop-nextest-docs> crates/alphal00p-docs-builder/src/lib.rs:2276:18
  878. 45.54 s gammaloop-nextest-docs> stack backtrace:
  879. 45.54 s gammaloop-nextest-docs> 0: __rustc::rust_begin_unwind
  880. 45.54 s gammaloop-nextest-docs> 1: core::panicking::panic_fmt
  881. 45.54 s gammaloop-nextest-docs> 2: core::result::unwrap_failed
  882. 45.54 s gammaloop-nextest-docs> 3: alphal00p_docs_builder::tests::write_test_portal
  883. 45.54 s gammaloop-nextest-docs> 4: alphal00p_docs_builder::tests::portal_emits_routes_and_valid_assets
  884. 45.54 s gammaloop-nextest-docs> 5: <alphal00p_docs_builder::tests::portal_emits_routes_and_valid_assets::{closure#0} as core::ops::function::FnOnce<()>>::call_once
  885. 45.54 s gammaloop-nextest-docs> note: Some details are omitted, run with `RUST_BACKTRACE=full` for a verbose backtrace.
  886. 45.54 s gammaloop-nextest-docs>
  887. 45.54 s gammaloop-nextest-docs> 4. alphal00p-docs-builder::tests::portal_task_chooser_routes_each_goal_to_the_registered_quickstart
  888. 45.54 s gammaloop-nextest-docs> failure: test failure with exit code 101
  889. 45.54 s gammaloop-nextest-docs> thread 'tests::portal_task_chooser_routes_each_goal_to_the_registered_quickstart' (431) panicked at crates/alphal00p-docs-builder/src/lib.rs:9684:14:
  890. 45.54 s gammaloop-nextest-docs> called `Result::unwrap()` on an `Err` value: failed to copy documentation asset crates/spynso3/typst/STIXTwoMath-Regular.woff2
  891. 45.54 s gammaloop-nextest-docs>
  892. 45.54 s gammaloop-nextest-docs> Caused by:
  893. 45.54 s gammaloop-nextest-docs> No such file or directory (os error 2)
  894. 45.54 s gammaloop-nextest-docs>
  895. 45.54 s gammaloop-nextest-docs> Location:
  896. 45.54 s gammaloop-nextest-docs> crates/alphal00p-docs-builder/src/lib.rs:2276:18
  897. 45.54 s gammaloop-nextest-docs> stack backtrace:
  898. 45.54 s gammaloop-nextest-docs> 0: __rustc::rust_begin_unwind
  899. 45.54 s gammaloop-nextest-docs> 1: core::panicking::panic_fmt
  900. 45.54 s gammaloop-nextest-docs> 2: core::result::unwrap_failed
  901. 45.54 s gammaloop-nextest-docs> 3: alphal00p_docs_builder::tests::write_test_portal
  902. 45.54 s gammaloop-nextest-docs> 4: alphal00p_docs_builder::tests::portal_task_chooser_routes_each_goal_to_the_registered_quickstart
  903. 45.54 s gammaloop-nextest-docs> 5: <alphal00p_docs_builder::tests::portal_task_chooser_routes_each_goal_to_the_registered_quickstart::{closure#0} as core::ops::function::FnOnce<()>>::call_once
  904. 45.54 s gammaloop-nextest-docs> note: Some details are omitted, run with `RUST_BACKTRACE=full` for a verbose backtrace.
  905. 45.54 s gammaloop-nextest-docs> system-out
  906. 45.54 s gammaloop-nextest-docs> running 1 test
  907. 45.54 s gammaloop-nextest-docs> test tests::portal_task_chooser_routes_each_goal_to_the_registered_quickstart ... FAILED
  908. 45.54 s gammaloop-nextest-docs>
  909. 45.54 s gammaloop-nextest-docs> failures:
  910. 45.54 s gammaloop-nextest-docs>
  911. 45.54 s gammaloop-nextest-docs> failures:
  912. 45.54 s gammaloop-nextest-docs> tests::portal_task_chooser_routes_each_goal_to_the_registered_quickstart
  913. 45.54 s gammaloop-nextest-docs>
  914. 45.54 s gammaloop-nextest-docs> test result: FAILED. 0 passed; 1 failed; 0 ignored; 0 measured; 128 filtered out; finished in 0.00s
  915. 45.54 s gammaloop-nextest-docs> system-err
  916. 45.54 s gammaloop-nextest-docs> thread 'tests::portal_task_chooser_routes_each_goal_to_the_registered_quickstart' (431) panicked at crates/alphal00p-docs-builder/src/lib.rs:9684:14:
  917. 45.54 s gammaloop-nextest-docs> called `Result::unwrap()` on an `Err` value: failed to copy documentation asset crates/spynso3/typst/STIXTwoMath-Regular.woff2
  918. 45.54 s gammaloop-nextest-docs>
  919. 45.54 s gammaloop-nextest-docs> Caused by:
  920. 45.54 s gammaloop-nextest-docs> No such file or directory (os error 2)
  921. 45.54 s gammaloop-nextest-docs>
  922. 45.54 s gammaloop-nextest-docs> Location:
  923. 45.54 s gammaloop-nextest-docs> crates/alphal00p-docs-builder/src/lib.rs:2276:18
  924. 45.54 s gammaloop-nextest-docs> stack backtrace:
  925. 45.54 s gammaloop-nextest-docs> 0: __rustc::rust_begin_unwind
  926. 45.54 s gammaloop-nextest-docs> 1: core::panicking::panic_fmt
  927. 45.54 s gammaloop-nextest-docs> 2: core::result::unwrap_failed
  928. 45.54 s gammaloop-nextest-docs> 3: alphal00p_docs_builder::tests::write_test_portal
  929. 45.54 s gammaloop-nextest-docs> 4: alphal00p_docs_builder::tests::portal_task_chooser_routes_each_goal_to_the_registered_quickstart
  930. 45.54 s gammaloop-nextest-docs> 5: <alphal00p_docs_builder::tests::portal_task_chooser_routes_each_goal_to_the_registered_quickstart::{closure#0} as core::ops::function::FnOnce<()>>::call_once
  931. 45.54 s gammaloop-nextest-docs> note: Some details are omitted, run with `RUST_BACKTRACE=full` for a verbose backtrace.
  932. 45.54 s gammaloop-nextest-docs>
  933. 45.54 s gammaloop-nextest-docs> 5. alphal00p-docs-builder::tests::portal_and_developer_pages_use_federated_search_and_feedback
  934. 45.54 s gammaloop-nextest-docs> failure: test failure with exit code 101
  935. 45.54 s gammaloop-nextest-docs> thread 'tests::portal_and_developer_pages_use_federated_search_and_feedback' (425) panicked at crates/alphal00p-docs-builder/src/lib.rs:9684:14:
  936. 45.54 s gammaloop-nextest-docs> called `Result::unwrap()` on an `Err` value: failed to copy documentation asset crates/spynso3/typst/STIXTwoMath-Regular.woff2
  937. 45.54 s gammaloop-nextest-docs>
  938. 45.54 s gammaloop-nextest-docs> Caused by:
  939. 45.54 s gammaloop-nextest-docs> No such file or directory (os error 2)
  940. 45.54 s gammaloop-nextest-docs>
  941. 45.54 s gammaloop-nextest-docs> Location:
  942. 45.54 s gammaloop-nextest-docs> crates/alphal00p-docs-builder/src/lib.rs:2276:18
  943. 45.54 s gammaloop-nextest-docs> stack backtrace:
  944. 45.54 s gammaloop-nextest-docs> 0: __rustc::rust_begin_unwind
  945. 45.54 s gammaloop-nextest-docs> 1: core::panicking::panic_fmt
  946. 45.54 s gammaloop-nextest-docs> 2: core::result::unwrap_failed
  947. 45.54 s gammaloop-nextest-docs> 3: alphal00p_docs_builder::tests::write_test_portal
  948. 45.54 s gammaloop-nextest-docs> 4: alphal00p_docs_builder::tests::portal_and_developer_pages_use_federated_search_and_feedback
  949. 45.54 s gammaloop-nextest-docs> 5: <alphal00p_docs_builder::tests::portal_and_developer_pages_use_federated_search_and_feedback::{closure#0} as core::ops::function::FnOnce<()>>::call_once
  950. 45.54 s gammaloop-nextest-docs> note: Some details are omitted, run with `RUST_BACKTRACE=full` for a verbose backtrace.
  951. 45.54 s gammaloop-nextest-docs> system-out
  952. 45.54 s gammaloop-nextest-docs> running 1 test
  953. 45.54 s gammaloop-nextest-docs> test tests::portal_and_developer_pages_use_federated_search_and_feedback ... FAILED
  954. 45.54 s gammaloop-nextest-docs>
  955. 45.54 s gammaloop-nextest-docs> failures:
  956. 45.54 s gammaloop-nextest-docs>
  957. 45.54 s gammaloop-nextest-docs> failures:
  958. 45.54 s gammaloop-nextest-docs> tests::portal_and_developer_pages_use_federated_search_and_feedback
  959. 45.54 s gammaloop-nextest-docs>
  960. 45.54 s gammaloop-nextest-docs> test result: FAILED. 0 passed; 1 failed; 0 ignored; 0 measured; 128 filtered out; finished in 0.01s
  961. 45.54 s gammaloop-nextest-docs> system-err
  962. 45.54 s gammaloop-nextest-docs> thread 'tests::portal_and_developer_pages_use_federated_search_and_feedback' (425) panicked at crates/alphal00p-docs-builder/src/lib.rs:9684:14:
  963. 45.54 s gammaloop-nextest-docs> called `Result::unwrap()` on an `Err` value: failed to copy documentation asset crates/spynso3/typst/STIXTwoMath-Regular.woff2
  964. 45.54 s gammaloop-nextest-docs>
  965. 45.54 s gammaloop-nextest-docs> Caused by:
  966. 45.54 s gammaloop-nextest-docs> No such file or directory (os error 2)
  967. 45.54 s gammaloop-nextest-docs>
  968. 45.54 s gammaloop-nextest-docs> Location:
  969. 45.54 s gammaloop-nextest-docs> crates/alphal00p-docs-builder/src/lib.rs:2276:18
  970. 45.54 s gammaloop-nextest-docs> stack backtrace:
  971. 45.54 s gammaloop-nextest-docs> 0: __rustc::rust_begin_unwind
  972. 45.54 s gammaloop-nextest-docs> 1: core::panicking::panic_fmt
  973. 45.54 s gammaloop-nextest-docs> 2: core::result::unwrap_failed
  974. 45.54 s gammaloop-nextest-docs> 3: alphal00p_docs_builder::tests::write_test_portal
  975. 45.54 s gammaloop-nextest-docs> 4: alphal00p_docs_builder::tests::portal_and_developer_pages_use_federated_search_and_feedback
  976. 45.54 s gammaloop-nextest-docs> 5: <alphal00p_docs_builder::tests::portal_and_developer_pages_use_federated_search_and_feedback::{closure#0} as core::ops::function::FnOnce<()>>::call_once
  977. 45.54 s gammaloop-nextest-docs> note: Some details are omitted, run with `RUST_BACKTRACE=full` for a verbose backtrace.
  978. 45.54 s gammaloop-nextest-docs>
  979. 45.54 s gammaloop-nextest-docs> 6. alphal00p-docs-builder::tests::checked_in_registry_is_valid
  980. 45.54 s gammaloop-nextest-docs> failure: test failure with exit code 101
  981. 45.54 s gammaloop-nextest-docs> thread 'tests::checked_in_registry_is_valid' (187) panicked at crates/alphal00p-docs-builder/src/lib.rs:12260:50:
  982. 45.54 s gammaloop-nextest-docs> called `Result::unwrap()` on an `Err` value: required documentation source is missing: /build/source/crates/spynso3/typst/STIXTwoMath-Regular.woff2
  983. 45.54 s gammaloop-nextest-docs>
  984. 45.54 s gammaloop-nextest-docs> Location:
  985. 45.54 s gammaloop-nextest-docs> crates/alphal00p-docs-builder/src/lib.rs:5103:9
  986. 45.54 s gammaloop-nextest-docs> stack backtrace:
  987. 45.54 s gammaloop-nextest-docs> 0: __rustc::rust_begin_unwind
  988. 45.54 s gammaloop-nextest-docs> 1: core::panicking::panic_fmt
  989. 45.54 s gammaloop-nextest-docs> 2: core::result::unwrap_failed
  990. 45.54 s gammaloop-nextest-docs> 3: alphal00p_docs_builder::tests::checked_in_registry_is_valid
  991. 45.54 s gammaloop-nextest-docs> 4: <alphal00p_docs_builder::tests::checked_in_registry_is_valid::{closure#0} as core::ops::function::FnOnce<()>>::call_once
  992. 45.54 s gammaloop-nextest-docs> note: Some details are omitted, run with `RUST_BACKTRACE=full` for a verbose backtrace.
  993. 45.54 s gammaloop-nextest-docs> system-out
  994. 45.54 s gammaloop-nextest-docs> running 1 test
  995. 45.54 s gammaloop-nextest-docs> test tests::checked_in_registry_is_valid ... FAILED
  996. 45.54 s gammaloop-nextest-docs>
  997. 45.54 s gammaloop-nextest-docs> failures:
  998. 45.54 s gammaloop-nextest-docs>
  999. 45.54 s gammaloop-nextest-docs> failures:
  1000. 45.54 s gammaloop-nextest-docs> tests::checked_in_registry_is_valid
  1001. 45.54 s gammaloop-nextest-docs>
  1002. 45.54 s gammaloop-nextest-docs> test result: FAILED. 0 passed; 1 failed; 0 ignored; 0 measured; 128 filtered out; finished in 0.11s
  1003. 45.54 s gammaloop-nextest-docs> system-err
  1004. 45.54 s gammaloop-nextest-docs> thread 'tests::checked_in_registry_is_valid' (187) panicked at crates/alphal00p-docs-builder/src/lib.rs:12260:50:
  1005. 45.54 s gammaloop-nextest-docs> called `Result::unwrap()` on an `Err` value: required documentation source is missing: /build/source/crates/spynso3/typst/STIXTwoMath-Regular.woff2
  1006. 45.54 s gammaloop-nextest-docs>
  1007. 45.54 s gammaloop-nextest-docs> Location:
  1008. 45.54 s gammaloop-nextest-docs> crates/alphal00p-docs-builder/src/lib.rs:5103:9
  1009. 45.54 s gammaloop-nextest-docs> stack backtrace:
  1010. 45.54 s gammaloop-nextest-docs> 0: __rustc::rust_begin_unwind
  1011. 45.54 s gammaloop-nextest-docs> 1: core::panicking::panic_fmt
  1012. 45.54 s gammaloop-nextest-docs> 2: core::result::unwrap_failed
  1013. 45.54 s gammaloop-nextest-docs> 3: alphal00p_docs_builder::tests::checked_in_registry_is_valid
  1014. 45.54 s gammaloop-nextest-docs> 4: <alphal00p_docs_builder::tests::checked_in_registry_is_valid::{closure#0} as core::ops::function::FnOnce<()>>::call_once
  1015. 45.54 s gammaloop-nextest-docs> note: Some details are omitted, run with `RUST_BACKTRACE=full` for a verbose backtrace.
  1016. 45.54 s gammaloop-nextest-docs>
  1017. 45.54 s gammaloop-nextest-docs> 7. alphal00p-docs-builder::provenance_tests::each_build_captures_one_revision_before_rendering
  1018. 45.54 s gammaloop-nextest-docs> failure: test failure with exit code 101
  1019. 45.54 s gammaloop-nextest-docs> thread 'provenance_tests::each_build_captures_one_revision_before_rendering' (170) panicked at crates/alphal00p-docs-builder/src/provenance_tests.rs:274:9:
  1020. 45.54 s gammaloop-nextest-docs> assertion failed: command.status().unwrap().success()
  1021. 45.54 s gammaloop-nextest-docs> stack backtrace:
  1022. 45.54 s gammaloop-nextest-docs> 0: __rustc::rust_begin_unwind
  1023. 45.54 s gammaloop-nextest-docs> 1: core::panicking::panic_fmt
  1024. 45.54 s gammaloop-nextest-docs> 2: core::panicking::panic
  1025. 45.54 s gammaloop-nextest-docs> 3: alphal00p_docs_builder::provenance_tests::each_build_captures_one_revision_before_rendering
  1026. 45.54 s gammaloop-nextest-docs> 4: <alphal00p_docs_builder::provenance_tests::each_build_captures_one_revision_before_rendering::{closure#0} as core::ops::function::FnOnce<()>>::call_once
  1027. 45.54 s gammaloop-nextest-docs> note: Some details are omitted, run with `RUST_BACKTRACE=full` for a verbose backtrace.
  1028. 45.54 s gammaloop-nextest-docs> system-out
  1029. 45.54 s gammaloop-nextest-docs> running 1 test
  1030. 45.54 s gammaloop-nextest-docs>
  1031. 45.54 s gammaloop-nextest-docs> running 1 test
  1032. 45.54 s gammaloop-nextest-docs> test provenance_tests::each_build_captures_one_revision_before_rendering ... FAILED
  1033. 45.54 s gammaloop-nextest-docs>
  1034. 45.54 s gammaloop-nextest-docs> failures:
  1035. 45.54 s gammaloop-nextest-docs>
  1036. 45.54 s gammaloop-nextest-docs> failures:
  1037. 45.54 s gammaloop-nextest-docs> provenance_tests::each_build_captures_one_revision_before_rendering
  1038. 45.54 s gammaloop-nextest-docs>
  1039. 45.54 s gammaloop-nextest-docs> test result: FAILED. 0 passed; 1 failed; 0 ignored; 0 measured; 128 filtered out; finished in 0.10s
  1040. 45.54 s gammaloop-nextest-docs>
  1041. 45.54 s gammaloop-nextest-docs> test provenance_tests::each_build_captures_one_revision_before_rendering ... FAILED
  1042. 45.54 s gammaloop-nextest-docs>
  1043. 45.54 s gammaloop-nextest-docs> failures:
  1044. 45.54 s gammaloop-nextest-docs>
  1045. 45.54 s gammaloop-nextest-docs> failures:
  1046. 45.54 s gammaloop-nextest-docs> provenance_tests::each_build_captures_one_revision_before_rendering
  1047. 45.54 s gammaloop-nextest-docs>
  1048. 45.54 s gammaloop-nextest-docs> test result: FAILED. 0 passed; 1 failed; 0 ignored; 0 measured; 128 filtered out; finished in 0.11s
  1049. 45.54 s gammaloop-nextest-docs> system-err
  1050. 45.54 s gammaloop-nextest-docs> thread 'provenance_tests::each_build_captures_one_revision_before_rendering' (253) panicked at crates/alphal00p-docs-builder/src/provenance_tests.rs:297:14:
  1051. 45.54 s gammaloop-nextest-docs> called `Result::unwrap()` on an `Err` value: required documentation source is missing: /build/source/target/nix-ci-tmp/.tmpuiqmMo/checkout/crates/spynso3/typst/STIXTwoMath-Regular.woff2
  1052. 45.54 s gammaloop-nextest-docs>
  1053. 45.54 s gammaloop-nextest-docs> Location:
  1054. 45.54 s gammaloop-nextest-docs> crates/alphal00p-docs-builder/src/lib.rs:5103:9
  1055. 45.54 s gammaloop-nextest-docs> stack backtrace:
  1056. 45.54 s gammaloop-nextest-docs> 0: __rustc::rust_begin_unwind
  1057. 45.54 s gammaloop-nextest-docs> 1: core::panicking::panic_fmt
  1058. 45.54 s gammaloop-nextest-docs> 2: core::result::unwrap_failed
  1059. 45.54 s gammaloop-nextest-docs> 3: alphal00p_docs_builder::provenance_tests::each_build_captures_one_revision_before_rendering
  1060. 45.54 s gammaloop-nextest-docs> 4: <alphal00p_docs_builder::provenance_tests::each_build_captures_one_revision_before_rendering::{closure#0} as core::ops::function::FnOnce<()>>::call_once
  1061. 45.54 s gammaloop-nextest-docs> note: Some details are omitted, run with `RUST_BACKTRACE=full` for a verbose backtrace.
  1062. 45.54 s gammaloop-nextest-docs>
  1063. 45.54 s gammaloop-nextest-docs> thread 'provenance_tests::each_build_captures_one_revision_before_rendering' (170) panicked at crates/alphal00p-docs-builder/src/provenance_tests.rs:274:9:
  1064. 45.54 s gammaloop-nextest-docs> assertion failed: command.status().unwrap().success()
  1065. 45.54 s gammaloop-nextest-docs> stack backtrace:
  1066. 45.54 s gammaloop-nextest-docs> 0: __rustc::rust_begin_unwind
  1067. 45.54 s gammaloop-nextest-docs> 1: core::panicking::panic_fmt
  1068. 45.54 s gammaloop-nextest-docs> 2: core::panicking::panic
  1069. 45.54 s gammaloop-nextest-docs> 3: alphal00p_docs_builder::provenance_tests::each_build_captures_one_revision_before_rendering
  1070. 45.54 s gammaloop-nextest-docs> 4: <alphal00p_docs_builder::provenance_tests::each_build_captures_one_revision_before_rendering::{closure#0} as core::ops::function::FnOnce<()>>::call_once
  1071. 45.54 s gammaloop-nextest-docs> note: Some details are omitted, run with `RUST_BACKTRACE=full` for a verbose backtrace.
  1072. 45.54 s gammaloop-nextest-docs>
  1073. 45.54 s gammaloop-nextest-docs> 8. alphal00p-docs-builder::tests::site_assets_replace_read_only_generated_files
  1074. 45.54 s gammaloop-nextest-docs> failure: test failure with exit code 101
  1075. 45.54 s gammaloop-nextest-docs> thread 'tests::site_assets_replace_read_only_generated_files' (670) panicked at crates/alphal00p-docs-builder/src/lib.rs:12305:50:
  1076. 45.54 s gammaloop-nextest-docs> called `Result::unwrap()` on an `Err` value: failed to copy documentation asset crates/spynso3/typst/STIXTwoMath-Regular.woff2
  1077. 45.54 s gammaloop-nextest-docs>
  1078. 45.54 s gammaloop-nextest-docs> Caused by:
  1079. 45.54 s gammaloop-nextest-docs> No such file or directory (os error 2)
  1080. 45.54 s gammaloop-nextest-docs>
  1081. 45.54 s gammaloop-nextest-docs> Location:
  1082. 45.54 s gammaloop-nextest-docs> crates/alphal00p-docs-builder/src/lib.rs:2276:18
  1083. 45.54 s gammaloop-nextest-docs> stack backtrace:
  1084. 45.54 s gammaloop-nextest-docs> 0: __rustc::rust_begin_unwind
  1085. 45.54 s gammaloop-nextest-docs> 1: core::panicking::panic_fmt
  1086. 45.54 s gammaloop-nextest-docs> 2: core::result::unwrap_failed
  1087. 45.54 s gammaloop-nextest-docs> 3: alphal00p_docs_builder::tests::site_assets_replace_read_only_generated_files
  1088. 45.54 s gammaloop-nextest-docs> 4: <alphal00p_docs_builder::tests::site_assets_replace_read_only_generated_files::{closure#0} as core::ops::function::FnOnce<()>>::call_once
  1089. 45.54 s gammaloop-nextest-docs> note: Some details are omitted, run with `RUST_BACKTRACE=full` for a verbose backtrace.
  1090. 45.54 s gammaloop-nextest-docs> system-out
  1091. 45.54 s gammaloop-nextest-docs> running 1 test
  1092. 45.54 s gammaloop-nextest-docs> test tests::site_assets_replace_read_only_generated_files ... FAILED
  1093. 45.54 s gammaloop-nextest-docs>
  1094. 45.54 s gammaloop-nextest-docs> failures:
  1095. 45.54 s gammaloop-nextest-docs>
  1096. 45.54 s gammaloop-nextest-docs> failures:
  1097. 45.54 s gammaloop-nextest-docs> tests::site_assets_replace_read_only_generated_files
  1098. 45.54 s gammaloop-nextest-docs>
  1099. 45.54 s gammaloop-nextest-docs> test result: FAILED. 0 passed; 1 failed; 0 ignored; 0 measured; 128 filtered out; finished in 0.01s
  1100. 45.54 s gammaloop-nextest-docs> system-err
  1101. 45.54 s gammaloop-nextest-docs> thread 'tests::site_assets_replace_read_only_generated_files' (670) panicked at crates/alphal00p-docs-builder/src/lib.rs:12305:50:
  1102. 45.54 s gammaloop-nextest-docs> called `Result::unwrap()` on an `Err` value: failed to copy documentation asset crates/spynso3/typst/STIXTwoMath-Regular.woff2
  1103. 45.54 s gammaloop-nextest-docs>
  1104. 45.54 s gammaloop-nextest-docs> Caused by:
  1105. 45.54 s gammaloop-nextest-docs> No such file or directory (os error 2)
  1106. 45.54 s gammaloop-nextest-docs>
  1107. 45.54 s gammaloop-nextest-docs> Location:
  1108. 45.54 s gammaloop-nextest-docs> crates/alphal00p-docs-builder/src/lib.rs:2276:18
  1109. 45.54 s gammaloop-nextest-docs> stack backtrace:
  1110. 45.54 s gammaloop-nextest-docs> 0: __rustc::rust_begin_unwind
  1111. 45.54 s gammaloop-nextest-docs> 1: core::panicking::panic_fmt
  1112. 45.54 s gammaloop-nextest-docs> 2: core::result::unwrap_failed
  1113. 45.54 s gammaloop-nextest-docs> 3: alphal00p_docs_builder::tests::site_assets_replace_read_only_generated_files
  1114. 45.54 s gammaloop-nextest-docs> 4: <alphal00p_docs_builder::tests::site_assets_replace_read_only_generated_files::{closure#0} as core::ops::function::FnOnce<()>>::call_once
  1115. 45.54 s gammaloop-nextest-docs> note: Some details are omitted, run with `RUST_BACKTRACE=full` for a verbose backtrace.
  1116. 45.54 s gammaloop-nextest-docs>
  1117. 45.54 s gammaloop-nextest-docs> 9. alphal00p-docs-builder::tests::developer_scope_ranges_ignore_unrelated_edits_and_warn_only_while_watching
  1118. 45.54 s gammaloop-nextest-docs> failure: test failure with exit code 101
  1119. 45.54 s gammaloop-nextest-docs> thread 'tests::developer_scope_ranges_ignore_unrelated_edits_and_warn_only_while_watching' (287) panicked at crates/alphal00p-docs-builder/src/lib.rs:12350:29:
  1120. 45.54 s gammaloop-nextest-docs> called `Result::unwrap()` on an `Err` value: required documentation source is missing: /build/source/crates/spynso3/typst/STIXTwoMath-Regular.woff2
  1121. 45.54 s gammaloop-nextest-docs>
  1122. 45.54 s gammaloop-nextest-docs> Location:
  1123. 45.54 s gammaloop-nextest-docs> crates/alphal00p-docs-builder/src/lib.rs:5103:9
  1124. 45.54 s gammaloop-nextest-docs> stack backtrace:
  1125. 45.54 s gammaloop-nextest-docs> 0: __rustc::rust_begin_unwind
  1126. 45.54 s gammaloop-nextest-docs> 1: core::panicking::panic_fmt
  1127. 45.54 s gammaloop-nextest-docs> 2: core::result::unwrap_failed
  1128. 45.54 s gammaloop-nextest-docs> 3: alphal00p_docs_builder::tests::developer_scope_ranges_ignore_unrelated_edits_and_warn_only_while_watching
  1129. 45.54 s gammaloop-nextest-docs> 4: <alphal00p_docs_builder::tests::developer_scope_ranges_ignore_unrelated_edits_and_warn_only_while_watching::{closure#0} as core::ops::function::FnOnce<()>>::call_once
  1130. 45.54 s gammaloop-nextest-docs> note: Some details are omitted, run with `RUST_BACKTRACE=full` for a verbose backtrace.
  1131. 45.54 s gammaloop-nextest-docs> system-out
  1132. 45.54 s gammaloop-nextest-docs> running 1 test
  1133. 45.54 s gammaloop-nextest-docs> test tests::developer_scope_ranges_ignore_unrelated_edits_and_warn_only_while_watching ... FAILED
  1134. 45.54 s gammaloop-nextest-docs>
  1135. 45.54 s gammaloop-nextest-docs> failures:
  1136. 45.54 s gammaloop-nextest-docs>
  1137. 45.54 s gammaloop-nextest-docs> failures:
  1138. 45.54 s gammaloop-nextest-docs> tests::developer_scope_ranges_ignore_unrelated_edits_and_warn_only_while_watching
  1139. 45.54 s gammaloop-nextest-docs>
  1140. 45.54 s gammaloop-nextest-docs> test result: FAILED. 0 passed; 1 failed; 0 ignored; 0 measured; 128 filtered out; finished in 0.10s
  1141. 45.54 s gammaloop-nextest-docs> system-err
  1142. 45.54 s gammaloop-nextest-docs> thread 'tests::developer_scope_ranges_ignore_unrelated_edits_and_warn_only_while_watching' (287) panicked at crates/alphal00p-docs-builder/src/lib.rs:12350:29:
  1143. 45.54 s gammaloop-nextest-docs> called `Result::unwrap()` on an `Err` value: required documentation source is missing: /build/source/crates/spynso3/typst/STIXTwoMath-Regular.woff2
  1144. 45.54 s gammaloop-nextest-docs>
  1145. 45.54 s gammaloop-nextest-docs> Location:
  1146. 45.54 s gammaloop-nextest-docs> crates/alphal00p-docs-builder/src/lib.rs:5103:9
  1147. 45.54 s gammaloop-nextest-docs> stack backtrace:
  1148. 45.54 s gammaloop-nextest-docs> 0: __rustc::rust_begin_unwind
  1149. 45.54 s gammaloop-nextest-docs> 1: core::panicking::panic_fmt
  1150. 45.54 s gammaloop-nextest-docs> 2: core::result::unwrap_failed
  1151. 45.54 s gammaloop-nextest-docs> 3: alphal00p_docs_builder::tests::developer_scope_ranges_ignore_unrelated_edits_and_warn_only_while_watching
  1152. 45.54 s gammaloop-nextest-docs> 4: <alphal00p_docs_builder::tests::developer_scope_ranges_ignore_unrelated_edits_and_warn_only_while_watching::{closure#0} as core::ops::function::FnOnce<()>>::call_once
  1153. 45.54 s gammaloop-nextest-docs> note: Some details are omitted, run with `RUST_BACKTRACE=full` for a verbose backtrace.
  1154. 45.54 s gammaloop-nextest-docs>
  1155. 45.54 s gammaloop-nextest-docs> 10. alphal00p-docs-builder::tests::every_product_requires_a_task_chooser_and_each_supported_interface
  1156. 45.54 s gammaloop-nextest-docs> failure: test failure with exit code 101
  1157. 45.54 s gammaloop-nextest-docs> thread 'tests::every_product_requires_a_task_chooser_and_each_supported_interface' (327) panicked at crates/alphal00p-docs-builder/src/lib.rs:12274:9:
  1158. 45.54 s gammaloop-nextest-docs> assertion failed: format!("{error:#}").contains("has no quickstart page")
  1159. 45.54 s gammaloop-nextest-docs> stack backtrace:
  1160. 45.54 s gammaloop-nextest-docs> 0: __rustc::rust_begin_unwind
  1161. 45.54 s gammaloop-nextest-docs> 1: core::panicking::panic_fmt
  1162. 45.54 s gammaloop-nextest-docs> 2: core::panicking::panic
  1163. 45.54 s gammaloop-nextest-docs> 3: alphal00p_docs_builder::tests::every_product_requires_a_task_chooser_and_each_supported_interface
  1164. 45.54 s gammaloop-nextest-docs> 4: <alphal00p_docs_builder::tests::every_product_requires_a_task_chooser_and_each_supported_interface::{closure#0} as core::ops::function::FnOnce<()>>::call_once
  1165. 45.54 s gammaloop-nextest-docs> note: Some details are omitted, run with `RUST_BACKTRACE=full` for a verbose backtrace.
  1166. 45.54 s gammaloop-nextest-docs> system-out
  1167. 45.54 s gammaloop-nextest-docs> running 1 test
  1168. 45.54 s gammaloop-nextest-docs> test tests::every_product_requires_a_task_chooser_and_each_supported_interface ... FAILED
  1169. 45.54 s gammaloop-nextest-docs>
  1170. 45.54 s gammaloop-nextest-docs> failures:
  1171. 45.54 s gammaloop-nextest-docs>
  1172. 45.54 s gammaloop-nextest-docs> failures:
  1173. 45.54 s gammaloop-nextest-docs> tests::every_product_requires_a_task_chooser_and_each_supported_interface
  1174. 45.54 s gammaloop-nextest-docs>
  1175. 45.54 s gammaloop-nextest-docs> test result: FAILED. 0 passed; 1 failed; 0 ignored; 0 measured; 128 filtered out; finished in 0.12s
  1176. 45.54 s gammaloop-nextest-docs> system-err
  1177. 45.54 s gammaloop-nextest-docs> thread 'tests::every_product_requires_a_task_chooser_and_each_supported_interface' (327) panicked at crates/alphal00p-docs-builder/src/lib.rs:12274:9:
  1178. 45.54 s gammaloop-nextest-docs> assertion failed: format!("{error:#}").contains("has no quickstart page")
  1179. 45.54 s gammaloop-nextest-docs> stack backtrace:
  1180. 45.54 s gammaloop-nextest-docs> 0: __rustc::rust_begin_unwind
  1181. 45.54 s gammaloop-nextest-docs> 1: core::panicking::panic_fmt
  1182. 45.54 s gammaloop-nextest-docs> 2: core::panicking::panic
  1183. 45.54 s gammaloop-nextest-docs> 3: alphal00p_docs_builder::tests::every_product_requires_a_task_chooser_and_each_supported_interface
  1184. 45.54 s gammaloop-nextest-docs> 4: <alphal00p_docs_builder::tests::every_product_requires_a_task_chooser_and_each_supported_interface::{closure#0} as core::ops::function::FnOnce<()>>::call_once
  1185. 45.54 s gammaloop-nextest-docs> note: Some details are omitted, run with `RUST_BACKTRACE=full` for a verbose backtrace.
  1186. 45.54 s gammaloop-nextest-docs>
  1187. 45.54 s gammaloop-nextest-docs> 11. alphal00p-docs-builder::tests::pdf_manual_chapter_order_must_match_the_page_registry
  1188. 45.54 s gammaloop-nextest-docs> failure: test failure with exit code 101
  1189. 45.54 s gammaloop-nextest-docs> thread 'tests::pdf_manual_chapter_order_must_match_the_page_registry' (396) panicked at crates/alphal00p-docs-builder/src/lib.rs:12330:9:
  1190. 45.54 s gammaloop-nextest-docs> assertion failed: format!("{error:#}").contains("PDF manual chapter order differs")
  1191. 45.54 s gammaloop-nextest-docs> stack backtrace:
  1192. 45.54 s gammaloop-nextest-docs> 0: __rustc::rust_begin_unwind
  1193. 45.54 s gammaloop-nextest-docs> 1: core::panicking::panic_fmt
  1194. 45.54 s gammaloop-nextest-docs> 2: core::panicking::panic
  1195. 45.54 s gammaloop-nextest-docs> 3: alphal00p_docs_builder::tests::pdf_manual_chapter_order_must_match_the_page_registry
  1196. 45.54 s gammaloop-nextest-docs> 4: <alphal00p_docs_builder::tests::pdf_manual_chapter_order_must_match_the_page_registry::{closure#0} as core::ops::function::FnOnce<()>>::call_once
  1197. 45.54 s gammaloop-nextest-docs> note: Some details are omitted, run with `RUST_BACKTRACE=full` for a verbose backtrace.
  1198. 45.54 s gammaloop-nextest-docs> system-out
  1199. 45.54 s gammaloop-nextest-docs> running 1 test
  1200. 45.54 s gammaloop-nextest-docs> test tests::pdf_manual_chapter_order_must_match_the_page_registry ... FAILED
  1201. 45.54 s gammaloop-nextest-docs>
  1202. 45.54 s gammaloop-nextest-docs> failures:
  1203. 45.54 s gammaloop-nextest-docs>
  1204. 45.54 s gammaloop-nextest-docs> failures:
  1205. 45.54 s gammaloop-nextest-docs> tests::pdf_manual_chapter_order_must_match_the_page_registry
  1206. 45.54 s gammaloop-nextest-docs>
  1207. 45.54 s gammaloop-nextest-docs> test result: FAILED. 0 passed; 1 failed; 0 ignored; 0 measured; 128 filtered out; finished in 0.11s
  1208. 45.54 s gammaloop-nextest-docs> system-err
  1209. 45.54 s gammaloop-nextest-docs> thread 'tests::pdf_manual_chapter_order_must_match_the_page_registry' (396) panicked at crates/alphal00p-docs-builder/src/lib.rs:12330:9:
  1210. 45.54 s gammaloop-nextest-docs> assertion failed: format!("{error:#}").contains("PDF manual chapter order differs")
  1211. 45.54 s gammaloop-nextest-docs> stack backtrace:
  1212. 45.54 s gammaloop-nextest-docs> 0: __rustc::rust_begin_unwind
  1213. 45.54 s gammaloop-nextest-docs> 1: core::panicking::panic_fmt
  1214. 45.54 s gammaloop-nextest-docs> 2: core::panicking::panic
  1215. 45.54 s gammaloop-nextest-docs> 3: alphal00p_docs_builder::tests::pdf_manual_chapter_order_must_match_the_page_registry
  1216. 45.54 s gammaloop-nextest-docs> 4: <alphal00p_docs_builder::tests::pdf_manual_chapter_order_must_match_the_page_registry::{closure#0} as core::ops::function::FnOnce<()>>::call_once
  1217. 45.54 s gammaloop-nextest-docs> note: Some details are omitted, run with `RUST_BACKTRACE=full` for a verbose backtrace.
  1218. 45.54 s gammaloop-nextest-docs> =========================================
  1219. 45.55 s gammaloop-nextest-docs> Extracting 2 binaries to /build/source
  1220. 45.58 s gammaloop-nextest-docs> Extracted 5 files to /build/source in 0.03s
  1221. 45.59 s gammaloop-nextest-docs> ------------
  1222. 45.59 s gammaloop-nextest-docs> Nextest run ID 24e191ac-d1d6-4525-a290-5ce6f5184db9 with nextest profile: ci_gammaloop
  1223. 45.59 s gammaloop-nextest-docs> Starting 22 tests across 2 binaries
  1224. 45.61 s gammaloop-nextest-docs> ------------
  1225. 45.61 s gammaloop-nextest-docs> Summary [ 0.018s] 22 tests run: 22 passed, 0 skipped
  1226. 45.64 s gammaloop-nextest-docs>
  1227. 45.64 s gammaloop-nextest-docs> ========== nextest test summary ==========
  1228. 45.64 s gammaloop-nextest-docs> report: target/nextest/ci_gammaloop/junit.xml
  1229. 45.64 s gammaloop-nextest-docs> tests: 22, failures: 0, errors: 0
  1230. 45.64 s gammaloop-nextest-docs> No failing testcases found.
  1231. 45.64 s gammaloop-nextest-docs> =========================================
  1232. 45.65 s gammaloop-nextest-docs> Extracting 3 binaries (including 2 non-test binaries), 1 build script output directory, and 2 linked paths to /build/source
  1233. 45.88 s gammaloop-nextest-docs> Extracted 22 files to /build/source in 0.23s
  1234. 45.88 s gammaloop-nextest-docs> ------------
  1235. 45.88 s gammaloop-nextest-docs> Nextest run ID fcb6b418-f25c-4bf7-8e1c-fbd57dfa5fb6 with nextest profile: ci_gammaloop
  1236. 45.88 s gammaloop-nextest-docs> Starting 89 tests across 1 binary
  1237. 45.92 s gammaloop-nextest-docs> ------------
  1238. 45.92 s gammaloop-nextest-docs> Summary [ 0.041s] 89 tests run: 89 passed, 0 skipped
  1239. 45.96 s gammaloop-nextest-docs>
  1240. 45.96 s gammaloop-nextest-docs> ========== nextest test summary ==========
  1241. 45.96 s gammaloop-nextest-docs> report: target/nextest/ci_gammaloop/junit.xml
  1242. 45.96 s gammaloop-nextest-docs> tests: 89, failures: 0, errors: 0
  1243. 45.96 s gammaloop-nextest-docs> No failing testcases found.
  1244. 45.96 s gammaloop-nextest-docs> =========================================
  1245. 45.97 s gammaloop-nextest-docs> Extracting 2 binaries to /build/source
  1246. 46.00 s gammaloop-nextest-docs> Extracted 5 files to /build/source in 0.04s
  1247. 46.01 s gammaloop-nextest-docs> ------------
  1248. 46.01 s gammaloop-nextest-docs> Nextest run ID cc8a25c9-e414-4efd-8b79-788c082f5116 with nextest profile: ci_gammaloop
  1249. 46.01 s gammaloop-nextest-docs> Starting 10 tests across 2 binaries
  1250. 57.11 s gammaloop-nextest-docs> ------------
  1251. 57.11 s gammaloop-nextest-docs> Summary [ 11.100s] 10 tests run: 10 passed, 0 skipped
  1252. 57.14 s gammaloop-nextest-docs>
  1253. 57.14 s gammaloop-nextest-docs> ========== nextest test summary ==========
  1254. 57.14 s gammaloop-nextest-docs> report: target/nextest/ci_gammaloop/junit.xml
  1255. 57.14 s gammaloop-nextest-docs> tests: 10, failures: 0, errors: 0
  1256. 57.14 s gammaloop-nextest-docs> No failing testcases found.
  1257. 57.14 s gammaloop-nextest-docs> =========================================
  1258. 57.15 s gammaloop-nextest-docs> Extracting 1 binary to /build/source
  1259. 57.18 s gammaloop-nextest-docs> Extracted 4 files to /build/source in 0.03s
  1260. 57.19 s gammaloop-nextest-docs> ------------
  1261. 57.19 s gammaloop-nextest-docs> Nextest run ID 697effbe-8f91-49cb-a1a8-e8b9de70dca3 with nextest profile: ci_gammaloop
  1262. 57.19 s gammaloop-nextest-docs> Starting 0 tests across 1 binary
  1263. 57.19 s gammaloop-nextest-docs> ------------
  1264. 57.19 s gammaloop-nextest-docs> Summary [ 0.000s] 0 tests run: 0 passed, 0 skipped
  1265. 57.21 s gammaloop-nextest-docs>
  1266. 57.21 s gammaloop-nextest-docs> ========== nextest test summary ==========
  1267. 57.21 s gammaloop-nextest-docs> report: target/nextest/ci_gammaloop/junit.xml
  1268. 57.21 s gammaloop-nextest-docs> tests: 0, failures: 0, errors: 0
  1269. 57.21 s gammaloop-nextest-docs> No failing testcases found.
  1270. 57.21 s gammaloop-nextest-docs> =========================================
  1271. 57.22 s gammaloop-nextest-docs> Extracting 1 binary to /build/source
  1272. 57.25 s gammaloop-nextest-docs> Extracted 4 files to /build/source in 0.03s
  1273. 57.26 s gammaloop-nextest-docs> ------------
  1274. 57.26 s gammaloop-nextest-docs> Nextest run ID b47940d8-20d1-4c44-92b6-b4203ed58244 with nextest profile: ci_gammaloop
  1275. 57.26 s gammaloop-nextest-docs> Starting 5 tests across 1 binary
  1276. 57.26 s gammaloop-nextest-docs> ------------
  1277. 57.26 s gammaloop-nextest-docs> Summary [ 0.004s] 5 tests run: 5 passed, 0 skipped
  1278. 57.29 s gammaloop-nextest-docs>
  1279. 57.29 s gammaloop-nextest-docs> ========== nextest test summary ==========
  1280. 57.29 s gammaloop-nextest-docs> report: target/nextest/ci_gammaloop/junit.xml
  1281. 57.29 s gammaloop-nextest-docs> tests: 5, failures: 0, errors: 0
  1282. 57.29 s gammaloop-nextest-docs> No failing testcases found.
  1283. 57.29 s gammaloop-nextest-docs> =========================================
  1284. 57.46 s error: Cannot build '/nix/store/lss98va6a34sawhfmb9hflr4awgmkih4-gammaloop-nextest-docs.drv'.
  1285. 57.46 s Reason: builder failed with exit code 100.
  1286. 57.46 s Output paths:
  1287. 57.46 s /nix/store/926njs5va6m12lpp63iqc0d8pab03bw0-gammaloop-nextest-docs
  1288. 57.46 s Last 1232 log lines:
  1289. 57.46 s > Extracting 2 binaries to /build/source
  1290. 57.46 s > Extracted 5 files to /build/source in 0.04s
  1291. 57.46 s > ------------
  1292. 57.46 s > Nextest run ID ea85f89a-f04e-473d-b29a-2b8cc1718ccd with nextest profile: ci_gammaloop
  1293. 57.46 s > Starting 129 tests across 2 binaries
  1294. 57.46 s > FAIL [ 0.014s] ( 26/129) alphal00p-docs-builder tests::developer_architecture_is_classified_searchable_and_source_backed
  1295. 57.46 s > stdout ---
  1296. 57.46 s >
  1297. 57.46 s > running 1 test
  1298. 57.46 s > test tests::developer_architecture_is_classified_searchable_and_source_backed ... FAILED
  1299. 57.46 s >
  1300. 57.46 s > failures:
  1301. 57.46 s >
  1302. 57.46 s > failures:
  1303. 57.46 s > tests::developer_architecture_is_classified_searchable_and_source_backed
  1304. 57.46 s >
  1305. 57.46 s > test result: FAILED. 0 passed; 1 failed; 0 ignored; 0 measured; 128 filtered out; finished in 0.01s
  1306. 57.46 s >
  1307. 57.46 s > stderr ---
  1308. 57.46 s >
  1309. 57.46 s > thread 'tests::developer_architecture_is_classified_searchable_and_source_backed' (289) panicked at crates/alphal00p-docs-builder/src/lib.rs:12751:14:
  1310. 57.46 s > called `Result::unwrap()` on an `Err` value: failed to copy documentation asset crates/spynso3/typst/STIXTwoMath-Regular.woff2
  1311. 57.46 s >
  1312. 57.46 s > Caused by:
  1313. 57.46 s > No such file or directory (os error 2)
  1314. 57.46 s >
  1315. 57.46 s > Location:
  1316. 57.46 s > crates/alphal00p-docs-builder/src/lib.rs:2276:18
  1317. 57.46 s > stack backtrace:
  1318. 57.46 s > 0: __rustc::rust_begin_unwind
  1319. 57.46 s > 1: core::panicking::panic_fmt
  1320. 57.46 s > 2: core::result::unwrap_failed
  1321. 57.46 s > 3: alphal00p_docs_builder::tests::developer_architecture_is_classified_searchable_and_source_backed
  1322. 57.46 s > 4: <alphal00p_docs_builder::tests::developer_architecture_is_classified_searchable_and_source_backed::{closure#0} as core::ops::function::FnOnce<()>>::call_once
  1323. 57.46 s > note: Some details are omitted, run with `RUST_BACKTRACE=full` for a verbose backtrace.
  1324. 57.46 s >
  1325. 57.46 s > FAIL [ 0.008s] ( 28/129) alphal00p-docs-builder tests::every_product_orients_rust_to_native_rustdoc_and_keeps_legacy_redirects
  1326. 57.46 s > stdout ---
  1327. 57.46 s >
  1328. 57.46 s > running 1 test
  1329. 57.46 s > test tests::every_product_orients_rust_to_native_rustdoc_and_keeps_legacy_redirects ... FAILED
  1330. 57.46 s >
  1331. 57.46 s > failures:
  1332. 57.46 s >
  1333. 57.46 s > failures:
  1334. 57.46 s > tests::every_product_orients_rust_to_native_rustdoc_and_keeps_legacy_redirects
  1335. 57.46 s >
  1336. 57.46 s > test result: FAILED. 0 passed; 1 failed; 0 ignored; 0 measured; 128 filtered out; finished in 0.00s
  1337. 57.46 s >
  1338. 57.46 s > stderr ---
  1339. 57.46 s >
  1340. 57.46 s > thread 'tests::every_product_orients_rust_to_native_rustdoc_and_keeps_legacy_redirects' (309) panicked at crates/alphal00p-docs-builder/src/lib.rs:12555:46:
  1341. 57.46 s > called `Result::unwrap()` on an `Err` value: failed to copy documentation asset crates/spynso3/typst/STIXTwoMath-Regular.woff2
  1342. 57.46 s >
  1343. 57.46 s > Caused by:
  1344. 57.46 s > No such file or directory (os error 2)
  1345. 57.46 s >
  1346. 57.46 s > Location:
  1347. 57.46 s > crates/alphal00p-docs-builder/src/lib.rs:2276:18
  1348. 57.46 s > stack backtrace:
  1349. 57.46 s > 0: __rustc::rust_begin_unwind
  1350. 57.46 s > 1: core::panicking::panic_fmt
  1351. 57.46 s > 2: core::result::unwrap_failed
  1352. 57.46 s > 3: alphal00p_docs_builder::tests::every_product_orients_rust_to_native_rustdoc_and_keeps_legacy_redirects
  1353. 57.46 s > 4: <alphal00p_docs_builder::tests::every_product_orients_rust_to_native_rustdoc_and_keeps_legacy_redirects::{closure#0} as core::ops::function::FnOnce<()>>::call_once
  1354. 57.46 s > note: Some details are omitted, run with `RUST_BACKTRACE=full` for a verbose backtrace.
  1355. 57.46 s >
  1356. 57.46 s > FAIL [ 0.011s] ( 54/129) alphal00p-docs-builder tests::portal_emits_routes_and_valid_assets
  1357. 57.46 s > stdout ---
  1358. 57.46 s >
  1359. 57.46 s > running 1 test
  1360. 57.46 s > test tests::portal_emits_routes_and_valid_assets ... FAILED
  1361. 57.46 s >
  1362. 57.46 s > failures:
  1363. 57.46 s >
  1364. 57.46 s > failures:
  1365. 57.46 s > tests::portal_emits_routes_and_valid_assets
  1366. 57.46 s >
  1367. 57.46 s > test result: FAILED. 0 passed; 1 failed; 0 ignored; 0 measured; 128 filtered out; finished in 0.01s
  1368. 57.46 s >
  1369. 57.46 s > stderr ---
  1370. 57.46 s >
  1371. 57.46 s > thread 'tests::portal_emits_routes_and_valid_assets' (424) panicked at crates/alphal00p-docs-builder/src/lib.rs:9684:14:
  1372. 57.46 s > called `Result::unwrap()` on an `Err` value: failed to copy documentation asset crates/spynso3/typst/STIXTwoMath-Regular.woff2
  1373. 57.46 s >
  1374. 57.46 s > Caused by:
  1375. 57.46 s > No such file or directory (os error 2)
  1376. 57.46 s >
  1377. 57.46 s > Location:
  1378. 57.46 s > crates/alphal00p-docs-builder/src/lib.rs:2276:18
  1379. 57.46 s > stack backtrace:
  1380. 57.46 s > 0: __rustc::rust_begin_unwind
  1381. 57.46 s > 1: core::panicking::panic_fmt
  1382. 57.46 s > 2: core::result::unwrap_failed
  1383. 57.46 s > 3: alphal00p_docs_builder::tests::write_test_portal
  1384. 57.46 s > 4: alphal00p_docs_builder::tests::portal_emits_routes_and_valid_assets
  1385. 57.46 s > 5: <alphal00p_docs_builder::tests::portal_emits_routes_and_valid_assets::{closure#0} as core::ops::function::FnOnce<()>>::call_once
  1386. 57.46 s > note: Some details are omitted, run with `RUST_BACKTRACE=full` for a verbose backtrace.
  1387. 57.46 s >
  1388. 57.46 s > FAIL [ 0.010s] ( 55/129) alphal00p-docs-builder tests::portal_task_chooser_routes_each_goal_to_the_registered_quickstart
  1389. 57.46 s > stdout ---
  1390. 57.46 s >
  1391. 57.46 s > running 1 test
  1392. 57.46 s > test tests::portal_task_chooser_routes_each_goal_to_the_registered_quickstart ... FAILED
  1393. 57.46 s >
  1394. 57.46 s > failures:
  1395. 57.46 s >
  1396. 57.46 s > failures:
  1397. 57.46 s > tests::portal_task_chooser_routes_each_goal_to_the_registered_quickstart
  1398. 57.46 s >
  1399. 57.46 s > test result: FAILED. 0 passed; 1 failed; 0 ignored; 0 measured; 128 filtered out; finished in 0.00s
  1400. 57.46 s >
  1401. 57.46 s > stderr ---
  1402. 57.46 s >
  1403. 57.46 s > thread 'tests::portal_task_chooser_routes_each_goal_to_the_registered_quickstart' (431) panicked at crates/alphal00p-docs-builder/src/lib.rs:9684:14:
  1404. 57.46 s > called `Result::unwrap()` on an `Err` value: failed to copy documentation asset crates/spynso3/typst/STIXTwoMath-Regular.woff2
  1405. 57.46 s >
  1406. 57.46 s > Caused by:
  1407. 57.46 s > No such file or directory (os error 2)
  1408. 57.46 s >
  1409. 57.46 s > Location:
  1410. 57.46 s > crates/alphal00p-docs-builder/src/lib.rs:2276:18
  1411. 57.46 s > stack backtrace:
  1412. 57.46 s > 0: __rustc::rust_begin_unwind
  1413. 57.46 s > 1: core::panicking::panic_fmt
  1414. 57.46 s > 2: core::result::unwrap_failed
  1415. 57.46 s > 3: alphal00p_docs_builder::tests::write_test_portal
  1416. 57.46 s > 4: alphal00p_docs_builder::tests::portal_task_chooser_routes_each_goal_to_the_registered_quickstart
  1417. 57.46 s > 5: <alphal00p_docs_builder::tests::portal_task_chooser_routes_each_goal_to_the_registered_quickstart::{closure#0} as core::ops::function::FnOnce<()>>::call_once
  1418. 57.46 s > note: Some details are omitted, run with `RUST_BACKTRACE=full` for a verbose backtrace.
  1419. 57.46 s >
  1420. 57.46 s > FAIL [ 0.012s] ( 56/129) alphal00p-docs-builder tests::portal_and_developer_pages_use_federated_search_and_feedback
  1421. 57.46 s > stdout ---
  1422. 57.46 s >
  1423. 57.46 s > running 1 test
  1424. 57.46 s > test tests::portal_and_developer_pages_use_federated_search_and_feedback ... FAILED
  1425. 57.46 s >
  1426. 57.46 s > failures:
  1427. 57.46 s >
  1428. 57.46 s > failures:
  1429. 57.46 s > tests::portal_and_developer_pages_use_federated_search_and_feedback
  1430. 57.46 s >
  1431. 57.46 s > test result: FAILED. 0 passed; 1 failed; 0 ignored; 0 measured; 128 filtered out; finished in 0.01s
  1432. 57.46 s >
  1433. 57.46 s > stderr ---
  1434. 57.46 s >
  1435. 57.46 s > thread 'tests::portal_and_developer_pages_use_federated_search_and_feedback' (425) panicked at crates/alphal00p-docs-builder/src/lib.rs:9684:14:
  1436. 57.46 s > called `Result::unwrap()` on an `Err` value: failed to copy documentation asset crates/spynso3/typst/STIXTwoMath-Regular.woff2
  1437. 57.46 s >
  1438. 57.46 s > Caused by:
  1439. 57.46 s > No such file or directory (os error 2)
  1440. 57.46 s >
  1441. 57.46 s > Location:
  1442. 57.46 s > crates/alphal00p-docs-builder/src/lib.rs:2276:18
  1443. 57.46 s > stack backtrace:
  1444. 57.46 s > 0: __rustc::rust_begin_unwind
  1445. 57.46 s > 1: core::panicking::panic_fmt
  1446. 57.46 s > 2: core::result::unwrap_failed
  1447. 57.46 s > 3: alphal00p_docs_builder::tests::write_test_portal
  1448. 57.46 s > 4: alphal00p_docs_builder::tests::portal_and_developer_pages_use_federated_search_and_feedback
  1449. 57.46 s > 5: <alphal00p_docs_builder::tests::portal_and_developer_pages_use_federated_search_and_feedback::{closure#0} as core::ops::function::FnOnce<()>>::call_once
  1450. 57.46 s > note: Some details are omitted, run with `RUST_BACKTRACE=full` for a verbose backtrace.
  1451. 57.46 s >
  1452. 57.46 s > FAIL [ 0.118s] ( 86/129) alphal00p-docs-builder tests::checked_in_registry_is_valid
  1453. 57.46 s > stdout ---
  1454. 57.46 s >
  1455. 57.46 s > running 1 test
  1456. 57.46 s > test tests::checked_in_registry_is_valid ... FAILED
  1457. 57.46 s >
  1458. 57.46 s > failures:
  1459. 57.46 s >
  1460. 57.46 s > failures:
  1461. 57.46 s > tests::checked_in_registry_is_valid
  1462. 57.46 s >
  1463. 57.46 s > test result: FAILED. 0 passed; 1 failed; 0 ignored; 0 measured; 128 filtered out; finished in 0.11s
  1464. 57.46 s >
  1465. 57.46 s > stderr ---
  1466. 57.46 s >
  1467. 57.46 s > thread 'tests::checked_in_registry_is_valid' (187) panicked at crates/alphal00p-docs-builder/src/lib.rs:12260:50:
  1468. 57.46 s > called `Result::unwrap()` on an `Err` value: required documentation source is missing: /build/source/crates/spynso3/typst/STIXTwoMath-Regular.woff2
  1469. 57.46 s >
  1470. 57.46 s > Location:
  1471. 57.46 s > crates/alphal00p-docs-builder/src/lib.rs:5103:9
  1472. 57.46 s > stack backtrace:
  1473. 57.46 s > 0: __rustc::rust_begin_unwind
  1474. 57.46 s > 1: core::panicking::panic_fmt
  1475. 57.46 s > 2: core::result::unwrap_failed
  1476. 57.46 s > 3: alphal00p_docs_builder::tests::checked_in_registry_is_valid
  1477. 57.46 s > 4: <alphal00p_docs_builder::tests::checked_in_registry_is_valid::{closure#0} as core::ops::function::FnOnce<()>>::call_once
  1478. 57.46 s > note: Some details are omitted, run with `RUST_BACKTRACE=full` for a verbose backtrace.
  1479. 57.46 s >
  1480. 57.46 s > FAIL [ 0.119s] ( 88/129) alphal00p-docs-builder provenance_tests::each_build_captures_one_revision_before_rendering
  1481. 57.46 s > stdout ---
  1482. 57.46 s >
  1483. 57.46 s > running 1 test
  1484. 57.46 s >
  1485. 57.46 s > running 1 test
  1486. 57.46 s > test provenance_tests::each_build_captures_one_revision_before_rendering ... FAILED
  1487. 57.46 s >
  1488. 57.46 s > failures:
  1489. 57.46 s >
  1490. 57.46 s > failures:
  1491. 57.46 s > provenance_tests::each_build_captures_one_revision_before_rendering
  1492. 57.46 s >
  1493. 57.46 s > test result: FAILED. 0 passed; 1 failed; 0 ignored; 0 measured; 128 filtered out; finished in 0.10s
  1494. 57.46 s >
  1495. 57.46 s > test provenance_tests::each_build_captures_one_revision_before_rendering ... FAILED
  1496. 57.46 s >
  1497. 57.46 s > failures:
  1498. 57.46 s >
  1499. 57.46 s > failures:
  1500. 57.46 s > provenance_tests::each_build_captures_one_revision_before_rendering
  1501. 57.46 s >
  1502. 57.46 s > test result: FAILED. 0 passed; 1 failed; 0 ignored; 0 measured; 128 filtered out; finished in 0.11s
  1503. 57.46 s >
  1504. 57.46 s > stderr ---
  1505. 57.46 s >
  1506. 57.46 s > thread 'provenance_tests::each_build_captures_one_revision_before_rendering' (253) panicked at crates/alphal00p-docs-builder/src/provenance_tests.rs:297:14:
  1507. 57.46 s > called `Result::unwrap()` on an `Err` value: required documentation source is missing: /build/source/target/nix-ci-tmp/.tmpuiqmMo/checkout/crates/spynso3/typst/STIXTwoMath-Regular.woff2
  1508. 57.46 s >
  1509. 57.46 s > Location:
  1510. 57.46 s > crates/alphal00p-docs-builder/src/lib.rs:5103:9
  1511. 57.46 s > stack backtrace:
  1512. 57.46 s > 0: __rustc::rust_begin_unwind
  1513. 57.46 s > 1: core::panicking::panic_fmt
  1514. 57.46 s > 2: core::result::unwrap_failed
  1515. 57.46 s > 3: alphal00p_docs_builder::provenance_tests::each_build_captures_one_revision_before_rendering
  1516. 57.46 s > 4: <alphal00p_docs_builder::provenance_tests::each_build_captures_one_revision_before_rendering::{closure#0} as core::ops::function::FnOnce<()>>::call_once
  1517. 57.46 s > note: Some details are omitted, run with `RUST_BACKTRACE=full` for a verbose backtrace.
  1518. 57.46 s >
  1519. 57.46 s > thread 'provenance_tests::each_build_captures_one_revision_before_rendering' (170) panicked at crates/alphal00p-docs-builder/src/provenance_tests.rs:274:9:
  1520. 57.46 s > assertion failed: command.status().unwrap().success()
  1521. 57.46 s > stack backtrace:
  1522. 57.46 s > 0: __rustc::rust_begin_unwind
  1523. 57.46 s > 1: core::panicking::panic_fmt
  1524. 57.46 s > 2: core::panicking::panic
  1525. 57.46 s > 3: alphal00p_docs_builder::provenance_tests::each_build_captures_one_revision_before_rendering
  1526. 57.46 s > 4: <alphal00p_docs_builder::provenance_tests::each_build_captures_one_revision_before_rendering::{closure#0} as core::ops::function::FnOnce<()>>::call_once
  1527. 57.46 s > note: Some details are omitted, run with `RUST_BACKTRACE=full` for a verbose backtrace.
  1528. 57.46 s >
  1529. 57.46 s > FAIL [ 0.010s] ( 89/129) alphal00p-docs-builder tests::site_assets_replace_read_only_generated_files
  1530. 57.46 s > stdout ---
  1531. 57.46 s >
  1532. 57.46 s > running 1 test
  1533. 57.46 s > test tests::site_assets_replace_read_only_generated_files ... FAILED
  1534. 57.46 s >
  1535. 57.46 s > failures:
  1536. 57.46 s >
  1537. 57.46 s > failures:
  1538. 57.46 s > tests::site_assets_replace_read_only_generated_files
  1539. 57.46 s >
  1540. 57.46 s > test result: FAILED. 0 passed; 1 failed; 0 ignored; 0 measured; 128 filtered out; finished in 0.01s
  1541. 57.46 s >
  1542. 57.46 s > stderr ---
  1543. 57.46 s >
  1544. 57.46 s > thread 'tests::site_assets_replace_read_only_generated_files' (670) panicked at crates/alphal00p-docs-builder/src/lib.rs:12305:50:
  1545. 57.46 s > called `Result::unwrap()` on an `Err` value: failed to copy documentation asset crates/spynso3/typst/STIXTwoMath-Regular.woff2
  1546. 57.46 s >
  1547. 57.46 s > Caused by:
  1548. 57.46 s > No such file or directory (os error 2)
  1549. 57.46 s >
  1550. 57.46 s > Location:
  1551. 57.46 s > crates/alphal00p-docs-builder/src/lib.rs:2276:18
  1552. 57.46 s > stack backtrace:
  1553. 57.46 s > 0: __rustc::rust_begin_unwind
  1554. 57.46 s > 1: core::panicking::panic_fmt
  1555. 57.46 s > 2: core::result::unwrap_failed
  1556. 57.46 s > 3: alphal00p_docs_builder::tests::site_assets_replace_read_only_generated_files
  1557. 57.46 s > 4: <alphal00p_docs_builder::tests::site_assets_replace_read_only_generated_files::{closure#0} as core::ops::function::FnOnce<()>>::call_once
  1558. 57.46 s > note: Some details are omitted, run with `RUST_BACKTRACE=full` for a verbose backtrace.
  1559. 57.46 s >
  1560. 57.46 s > FAIL [ 0.108s] ( 90/129) alphal00p-docs-builder tests::developer_scope_ranges_ignore_unrelated_edits_and_warn_only_while_watching
  1561. 57.46 s > stdout ---
  1562. 57.46 s >
  1563. 57.46 s > running 1 test
  1564. 57.46 s > test tests::developer_scope_ranges_ignore_unrelated_edits_and_warn_only_while_watching ... FAILED
  1565. 57.46 s >
  1566. 57.46 s > failures:
  1567. 57.46 s >
  1568. 57.46 s > failures:
  1569. 57.46 s > tests::developer_scope_ranges_ignore_unrelated_edits_and_warn_only_while_watching
  1570. 57.46 s >
  1571. 57.46 s > test result: FAILED. 0 passed; 1 failed; 0 ignored; 0 measured; 128 filtered out; finished in 0.10s
  1572. 57.46 s >
  1573. 57.46 s > stderr ---
  1574. 57.46 s >
  1575. 57.46 s > thread 'tests::developer_scope_ranges_ignore_unrelated_edits_and_warn_only_while_watching' (287) panicked at crates/alphal00p-docs-builder/src/lib.rs:12350:29:
  1576. 57.46 s > called `Result::unwrap()` on an `Err` value: required documentation source is missing: /build/source/crates/spynso3/typst/STIXTwoMath-Regular.woff2
  1577. 57.46 s >
  1578. 57.46 s > Location:
  1579. 57.46 s > crates/alphal00p-docs-builder/src/lib.rs:5103:9
  1580. 57.46 s > stack backtrace:
  1581. 57.46 s > 0: __rustc::rust_begin_unwind
  1582. 57.46 s > 1: core::panicking::panic_fmt
  1583. 57.46 s > 2: core::result::unwrap_failed
  1584. 57.46 s > 3: alphal00p_docs_builder::tests::developer_scope_ranges_ignore_unrelated_edits_and_warn_only_while_watching
  1585. 57.46 s > 4: <alphal00p_docs_builder::tests::developer_scope_ranges_ignore_unrelated_edits_and_warn_only_while_watching::{closure#0} as core::ops::function::FnOnce<()>>::call_once
  1586. 57.46 s > note: Some details are omitted, run with `RUST_BACKTRACE=full` for a verbose backtrace.
  1587. 57.46 s >
  1588. 57.46 s > FAIL [ 0.127s] (121/129) alphal00p-docs-builder tests::every_product_requires_a_task_chooser_and_each_supported_interface
  1589. 57.46 s > stdout ---
  1590. 57.46 s >
  1591. 57.46 s > running 1 test
  1592. 57.46 s > test tests::every_product_requires_a_task_chooser_and_each_supported_interface ... FAILED
  1593. 57.46 s >
  1594. 57.46 s > failures:
  1595. 57.46 s >
  1596. 57.46 s > failures:
  1597. 57.46 s > tests::every_product_requires_a_task_chooser_and_each_supported_interface
  1598. 57.46 s >
  1599. 57.46 s > test result: FAILED. 0 passed; 1 failed; 0 ignored; 0 measured; 128 filtered out; finished in 0.12s
  1600. 57.46 s >
  1601. 57.46 s > stderr ---
  1602. 57.46 s >
  1603. 57.46 s > thread 'tests::every_product_requires_a_task_chooser_and_each_supported_interface' (327) panicked at crates/alphal00p-docs-builder/src/lib.rs:12274:9:
  1604. 57.46 s > assertion failed: format!("{error:#}").contains("has no quickstart page")
  1605. 57.46 s > stack backtrace:
  1606. 57.46 s > 0: __rustc::rust_begin_unwind
  1607. 57.46 s > 1: core::panicking::panic_fmt
  1608. 57.46 s > 2: core::panicking::panic
  1609. 57.46 s > 3: alphal00p_docs_builder::tests::every_product_requires_a_task_chooser_and_each_supported_interface
  1610. 57.46 s > 4: <alphal00p_docs_builder::tests::every_product_requires_a_task_chooser_and_each_supported_interface::{closure#0} as core::ops::function::FnOnce<()>>::call_once
  1611. 57.46 s > note: Some details are omitted, run with `RUST_BACKTRACE=full` for a verbose backtrace.
  1612. 57.46 s >
  1613. 57.46 s > FAIL [ 0.111s] (122/129) alphal00p-docs-builder tests::pdf_manual_chapter_order_must_match_the_page_registry
  1614. 57.46 s > stdout ---
  1615. 57.46 s >
  1616. 57.46 s > running 1 test
  1617. 57.46 s > test tests::pdf_manual_chapter_order_must_match_the_page_registry ... FAILED
  1618. 57.46 s >
  1619. 57.46 s > failures:
  1620. 57.46 s >
  1621. 57.46 s > failures:
  1622. 57.46 s > tests::pdf_manual_chapter_order_must_match_the_page_registry
  1623. 57.46 s >
  1624. 57.46 s > test result: FAILED. 0 passed; 1 failed; 0 ignored; 0 measured; 128 filtered out; finished in 0.11s
  1625. 57.46 s >
  1626. 57.46 s > stderr ---
  1627. 57.46 s >
  1628. 57.46 s > thread 'tests::pdf_manual_chapter_order_must_match_the_page_registry' (396) panicked at crates/alphal00p-docs-builder/src/lib.rs:12330:9:
  1629. 57.46 s > assertion failed: format!("{error:#}").contains("PDF manual chapter order differs")
  1630. 57.46 s > stack backtrace:
  1631. 57.46 s > 0: __rustc::rust_begin_unwind
  1632. 57.46 s > 1: core::panicking::panic_fmt
  1633. 57.46 s > 2: core::panicking::panic
  1634. 57.46 s > 3: alphal00p_docs_builder::tests::pdf_manual_chapter_order_must_match_the_page_registry
  1635. 57.46 s > 4: <alphal00p_docs_builder::tests::pdf_manual_chapter_order_must_match_the_page_registry::{closure#0} as core::ops::function::FnOnce<()>>::call_once
  1636. 57.46 s > note: Some details are omitted, run with `RUST_BACKTRACE=full` for a verbose backtrace.
  1637. 57.46 s >
  1638. 57.46 s > ------------
  1639. 57.46 s > Summary [ 10.186s] 129 tests run: 118 passed, 11 failed, 0 skipped
  1640. 57.46 s > FAIL [ 0.014s] ( 26/129) alphal00p-docs-builder tests::developer_architecture_is_classified_searchable_and_source_backed
  1641. 57.46 s > stdout ---
  1642. 57.46 s >
  1643. 57.46 s > running 1 test
  1644. 57.46 s > test tests::developer_architecture_is_classified_searchable_and_source_backed ... FAILED
  1645. 57.46 s >
  1646. 57.46 s > failures:
  1647. 57.46 s >
  1648. 57.46 s > failures:
  1649. 57.46 s > tests::developer_architecture_is_classified_searchable_and_source_backed
  1650. 57.46 s >
  1651. 57.46 s > test result: FAILED. 0 passed; 1 failed; 0 ignored; 0 measured; 128 filtered out; finished in 0.01s
  1652. 57.46 s >
  1653. 57.46 s > stderr ---
  1654. 57.46 s >
  1655. 57.46 s > thread 'tests::developer_architecture_is_classified_searchable_and_source_backed' (289) panicked at crates/alphal00p-docs-builder/src/lib.rs:12751:14:
  1656. 57.46 s > called `Result::unwrap()` on an `Err` value: failed to copy documentation asset crates/spynso3/typst/STIXTwoMath-Regular.woff2
  1657. 57.46 s >
  1658. 57.46 s > Caused by:
  1659. 57.46 s > No such file or directory (os error 2)
  1660. 57.46 s >
  1661. 57.46 s > Location:
  1662. 57.46 s > crates/alphal00p-docs-builder/src/lib.rs:2276:18
  1663. 57.46 s > stack backtrace:
  1664. 57.46 s > 0: __rustc::rust_begin_unwind
  1665. 57.46 s > 1: core::panicking::panic_fmt
  1666. 57.46 s > 2: core::result::unwrap_failed
  1667. 57.46 s > 3: alphal00p_docs_builder::tests::developer_architecture_is_classified_searchable_and_source_backed
  1668. 57.46 s > 4: <alphal00p_docs_builder::tests::developer_architecture_is_classified_searchable_and_source_backed::{closure#0} as core::ops::function::FnOnce<()>>::call_once
  1669. 57.46 s > note: Some details are omitted, run with `RUST_BACKTRACE=full` for a verbose backtrace.
  1670. 57.46 s >
  1671. 57.46 s > FAIL [ 0.008s] ( 28/129) alphal00p-docs-builder tests::every_product_orients_rust_to_native_rustdoc_and_keeps_legacy_redirects
  1672. 57.46 s > stdout ---
  1673. 57.46 s >
  1674. 57.46 s > running 1 test
  1675. 57.46 s > test tests::every_product_orients_rust_to_native_rustdoc_and_keeps_legacy_redirects ... FAILED
  1676. 57.46 s >
  1677. 57.46 s > failures:
  1678. 57.46 s >
  1679. 57.46 s > failures:
  1680. 57.46 s > tests::every_product_orients_rust_to_native_rustdoc_and_keeps_legacy_redirects
  1681. 57.46 s >
  1682. 57.46 s > test result: FAILED. 0 passed; 1 failed; 0 ignored; 0 measured; 128 filtered out; finished in 0.00s
  1683. 57.46 s >
  1684. 57.46 s > stderr ---
  1685. 57.46 s >
  1686. 57.46 s > thread 'tests::every_product_orients_rust_to_native_rustdoc_and_keeps_legacy_redirects' (309) panicked at crates/alphal00p-docs-builder/src/lib.rs:12555:46:
  1687. 57.46 s > called `Result::unwrap()` on an `Err` value: failed to copy documentation asset crates/spynso3/typst/STIXTwoMath-Regular.woff2
  1688. 57.46 s >
  1689. 57.46 s > Caused by:
  1690. 57.46 s > No such file or directory (os error 2)
  1691. 57.46 s >
  1692. 57.46 s > Location:
  1693. 57.46 s > crates/alphal00p-docs-builder/src/lib.rs:2276:18
  1694. 57.46 s > stack backtrace:
  1695. 57.46 s > 0: __rustc::rust_begin_unwind
  1696. 57.46 s > 1: core::panicking::panic_fmt
  1697. 57.46 s > 2: core::result::unwrap_failed
  1698. 57.46 s > 3: alphal00p_docs_builder::tests::every_product_orients_rust_to_native_rustdoc_and_keeps_legacy_redirects
  1699. 57.46 s > 4: <alphal00p_docs_builder::tests::every_product_orients_rust_to_native_rustdoc_and_keeps_legacy_redirects::{closure#0} as core::ops::function::FnOnce<()>>::call_once
  1700. 57.46 s > note: Some details are omitted, run with `RUST_BACKTRACE=full` for a verbose backtrace.
  1701. 57.46 s >
  1702. 57.46 s > FAIL [ 0.011s] ( 54/129) alphal00p-docs-builder tests::portal_emits_routes_and_valid_assets
  1703. 57.46 s > stdout ---
  1704. 57.46 s >
  1705. 57.46 s > running 1 test
  1706. 57.46 s > test tests::portal_emits_routes_and_valid_assets ... FAILED
  1707. 57.46 s >
  1708. 57.46 s > failures:
  1709. 57.46 s >
  1710. 57.46 s > failures:
  1711. 57.46 s > tests::portal_emits_routes_and_valid_assets
  1712. 57.46 s >
  1713. 57.46 s > test result: FAILED. 0 passed; 1 failed; 0 ignored; 0 measured; 128 filtered out; finished in 0.01s
  1714. 57.46 s >
  1715. 57.46 s > stderr ---
  1716. 57.46 s >
  1717. 57.46 s > thread 'tests::portal_emits_routes_and_valid_assets' (424) panicked at crates/alphal00p-docs-builder/src/lib.rs:9684:14:
  1718. 57.46 s > called `Result::unwrap()` on an `Err` value: failed to copy documentation asset crates/spynso3/typst/STIXTwoMath-Regular.woff2
  1719. 57.46 s >
  1720. 57.46 s > Caused by:
  1721. 57.46 s > No such file or directory (os error 2)
  1722. 57.46 s >
  1723. 57.46 s > Location:
  1724. 57.46 s > crates/alphal00p-docs-builder/src/lib.rs:2276:18
  1725. 57.47 s > stack backtrace:
  1726. 57.47 s > 0: __rustc::rust_begin_unwind
  1727. 57.47 s > 1: core::panicking::panic_fmt
  1728. 57.47 s > 2: core::result::unwrap_failed
  1729. 57.47 s > 3: alphal00p_docs_builder::tests::write_test_portal
  1730. 57.47 s > 4: alphal00p_docs_builder::tests::portal_emits_routes_and_valid_assets
  1731. 57.47 s > 5: <alphal00p_docs_builder::tests::portal_emits_routes_and_valid_assets::{closure#0} as core::ops::function::FnOnce<()>>::call_once
  1732. 57.47 s > note: Some details are omitted, run with `RUST_BACKTRACE=full` for a verbose backtrace.
  1733. 57.47 s >
  1734. 57.47 s > FAIL [ 0.010s] ( 55/129) alphal00p-docs-builder tests::portal_task_chooser_routes_each_goal_to_the_registered_quickstart
  1735. 57.47 s > stdout ---
  1736. 57.47 s >
  1737. 57.47 s > running 1 test
  1738. 57.47 s > test tests::portal_task_chooser_routes_each_goal_to_the_registered_quickstart ... FAILED
  1739. 57.47 s >
  1740. 57.47 s > failures:
  1741. 57.47 s >
  1742. 57.47 s > failures:
  1743. 57.47 s > tests::portal_task_chooser_routes_each_goal_to_the_registered_quickstart
  1744. 57.47 s >
  1745. 57.47 s > test result: FAILED. 0 passed; 1 failed; 0 ignored; 0 measured; 128 filtered out; finished in 0.00s
  1746. 57.47 s >
  1747. 57.47 s > stderr ---
  1748. 57.47 s >
  1749. 57.47 s > thread 'tests::portal_task_chooser_routes_each_goal_to_the_registered_quickstart' (431) panicked at crates/alphal00p-docs-builder/src/lib.rs:9684:14:
  1750. 57.47 s > called `Result::unwrap()` on an `Err` value: failed to copy documentation asset crates/spynso3/typst/STIXTwoMath-Regular.woff2
  1751. 57.47 s >
  1752. 57.47 s > Caused by:
  1753. 57.47 s > No such file or directory (os error 2)
  1754. 57.47 s >
  1755. 57.47 s > Location:
  1756. 57.47 s > crates/alphal00p-docs-builder/src/lib.rs:2276:18
  1757. 57.47 s > stack backtrace:
  1758. 57.47 s > 0: __rustc::rust_begin_unwind
  1759. 57.47 s > 1: core::panicking::panic_fmt
  1760. 57.47 s > 2: core::result::unwrap_failed
  1761. 57.47 s > 3: alphal00p_docs_builder::tests::write_test_portal
  1762. 57.47 s > 4: alphal00p_docs_builder::tests::portal_task_chooser_routes_each_goal_to_the_registered_quickstart
  1763. 57.47 s > 5: <alphal00p_docs_builder::tests::portal_task_chooser_routes_each_goal_to_the_registered_quickstart::{closure#0} as core::ops::function::FnOnce<()>>::call_once
  1764. 57.47 s > note: Some details are omitted, run with `RUST_BACKTRACE=full` for a verbose backtrace.
  1765. 57.47 s >
  1766. 57.47 s > FAIL [ 0.012s] ( 56/129) alphal00p-docs-builder tests::portal_and_developer_pages_use_federated_search_and_feedback
  1767. 57.47 s > stdout ---
  1768. 57.47 s >
  1769. 57.47 s > running 1 test
  1770. 57.47 s > test tests::portal_and_developer_pages_use_federated_search_and_feedback ... FAILED
  1771. 57.47 s >
  1772. 57.47 s > failures:
  1773. 57.47 s >
  1774. 57.47 s > failures:
  1775. 57.47 s > tests::portal_and_developer_pages_use_federated_search_and_feedback
  1776. 57.47 s >
  1777. 57.47 s > test result: FAILED. 0 passed; 1 failed; 0 ignored; 0 measured; 128 filtered out; finished in 0.01s
  1778. 57.47 s >
  1779. 57.47 s > stderr ---
  1780. 57.47 s >
  1781. 57.47 s > thread 'tests::portal_and_developer_pages_use_federated_search_and_feedback' (425) panicked at crates/alphal00p-docs-builder/src/lib.rs:9684:14:
  1782. 57.47 s > called `Result::unwrap()` on an `Err` value: failed to copy documentation asset crates/spynso3/typst/STIXTwoMath-Regular.woff2
  1783. 57.47 s >
  1784. 57.47 s > Caused by:
  1785. 57.47 s > No such file or directory (os error 2)
  1786. 57.47 s >
  1787. 57.47 s > Location:
  1788. 57.47 s > crates/alphal00p-docs-builder/src/lib.rs:2276:18
  1789. 57.47 s > stack backtrace:
  1790. 57.47 s > 0: __rustc::rust_begin_unwind
  1791. 57.47 s > 1: core::panicking::panic_fmt
  1792. 57.47 s > 2: core::result::unwrap_failed
  1793. 57.47 s > 3: alphal00p_docs_builder::tests::write_test_portal
  1794. 57.47 s > 4: alphal00p_docs_builder::tests::portal_and_developer_pages_use_federated_search_and_feedback
  1795. 57.47 s > 5: <alphal00p_docs_builder::tests::portal_and_developer_pages_use_federated_search_and_feedback::{closure#0} as core::ops::function::FnOnce<()>>::call_once
  1796. 57.47 s > note: Some details are omitted, run with `RUST_BACKTRACE=full` for a verbose backtrace.
  1797. 57.47 s >
  1798. 57.47 s > FAIL [ 0.118s] ( 86/129) alphal00p-docs-builder tests::checked_in_registry_is_valid
  1799. 57.47 s > stdout ---
  1800. 57.47 s >
  1801. 57.47 s > running 1 test
  1802. 57.47 s > test tests::checked_in_registry_is_valid ... FAILED
  1803. 57.47 s >
  1804. 57.47 s > failures:
  1805. 57.47 s >
  1806. 57.47 s > failures:
  1807. 57.47 s > tests::checked_in_registry_is_valid
  1808. 57.47 s >
  1809. 57.47 s > test result: FAILED. 0 passed; 1 failed; 0 ignored; 0 measured; 128 filtered out; finished in 0.11s
  1810. 57.47 s >
  1811. 57.47 s > stderr ---
  1812. 57.47 s >
  1813. 57.47 s > thread 'tests::checked_in_registry_is_valid' (187) panicked at crates/alphal00p-docs-builder/src/lib.rs:12260:50:
  1814. 57.47 s > called `Result::unwrap()` on an `Err` value: required documentation source is missing: /build/source/crates/spynso3/typst/STIXTwoMath-Regular.woff2
  1815. 57.47 s >
  1816. 57.47 s > Location:
  1817. 57.47 s > crates/alphal00p-docs-builder/src/lib.rs:5103:9
  1818. 57.47 s > stack backtrace:
  1819. 57.47 s > 0: __rustc::rust_begin_unwind
  1820. 57.47 s > 1: core::panicking::panic_fmt
  1821. 57.47 s > 2: core::result::unwrap_failed
  1822. 57.47 s > 3: alphal00p_docs_builder::tests::checked_in_registry_is_valid
  1823. 57.47 s > 4: <alphal00p_docs_builder::tests::checked_in_registry_is_valid::{closure#0} as core::ops::function::FnOnce<()>>::call_once
  1824. 57.47 s > note: Some details are omitted, run with `RUST_BACKTRACE=full` for a verbose backtrace.
  1825. 57.47 s >
  1826. 57.47 s > FAIL [ 0.119s] ( 88/129) alphal00p-docs-builder provenance_tests::each_build_captures_one_revision_before_rendering
  1827. 57.47 s > stdout ---
  1828. 57.47 s >
  1829. 57.47 s > running 1 test
  1830. 57.47 s >
  1831. 57.47 s > running 1 test
  1832. 57.47 s > test provenance_tests::each_build_captures_one_revision_before_rendering ... FAILED
  1833. 57.47 s >
  1834. 57.47 s > failures:
  1835. 57.47 s >
  1836. 57.47 s > failures:
  1837. 57.47 s > provenance_tests::each_build_captures_one_revision_before_rendering
  1838. 57.47 s >
  1839. 57.47 s > test result: FAILED. 0 passed; 1 failed; 0 ignored; 0 measured; 128 filtered out; finished in 0.10s
  1840. 57.47 s >
  1841. 57.47 s > test provenance_tests::each_build_captures_one_revision_before_rendering ... FAILED
  1842. 57.47 s >
  1843. 57.47 s > failures:
  1844. 57.47 s >
  1845. 57.47 s > failures:
  1846. 57.47 s > provenance_tests::each_build_captures_one_revision_before_rendering
  1847. 57.47 s >
  1848. 57.47 s > test result: FAILED. 0 passed; 1 failed; 0 ignored; 0 measured; 128 filtered out; finished in 0.11s
  1849. 57.47 s >
  1850. 57.47 s > stderr ---
  1851. 57.47 s >
  1852. 57.47 s > thread 'provenance_tests::each_build_captures_one_revision_before_rendering' (253) panicked at crates/alphal00p-docs-builder/src/provenance_tests.rs:297:14:
  1853. 57.47 s > called `Result::unwrap()` on an `Err` value: required documentation source is missing: /build/source/target/nix-ci-tmp/.tmpuiqmMo/checkout/crates/spynso3/typst/STIXTwoMath-Regular.woff2
  1854. 57.47 s >
  1855. 57.47 s > Location:
  1856. 57.47 s > crates/alphal00p-docs-builder/src/lib.rs:5103:9
  1857. 57.47 s > stack backtrace:
  1858. 57.47 s > 0: __rustc::rust_begin_unwind
  1859. 57.47 s > 1: core::panicking::panic_fmt
  1860. 57.47 s > 2: core::result::unwrap_failed
  1861. 57.47 s > 3: alphal00p_docs_builder::provenance_tests::each_build_captures_one_revision_before_rendering
  1862. 57.47 s > 4: <alphal00p_docs_builder::provenance_tests::each_build_captures_one_revision_before_rendering::{closure#0} as core::ops::function::FnOnce<()>>::call_once
  1863. 57.47 s > note: Some details are omitted, run with `RUST_BACKTRACE=full` for a verbose backtrace.
  1864. 57.47 s >
  1865. 57.47 s > thread 'provenance_tests::each_build_captures_one_revision_before_rendering' (170) panicked at crates/alphal00p-docs-builder/src/provenance_tests.rs:274:9:
  1866. 57.47 s > assertion failed: command.status().unwrap().success()
  1867. 57.47 s > stack backtrace:
  1868. 57.47 s > 0: __rustc::rust_begin_unwind
  1869. 57.47 s > 1: core::panicking::panic_fmt
  1870. 57.47 s > 2: core::panicking::panic
  1871. 57.47 s > 3: alphal00p_docs_builder::provenance_tests::each_build_captures_one_revision_before_rendering
  1872. 57.47 s > 4: <alphal00p_docs_builder::provenance_tests::each_build_captures_one_revision_before_rendering::{closure#0} as core::ops::function::FnOnce<()>>::call_once
  1873. 57.47 s > note: Some details are omitted, run with `RUST_BACKTRACE=full` for a verbose backtrace.
  1874. 57.47 s >
  1875. 57.47 s > FAIL [ 0.010s] ( 89/129) alphal00p-docs-builder tests::site_assets_replace_read_only_generated_files
  1876. 57.47 s > stdout ---
  1877. 57.47 s >
  1878. 57.47 s > running 1 test
  1879. 57.47 s > test tests::site_assets_replace_read_only_generated_files ... FAILED
  1880. 57.47 s >
  1881. 57.47 s > failures:
  1882. 57.47 s >
  1883. 57.47 s > failures:
  1884. 57.47 s > tests::site_assets_replace_read_only_generated_files
  1885. 57.47 s >
  1886. 57.47 s > test result: FAILED. 0 passed; 1 failed; 0 ignored; 0 measured; 128 filtered out; finished in 0.01s
  1887. 57.47 s >
  1888. 57.47 s > stderr ---
  1889. 57.47 s >
  1890. 57.47 s > thread 'tests::site_assets_replace_read_only_generated_files' (670) panicked at crates/alphal00p-docs-builder/src/lib.rs:12305:50:
  1891. 57.47 s > called `Result::unwrap()` on an `Err` value: failed to copy documentation asset crates/spynso3/typst/STIXTwoMath-Regular.woff2
  1892. 57.47 s >
  1893. 57.47 s > Caused by:
  1894. 57.47 s > No such file or directory (os error 2)
  1895. 57.47 s >
  1896. 57.47 s > Location:
  1897. 57.47 s > crates/alphal00p-docs-builder/src/lib.rs:2276:18
  1898. 57.47 s > stack backtrace:
  1899. 57.47 s > 0: __rustc::rust_begin_unwind
  1900. 57.47 s > 1: core::panicking::panic_fmt
  1901. 57.47 s > 2: core::result::unwrap_failed
  1902. 57.47 s > 3: alphal00p_docs_builder::tests::site_assets_replace_read_only_generated_files
  1903. 57.47 s > 4: <alphal00p_docs_builder::tests::site_assets_replace_read_only_generated_files::{closure#0} as core::ops::function::FnOnce<()>>::call_once
  1904. 57.47 s > note: Some details are omitted, run with `RUST_BACKTRACE=full` for a verbose backtrace.
  1905. 57.47 s >
  1906. 57.47 s > FAIL [ 0.108s] ( 90/129) alphal00p-docs-builder tests::developer_scope_ranges_ignore_unrelated_edits_and_warn_only_while_watching
  1907. 57.47 s > stdout ---
  1908. 57.47 s >
  1909. 57.47 s > running 1 test
  1910. 57.47 s > test tests::developer_scope_ranges_ignore_unrelated_edits_and_warn_only_while_watching ... FAILED
  1911. 57.47 s >
  1912. 57.47 s > failures:
  1913. 57.47 s >
  1914. 57.47 s > failures:
  1915. 57.47 s > tests::developer_scope_ranges_ignore_unrelated_edits_and_warn_only_while_watching
  1916. 57.47 s >
  1917. 57.47 s > test result: FAILED. 0 passed; 1 failed; 0 ignored; 0 measured; 128 filtered out; finished in 0.10s
  1918. 57.47 s >
  1919. 57.47 s > stderr ---
  1920. 57.47 s >
  1921. 57.47 s > thread 'tests::developer_scope_ranges_ignore_unrelated_edits_and_warn_only_while_watching' (287) panicked at crates/alphal00p-docs-builder/src/lib.rs:12350:29:
  1922. 57.47 s > called `Result::unwrap()` on an `Err` value: required documentation source is missing: /build/source/crates/spynso3/typst/STIXTwoMath-Regular.woff2
  1923. 57.47 s >
  1924. 57.47 s > Location:
  1925. 57.47 s > crates/alphal00p-docs-builder/src/lib.rs:5103:9
  1926. 57.47 s > stack backtrace:
  1927. 57.47 s > 0: __rustc::rust_begin_unwind
  1928. 57.47 s > 1: core::panicking::panic_fmt
  1929. 57.47 s > 2: core::result::unwrap_failed
  1930. 57.47 s > 3: alphal00p_docs_builder::tests::developer_scope_ranges_ignore_unrelated_edits_and_warn_only_while_watching
  1931. 57.47 s > 4: <alphal00p_docs_builder::tests::developer_scope_ranges_ignore_unrelated_edits_and_warn_only_while_watching::{closure#0} as core::ops::function::FnOnce<()>>::call_once
  1932. 57.47 s > note: Some details are omitted, run with `RUST_BACKTRACE=full` for a verbose backtrace.
  1933. 57.47 s >
  1934. 57.47 s > FAIL [ 0.127s] (121/129) alphal00p-docs-builder tests::every_product_requires_a_task_chooser_and_each_supported_interface
  1935. 57.47 s > stdout ---
  1936. 57.47 s >
  1937. 57.47 s > running 1 test
  1938. 57.47 s > test tests::every_product_requires_a_task_chooser_and_each_supported_interface ... FAILED
  1939. 57.47 s >
  1940. 57.47 s > failures:
  1941. 57.47 s >
  1942. 57.47 s > failures:
  1943. 57.47 s > tests::every_product_requires_a_task_chooser_and_each_supported_interface
  1944. 57.47 s >
  1945. 57.47 s > test result: FAILED. 0 passed; 1 failed; 0 ignored; 0 measured; 128 filtered out; finished in 0.12s
  1946. 57.47 s >
  1947. 57.47 s > stderr ---
  1948. 57.47 s >
  1949. 57.47 s > thread 'tests::every_product_requires_a_task_chooser_and_each_supported_interface' (327) panicked at crates/alphal00p-docs-builder/src/lib.rs:12274:9:
  1950. 57.47 s > assertion failed: format!("{error:#}").contains("has no quickstart page")
  1951. 57.47 s > stack backtrace:
  1952. 57.47 s > 0: __rustc::rust_begin_unwind
  1953. 57.47 s > 1: core::panicking::panic_fmt
  1954. 57.47 s > 2: core::panicking::panic
  1955. 57.47 s > 3: alphal00p_docs_builder::tests::every_product_requires_a_task_chooser_and_each_supported_interface
  1956. 57.47 s > 4: <alphal00p_docs_builder::tests::every_product_requires_a_task_chooser_and_each_supported_interface::{closure#0} as core::ops::function::FnOnce<()>>::call_once
  1957. 57.47 s > note: Some details are omitted, run with `RUST_BACKTRACE=full` for a verbose backtrace.
  1958. 57.47 s >
  1959. 57.47 s > FAIL [ 0.111s] (122/129) alphal00p-docs-builder tests::pdf_manual_chapter_order_must_match_the_page_registry
  1960. 57.47 s > stdout ---
  1961. 57.47 s >
  1962. 57.47 s > running 1 test
  1963. 57.47 s > test tests::pdf_manual_chapter_order_must_match_the_page_registry ... FAILED
  1964. 57.47 s >
  1965. 57.47 s > failures:
  1966. 57.47 s >
  1967. 57.47 s > failures:
  1968. 57.47 s > tests::pdf_manual_chapter_order_must_match_the_page_registry
  1969. 57.47 s >
  1970. 57.47 s > test result: FAILED. 0 passed; 1 failed; 0 ignored; 0 measured; 128 filtered out; finished in 0.11s
  1971. 57.47 s >
  1972. 57.47 s > stderr ---
  1973. 57.47 s >
  1974. 57.47 s > thread 'tests::pdf_manual_chapter_order_must_match_the_page_registry' (396) panicked at crates/alphal00p-docs-builder/src/lib.rs:12330:9:
  1975. 57.47 s > assertion failed: format!("{error:#}").contains("PDF manual chapter order differs")
  1976. 57.47 s > stack backtrace:
  1977. 57.47 s > 0: __rustc::rust_begin_unwind
  1978. 57.47 s > 1: core::panicking::panic_fmt
  1979. 57.47 s > 2: core::panicking::panic
  1980. 57.47 s > 3: alphal00p_docs_builder::tests::pdf_manual_chapter_order_must_match_the_page_registry
  1981. 57.47 s > 4: <alphal00p_docs_builder::tests::pdf_manual_chapter_order_must_match_the_page_registry::{closure#0} as core::ops::function::FnOnce<()>>::call_once
  1982. 57.47 s > note: Some details are omitted, run with `RUST_BACKTRACE=full` for a verbose backtrace.
  1983. 57.47 s >
  1984. 57.47 s > error: test run failed
  1985. 57.47 s >
  1986. 57.47 s > ========== nextest test summary ==========
  1987. 57.47 s > report: target/nextest/ci_gammaloop/junit.xml
  1988. 57.47 s > tests: 129, failures: 11, errors: 0
  1989. 57.47 s >
  1990. 57.47 s > 1. alphal00p-docs-builder::tests::developer_architecture_is_classified_searchable_and_source_backed
  1991. 57.47 s > failure: test failure with exit code 101
  1992. 57.47 s > thread 'tests::developer_architecture_is_classified_searchable_and_source_backed' (289) panicked at crates/alphal00p-docs-builder/src/lib.rs:12751:14:
  1993. 57.47 s > called `Result::unwrap()` on an `Err` value: failed to copy documentation asset crates/spynso3/typst/STIXTwoMath-Regular.woff2
  1994. 57.47 s >
  1995. 57.47 s > Caused by:
  1996. 57.47 s > No such file or directory (os error 2)
  1997. 57.47 s >
  1998. 57.47 s > Location:
  1999. 57.47 s > crates/alphal00p-docs-builder/src/lib.rs:2276:18
  2000. 57.47 s > stack backtrace:
  2001. 57.47 s > 0: __rustc::rust_begin_unwind
  2002. 57.47 s > 1: core::panicking::panic_fmt
  2003. 57.47 s > 2: core::result::unwrap_failed
  2004. 57.47 s > 3: alphal00p_docs_builder::tests::developer_architecture_is_classified_searchable_and_source_backed
  2005. 57.47 s > 4: <alphal00p_docs_builder::tests::developer_architecture_is_classified_searchable_and_source_backed::{closure#0} as core::ops::function::FnOnce<()>>::call_once
  2006. 57.47 s > note: Some details are omitted, run with `RUST_BACKTRACE=full` for a verbose backtrace.
  2007. 57.47 s > system-out
  2008. 57.47 s > running 1 test
  2009. 57.47 s > test tests::developer_architecture_is_classified_searchable_and_source_backed ... FAILED
  2010. 57.47 s >
  2011. 57.47 s > failures:
  2012. 57.47 s >
  2013. 57.47 s > failures:
  2014. 57.47 s > tests::developer_architecture_is_classified_searchable_and_source_backed
  2015. 57.47 s >
  2016. 57.47 s > test result: FAILED. 0 passed; 1 failed; 0 ignored; 0 measured; 128 filtered out; finished in 0.01s
  2017. 57.47 s > system-err
  2018. 57.47 s > thread 'tests::developer_architecture_is_classified_searchable_and_source_backed' (289) panicked at crates/alphal00p-docs-builder/src/lib.rs:12751:14:
  2019. 57.47 s > called `Result::unwrap()` on an `Err` value: failed to copy documentation asset crates/spynso3/typst/STIXTwoMath-Regular.woff2
  2020. 57.47 s >
  2021. 57.47 s > Caused by:
  2022. 57.47 s > No such file or directory (os error 2)
  2023. 57.47 s >
  2024. 57.47 s > Location:
  2025. 57.47 s > crates/alphal00p-docs-builder/src/lib.rs:2276:18
  2026. 57.47 s > stack backtrace:
  2027. 57.47 s > 0: __rustc::rust_begin_unwind
  2028. 57.47 s > 1: core::panicking::panic_fmt
  2029. 57.47 s > 2: core::result::unwrap_failed
  2030. 57.47 s > 3: alphal00p_docs_builder::tests::developer_architecture_is_classified_searchable_and_source_backed
  2031. 57.47 s > 4: <alphal00p_docs_builder::tests::developer_architecture_is_classified_searchable_and_source_backed::{closure#0} as core::ops::function::FnOnce<()>>::call_once
  2032. 57.47 s > note: Some details are omitted, run with `RUST_BACKTRACE=full` for a verbose backtrace.
  2033. 57.47 s >
  2034. 57.47 s > 2. alphal00p-docs-builder::tests::every_product_orients_rust_to_native_rustdoc_and_keeps_legacy_redirects
  2035. 57.47 s > failure: test failure with exit code 101
  2036. 57.47 s > thread 'tests::every_product_orients_rust_to_native_rustdoc_and_keeps_legacy_redirects' (309) panicked at crates/alphal00p-docs-builder/src/lib.rs:12555:46:
  2037. 57.47 s > called `Result::unwrap()` on an `Err` value: failed to copy documentation asset crates/spynso3/typst/STIXTwoMath-Regular.woff2
  2038. 57.47 s >
  2039. 57.47 s > Caused by:
  2040. 57.47 s > No such file or directory (os error 2)
  2041. 57.47 s >
  2042. 57.47 s > Location:
  2043. 57.47 s > crates/alphal00p-docs-builder/src/lib.rs:2276:18
  2044. 57.47 s > stack backtrace:
  2045. 57.47 s > 0: __rustc::rust_begin_unwind
  2046. 57.47 s > 1: core::panicking::panic_fmt
  2047. 57.47 s > 2: core::result::unwrap_failed
  2048. 57.47 s > 3: alphal00p_docs_builder::tests::every_product_orients_rust_to_native_rustdoc_and_keeps_legacy_redirects
  2049. 57.47 s > 4: <alphal00p_docs_builder::tests::every_product_orients_rust_to_native_rustdoc_and_keeps_legacy_redirects::{closure#0} as core::ops::function::FnOnce<()>>::call_once
  2050. 57.47 s > note: Some details are omitted, run with `RUST_BACKTRACE=full` for a verbose backtrace.
  2051. 57.47 s > system-out
  2052. 57.47 s > running 1 test
  2053. 57.47 s > test tests::every_product_orients_rust_to_native_rustdoc_and_keeps_legacy_redirects ... FAILED
  2054. 57.47 s >
  2055. 57.47 s > failures:
  2056. 57.47 s >
  2057. 57.47 s > failures:
  2058. 57.47 s > tests::every_product_orients_rust_to_native_rustdoc_and_keeps_legacy_redirects
  2059. 57.47 s >
  2060. 57.47 s > test result: FAILED. 0 passed; 1 failed; 0 ignored; 0 measured; 128 filtered out; finished in 0.00s
  2061. 57.47 s > system-err
  2062. 57.47 s > thread 'tests::every_product_orients_rust_to_native_rustdoc_and_keeps_legacy_redirects' (309) panicked at crates/alphal00p-docs-builder/src/lib.rs:12555:46:
  2063. 57.47 s > called `Result::unwrap()` on an `Err` value: failed to copy documentation asset crates/spynso3/typst/STIXTwoMath-Regular.woff2
  2064. 57.47 s >
  2065. 57.47 s > Caused by:
  2066. 57.47 s > No such file or directory (os error 2)
  2067. 57.47 s >
  2068. 57.47 s > Location:
  2069. 57.47 s > crates/alphal00p-docs-builder/src/lib.rs:2276:18
  2070. 57.47 s > stack backtrace:
  2071. 57.47 s > 0: __rustc::rust_begin_unwind
  2072. 57.47 s > 1: core::panicking::panic_fmt
  2073. 57.47 s > 2: core::result::unwrap_failed
  2074. 57.47 s > 3: alphal00p_docs_builder::tests::every_product_orients_rust_to_native_rustdoc_and_keeps_legacy_redirects
  2075. 57.47 s > 4: <alphal00p_docs_builder::tests::every_product_orients_rust_to_native_rustdoc_and_keeps_legacy_redirects::{closure#0} as core::ops::function::FnOnce<()>>::call_once
  2076. 57.47 s > note: Some details are omitted, run with `RUST_BACKTRACE=full` for a verbose backtrace.
  2077. 57.47 s >
  2078. 57.47 s > 3. alphal00p-docs-builder::tests::portal_emits_routes_and_valid_assets
  2079. 57.47 s > failure: test failure with exit code 101
  2080. 57.47 s > thread 'tests::portal_emits_routes_and_valid_assets' (424) panicked at crates/alphal00p-docs-builder/src/lib.rs:9684:14:
  2081. 57.47 s > called `Result::unwrap()` on an `Err` value: failed to copy documentation asset crates/spynso3/typst/STIXTwoMath-Regular.woff2
  2082. 57.47 s >
  2083. 57.47 s > Caused by:
  2084. 57.47 s > No such file or directory (os error 2)
  2085. 57.47 s >
  2086. 57.47 s > Location:
  2087. 57.47 s > crates/alphal00p-docs-builder/src/lib.rs:2276:18
  2088. 57.47 s > stack backtrace:
  2089. 57.47 s > 0: __rustc::rust_begin_unwind
  2090. 57.47 s > 1: core::panicking::panic_fmt
  2091. 57.47 s > 2: core::result::unwrap_failed
  2092. 57.47 s > 3: alphal00p_docs_builder::tests::write_test_portal
  2093. 57.47 s > 4: alphal00p_docs_builder::tests::portal_emits_routes_and_valid_assets
  2094. 57.47 s > 5: <alphal00p_docs_builder::tests::portal_emits_routes_and_valid_assets::{closure#0} as core::ops::function::FnOnce<()>>::call_once
  2095. 57.47 s > note: Some details are omitted, run with `RUST_BACKTRACE=full` for a verbose backtrace.
  2096. 57.47 s > system-out
  2097. 57.47 s > running 1 test
  2098. 57.47 s > test tests::portal_emits_routes_and_valid_assets ... FAILED
  2099. 57.47 s >
  2100. 57.47 s > failures:
  2101. 57.47 s >
  2102. 57.47 s > failures:
  2103. 57.47 s > tests::portal_emits_routes_and_valid_assets
  2104. 57.47 s >
  2105. 57.47 s > test result: FAILED. 0 passed; 1 failed; 0 ignored; 0 measured; 128 filtered out; finished in 0.01s
  2106. 57.47 s > system-err
  2107. 57.47 s > thread 'tests::portal_emits_routes_and_valid_assets' (424) panicked at crates/alphal00p-docs-builder/src/lib.rs:9684:14:
  2108. 57.47 s > called `Result::unwrap()` on an `Err` value: failed to copy documentation asset crates/spynso3/typst/STIXTwoMath-Regular.woff2
  2109. 57.47 s >
  2110. 57.47 s > Caused by:
  2111. 57.47 s > No such file or directory (os error 2)
  2112. 57.47 s >
  2113. 57.47 s > Location:
  2114. 57.47 s > crates/alphal00p-docs-builder/src/lib.rs:2276:18
  2115. 57.47 s > stack backtrace:
  2116. 57.47 s > 0: __rustc::rust_begin_unwind
  2117. 57.47 s > 1: core::panicking::panic_fmt
  2118. 57.47 s > 2: core::result::unwrap_failed
  2119. 57.47 s > 3: alphal00p_docs_builder::tests::write_test_portal
  2120. 57.47 s > 4: alphal00p_docs_builder::tests::portal_emits_routes_and_valid_assets
  2121. 57.47 s > 5: <alphal00p_docs_builder::tests::portal_emits_routes_and_valid_assets::{closure#0} as core::ops::function::FnOnce<()>>::call_once
  2122. 57.47 s > note: Some details are omitted, run with `RUST_BACKTRACE=full` for a verbose backtrace.
  2123. 57.47 s >
  2124. 57.47 s > 4. alphal00p-docs-builder::tests::portal_task_chooser_routes_each_goal_to_the_registered_quickstart
  2125. 57.47 s > failure: test failure with exit code 101
  2126. 57.47 s > thread 'tests::portal_task_chooser_routes_each_goal_to_the_registered_quickstart' (431) panicked at crates/alphal00p-docs-builder/src/lib.rs:9684:14:
  2127. 57.47 s > called `Result::unwrap()` on an `Err` value: failed to copy documentation asset crates/spynso3/typst/STIXTwoMath-Regular.woff2
  2128. 57.47 s >
  2129. 57.47 s > Caused by:
  2130. 57.47 s > No such file or directory (os error 2)
  2131. 57.47 s >
  2132. 57.47 s > Location:
  2133. 57.47 s > crates/alphal00p-docs-builder/src/lib.rs:2276:18
  2134. 57.47 s > stack backtrace:
  2135. 57.47 s > 0: __rustc::rust_begin_unwind
  2136. 57.47 s > 1: core::panicking::panic_fmt
  2137. 57.47 s > 2: core::result::unwrap_failed
  2138. 57.47 s > 3: alphal00p_docs_builder::tests::write_test_portal
  2139. 57.47 s > 4: alphal00p_docs_builder::tests::portal_task_chooser_routes_each_goal_to_the_registered_quickstart
  2140. 57.47 s > 5: <alphal00p_docs_builder::tests::portal_task_chooser_routes_each_goal_to_the_registered_quickstart::{closure#0} as core::ops::function::FnOnce<()>>::call_once
  2141. 57.47 s > note: Some details are omitted, run with `RUST_BACKTRACE=full` for a verbose backtrace.
  2142. 57.47 s > system-out
  2143. 57.47 s > running 1 test
  2144. 57.47 s > test tests::portal_task_chooser_routes_each_goal_to_the_registered_quickstart ... FAILED
  2145. 57.47 s >
  2146. 57.47 s > failures:
  2147. 57.47 s >
  2148. 57.47 s > failures:
  2149. 57.47 s > tests::portal_task_chooser_routes_each_goal_to_the_registered_quickstart
  2150. 57.47 s >
  2151. 57.47 s > test result: FAILED. 0 passed; 1 failed; 0 ignored; 0 measured; 128 filtered out; finished in 0.00s
  2152. 57.47 s > system-err
  2153. 57.47 s > thread 'tests::portal_task_chooser_routes_each_goal_to_the_registered_quickstart' (431) panicked at crates/alphal00p-docs-builder/src/lib.rs:9684:14:
  2154. 57.47 s > called `Result::unwrap()` on an `Err` value: failed to copy documentation asset crates/spynso3/typst/STIXTwoMath-Regular.woff2
  2155. 57.47 s >
  2156. 57.47 s > Caused by:
  2157. 57.47 s > No such file or directory (os error 2)
  2158. 57.47 s >
  2159. 57.47 s > Location:
  2160. 57.47 s > crates/alphal00p-docs-builder/src/lib.rs:2276:18
  2161. 57.47 s > stack backtrace:
  2162. 57.47 s > 0: __rustc::rust_begin_unwind
  2163. 57.47 s > 1: core::panicking::panic_fmt
  2164. 57.47 s > 2: core::result::unwrap_failed
  2165. 57.47 s > 3: alphal00p_docs_builder::tests::write_test_portal
  2166. 57.47 s > 4: alphal00p_docs_builder::tests::portal_task_chooser_routes_each_goal_to_the_registered_quickstart
  2167. 57.47 s > 5: <alphal00p_docs_builder::tests::portal_task_chooser_routes_each_goal_to_the_registered_quickstart::{closure#0} as core::ops::function::FnOnce<()>>::call_once
  2168. 57.47 s > note: Some details are omitted, run with `RUST_BACKTRACE=full` for a verbose backtrace.
  2169. 57.47 s >
  2170. 57.47 s > 5. alphal00p-docs-builder::tests::portal_and_developer_pages_use_federated_search_and_feedback
  2171. 57.47 s > failure: test failure with exit code 101
  2172. 57.47 s > thread 'tests::portal_and_developer_pages_use_federated_search_and_feedback' (425) panicked at crates/alphal00p-docs-builder/src/lib.rs:9684:14:
  2173. 57.47 s > called `Result::unwrap()` on an `Err` value: failed to copy documentation asset crates/spynso3/typst/STIXTwoMath-Regular.woff2
  2174. 57.47 s >
  2175. 57.47 s > Caused by:
  2176. 57.47 s > No such file or directory (os error 2)
  2177. 57.47 s >
  2178. 57.47 s > Location:
  2179. 57.47 s > crates/alphal00p-docs-builder/src/lib.rs:2276:18
  2180. 57.47 s > stack backtrace:
  2181. 57.47 s > 0: __rustc::rust_begin_unwind
  2182. 57.47 s > 1: core::panicking::panic_fmt
  2183. 57.47 s > 2: core::result::unwrap_failed
  2184. 57.47 s > 3: alphal00p_docs_builder::tests::write_test_portal
  2185. 57.47 s > 4: alphal00p_docs_builder::tests::portal_and_developer_pages_use_federated_search_and_feedback
  2186. 57.47 s > 5: <alphal00p_docs_builder::tests::portal_and_developer_pages_use_federated_search_and_feedback::{closure#0} as core::ops::function::FnOnce<()>>::call_once
  2187. 57.47 s > note: Some details are omitted, run with `RUST_BACKTRACE=full` for a verbose backtrace.
  2188. 57.47 s > system-out
  2189. 57.47 s > running 1 test
  2190. 57.47 s > test tests::portal_and_developer_pages_use_federated_search_and_feedback ... FAILED
  2191. 57.47 s >
  2192. 57.47 s > failures:
  2193. 57.47 s >
  2194. 57.47 s > failures:
  2195. 57.47 s > tests::portal_and_developer_pages_use_federated_search_and_feedback
  2196. 57.47 s >
  2197. 57.47 s > test result: FAILED. 0 passed; 1 failed; 0 ignored; 0 measured; 128 filtered out; finished in 0.01s
  2198. 57.47 s > system-err
  2199. 57.47 s > thread 'tests::portal_and_developer_pages_use_federated_search_and_feedback' (425) panicked at crates/alphal00p-docs-builder/src/lib.rs:9684:14:
  2200. 57.47 s > called `Result::unwrap()` on an `Err` value: failed to copy documentation asset crates/spynso3/typst/STIXTwoMath-Regular.woff2
  2201. 57.47 s >
  2202. 57.47 s > Caused by:
  2203. 57.47 s > No such file or directory (os error 2)
  2204. 57.47 s >
  2205. 57.47 s > Location:
  2206. 57.47 s > crates/alphal00p-docs-builder/src/lib.rs:2276:18
  2207. 57.47 s > stack backtrace:
  2208. 57.47 s > 0: __rustc::rust_begin_unwind
  2209. 57.47 s > 1: core::panicking::panic_fmt
  2210. 57.47 s > 2: core::result::unwrap_failed
  2211. 57.47 s > 3: alphal00p_docs_builder::tests::write_test_portal
  2212. 57.47 s > 4: alphal00p_docs_builder::tests::portal_and_developer_pages_use_federated_search_and_feedback
  2213. 57.47 s > 5: <alphal00p_docs_builder::tests::portal_and_developer_pages_use_federated_search_and_feedback::{closure#0} as core::ops::function::FnOnce<()>>::call_once
  2214. 57.47 s > note: Some details are omitted, run with `RUST_BACKTRACE=full` for a verbose backtrace.
  2215. 57.47 s >
  2216. 57.47 s > 6. alphal00p-docs-builder::tests::checked_in_registry_is_valid
  2217. 57.47 s > failure: test failure with exit code 101
  2218. 57.47 s > thread 'tests::checked_in_registry_is_valid' (187) panicked at crates/alphal00p-docs-builder/src/lib.rs:12260:50:
  2219. 57.47 s > called `Result::unwrap()` on an `Err` value: required documentation source is missing: /build/source/crates/spynso3/typst/STIXTwoMath-Regular.woff2
  2220. 57.47 s >
  2221. 57.47 s > Location:
  2222. 57.47 s > crates/alphal00p-docs-builder/src/lib.rs:5103:9
  2223. 57.47 s > stack backtrace:
  2224. 57.47 s > 0: __rustc::rust_begin_unwind
  2225. 57.47 s > 1: core::panicking::panic_fmt
  2226. 57.47 s > 2: core::result::unwrap_failed
  2227. 57.47 s > 3: alphal00p_docs_builder::tests::checked_in_registry_is_valid
  2228. 57.47 s > 4: <alphal00p_docs_builder::tests::checked_in_registry_is_valid::{closure#0} as core::ops::function::FnOnce<()>>::call_once
  2229. 57.47 s > note: Some details are omitted, run with `RUST_BACKTRACE=full` for a verbose backtrace.
  2230. 57.47 s > system-out
  2231. 57.47 s > running 1 test
  2232. 57.47 s > test tests::checked_in_registry_is_valid ... FAILED
  2233. 57.47 s >
  2234. 57.47 s > failures:
  2235. 57.47 s >
  2236. 57.47 s > failures:
  2237. 57.47 s > tests::checked_in_registry_is_valid
  2238. 57.47 s >
  2239. 57.47 s > test result: FAILED. 0 passed; 1 failed; 0 ignored; 0 measured; 128 filtered out; finished in 0.11s
  2240. 57.47 s > system-err
  2241. 57.47 s > thread 'tests::checked_in_registry_is_valid' (187) panicked at crates/alphal00p-docs-builder/src/lib.rs:12260:50:
  2242. 57.47 s > called `Result::unwrap()` on an `Err` value: required documentation source is missing: /build/source/crates/spynso3/typst/STIXTwoMath-Regular.woff2
  2243. 57.47 s >
  2244. 57.47 s > Location:
  2245. 57.47 s > crates/alphal00p-docs-builder/src/lib.rs:5103:9
  2246. 57.47 s > stack backtrace:
  2247. 57.47 s > 0: __rustc::rust_begin_unwind
  2248. 57.47 s > 1: core::panicking::panic_fmt
  2249. 57.47 s > 2: core::result::unwrap_failed
  2250. 57.47 s > 3: alphal00p_docs_builder::tests::checked_in_registry_is_valid
  2251. 57.47 s > 4: <alphal00p_docs_builder::tests::checked_in_registry_is_valid::{closure#0} as core::ops::function::FnOnce<()>>::call_once
  2252. 57.47 s > note: Some details are omitted, run with `RUST_BACKTRACE=full` for a verbose backtrace.
  2253. 57.47 s >
  2254. 57.47 s > 7. alphal00p-docs-builder::provenance_tests::each_build_captures_one_revision_before_rendering
  2255. 57.47 s > failure: test failure with exit code 101
  2256. 57.47 s > thread 'provenance_tests::each_build_captures_one_revision_before_rendering' (170) panicked at crates/alphal00p-docs-builder/src/provenance_tests.rs:274:9:
  2257. 57.47 s > assertion failed: command.status().unwrap().success()
  2258. 57.47 s > stack backtrace:
  2259. 57.47 s > 0: __rustc::rust_begin_unwind
  2260. 57.47 s > 1: core::panicking::panic_fmt
  2261. 57.47 s > 2: core::panicking::panic
  2262. 57.47 s > 3: alphal00p_docs_builder::provenance_tests::each_build_captures_one_revision_before_rendering
  2263. 57.47 s > 4: <alphal00p_docs_builder::provenance_tests::each_build_captures_one_revision_before_rendering::{closure#0} as core::ops::function::FnOnce<()>>::call_once
  2264. 57.47 s > note: Some details are omitted, run with `RUST_BACKTRACE=full` for a verbose backtrace.
  2265. 57.47 s > system-out
  2266. 57.47 s > running 1 test
  2267. 57.47 s >
  2268. 57.47 s > running 1 test
  2269. 57.47 s > test provenance_tests::each_build_captures_one_revision_before_rendering ... FAILED
  2270. 57.47 s >
  2271. 57.47 s > failures:
  2272. 57.47 s >
  2273. 57.47 s > failures:
  2274. 57.47 s > provenance_tests::each_build_captures_one_revision_before_rendering
  2275. 57.47 s >
  2276. 57.47 s > test result: FAILED. 0 passed; 1 failed; 0 ignored; 0 measured; 128 filtered out; finished in 0.10s
  2277. 57.47 s >
  2278. 57.47 s > test provenance_tests::each_build_captures_one_revision_before_rendering ... FAILED
  2279. 57.47 s >
  2280. 57.47 s > failures:
  2281. 57.47 s >
  2282. 57.47 s > failures:
  2283. 57.47 s > provenance_tests::each_build_captures_one_revision_before_rendering
  2284. 57.47 s >
  2285. 57.47 s > test result: FAILED. 0 passed; 1 failed; 0 ignored; 0 measured; 128 filtered out; finished in 0.11s
  2286. 57.47 s > system-err
  2287. 57.47 s > thread 'provenance_tests::each_build_captures_one_revision_before_rendering' (253) panicked at crates/alphal00p-docs-builder/src/provenance_tests.rs:297:14:
  2288. 57.47 s > called `Result::unwrap()` on an `Err` value: required documentation source is missing: /build/source/target/nix-ci-tmp/.tmpuiqmMo/checkout/crates/spynso3/typst/STIXTwoMath-Regular.woff2
  2289. 57.47 s >
  2290. 57.47 s > Location:
  2291. 57.47 s > crates/alphal00p-docs-builder/src/lib.rs:5103:9
  2292. 57.47 s > stack backtrace:
  2293. 57.47 s > 0: __rustc::rust_begin_unwind
  2294. 57.47 s > 1: core::panicking::panic_fmt
  2295. 57.47 s > 2: core::result::unwrap_failed
  2296. 57.47 s > 3: alphal00p_docs_builder::provenance_tests::each_build_captures_one_revision_before_rendering
  2297. 57.47 s > 4: <alphal00p_docs_builder::provenance_tests::each_build_captures_one_revision_before_rendering::{closure#0} as core::ops::function::FnOnce<()>>::call_once
  2298. 57.47 s > note: Some details are omitted, run with `RUST_BACKTRACE=full` for a verbose backtrace.
  2299. 57.47 s >
  2300. 57.47 s > thread 'provenance_tests::each_build_captures_one_revision_before_rendering' (170) panicked at crates/alphal00p-docs-builder/src/provenance_tests.rs:274:9:
  2301. 57.47 s > assertion failed: command.status().unwrap().success()
  2302. 57.47 s > stack backtrace:
  2303. 57.47 s > 0: __rustc::rust_begin_unwind
  2304. 57.47 s > 1: core::panicking::panic_fmt
  2305. 57.47 s > 2: core::panicking::panic
  2306. 57.47 s > 3: alphal00p_docs_builder::provenance_tests::each_build_captures_one_revision_before_rendering
  2307. 57.47 s > 4: <alphal00p_docs_builder::provenance_tests::each_build_captures_one_revision_before_rendering::{closure#0} as core::ops::function::FnOnce<()>>::call_once
  2308. 57.47 s > note: Some details are omitted, run with `RUST_BACKTRACE=full` for a verbose backtrace.
  2309. 57.47 s >
  2310. 57.47 s > 8. alphal00p-docs-builder::tests::site_assets_replace_read_only_generated_files
  2311. 57.47 s > failure: test failure with exit code 101
  2312. 57.47 s > thread 'tests::site_assets_replace_read_only_generated_files' (670) panicked at crates/alphal00p-docs-builder/src/lib.rs:12305:50:
  2313. 57.47 s > called `Result::unwrap()` on an `Err` value: failed to copy documentation asset crates/spynso3/typst/STIXTwoMath-Regular.woff2
  2314. 57.47 s >
  2315. 57.47 s > Caused by:
  2316. 57.47 s > No such file or directory (os error 2)
  2317. 57.47 s >
  2318. 57.47 s > Location:
  2319. 57.47 s > crates/alphal00p-docs-builder/src/lib.rs:2276:18
  2320. 57.47 s > stack backtrace:
  2321. 57.47 s > 0: __rustc::rust_begin_unwind
  2322. 57.47 s > 1: core::panicking::panic_fmt
  2323. 57.47 s > 2: core::result::unwrap_failed
  2324. 57.47 s > 3: alphal00p_docs_builder::tests::site_assets_replace_read_only_generated_files
  2325. 57.47 s > 4: <alphal00p_docs_builder::tests::site_assets_replace_read_only_generated_files::{closure#0} as core::ops::function::FnOnce<()>>::call_once
  2326. 57.47 s > note: Some details are omitted, run with `RUST_BACKTRACE=full` for a verbose backtrace.
  2327. 57.47 s > system-out
  2328. 57.47 s > running 1 test
  2329. 57.47 s > test tests::site_assets_replace_read_only_generated_files ... FAILED
  2330. 57.47 s >
  2331. 57.47 s > failures:
  2332. 57.47 s >
  2333. 57.47 s > failures:
  2334. 57.47 s > tests::site_assets_replace_read_only_generated_files
  2335. 57.47 s >
  2336. 57.47 s > test result: FAILED. 0 passed; 1 failed; 0 ignored; 0 measured; 128 filtered out; finished in 0.01s
  2337. 57.47 s > system-err
  2338. 57.47 s > thread 'tests::site_assets_replace_read_only_generated_files' (670) panicked at crates/alphal00p-docs-builder/src/lib.rs:12305:50:
  2339. 57.47 s > called `Result::unwrap()` on an `Err` value: failed to copy documentation asset crates/spynso3/typst/STIXTwoMath-Regular.woff2
  2340. 57.47 s >
  2341. 57.47 s > Caused by:
  2342. 57.47 s > No such file or directory (os error 2)
  2343. 57.47 s >
  2344. 57.47 s > Location:
  2345. 57.47 s > crates/alphal00p-docs-builder/src/lib.rs:2276:18
  2346. 57.47 s > stack backtrace:
  2347. 57.47 s > 0: __rustc::rust_begin_unwind
  2348. 57.47 s > 1: core::panicking::panic_fmt
  2349. 57.47 s > 2: core::result::unwrap_failed
  2350. 57.47 s > 3: alphal00p_docs_builder::tests::site_assets_replace_read_only_generated_files
  2351. 57.47 s > 4: <alphal00p_docs_builder::tests::site_assets_replace_read_only_generated_files::{closure#0} as core::ops::function::FnOnce<()>>::call_once
  2352. 57.47 s > note: Some details are omitted, run with `RUST_BACKTRACE=full` for a verbose backtrace.
  2353. 57.47 s >
  2354. 57.47 s > 9. alphal00p-docs-builder::tests::developer_scope_ranges_ignore_unrelated_edits_and_warn_only_while_watching
  2355. 57.47 s > failure: test failure with exit code 101
  2356. 57.47 s > thread 'tests::developer_scope_ranges_ignore_unrelated_edits_and_warn_only_while_watching' (287) panicked at crates/alphal00p-docs-builder/src/lib.rs:12350:29:
  2357. 57.47 s > called `Result::unwrap()` on an `Err` value: required documentation source is missing: /build/source/crates/spynso3/typst/STIXTwoMath-Regular.woff2
  2358. 57.47 s >
  2359. 57.47 s > Location:
  2360. 57.47 s > crates/alphal00p-docs-builder/src/lib.rs:5103:9
  2361. 57.47 s > stack backtrace:
  2362. 57.47 s > 0: __rustc::rust_begin_unwind
  2363. 57.47 s > 1: core::panicking::panic_fmt
  2364. 57.47 s > 2: core::result::unwrap_failed
  2365. 57.47 s > 3: alphal00p_docs_builder::tests::developer_scope_ranges_ignore_unrelated_edits_and_warn_only_while_watching
  2366. 57.47 s > 4: <alphal00p_docs_builder::tests::developer_scope_ranges_ignore_unrelated_edits_and_warn_only_while_watching::{closure#0} as core::ops::function::FnOnce<()>>::call_once
  2367. 57.47 s > note: Some details are omitted, run with `RUST_BACKTRACE=full` for a verbose backtrace.
  2368. 57.47 s > system-out
  2369. 57.47 s > running 1 test
  2370. 57.47 s > test tests::developer_scope_ranges_ignore_unrelated_edits_and_warn_only_while_watching ... FAILED
  2371. 57.47 s >
  2372. 57.47 s > failures:
  2373. 57.47 s >
  2374. 57.47 s > failures:
  2375. 57.47 s > tests::developer_scope_ranges_ignore_unrelated_edits_and_warn_only_while_watching
  2376. 57.47 s >
  2377. 57.47 s > test result: FAILED. 0 passed; 1 failed; 0 ignored; 0 measured; 128 filtered out; finished in 0.10s
  2378. 57.47 s > system-err
  2379. 57.47 s > thread 'tests::developer_scope_ranges_ignore_unrelated_edits_and_warn_only_while_watching' (287) panicked at crates/alphal00p-docs-builder/src/lib.rs:12350:29:
  2380. 57.47 s > called `Result::unwrap()` on an `Err` value: required documentation source is missing: /build/source/crates/spynso3/typst/STIXTwoMath-Regular.woff2
  2381. 57.47 s >
  2382. 57.47 s > Location:
  2383. 57.47 s > crates/alphal00p-docs-builder/src/lib.rs:5103:9
  2384. 57.47 s > stack backtrace:
  2385. 57.47 s > 0: __rustc::rust_begin_unwind
  2386. 57.47 s > 1: core::panicking::panic_fmt
  2387. 57.47 s > 2: core::result::unwrap_failed
  2388. 57.47 s > 3: alphal00p_docs_builder::tests::developer_scope_ranges_ignore_unrelated_edits_and_warn_only_while_watching
  2389. 57.47 s > 4: <alphal00p_docs_builder::tests::developer_scope_ranges_ignore_unrelated_edits_and_warn_only_while_watching::{closure#0} as core::ops::function::FnOnce<()>>::call_once
  2390. 57.47 s > note: Some details are omitted, run with `RUST_BACKTRACE=full` for a verbose backtrace.
  2391. 57.47 s >
  2392. 57.47 s > 10. alphal00p-docs-builder::tests::every_product_requires_a_task_chooser_and_each_supported_interface
  2393. 57.47 s > failure: test failure with exit code 101
  2394. 57.47 s > thread 'tests::every_product_requires_a_task_chooser_and_each_supported_interface' (327) panicked at crates/alphal00p-docs-builder/src/lib.rs:12274:9:
  2395. 57.47 s > assertion failed: format!("{error:#}").contains("has no quickstart page")
  2396. 57.47 s > stack backtrace:
  2397. 57.47 s > 0: __rustc::rust_begin_unwind
  2398. 57.47 s > 1: core::panicking::panic_fmt
  2399. 57.47 s > 2: core::panicking::panic
  2400. 57.47 s > 3: alphal00p_docs_builder::tests::every_product_requires_a_task_chooser_and_each_supported_interface
  2401. 57.47 s > 4: <alphal00p_docs_builder::tests::every_product_requires_a_task_chooser_and_each_supported_interface::{closure#0} as core::ops::function::FnOnce<()>>::call_once
  2402. 57.47 s > note: Some details are omitted, run with `RUST_BACKTRACE=full` for a verbose backtrace.
  2403. 57.47 s > system-out
  2404. 57.47 s > running 1 test
  2405. 57.47 s > test tests::every_product_requires_a_task_chooser_and_each_supported_interface ... FAILED
  2406. 57.47 s >
  2407. 57.47 s > failures:
  2408. 57.47 s >
  2409. 57.47 s > failures:
  2410. 57.47 s > tests::every_product_requires_a_task_chooser_and_each_supported_interface
  2411. 57.47 s >
  2412. 57.47 s > test result: FAILED. 0 passed; 1 failed; 0 ignored; 0 measured; 128 filtered out; finished in 0.12s
  2413. 57.47 s > system-err
  2414. 57.47 s > thread 'tests::every_product_requires_a_task_chooser_and_each_supported_interface' (327) panicked at crates/alphal00p-docs-builder/src/lib.rs:12274:9:
  2415. 57.47 s > assertion failed: format!("{error:#}").contains("has no quickstart page")
  2416. 57.47 s > stack backtrace:
  2417. 57.47 s > 0: __rustc::rust_begin_unwind
  2418. 57.47 s > 1: core::panicking::panic_fmt
  2419. 57.47 s > 2: core::panicking::panic
  2420. 57.47 s > 3: alphal00p_docs_builder::tests::every_product_requires_a_task_chooser_and_each_supported_interface
  2421. 57.47 s > 4: <alphal00p_docs_builder::tests::every_product_requires_a_task_chooser_and_each_supported_interface::{closure#0} as core::ops::function::FnOnce<()>>::call_once
  2422. 57.47 s > note: Some details are omitted, run with `RUST_BACKTRACE=full` for a verbose backtrace.
  2423. 57.47 s >
  2424. 57.47 s > 11. alphal00p-docs-builder::tests::pdf_manual_chapter_order_must_match_the_page_registry
  2425. 57.47 s > failure: test failure with exit code 101
  2426. 57.47 s > thread 'tests::pdf_manual_chapter_order_must_match_the_page_registry' (396) panicked at crates/alphal00p-docs-builder/src/lib.rs:12330:9:
  2427. 57.47 s > assertion failed: format!("{error:#}").contains("PDF manual chapter order differs")
  2428. 57.47 s > stack backtrace:
  2429. 57.47 s > 0: __rustc::rust_begin_unwind
  2430. 57.47 s > 1: core::panicking::panic_fmt
  2431. 57.47 s > 2: core::panicking::panic
  2432. 57.47 s > 3: alphal00p_docs_builder::tests::pdf_manual_chapter_order_must_match_the_page_registry
  2433. 57.47 s > 4: <alphal00p_docs_builder::tests::pdf_manual_chapter_order_must_match_the_page_registry::{closure#0} as core::ops::function::FnOnce<()>>::call_once
  2434. 57.47 s > note: Some details are omitted, run with `RUST_BACKTRACE=full` for a verbose backtrace.
  2435. 57.47 s > system-out
  2436. 57.47 s > running 1 test
  2437. 57.47 s > test tests::pdf_manual_chapter_order_must_match_the_page_registry ... FAILED
  2438. 57.47 s >
  2439. 57.47 s > failures:
  2440. 57.47 s >
  2441. 57.47 s > failures:
  2442. 57.47 s > tests::pdf_manual_chapter_order_must_match_the_page_registry
  2443. 57.47 s >
  2444. 57.47 s > test result: FAILED. 0 passed; 1 failed; 0 ignored; 0 measured; 128 filtered out; finished in 0.11s
  2445. 57.47 s > system-err
  2446. 57.47 s > thread 'tests::pdf_manual_chapter_order_must_match_the_page_registry' (396) panicked at crates/alphal00p-docs-builder/src/lib.rs:12330:9:
  2447. 57.47 s > assertion failed: format!("{error:#}").contains("PDF manual chapter order differs")
  2448. 57.47 s > stack backtrace:
  2449. 57.47 s > 0: __rustc::rust_begin_unwind
  2450. 57.47 s > 1: core::panicking::panic_fmt
  2451. 57.47 s > 2: core::panicking::panic
  2452. 57.47 s > 3: alphal00p_docs_builder::tests::pdf_manual_chapter_order_must_match_the_page_registry
  2453. 57.47 s > 4: <alphal00p_docs_builder::tests::pdf_manual_chapter_order_must_match_the_page_registry::{closure#0} as core::ops::function::FnOnce<()>>::call_once
  2454. 57.47 s > note: Some details are omitted, run with `RUST_BACKTRACE=full` for a verbose backtrace.
  2455. 57.47 s > =========================================
  2456. 57.47 s > Extracting 2 binaries to /build/source
  2457. 57.47 s > Extracted 5 files to /build/source in 0.03s
  2458. 57.47 s > ------------
  2459. 57.47 s > Nextest run ID 24e191ac-d1d6-4525-a290-5ce6f5184db9 with nextest profile: ci_gammaloop
  2460. 57.47 s > Starting 22 tests across 2 binaries
  2461. 57.47 s > ------------
  2462. 57.47 s > Summary [ 0.018s] 22 tests run: 22 passed, 0 skipped
  2463. 57.47 s >
  2464. 57.47 s > ========== nextest test summary ==========
  2465. 57.47 s > report: target/nextest/ci_gammaloop/junit.xml
  2466. 57.47 s > tests: 22, failures: 0, errors: 0
  2467. 57.47 s > No failing testcases found.
  2468. 57.47 s > =========================================
  2469. 57.47 s > Extracting 3 binaries (including 2 non-test binaries), 1 build script output directory, and 2 linked paths to /build/source
  2470. 57.47 s > Extracted 22 files to /build/source in 0.23s
  2471. 57.47 s > ------------
  2472. 57.47 s > Nextest run ID fcb6b418-f25c-4bf7-8e1c-fbd57dfa5fb6 with nextest profile: ci_gammaloop
  2473. 57.47 s > Starting 89 tests across 1 binary
  2474. 57.47 s > ------------
  2475. 57.47 s > Summary [ 0.041s] 89 tests run: 89 passed, 0 skipped
  2476. 57.47 s >
  2477. 57.47 s > ========== nextest test summary ==========
  2478. 57.47 s > report: target/nextest/ci_gammaloop/junit.xml
  2479. 57.47 s > tests: 89, failures: 0, errors: 0
  2480. 57.47 s > No failing testcases found.
  2481. 57.47 s > =========================================
  2482. 57.47 s > Extracting 2 binaries to /build/source
  2483. 57.47 s > Extracted 5 files to /build/source in 0.04s
  2484. 57.47 s > ------------
  2485. 57.47 s > Nextest run ID cc8a25c9-e414-4efd-8b79-788c082f5116 with nextest profile: ci_gammaloop
  2486. 57.47 s > Starting 10 tests across 2 binaries
  2487. 57.47 s > ------------
  2488. 57.47 s > Summary [ 11.100s] 10 tests run: 10 passed, 0 skipped
  2489. 57.47 s >
  2490. 57.47 s > ========== nextest test summary ==========
  2491. 57.47 s > report: target/nextest/ci_gammaloop/junit.xml
  2492. 57.47 s > tests: 10, failures: 0, errors: 0
  2493. 57.47 s > No failing testcases found.
  2494. 57.47 s > =========================================
  2495. 57.47 s > Extracting 1 binary to /build/source
  2496. 57.47 s > Extracted 4 files to /build/source in 0.03s
  2497. 57.47 s > ------------
  2498. 57.47 s > Nextest run ID 697effbe-8f91-49cb-a1a8-e8b9de70dca3 with nextest profile: ci_gammaloop
  2499. 57.47 s > Starting 0 tests across 1 binary
  2500. 57.47 s > ------------
  2501. 57.47 s > Summary [ 0.000s] 0 tests run: 0 passed, 0 skipped
  2502. 57.47 s >
  2503. 57.47 s > ========== nextest test summary ==========
  2504. 57.47 s > report: target/nextest/ci_gammaloop/junit.xml
  2505. 57.47 s > tests: 0, failures: 0, errors: 0
  2506. 57.47 s > No failing testcases found.
  2507. 57.47 s > =========================================
  2508. 57.47 s > Extracting 1 binary to /build/source
  2509. 57.47 s > Extracted 4 files to /build/source in 0.03s
  2510. 57.47 s > ------------
  2511. 57.47 s > Nextest run ID b47940d8-20d1-4c44-92b6-b4203ed58244 with nextest profile: ci_gammaloop
  2512. 57.47 s > Starting 5 tests across 1 binary
  2513. 57.47 s > ------------
  2514. 57.47 s > Summary [ 0.004s] 5 tests run: 5 passed, 0 skipped
  2515. 57.47 s >
  2516. 57.47 s > ========== nextest test summary ==========
  2517. 57.47 s > report: target/nextest/ci_gammaloop/junit.xml
  2518. 57.47 s > tests: 5, failures: 0, errors: 0
  2519. 57.47 s > No failing testcases found.
  2520. 57.47 s > =========================================
  2521. 57.47 s For full logs, run:
  2522. 57.47 s nix log /nix/store/lss98va6a34sawhfmb9hflr4awgmkih4-gammaloop-nextest-docs.drv
  2523. 57.63 s [2 built (1 failed), 103Run failed.