test packages.x86_64-linux.nix-ci-check-gammaloop-nextest-feynkit

Reproduce this run
Original Run
  1. 0.00 s $ /nix/store/61685rbaxmpigwi3z23i33sv3jyfl70q-coreutils-9.11/bin/timeout --kill-after=15s 7200s /nix/store/wknkybkzrc16r11vk5vrykh4wmw7a353-nix-2.34.8/bin/nix --extra-experimental-features nix-command --extra-experimental-features flakes flake clone git+https://github.com/alphal00p/gammaloop --dest /tmp/nix-ci-worker/stable-pwd/repo/
  2. 0.07 s Cloning into '/tmp/nix-ci-worker/stable-pwd/repo'...
  3. 1.03 s remote: Enumerating objects: 103068, done.
  4. 1.15 s remote: Counting objects: 0% (1/9461) remote: Counting objects: 1% (95/9461) remote: Counting objects: 2% (190/9461) remote: Counting objects: 3% (284/9461) remote: Counting objects: 4% (379/9461) remote: Counting objects: 5% (474/9461) remote: Counting objects: 6% (568/9461) remote: Counting objects: 7% (663/9461) remote: Counting objects: 8% (757/9461) remote: Counting objects: 9% (852/9461) remote: Counting objects: 10% (947/9461) remote: Counting objects: 11% (1041/9461) remote: Counting objects: 12% (1136/9461) remote: Counting objects: 13% (1230/9461) remote: Counting objects: 14% (1325/9461) remote: Counting objects: 15% (1420/9461) remote: Counting objects: 16% (1514/9461) remote: Counting objects: 17% (1609/9461) remote: Counting objects: 18% (1703/9461) remote: Counting objects: 19% (1798/9461) remote: Counting objects: 20% (1893/9461) remote: Counting objects: 21% (1987/9461) remote: Counting objects: 22% (2082/9461) remote: Counting objects: 23% (2177/9461) remote: Counting objects: 24% (2271/9461) remote: Counting objects: 25% (2366/9461) remote: Counting objects: 26% (2460/9461) remote: Counting objects: 27% (2555/9461) remote: Counting objects: 28% (2650/9461) remote: Counting objects: 29% (2744/9461) remote: Counting objects: 30% (2839/9461) remote: Counting objects: 31% (2933/9461) remote: Counting objects: 32% (3028/9461) remote: Counting objects: 33% (3123/9461) remote: Counting objects: 34% (3217/9461) remote: Counting objects: 35% (3312/9461) remote: Counting objects: 36% (3406/9461) remote: Counting objects: 37% (3501/9461) remote: Counting objects: 38% (3596/9461) remote: Counting objects: 39% (3690/9461) remote: Counting objects: 40% (3785/9461) remote: Counting objects: 41% (3880/9461) remote: Counting objects: 42% (3974/9461) remote: Counting objects: 43% (4069/9461) remote: Counting objects: 44% (4163/9461) remote: Counting objects: 45% (4258/9461) remote: Counting objects: 46% (4353/9461) remote: Counting objects: 47% (4447/9461) remote: Counting objects: 48% (4542/9461) remote: Counting objects: 49% (4636/9461) remote: Counting objects: 50% (4731/9461) remote: Counting objects: 51% (4826/9461) remote: Counting objects: 52% (4920/9461) remote: Counting objects: 53% (5015/9461) remote: Counting objects: 54% (5109/9461) remote: Counting objects: 55% (5204/9461) remote: Counting objects: 56% (5299/9461) remote: Counting objects: 57% (5393/9461) remote: Counting objects: 58% (5488/9461) remote: Counting objects: 59% (5582/9461) remote: Counting objects: 60% (5677/9461) remote: Counting objects: 61% (5772/9461) remote: Counting objects: 62% (5866/9461) remote: Counting objects: 63% (5961/9461) remote: Counting objects: 64% (6056/9461) remote: Counting objects: 65% (6150/9461) remote: Counting objects: 66% (6245/9461) remote: Counting objects: 67% (6339/9461) remote: Counting objects: 68% (6434/9461) remote: Counting objects: 69% (6529/9461) remote: Counting objects: 70% (6623/9461) remote: Counting objects: 71% (6718/9461) remote: Counting objects: 72% (6812/9461) remote: Counting objects: 73% (6907/9461) remote: Counting objects: 74% (7002/9461) remote: Counting objects: 75% (7096/9461) remote: Counting objects: 76% (7191/9461) remote: Counting objects: 77% (7285/9461) remote: Counting objects: 78% (7380/9461) remote: Counting objects: 79% (7475/9461) remote: Counting objects: 80% (7569/9461) remote: Counting objects: 81% (7664/9461) remote: Counting objects: 82% (7759/9461) remote: Counting objects: 83% (7853/9461) remote: Counting objects: 84% (7948/9461) remote: Counting objects: 85% (8042/9461) remote: Counting objects: 86% (8137/9461) remote: Counting objects: 87% (8232/9461) remote: Counting objects: 88% (8326/9461) remote: Counting objects: 89% (8421/9461) remote: Counting objects: 90% (8515/9461) remote: Counting objects: 91% (8610/9461) remote: Counting objects: 92% (8705/9461) remote: Counting objects: 93% (8799/9461) remote: Counting objects: 94% (8894/9461) remote: Counting objects: 95% (8988/9461) remote: Counting objects: 96% (9083/9461) remote: Counting objects: 97% (9178/9461) remote: Counting objects: 98% (9272/9461) remote: Counting objects: 99% (9367/9461) remote: Counting objects: 100% (9461/9461) remote: Counting objects: 100% (9461/9461), done.
  5. 3.28 s remote: Compressing objects: 0% (1/2048) remote: Compressing objects: 1% (21/2048) remote: Compressing objects: 2% (41/2048) remote: Compressing objects: 3% (62/2048) remote: Compressing objects: 4% (82/2048) remote: Compressing objects: 5% (103/2048) remote: Compressing objects: 6% (123/2048) remote: Compressing objects: 7% (144/2048) remote: Compressing objects: 8% (164/2048) remote: Compressing objects: 8% (176/2048) remote: Compressing objects: 9% (185/2048) remote: Compressing objects: 10% (205/2048) remote: Compressing objects: 11% (226/2048) remote: Compressing objects: 12% (246/2048) remote: Compressing objects: 13% (267/2048) remote: Compressing objects: 14% (287/2048) remote: Compressing objects: 15% (308/2048) remote: Compressing objects: 16% (328/2048) remote: Compressing objects: 17% (349/2048) remote: Compressing objects: 18% (369/2048) remote: Compressing objects: 19% (390/2048) remote: Compressing objects: 20% (410/2048) remote: Compressing objects: 21% (431/2048) remote: Compressing objects: 22% (451/2048) remote: Compressing objects: 23% (472/2048) remote: Compressing objects: 23% (480/2048) remote: Compressing objects: 24% (492/2048) remote: Compressing objects: 25% (512/2048) remote: Compressing objects: 26% (533/2048) remote: Compressing objects: 27% (553/2048) remote: Compressing objects: 28% (574/2048) remote: Compressing objects: 29% (594/2048) remote: Compressing objects: 30% (615/2048) remote: Compressing objects: 31% (635/2048) remote: Compressing objects: 32% (656/2048) remote: Compressing objects: 33% (676/2048) remote: Compressing objects: 34% (697/2048) remote: Compressing objects: 35% (717/2048) remote: Compressing objects: 36% (738/2048) remote: Compressing objects: 37% (758/2048) remote: Compressing objects: 38% (779/2048) remote: Compressing objects: 39% (799/2048) remote: Compressing objects: 40% (820/2048) remote: Compressing objects: 41% (840/2048) remote: Compressing objects: 42% (861/2048) remote: Compressing objects: 43% (881/2048) remote: Compressing objects: 44% (902/2048) remote: Compressing objects: 45% (922/2048) remote: Compressing objects: 46% (943/2048) remote: Compressing objects: 47% (963/2048) remote: Compressing objects: 48% (984/2048) remote: Compressing objects: 49% (1004/2048) remote: Compressing objects: 50% (1024/2048) remote: Compressing objects: 51% (1045/2048) remote: Compressing objects: 52% (1065/2048) remote: Compressing objects: 53% (1086/2048) remote: Compressing objects: 54% (1106/2048) remote: Compressing objects: 55% (1127/2048) remote: Compressing objects: 56% (1147/2048) remote: Compressing objects: 57% (1168/2048) remote: Compressing objects: 58% (1188/2048) remote: Compressing objects: 59% (1209/2048) remote: Compressing objects: 60% (1229/2048) remote: Compressing objects: 61% (1250/2048) remote: Compressing objects: 62% (1270/2048) remote: Compressing objects: 63% (1291/2048) remote: Compressing objects: 64% (1311/2048) remote: Compressing objects: 65% (1332/2048) remote: Compressing objects: 66% (1352/2048) remote: Compressing objects: 67% (1373/2048) remote: Compressing objects: 68% (1393/2048) remote: Compressing objects: 69% (1414/2048) remote: Compressing objects: 70% (1434/2048) remote: Compressing objects: 71% (1455/2048) remote: Compressing objects: 72% (1475/2048) remote: Compressing objects: 73% (1496/2048) remote: Compressing objects: 74% (1516/2048) remote: Compressing objects: 75% (1536/2048) remote: Compressing objects: 76% (1557/2048) remote: Compressing objects: 77% (1577/2048) remote: Compressing objects: 78% (1598/2048) remote: Compressing objects: 79% (1618/2048) remote: Compressing objects: 80% (1639/2048) remote: Compressing objects: 81% (1659/2048) remote: Compressing objects: 82% (1680/2048) remote: Compressing objects: 83% (1700/2048) remote: Compressing objects: 84% (1721/2048) remote: Compressing objects: 85% (1741/2048) remote: Compressing objects: 86% (1762/2048) remote: Compressing objects: 87% (1782/2048) remote: Compressing objects: 88% (1803/2048) remote: Compressing objects: 89% (1823/2048) remote: Compressing objects: 90% (1844/2048) remote: Compressing objects: 91% (1864/2048) remote: Compressing objects: 92% (1885/2048) remote: Compressing objects: 93% (1905/2048) remote: Compressing objects: 94% (1926/2048) remote: Compressing objects: 95% (1946/2048) remote: Compressing objects: 96% (1967/2048) remote: Compressing objects: 97% (1987/2048) remote: Compressing objects: 98% (2008/2048) remote: Compressing objects: 99% (2028/2048) remote: Compressing objects: 100% (2048/2048) remote: Compressing objects: 100% (2048/2048), done.
  6. 15.14 s Receiving objects: 0% (1/103068) Receiving objects: 1% (1031/103068) Receiving objects: 2% (2062/103068) Receiving objects: 3% (3093/103068) Receiving objects: 4% (4123/103068) Receiving objects: 5% (5154/103068) Receiving objects: 6% (6185/103068) Receiving objects: 7% (7215/103068), 15.37 MiB | 30.73 MiB/s Receiving objects: 8% (8246/103068), 15.37 MiB | 30.73 MiB/s Receiving objects: 9% (9277/103068), 15.37 MiB | 30.73 MiB/s Receiving objects: 10% (10307/103068), 15.37 MiB | 30.73 MiB/s Receiving objects: 11% (11338/103068), 15.37 MiB | 30.73 MiB/s Receiving objects: 12% (12369/103068), 15.37 MiB | 30.73 MiB/s Receiving objects: 13% (13399/103068), 15.37 MiB | 30.73 MiB/s Receiving objects: 14% (14430/103068), 15.37 MiB | 30.73 MiB/s Receiving objects: 15% (15461/103068), 15.37 MiB | 30.73 MiB/s Receiving objects: 16% (16491/103068), 15.37 MiB | 30.73 MiB/s Receiving objects: 17% (17522/103068), 15.37 MiB | 30.73 MiB/s Receiving objects: 18% (18553/103068), 15.37 MiB | 30.73 MiB/s Receiving objects: 19% (19583/103068), 15.37 MiB | 30.73 MiB/s Receiving objects: 20% (20614/103068), 15.37 MiB | 30.73 MiB/s Receiving objects: 21% (21645/103068), 15.37 MiB | 30.73 MiB/s Receiving objects: 22% (22675/103068), 15.37 MiB | 30.73 MiB/s Receiving objects: 23% (23706/103068), 15.37 MiB | 30.73 MiB/s Receiving objects: 24% (24737/103068), 15.37 MiB | 30.73 MiB/s Receiving objects: 25% (25767/103068), 15.37 MiB | 30.73 MiB/s Receiving objects: 26% (26798/103068), 15.37 MiB | 30.73 MiB/s Receiving objects: 27% (27829/103068), 15.37 MiB | 30.73 MiB/s Receiving objects: 28% (28860/103068), 15.37 MiB | 30.73 MiB/s Receiving objects: 29% (29890/103068), 15.37 MiB | 30.73 MiB/s Receiving objects: 30% (30921/103068), 15.37 MiB | 30.73 MiB/s Receiving objects: 31% (31952/103068), 15.37 MiB | 30.73 MiB/s Receiving objects: 32% (32982/103068), 15.37 MiB | 30.73 MiB/s Receiving objects: 33% (34013/103068), 15.37 MiB | 30.73 MiB/s Receiving objects: 33% (34403/103068), 33.49 MiB | 33.48 MiB/s Receiving objects: 34% (35044/103068), 33.49 MiB | 33.48 MiB/s Receiving objects: 35% (36074/103068), 33.49 MiB | 33.48 MiB/s Receiving objects: 36% (37105/103068), 33.49 MiB | 33.48 MiB/s Receiving objects: 37% (38136/103068), 33.49 MiB | 33.48 MiB/s Receiving objects: 38% (39166/103068), 33.49 MiB | 33.48 MiB/s Receiving objects: 39% (40197/103068), 33.49 MiB | 33.48 MiB/s Receiving objects: 40% (41228/103068), 33.49 MiB | 33.48 MiB/s Receiving objects: 41% (42258/103068), 33.49 MiB | 33.48 MiB/s Receiving objects: 42% (43289/103068), 50.46 MiB | 33.55 MiB/s Receiving objects: 43% (44320/103068), 50.46 MiB | 33.55 MiB/s Receiving objects: 44% (45350/103068), 50.46 MiB | 33.55 MiB/s Receiving objects: 45% (46381/103068), 50.46 MiB | 33.55 MiB/s Receiving objects: 46% (47412/103068), 50.46 MiB | 33.55 MiB/s Receiving objects: 47% (48442/103068), 50.46 MiB | 33.55 MiB/s Receiving objects: 47% (48737/103068), 50.46 MiB | 33.55 MiB/s Receiving objects: 48% (49473/103068), 66.43 MiB | 33.02 MiB/s Receiving objects: 49% (50504/103068), 66.43 MiB | 33.02 MiB/s Receiving objects: 50% (51534/103068), 66.43 MiB | 33.02 MiB/s Receiving objects: 51% (52565/103068), 66.43 MiB | 33.02 MiB/s Receiving objects: 52% (53596/103068), 66.43 MiB | 33.02 MiB/s Receiving objects: 53% (54627/103068), 66.43 MiB | 33.02 MiB/s Receiving objects: 54% (55657/103068), 66.43 MiB | 33.02 MiB/s Receiving objects: 55% (56688/103068), 66.43 MiB | 33.02 MiB/s Receiving objects: 55% (57067/103068), 100.50 MiB | 33.37 MiB/s Receiving objects: 55% (57164/103068), 133.12 MiB | 33.12 MiB/s Receiving objects: 56% (57719/103068), 149.68 MiB | 33.12 MiB/s Receiving objects: 57% (58749/103068), 149.68 MiB | 33.12 MiB/s Receiving objects: 57% (58952/103068), 149.68 MiB | 33.12 MiB/s Receiving objects: 58% (59780/103068), 166.36 MiB | 33.42 MiB/s Receiving objects: 59% (60811/103068), 166.36 MiB | 33.42 MiB/s Receiving objects: 60% (61841/103068), 166.36 MiB | 33.42 MiB/s Receiving objects: 61% (62872/103068), 166.36 MiB | 33.42 MiB/s Receiving objects: 62% (63903/103068), 166.36 MiB | 33.42 MiB/s Receiving objects: 63% (64933/103068), 182.53 MiB | 32.99 MiB/s Receiving objects: 64% (65964/103068), 182.53 MiB | 32.99 MiB/s Receiving objects: 65% (66995/103068), 182.53 MiB | 32.99 MiB/s Receiving objects: 66% (68025/103068), 182.53 MiB | 32.99 MiB/s Receiving objects: 67% (69056/103068), 182.53 MiB | 32.99 MiB/s Receiving objects: 68% (70087/103068), 182.53 MiB | 32.99 MiB/s Receiving objects: 69% (71117/103068), 182.53 MiB | 32.99 MiB/s Receiving objects: 70% (72148/103068), 182.53 MiB | 32.99 MiB/s Receiving objects: 71% (73179/103068), 182.53 MiB | 32.99 MiB/s Receiving objects: 71% (73872/103068), 182.53 MiB | 32.99 MiB/s Receiving objects: 72% (74209/103068), 198.78 MiB | 32.86 MiB/s Receiving objects: 73% (75240/103068), 198.78 MiB | 32.86 MiB/s Receiving objects: 74% (76271/103068), 198.78 MiB | 32.86 MiB/s Receiving objects: 74% (77133/103068), 215.57 MiB | 33.10 MiB/s Receiving objects: 75% (77301/103068), 232.52 MiB | 33.13 MiB/s Receiving objects: 76% (78332/103068), 232.52 MiB | 33.13 MiB/s Receiving objects: 77% (79363/103068), 232.52 MiB | 33.13 MiB/s Receiving objects: 78% (80394/103068), 232.52 MiB | 33.13 MiB/s Receiving objects: 79% (81424/103068), 232.52 MiB | 33.13 MiB/s Receiving objects: 80% (82455/103068), 232.52 MiB | 33.13 MiB/s Receiving objects: 81% (83486/103068), 232.52 MiB | 33.13 MiB/s Receiving objects: 81% (84187/103068), 265.25 MiB | 32.99 MiB/s Receiving objects: 82% (84516/103068), 281.63 MiB | 32.99 MiB/s Receiving objects: 82% (84516/103068), 298.79 MiB | 33.12 MiB/s Receiving objects: 83% (85547/103068), 314.91 MiB | 32.99 MiB/s Receiving objects: 84% (86578/103068), 314.91 MiB | 32.99 MiB/s Receiving objects: 85% (87608/103068), 314.91 MiB | 32.99 MiB/s Receiving objects: 85% (87908/103068), 314.91 MiB | 32.99 MiB/s Receiving objects: 86% (88639/103068), 331.56 MiB | 33.10 MiB/s Receiving objects: 87% (89670/103068), 331.56 MiB | 33.10 MiB/s Receiving objects: 88% (90700/103068), 331.56 MiB | 33.10 MiB/s Receiving objects: 88% (91591/103068), 364.36 MiB | 33.04 MiB/s Receiving objects: 89% (91731/103068), 364.36 MiB | 33.04 MiB/s Receiving objects: 90% (92762/103068), 380.38 MiB | 32.84 MiB/s Receiving objects: 91% (93792/103068), 380.38 MiB | 32.84 MiB/s Receiving objects: 92% (94823/103068), 380.38 MiB | 32.84 MiB/s Receiving objects: 93% (95854/103068), 380.38 MiB | 32.84 MiB/s Receiving objects: 94% (96884/103068), 380.38 MiB | 32.84 MiB/s Receiving objects: 95% (97915/103068), 380.38 MiB | 32.84 MiB/s Receiving objects: 96% (98946/103068), 380.38 MiB | 32.84 MiB/s Receiving objects: 97% (99976/103068), 380.38 MiB | 32.84 MiB/s Receiving objects: 98% (101007/103068), 380.38 MiB | 32.84 MiB/s Receiving objects: 99% (102038/103068), 380.38 MiB | 32.84 MiB/s remote: Total 103068 (delta 8175), reused 7487 (delta 7404), pack-reused 93607 (from 4)
  7. 15.14 s Receiving objects: 100% (103068/103068), 380.38 MiB | 32.84 MiB/s Receiving objects: 100% (103068/103068), 391.57 MiB | 33.02 MiB/s, done.
  8. 16.47 s Resolving deltas: 0% (0/67530) Resolving deltas: 1% (676/67530) Resolving deltas: 2% (1351/67530) Resolving deltas: 3% (2026/67530) Resolving deltas: 4% (2702/67530) Resolving deltas: 5% (3377/67530) Resolving deltas: 6% (4052/67530) Resolving deltas: 7% (4728/67530) Resolving deltas: 8% (5403/67530) Resolving deltas: 9% (6078/67530) Resolving deltas: 10% (6754/67530) Resolving deltas: 11% (7429/67530) Resolving deltas: 12% (8104/67530) Resolving deltas: 13% (8779/67530) Resolving deltas: 14% (9457/67530) Resolving deltas: 15% (10130/67530) Resolving deltas: 16% (10806/67530) Resolving deltas: 17% (11481/67530) Resolving deltas: 18% (12156/67530) Resolving deltas: 19% (12831/67530) Resolving deltas: 20% (13506/67530) Resolving deltas: 21% (14182/67530) Resolving deltas: 22% (14857/67530) Resolving deltas: 23% (15532/67530) Resolving deltas: 24% (16208/67530) Resolving deltas: 25% (16883/67530) Resolving deltas: 26% (17558/67530) Resolving deltas: 27% (18234/67530) Resolving deltas: 28% (18909/67530) Resolving deltas: 29% (19584/67530) Resolving deltas: 30% (20259/67530) Resolving deltas: 31% (20935/67530) Resolving deltas: 32% (21610/67530) Resolving deltas: 33% (22285/67530) Resolving deltas: 34% (22962/67530) Resolving deltas: 35% (23636/67530) Resolving deltas: 36% (24312/67530) Resolving deltas: 37% (24987/67530) Resolving deltas: 38% (25662/67530) Resolving deltas: 39% (26337/67530) Resolving deltas: 40% (27012/67530) Resolving deltas: 41% (27688/67530) Resolving deltas: 42% (28364/67530) Resolving deltas: 43% (29042/67530) Resolving deltas: 44% (29714/67530) Resolving deltas: 45% (30390/67530) Resolving deltas: 46% (31064/67530) Resolving deltas: 47% (31740/67530) Resolving deltas: 48% (32415/67530) Resolving deltas: 49% (33090/67530) Resolving deltas: 50% (33765/67530) Resolving deltas: 51% (34443/67530) Resolving deltas: 52% (35116/67530) Resolving deltas: 53% (35792/67530) Resolving deltas: 54% (36469/67530) Resolving deltas: 55% (37143/67530) Resolving deltas: 56% (37817/67530) Resolving deltas: 57% (38493/67530) Resolving deltas: 58% (39168/67530) Resolving deltas: 59% (39843/67530) Resolving deltas: 60% (40518/67530) Resolving deltas: 61% (41194/67530) Resolving deltas: 62% (41869/67530) Resolving deltas: 63% (42544/67530) Resolving deltas: 64% (43220/67530) Resolving deltas: 65% (43895/67530) Resolving deltas: 66% (44570/67530) Resolving deltas: 67% (45246/67530) Resolving deltas: 68% (45921/67530) Resolving deltas: 69% (46596/67530) Resolving deltas: 70% (47271/67530) Resolving deltas: 71% (47947/67530) Resolving deltas: 72% (48622/67530) Resolving deltas: 73% (49297/67530) Resolving deltas: 74% (49973/67530) Resolving deltas: 75% (50648/67530) Resolving deltas: 76% (51323/67530) Resolving deltas: 77% (52000/67530) Resolving deltas: 77% (52242/67530) Resolving deltas: 78% (52674/67530) Resolving deltas: 79% (53349/67530) Resolving deltas: 80% (54024/67530) Resolving deltas: 81% (54700/67530) Resolving deltas: 82% (55375/67530) Resolving deltas: 83% (56050/67530) Resolving deltas: 84% (56726/67530) Resolving deltas: 85% (57401/67530) Resolving deltas: 86% (58076/67530) Resolving deltas: 87% (58752/67530) Resolving deltas: 88% (59428/67530) Resolving deltas: 89% (60102/67530) Resolving deltas: 90% (60777/67530) Resolving deltas: 91% (61453/67530) Resolving deltas: 92% (62128/67530) Resolving deltas: 93% (62803/67530) Resolving deltas: 94% (63479/67530) Resolving deltas: 95% (64154/67530) Resolving deltas: 96% (64829/67530) Resolving deltas: 97% (65505/67530) Resolving deltas: 98% (66180/67530) Resolving deltas: 99% (66856/67530) Resolving deltas: 100% (67530/67530) Resolving deltas: 100% (67530/67530), done.
  9. 17.16 s Fetching commit 318759b6ebbe3c9f174340a96740fa34c8812634 for feynkit ...
  10. 17.16 s $ /nix/store/5vpcfsdx1lcnlb2y4k7xyc74shp5qwbh-git-2.54.0/bin/git fetch origin 318759b6ebbe3c9f174340a96740fa34c8812634
  11. 17.58 s From https://github.com/alphal00p/gammaloop
  12. 17.58 s * branch 318759b6ebbe3c9f174340a96740fa34c8812634 -> FETCH_HEAD
  13. 17.60 s $ /nix/store/61685rbaxmpigwi3z23i33sv3jyfl70q-coreutils-9.11/bin/timeout --kill-after=15s 7200s /nix/store/5vpcfsdx1lcnlb2y4k7xyc74shp5qwbh-git-2.54.0/bin/git -c advice.detachedHead=false checkout 318759b6ebbe3c9f174340a96740fa34c8812634
  14. 17.88 s HEAD is now at 318759b6e expose diagram analysis and make Python generation interruptible
  15. 17.88 s $ /nix/store/61685rbaxmpigwi3z23i33sv3jyfl70q-coreutils-9.11/bin/timeout --kill-after=15s 7200s /nix/store/wknkybkzrc16r11vk5vrykh4wmw7a353-nix-2.34.8/bin/nix --extra-experimental-features nix-command --extra-experimental-features flakes --log-format internal-json run .#packages.x86_64-linux.nix-ci-check-gammaloop-nextest-feynkit --print-build-logs
  16. 18.07 s warning: ignoring untrusted flake configuration setting 'extra-substituters'.
  17. 18.07 s Pass '--accept-flake-config' to trust it
  18. 18.07 s warning: ignoring untrusted flake configuration setting 'extra-trusted-public-keys'.
  19. 18.07 s Pass '--accept-flake-config' to trust it
  20. 25.70 s
  21. 25.92 s Downloading cached boehm-gc from https://cache.nix-ci.com
  22. 25.92 s Downloading cached busybox from https://cache.nix-ci.com
  23. 25.92 s Downloading cached aws-c-common from https://cache.nix-ci.com
  24. 25.92 s Downloading cached brotli-1.2.0-lib from https://cache.nix-ci.com
  25. 25.92 s Downloading cached editline-1.17.1-unstable-2025-05 from https://cache.nix-ci.com
  26. 25.93 s Downloading cached libcpuid from https://cache.nix-ci.com
  27. 25.93 s Downloading cached libseccomp-2.6.1-lib from https://cache.nix-ci.com
  28. 25.93 s Downloading cached libsodium-1.0.22-unstable-2026-08 from https://cache.nix-ci.com
  29. 25.93 s Downloading cached lowdown-3.0.1-lib from https://cache.nix-ci.com
  30. 25.93 s Downloading cached publicsuffix-list-0-unstable-2026-09 from https://cache.nix-ci.com
  31. 25.93 s Downloading cached icu4c from https://cache.nix-ci.com
  32. 25.93 s Downloading cached libssh2 from https://cache.nix-ci.com
  33. 25.93 s Downloading cached libxml2 from https://cache.nix-ci.com
  34. 25.93 s Downloading cached llhttp from https://cache.nix-ci.com
  35. 25.93 s Downloading cached nghttp2-1.70.0-lib from https://cache.nix-ci.com
  36. 25.93 s Downloading cached nghttp3 from https://cache.nix-ci.com
  37. 25.99 s Downloaded cached editline-1.17.1-unstable-2025-05 (58 KiB) in 65ms
  38. 25.99 s Progress: 0 of 1 built, 1 of 50 downloaded from cache (15 downloading)
  39. 25.99 s Downloading cached hwloc-2.14.0-lib from https://cache.nix-ci.com
  40. 25.99 s Downloaded cached llhttp (89 KiB) in 65ms
  41. 25.99 s Progress: 0 of 1 built, 2 of 50 downloaded from cache (15 downloading)
  42. 25.99 s Downloading cached keyutils-1.6.3-lib from https://cache.nix-ci.com
  43. 26.00 s Downloaded cached nghttp3 (228 KiB) in 69ms
  44. 26.00 s Progress: 0 of 1 built, 3 of 50 downloaded from cache (15 downloading)
  45. 26.00 s Downloading cached ngtcp2 from https://cache.nix-ci.com
  46. 26.00 s Downloaded cached libseccomp-2.6.1-lib (189 KiB) in 71ms
  47. 26.00 s Progress: 0 of 1 built, 4 of 50 downloaded from cache (15 downloading)
  48. 26.00 s Downloading cached s2n-tls from https://cache.nix-ci.com
  49. 26.00 s Downloaded cached libcpuid (326 KiB) in 73ms
  50. 26.00 s Progress: 0 of 1 built, 5 of 50 downloaded from cache (15 downloading)
  51. 26.00 s Downloaded cached publicsuffix-list-0-unstable-2026-09 (330 KiB) in 75ms
  52. 26.00 s Progress: 0 of 1 built, 6 of 50 downloaded from cache (14 downloading)
  53. 26.00 s Downloaded cached boehm-gc (312 KiB) in 79ms
  54. 26.00 s Progress: 0 of 1 built, 7 of 50 downloaded from cache (14 downloading)
  55. 26.00 s Downloading cached libpsl from https://cache.nix-ci.com
  56. 26.00 s Downloaded cached nghttp2-1.70.0-lib (225 KiB) in 77ms
  57. 26.00 s Progress: 0 of 1 built, 8 of 50 downloaded from cache (13 downloading)
  58. 26.01 s Downloaded cached libssh2 (330 KiB) in 80ms
  59. 26.01 s Progress: 0 of 1 built, 9 of 50 downloaded from cache (12 downloading)
  60. 26.01 s Downloaded cached busybox (230 KiB) in 84ms
  61. 26.01 s Downloading cached libgit2-1.9.7-lib from https://cache.nix-ci.com
  62. 26.01 s Progress: 0 of 1 built, 10 of 50 downloaded from cache (12 downloading)
  63. 26.01 s Downloaded cached lowdown-3.0.1-lib (341 KiB) in 82ms
  64. 26.01 s Progress: 0 of 1 built, 11 of 50 downloaded from cache (11 downloading)
  65. 26.01 s Downloaded cached libsodium-1.0.22-unstable-2026-08 (669 KiB) in 86ms
  66. 26.01 s Progress: 0 of 1 built, 12 of 50 downloaded from cache (10 downloading)
  67. 26.01 s Downloaded cached aws-c-common (1.1 MiB) in 89ms
  68. 26.01 s Progress: 0 of 1 built, 13 of 50 downloaded from cache (9 downloading)
  69. 26.01 s Downloading cached aws-c-cal from https://cache.nix-ci.com
  70. 26.01 s Downloading cached aws-c-compression from https://cache.nix-ci.com
  71. 26.01 s Downloading cached aws-c-sdkutils from https://cache.nix-ci.com
  72. 26.01 s Downloading cached aws-checksums from https://cache.nix-ci.com
  73. 26.02 s Downloaded cached brotli-1.2.0-lib (961 KiB) in 92ms
  74. 26.02 s Progress: 0 of 1 built, 14 of 50 downloaded from cache (12 downloading)
  75. 26.02 s Downloaded cached libxml2 (1.4 MiB) in 94ms
  76. 26.02 s Progress: 0 of 1 built, 15 of 50 downloaded from cache (11 downloading)
  77. 26.02 s Downloading cached libarchive-3.8.9-lib from https://cache.nix-ci.com
  78. 26.05 s Downloaded cached keyutils-1.6.3-lib (41 KiB) in 53ms
  79. 26.05 s Progress: 0 of 1 built, 16 of 50 downloaded from cache (11 downloading)
  80. 26.05 s Downloading cached krb5-1.22.2-lib from https://cache.nix-ci.com
  81. 26.05 s Downloaded cached hwloc-2.14.0-lib (458 KiB) in 56ms
  82. 26.05 s Progress: 0 of 1 built, 17 of 50 downloaded from cache (11 downloading)
  83. 26.05 s Downloading cached onetbb from https://cache.nix-ci.com
  84. 26.06 s Downloaded cached ngtcp2 (515 KiB) in 61ms
  85. 26.06 s Progress: 0 of 1 built, 18 of 50 downloaded from cache (11 downloading)
  86. 26.06 s Downloaded cached libpsl (114 KiB) in 56ms
  87. 26.06 s Progress: 0 of 1 built, 19 of 50 downloaded from cache (10 downloading)
  88. 26.06 s Downloaded cached s2n-tls (1.3 MiB) in 62ms
  89. 26.06 s Progress: 0 of 1 built, 20 of 50 downloaded from cache (9 downloading)
  90. 26.07 s Downloaded cached aws-c-compression (31 KiB) in 58ms
  91. 26.07 s Progress: 0 of 1 built, 21 of 50 downloaded from cache (8 downloading)
  92. 26.08 s Downloaded cached aws-checksums (86 KiB) in 60ms
  93. 26.08 s Progress: 0 of 1 built, 22 of 50 downloaded from cache (7 downloading)
  94. 26.08 s Downloaded cached libgit2-1.9.7-lib (1.6 MiB) in 69ms
  95. 26.08 s Progress: 0 of 1 built, 23 of 50 downloaded from cache (6 downloading)
  96. 26.08 s Downloaded cached aws-c-sdkutils (155 KiB) in 63ms
  97. 26.08 s Progress: 0 of 1 built, 24 of 50 downloaded from cache (5 downloading)
  98. 26.08 s Downloaded cached aws-c-cal (158 KiB) in 65ms
  99. 26.08 s Progress: 0 of 1 built, 25 of 50 downloaded from cache (4 downloading)
  100. 26.08 s Downloading cached aws-c-io from https://cache.nix-ci.com
  101. 26.08 s Downloaded cached libarchive-3.8.9-lib (961 KiB) in 61ms
  102. 26.08 s Progress: 0 of 1 built, 26 of 50 downloaded from cache (4 downloading)
  103. 26.09 s Downloaded cached onetbb (626 KiB) in 45ms
  104. 26.09 s Progress: 0 of 1 built, 27 of 50 downloaded from cache (3 downloading)
  105. 26.09 s Downloading cached libblake3 from https://cache.nix-ci.com
  106. 26.11 s Downloaded cached krb5-1.22.2-lib (2.7 MiB) in 62ms
  107. 26.11 s Progress: 0 of 1 built, 28 of 50 downloaded from cache (3 downloading)
  108. 26.11 s Downloading cached curl from https://cache.nix-ci.com
  109. 26.14 s Downloaded cached aws-c-io (648 KiB) in 62ms
  110. 26.14 s Progress: 0 of 1 built, 29 of 50 downloaded from cache (3 downloading)
  111. 26.14 s Downloading cached aws-c-event-stream from https://cache.nix-ci.com
  112. 26.14 s Downloading cached aws-c-http from https://cache.nix-ci.com
  113. 26.15 s Downloaded cached libblake3 (117 KiB) in 56ms
  114. 26.15 s Progress: 0 of 1 built, 30 of 50 downloaded from cache (4 downloading)
  115. 26.18 s Downloaded cached curl (1.2 MiB) in 66ms
  116. 26.18 s Progress: 0 of 1 built, 31 of 50 downloaded from cache (3 downloading)
  117. 26.18 s Downloaded cached icu4c (39.5 MiB) in 258ms
  118. 26.18 s Progress: 0 of 1 built, 32 of 50 downloaded from cache (2 downloading)
  119. 26.18 s Downloading cached boost from https://cache.nix-ci.com
  120. 26.19 s Downloaded cached aws-c-http (641 KiB) in 41ms
  121. 26.19 s Progress: 0 of 1 built, 33 of 50 downloaded from cache (2 downloading)
  122. 26.19 s Downloading cached aws-c-auth from https://cache.nix-ci.com
  123. 26.19 s Downloading cached aws-c-mqtt from https://cache.nix-ci.com
  124. 26.19 s Downloaded cached aws-c-event-stream (176 KiB) in 42ms
  125. 26.19 s Progress: 0 of 1 built, 34 of 50 downloaded from cache (3 downloading)
  126. 26.23 s Downloaded cached aws-c-mqtt (557 KiB) in 41ms
  127. 26.23 s Progress: 0 of 1 built, 35 of 50 downloaded from cache (2 downloading)
  128. 26.23 s Downloaded cached aws-c-auth (387 KiB) in 43ms
  129. 26.23 s Progress: 0 of 1 built, 36 of 50 downloaded from cache (1 downloading)
  130. 26.23 s Downloading cached aws-c-s3 from https://cache.nix-ci.com
  131. 26.26 s Downloaded cached boost (14.5 MiB) in 71ms
  132. 26.26 s Progress: 0 of 1 built, 37 of 50 downloaded from cache (1 downloading)
  133. 26.26 s Downloading cached nix-util from https://cache.nix-ci.com
  134. 26.26 s Downloaded cached aws-c-s3 (384 KiB) in 34ms
  135. 26.26 s Progress: 0 of 1 built, 38 of 50 downloaded from cache (1 downloading)
  136. 26.26 s Downloading cached aws-crt-cpp from https://cache.nix-ci.com
  137. 26.30 s Downloaded cached aws-crt-cpp (979 KiB) in 33ms
  138. 26.30 s Progress: 0 of 1 built, 39 of 50 downloaded from cache (1 downloading)
  139. 26.32 s Downloaded cached nix-util (2.4 MiB) in 58ms
  140. 26.32 s Progress: 0 of 1 built, 40 of 50 downloaded from cache
  141. 26.32 s Downloading cached nix-nswrapper from https://cache.nix-ci.com
  142. 26.32 s Downloading cached nix-store from https://cache.nix-ci.com
  143. 26.34 s Downloaded cached nix-nswrapper (131 KiB) in 28ms
  144. 26.34 s Progress: 0 of 1 built, 41 of 50 downloaded from cache (1 downloading)
  145. 26.37 s Downloaded cached nix-store (5.8 MiB) in 53ms
  146. 26.37 s Progress: 0 of 1 built, 42 of 50 downloaded from cache
  147. 26.37 s Downloading cached nix-fetchers from https://cache.nix-ci.com
  148. 26.37 s Downloading cached nix-main from https://cache.nix-ci.com
  149. 26.40 s Downloaded cached nix-main (393 KiB) in 33ms
  150. 26.40 s Progress: 0 of 1 built, 43 of 50 downloaded from cache (1 downloading)
  151. 26.41 s Downloaded cached nix-fetchers (1.5 MiB) in 37ms
  152. 26.41 s Progress: 0 of 1 built, 44 of 50 downloaded from cache
  153. 26.41 s Downloading cached nix-expr from https://cache.nix-ci.com
  154. 26.45 s Downloaded cached nix-expr (3.3 MiB) in 38ms
  155. 26.45 s Progress: 0 of 1 built, 45 of 50 downloaded from cache
  156. 26.45 s Downloading cached nix-flake from https://cache.nix-ci.com
  157. 26.48 s Downloaded cached nix-flake (956 KiB) in 31ms
  158. 26.48 s Progress: 0 of 1 built, 46 of 50 downloaded from cache
  159. 26.48 s Downloading cached nix-cmd from https://cache.nix-ci.com
  160. 26.51 s Downloaded cached nix-cmd (1 MiB) in 33ms
  161. 26.51 s Progress: 0 of 1 built, 47 of 50 downloaded from cache
  162. 26.51 s Downloading cached nix from https://cache.nix-ci.com
  163. 26.56 s Downloaded cached nix (3.9 MiB) in 44ms
  164. 26.56 s Progress: 0 of 1 built, 48 of 50 downloaded from cache
  165. 26.56 s Downloading cached nix from https://cache.nix-ci.com
  166. 26.59 s Downloaded cached nix (8848 B) in 31ms
  167. 26.59 s Progress: 0 of 1 built, 49 of 50 downloaded from cache
  168. 26.59 s Downloading cached nix-ci-check-gammaloop-nextest-feynkit from https://cache.nix-ci.com
  169. 26.63 s Downloaded cached nix-ci-check-gammaloop-nextest-feynkit (1128 B) in 38ms
  170. 26.63 s Progress: 0 of 1 built, 50 of 50 downloaded from cache
  171. 26.80 s evaluating derivation 'gdo you want to allow configuration setting 'extra-substituters' to be set to 'https://cache.nix-ci.com' (y/N)? do you want to permanently mark this value as untrusted (y/N)? warning: ignoring untrusted flake configuration setting 'extra-substituters'.
  172. 26.80 s Pass '--accept-flake-config' to trust it
  173. 26.80 s do you want to allow configuration setting 'extra-trusted-public-keys' to be set to 'nix-ci:g3xV5BDTLtIBZr/A00IU1x0EtKKlb7YLgBN2SgYgM6A=' (y/N)? do you want to permanently mark this value as untrusted (y/N)? warning: ignoring untrusted flake configuration setting 'extra-trusted-public-keys'.
  174. 26.80 s Pass '--accept-flake-config' to trust it
  175. 32.91 s copying '/nix/store/wv69 evaluating derivation 'g copying '/nix/store/wv69 evaluating derivation 'g copying '/nix/store/wv69 evaluating derivation 'g copying '/nix/store/wv69 evaluating derivation 'g copying '/nix/store/wv69 evaluating derivation 'g copying '/nix/store/wv69 evaluating derivation 'g querying gammaloop-nexte querying info about miss querying gammaloop-nexte [0.0 KiB DL] querying in [0/2 built, 1/0/1 copied [0/1 built, 1 copied (4. [1/0/1 built, 1 copied (gammaloop-nextest-feynkit> Extracting 1 binary and 2 linked paths to /build/source
  176. 33.00 s gammaloop-nextest-feynkit> Extracted 15 files to /build/source in 0.09s
  177. 33.01 s gammaloop-nextest-feynkit> ------------
  178. 33.01 s gammaloop-nextest-feynkit> Nextest run ID acf39b19-0410-4ce3-a79e-f0c6744f5c78 with nextest profile: ci_gammaloop
  179. 33.01 s gammaloop-nextest-feynkit> Starting 1 test across 1 binary
  180. 33.01 s gammaloop-nextest-feynkit> ------------
  181. 33.01 s gammaloop-nextest-feynkit> Summary [ 0.006s] 1 test run: 1 passed, 0 skipped
  182. 33.08 s gammaloop-nextest-feynkit>
  183. 33.08 s gammaloop-nextest-feynkit> ========== nextest test summary ==========
  184. 33.08 s gammaloop-nextest-feynkit> report: target/nextest/ci_gammaloop/junit.xml
  185. 33.08 s gammaloop-nextest-feynkit> tests: 1, failures: 0, errors: 0
  186. 33.08 s gammaloop-nextest-feynkit> No failing testcases found.
  187. 33.08 s gammaloop-nextest-feynkit> =========================================
  188. 33.09 s gammaloop-nextest-feynkit> Extracting 1 binary and 2 linked paths to /build/source
  189. 33.18 s gammaloop-nextest-feynkit> Extracted 15 files to /build/source in 0.09s
  190. 33.19 s gammaloop-nextest-feynkit> ------------
  191. 33.19 s gammaloop-nextest-feynkit> Nextest run ID c0e61333-b8a4-4f21-94f0-e6db1e4d42b6 with nextest profile: ci_gammaloop
  192. 33.19 s gammaloop-nextest-feynkit> Starting 33 tests across 1 binary
  193. 33.21 s gammaloop-nextest-feynkit> ------------
  194. 33.21 s gammaloop-nextest-feynkit> Summary [ 0.019s] 33 tests run: 33 passed, 0 skipped
  195. 33.25 s gammaloop-nextest-feynkit>
  196. 33.25 s gammaloop-nextest-feynkit> ========== nextest test summary ==========
  197. 33.25 s gammaloop-nextest-feynkit> report: target/nextest/ci_gammaloop/junit.xml
  198. 33.25 s gammaloop-nextest-feynkit> tests: 33, failures: 0, errors: 0
  199. 33.25 s gammaloop-nextest-feynkit> No failing testcases found.
  200. 33.25 s gammaloop-nextest-feynkit> =========================================
  201. 33.26 s gammaloop-nextest-feynkit> Extracting 2 binaries and 2 linked paths to /build/source
  202. 33.41 s gammaloop-nextest-feynkit> Extracted 16 files to /build/source in 0.15s
  203. 33.42 s gammaloop-nextest-feynkit> ------------
  204. 33.42 s gammaloop-nextest-feynkit> Nextest run ID 7d048748-75a7-4826-bcd0-a2ed10310db4 with nextest profile: ci_gammaloop
  205. 33.42 s gammaloop-nextest-feynkit> Starting 58 tests across 2 binaries
  206. 33.48 s gammaloop-nextest-feynkit> ------------
  207. 33.48 s gammaloop-nextest-feynkit> Summary [ 0.054s] 58 tests run: 58 passed, 0 skipped
  208. 33.51 s gammaloop-nextest-feynkit>
  209. 33.51 s gammaloop-nextest-feynkit> ========== nextest test summary ==========
  210. 33.51 s gammaloop-nextest-feynkit> report: target/nextest/ci_gammaloop/junit.xml
  211. 33.51 s gammaloop-nextest-feynkit> tests: 58, failures: 0, errors: 0
  212. 33.51 s gammaloop-nextest-feynkit> No failing testcases found.
  213. 33.51 s gammaloop-nextest-feynkit> =========================================
  214. 33.53 s gammaloop-nextest-feynkit> Extracting 1 binary and 2 linked paths to /build/source
  215. 33.61 s gammaloop-nextest-feynkit> Extracted 15 files to /build/source in 0.09s
  216. 33.62 s gammaloop-nextest-feynkit> ------------
  217. 33.62 s gammaloop-nextest-feynkit> Nextest run ID aaf21e41-573e-4caf-8143-02b59bf9d910 with nextest profile: ci_gammaloop
  218. 33.62 s gammaloop-nextest-feynkit> Starting 27 tests across 1 binary
  219. 33.64 s gammaloop-nextest-feynkit> ------------
  220. 33.64 s gammaloop-nextest-feynkit> Summary [ 0.018s] 27 tests run: 27 passed, 0 skipped
  221. 33.67 s gammaloop-nextest-feynkit>
  222. 33.67 s gammaloop-nextest-feynkit> ========== nextest test summary ==========
  223. 33.67 s gammaloop-nextest-feynkit> report: target/nextest/ci_gammaloop/junit.xml
  224. 33.67 s gammaloop-nextest-feynkit> tests: 27, failures: 0, errors: 0
  225. 33.67 s gammaloop-nextest-feynkit> No failing testcases found.
  226. 33.67 s gammaloop-nextest-feynkit> =========================================
  227. 33.69 s gammaloop-nextest-feynkit> Extracting 1 binary and 1 linked path to /build/source
  228. 33.78 s gammaloop-nextest-feynkit> Extracted 7 files to /build/source in 0.09s
  229. 33.79 s gammaloop-nextest-feynkit> ------------
  230. 33.79 s gammaloop-nextest-feynkit> Nextest run ID 96e7b67a-f0f2-43d8-9bb8-19a35d508263 with nextest profile: ci_gammaloop
  231. 33.79 s gammaloop-nextest-feynkit> Starting 21 tests across 1 binary
  232. 33.80 s gammaloop-nextest-feynkit> ------------
  233. 33.80 s gammaloop-nextest-feynkit> Summary [ 0.012s] 21 tests run: 21 passed, 0 skipped
  234. 33.83 s gammaloop-nextest-feynkit>
  235. 33.83 s gammaloop-nextest-feynkit> ========== nextest test summary ==========
  236. 33.83 s gammaloop-nextest-feynkit> report: target/nextest/ci_gammaloop/junit.xml
  237. 33.83 s gammaloop-nextest-feynkit> tests: 21, failures: 0, errors: 0
  238. 33.83 s gammaloop-nextest-feynkit> No failing testcases found.
  239. 33.83 s gammaloop-nextest-feynkit> =========================================
  240. 33.85 s gammaloop-nextest-feynkit> Extracting 2 binaries and 2 linked paths to /build/source
  241. 33.97 s gammaloop-nextest-feynkit> Extracted 16 files to /build/source in 0.12s
  242. 33.98 s gammaloop-nextest-feynkit> ------------
  243. 33.98 s gammaloop-nextest-feynkit> Nextest run ID f87bef2a-79a8-4c15-b51a-8a473963c5d3 with nextest profile: ci_gammaloop
  244. 33.98 s gammaloop-nextest-feynkit> Starting 14 tests across 2 binaries
  245. 33.99 s gammaloop-nextest-feynkit> ------------
  246. 33.99 s gammaloop-nextest-feynkit> Summary [ 0.011s] 14 tests run: 14 passed, 0 skipped
  247. 34.02 s gammaloop-nextest-feynkit>
  248. 34.02 s gammaloop-nextest-feynkit> ========== nextest test summary ==========
  249. 34.02 s gammaloop-nextest-feynkit> report: target/nextest/ci_gammaloop/junit.xml
  250. 34.02 s gammaloop-nextest-feynkit> tests: 14, failures: 0, errors: 0
  251. 34.02 s gammaloop-nextest-feynkit> No failing testcases found.
  252. 34.02 s gammaloop-nextest-feynkit> =========================================
  253. 34.04 s gammaloop-nextest-feynkit> Extracting 5 binaries (including 3 non-test binaries) and 2 linked paths to /build/source
  254. 34.67 s gammaloop-nextest-feynkit> Extracted 22 files to /build/source in 0.63s
  255. 34.68 s gammaloop-nextest-feynkit> ------------
  256. 34.68 s gammaloop-nextest-feynkit> Nextest run ID f4fb7b6e-2a5b-4464-b085-a90fb8d39956 with nextest profile: ci_gammaloop
  257. 34.68 s gammaloop-nextest-feynkit> Starting 13 tests across 2 binaries
  258. 34.75 s gammaloop-nextest-feynkit> FAIL [ 0.070s] (10/13) feynkit-py tests::standalone_python_pipeline_covers_generation_graphs_cff_and_kinematics
  259. 34.75 s gammaloop-nextest-feynkit> stdout ---
  260. 34.75 s gammaloop-nextest-feynkit>
  261. 34.75 s gammaloop-nextest-feynkit> running 1 test
  262. 34.75 s gammaloop-nextest-feynkit> test tests::standalone_python_pipeline_covers_generation_graphs_cff_and_kinematics ... FAILED
  263. 34.75 s gammaloop-nextest-feynkit>
  264. 34.75 s gammaloop-nextest-feynkit> failures:
  265. 34.75 s gammaloop-nextest-feynkit>
  266. 34.75 s gammaloop-nextest-feynkit> failures:
  267. 34.75 s gammaloop-nextest-feynkit> tests::standalone_python_pipeline_covers_generation_graphs_cff_and_kinematics
  268. 34.75 s gammaloop-nextest-feynkit>
  269. 34.75 s gammaloop-nextest-feynkit> test result: FAILED. 0 passed; 1 failed; 0 ignored; 0 measured; 11 filtered out; finished in 0.06s
  270. 34.75 s gammaloop-nextest-feynkit>
  271. 34.75 s gammaloop-nextest-feynkit> stderr ---
  272. 34.75 s gammaloop-nextest-feynkit>
  273. 34.75 s gammaloop-nextest-feynkit> thread 'tests::standalone_python_pipeline_covers_generation_graphs_cff_and_kinematics' (894) panicked at crates/feynkit-py/src/lib.rs:438:57:
  274. 34.75 s gammaloop-nextest-feynkit> called `Result::unwrap()` on an `Err` value: PyErr { type: <class 'AssertionError'>, value: AssertionError(), traceback: Some("Traceback (most recent call last):\n File \"<string>\", line 39, in <module>\n") }
  275. 34.75 s gammaloop-nextest-feynkit> stack backtrace:
  276. 34.75 s gammaloop-nextest-feynkit> 0: __rustc::rust_begin_unwind
  277. 34.75 s gammaloop-nextest-feynkit> 1: core::panicking::panic_fmt
  278. 34.75 s gammaloop-nextest-feynkit> 2: core::result::unwrap_failed
  279. 34.75 s gammaloop-nextest-feynkit> 3: feynkit_py::tests::standalone_python_pipeline_covers_generation_graphs_cff_and_kinematics
  280. 34.75 s gammaloop-nextest-feynkit> 4: <feynkit_py::tests::standalone_python_pipeline_covers_generation_graphs_cff_and_kinematics::{closure#0} as core::ops::function::FnOnce<()>>::call_once
  281. 34.75 s gammaloop-nextest-feynkit> note: Some details are omitted, run with `RUST_BACKTRACE=full` for a verbose backtrace.
  282. 34.76 s gammaloop-nextest-feynkit>
  283. 35.75 s gammaloop-nextest-feynkit> ------------
  284. 35.75 s gammaloop-nextest-feynkit> Summary [ 1.062s] 13 tests run: 12 passed, 1 failed, 0 skipped
  285. 35.75 s gammaloop-nextest-feynkit> FAIL [ 0.070s] (10/13) feynkit-py tests::standalone_python_pipeline_covers_generation_graphs_cff_and_kinematics
  286. 35.75 s gammaloop-nextest-feynkit> stdout ---
  287. 35.75 s gammaloop-nextest-feynkit>
  288. 35.75 s gammaloop-nextest-feynkit> running 1 test
  289. 35.75 s gammaloop-nextest-feynkit> test tests::standalone_python_pipeline_covers_generation_graphs_cff_and_kinematics ... FAILED
  290. 35.75 s gammaloop-nextest-feynkit>
  291. 35.75 s gammaloop-nextest-feynkit> failures:
  292. 35.75 s gammaloop-nextest-feynkit>
  293. 35.75 s gammaloop-nextest-feynkit> failures:
  294. 35.75 s gammaloop-nextest-feynkit> tests::standalone_python_pipeline_covers_generation_graphs_cff_and_kinematics
  295. 35.75 s gammaloop-nextest-feynkit>
  296. 35.75 s gammaloop-nextest-feynkit> test result: FAILED. 0 passed; 1 failed; 0 ignored; 0 measured; 11 filtered out; finished in 0.06s
  297. 35.75 s gammaloop-nextest-feynkit>
  298. 35.75 s gammaloop-nextest-feynkit> stderr ---
  299. 35.75 s gammaloop-nextest-feynkit>
  300. 35.75 s gammaloop-nextest-feynkit> thread 'tests::standalone_python_pipeline_covers_generation_graphs_cff_and_kinematics' (894) panicked at crates/feynkit-py/src/lib.rs:438:57:
  301. 35.75 s gammaloop-nextest-feynkit> called `Result::unwrap()` on an `Err` value: PyErr { type: <class 'AssertionError'>, value: AssertionError(), traceback: Some("Traceback (most recent call last):\n File \"<string>\", line 39, in <module>\n") }
  302. 35.75 s gammaloop-nextest-feynkit> stack backtrace:
  303. 35.75 s gammaloop-nextest-feynkit> 0: __rustc::rust_begin_unwind
  304. 35.75 s gammaloop-nextest-feynkit> 1: core::panicking::panic_fmt
  305. 35.75 s gammaloop-nextest-feynkit> 2: core::result::unwrap_failed
  306. 35.75 s gammaloop-nextest-feynkit> 3: feynkit_py::tests::standalone_python_pipeline_covers_generation_graphs_cff_and_kinematics
  307. 35.75 s gammaloop-nextest-feynkit> 4: <feynkit_py::tests::standalone_python_pipeline_covers_generation_graphs_cff_and_kinematics::{closure#0} as core::ops::function::FnOnce<()>>::call_once
  308. 35.75 s gammaloop-nextest-feynkit> note: Some details are omitted, run with `RUST_BACKTRACE=full` for a verbose backtrace.
  309. 35.75 s gammaloop-nextest-feynkit>
  310. 35.75 s gammaloop-nextest-feynkit> error: test run failed
  311. 35.78 s gammaloop-nextest-feynkit>
  312. 35.78 s gammaloop-nextest-feynkit> ========== nextest test summary ==========
  313. 35.78 s gammaloop-nextest-feynkit> report: target/nextest/ci_gammaloop/junit.xml
  314. 35.78 s gammaloop-nextest-feynkit> tests: 13, failures: 1, errors: 0
  315. 35.78 s gammaloop-nextest-feynkit>
  316. 35.78 s gammaloop-nextest-feynkit> 1. feynkit-py::tests::standalone_python_pipeline_covers_generation_graphs_cff_and_kinematics
  317. 35.78 s gammaloop-nextest-feynkit> failure: test failure with exit code 101
  318. 35.78 s gammaloop-nextest-feynkit> thread 'tests::standalone_python_pipeline_covers_generation_graphs_cff_and_kinematics' (894) panicked at crates/feynkit-py/src/lib.rs:438:57:
  319. 35.78 s gammaloop-nextest-feynkit> called `Result::unwrap()` on an `Err` value: PyErr { type: <class 'AssertionError'>, value: AssertionError(), traceback: Some("Traceback (most recent call last):\n File \"<string>\", line 39, in <module>\n") }
  320. 35.78 s gammaloop-nextest-feynkit> stack backtrace:
  321. 35.78 s gammaloop-nextest-feynkit> 0: __rustc::rust_begin_unwind
  322. 35.78 s gammaloop-nextest-feynkit> 1: core::panicking::panic_fmt
  323. 35.78 s gammaloop-nextest-feynkit> 2: core::result::unwrap_failed
  324. 35.78 s gammaloop-nextest-feynkit> 3: feynkit_py::tests::standalone_python_pipeline_covers_generation_graphs_cff_and_kinematics
  325. 35.78 s gammaloop-nextest-feynkit> 4: <feynkit_py::tests::standalone_python_pipeline_covers_generation_graphs_cff_and_kinematics::{closure#0} as core::ops::function::FnOnce<()>>::call_once
  326. 35.78 s gammaloop-nextest-feynkit> note: Some details are omitted, run with `RUST_BACKTRACE=full` for a verbose backtrace.
  327. 35.78 s gammaloop-nextest-feynkit> system-out
  328. 35.78 s gammaloop-nextest-feynkit> running 1 test
  329. 35.78 s gammaloop-nextest-feynkit> test tests::standalone_python_pipeline_covers_generation_graphs_cff_and_kinematics ... FAILED
  330. 35.78 s gammaloop-nextest-feynkit>
  331. 35.78 s gammaloop-nextest-feynkit> failures:
  332. 35.78 s gammaloop-nextest-feynkit>
  333. 35.78 s gammaloop-nextest-feynkit> failures:
  334. 35.78 s gammaloop-nextest-feynkit> tests::standalone_python_pipeline_covers_generation_graphs_cff_and_kinematics
  335. 35.78 s gammaloop-nextest-feynkit>
  336. 35.78 s gammaloop-nextest-feynkit> test result: FAILED. 0 passed; 1 failed; 0 ignored; 0 measured; 11 filtered out; finished in 0.06s
  337. 35.78 s gammaloop-nextest-feynkit> system-err
  338. 35.78 s gammaloop-nextest-feynkit> thread 'tests::standalone_python_pipeline_covers_generation_graphs_cff_and_kinematics' (894) panicked at crates/feynkit-py/src/lib.rs:438:57:
  339. 35.78 s gammaloop-nextest-feynkit> called `Result::unwrap()` on an `Err` value: PyErr { type: <class 'AssertionError'>, value: AssertionError(), traceback: Some("Traceback (most recent call last):\n File \"<string>\", line 39, in <module>\n") }
  340. 35.78 s gammaloop-nextest-feynkit> stack backtrace:
  341. 35.78 s gammaloop-nextest-feynkit> 0: __rustc::rust_begin_unwind
  342. 35.78 s gammaloop-nextest-feynkit> 1: core::panicking::panic_fmt
  343. 35.78 s gammaloop-nextest-feynkit> 2: core::result::unwrap_failed
  344. 35.78 s gammaloop-nextest-feynkit> 3: feynkit_py::tests::standalone_python_pipeline_covers_generation_graphs_cff_and_kinematics
  345. 35.78 s gammaloop-nextest-feynkit> 4: <feynkit_py::tests::standalone_python_pipeline_covers_generation_graphs_cff_and_kinematics::{closure#0} as core::ops::function::FnOnce<()>>::call_once
  346. 35.78 s gammaloop-nextest-feynkit> note: Some details are omitted, run with `RUST_BACKTRACE=full` for a verbose backtrace.
  347. 35.78 s gammaloop-nextest-feynkit> =========================================
  348. 35.79 s gammaloop-nextest-feynkit> Extracting 1 binary and 2 linked paths to /build/source
  349. 35.89 s gammaloop-nextest-feynkit> Extracted 15 files to /build/source in 0.10s
  350. 35.90 s gammaloop-nextest-feynkit> ------------
  351. 35.90 s gammaloop-nextest-feynkit> Nextest run ID 7d24ea97-415c-4787-b927-504f5ed189c1 with nextest profile: ci_gammaloop
  352. 35.90 s gammaloop-nextest-feynkit> Starting 45 tests across 1 binary (1 test skipped)
  353. 36.02 s gammaloop-nextest-feynkit> ------------
  354. 36.02 s gammaloop-nextest-feynkit> Summary [ 0.120s] 45 tests run: 45 passed, 1 skipped
  355. 36.07 s gammaloop-nextest-feynkit>
  356. 36.07 s gammaloop-nextest-feynkit> ========== nextest test summary ==========
  357. 36.07 s gammaloop-nextest-feynkit> report: target/nextest/ci_gammaloop/junit.xml
  358. 36.07 s gammaloop-nextest-feynkit> tests: 45, failures: 0, errors: 0
  359. 36.07 s gammaloop-nextest-feynkit> No failing testcases found.
  360. 36.07 s gammaloop-nextest-feynkit> =========================================
  361. 36.08 s gammaloop-nextest-feynkit> Extracting 1 binary and 2 linked paths to /build/source
  362. 36.17 s gammaloop-nextest-feynkit> Extracted 15 files to /build/source in 0.08s
  363. 36.18 s gammaloop-nextest-feynkit> ------------
  364. 36.18 s gammaloop-nextest-feynkit> Nextest run ID 9430aded-9ab0-4efa-b975-91a7b3e5e8d4 with nextest profile: ci_gammaloop
  365. 36.18 s gammaloop-nextest-feynkit> Starting 2 tests across 1 binary
  366. 36.19 s gammaloop-nextest-feynkit> ------------
  367. 36.19 s gammaloop-nextest-feynkit> Summary [ 0.018s] 2 tests run: 2 passed, 0 skipped
  368. 36.23 s gammaloop-nextest-feynkit>
  369. 36.23 s gammaloop-nextest-feynkit> ========== nextest test summary ==========
  370. 36.23 s gammaloop-nextest-feynkit> report: target/nextest/ci_gammaloop/junit.xml
  371. 36.23 s gammaloop-nextest-feynkit> tests: 2, failures: 0, errors: 0
  372. 36.23 s gammaloop-nextest-feynkit> No failing testcases found.
  373. 36.23 s gammaloop-nextest-feynkit> =========================================
  374. 36.40 s error: Cannot build '/nix/store/zh4pw054f6hx097n2qj1gy61y2ksp3nz-gammaloop-nextest-feynkit.drv'.
  375. 36.40 s Reason: builder failed with exit code 100.
  376. 36.40 s Output paths:
  377. 36.40 s /nix/store/x47xvchzdig7wfp2l11w8ppylahhi2kx-gammaloop-nextest-feynkit
  378. 36.40 s Last 199 log lines:
  379. 36.40 s > Extracting 1 binary and 2 linked paths to /build/source
  380. 36.40 s > Extracted 15 files to /build/source in 0.09s
  381. 36.40 s > ------------
  382. 36.40 s > Nextest run ID acf39b19-0410-4ce3-a79e-f0c6744f5c78 with nextest profile: ci_gammaloop
  383. 36.40 s > Starting 1 test across 1 binary
  384. 36.40 s > ------------
  385. 36.40 s > Summary [ 0.006s] 1 test run: 1 passed, 0 skipped
  386. 36.40 s >
  387. 36.40 s > ========== nextest test summary ==========
  388. 36.40 s > report: target/nextest/ci_gammaloop/junit.xml
  389. 36.40 s > tests: 1, failures: 0, errors: 0
  390. 36.40 s > No failing testcases found.
  391. 36.40 s > =========================================
  392. 36.40 s > Extracting 1 binary and 2 linked paths to /build/source
  393. 36.40 s > Extracted 15 files to /build/source in 0.09s
  394. 36.40 s > ------------
  395. 36.40 s > Nextest run ID c0e61333-b8a4-4f21-94f0-e6db1e4d42b6 with nextest profile: ci_gammaloop
  396. 36.40 s > Starting 33 tests across 1 binary
  397. 36.40 s > ------------
  398. 36.40 s > Summary [ 0.019s] 33 tests run: 33 passed, 0 skipped
  399. 36.40 s >
  400. 36.40 s > ========== nextest test summary ==========
  401. 36.40 s > report: target/nextest/ci_gammaloop/junit.xml
  402. 36.40 s > tests: 33, failures: 0, errors: 0
  403. 36.40 s > No failing testcases found.
  404. 36.40 s > =========================================
  405. 36.40 s > Extracting 2 binaries and 2 linked paths to /build/source
  406. 36.40 s > Extracted 16 files to /build/source in 0.15s
  407. 36.40 s > ------------
  408. 36.40 s > Nextest run ID 7d048748-75a7-4826-bcd0-a2ed10310db4 with nextest profile: ci_gammaloop
  409. 36.40 s > Starting 58 tests across 2 binaries
  410. 36.40 s > ------------
  411. 36.40 s > Summary [ 0.054s] 58 tests run: 58 passed, 0 skipped
  412. 36.40 s >
  413. 36.40 s > ========== nextest test summary ==========
  414. 36.40 s > report: target/nextest/ci_gammaloop/junit.xml
  415. 36.40 s > tests: 58, failures: 0, errors: 0
  416. 36.40 s > No failing testcases found.
  417. 36.40 s > =========================================
  418. 36.40 s > Extracting 1 binary and 2 linked paths to /build/source
  419. 36.40 s > Extracted 15 files to /build/source in 0.09s
  420. 36.40 s > ------------
  421. 36.40 s > Nextest run ID aaf21e41-573e-4caf-8143-02b59bf9d910 with nextest profile: ci_gammaloop
  422. 36.40 s > Starting 27 tests across 1 binary
  423. 36.40 s > ------------
  424. 36.40 s > Summary [ 0.018s] 27 tests run: 27 passed, 0 skipped
  425. 36.40 s >
  426. 36.40 s > ========== nextest test summary ==========
  427. 36.40 s > report: target/nextest/ci_gammaloop/junit.xml
  428. 36.40 s > tests: 27, failures: 0, errors: 0
  429. 36.40 s > No failing testcases found.
  430. 36.40 s > =========================================
  431. 36.40 s > Extracting 1 binary and 1 linked path to /build/source
  432. 36.40 s > Extracted 7 files to /build/source in 0.09s
  433. 36.40 s > ------------
  434. 36.40 s > Nextest run ID 96e7b67a-f0f2-43d8-9bb8-19a35d508263 with nextest profile: ci_gammaloop
  435. 36.40 s > Starting 21 tests across 1 binary
  436. 36.40 s > ------------
  437. 36.40 s > Summary [ 0.012s] 21 tests run: 21 passed, 0 skipped
  438. 36.40 s >
  439. 36.40 s > ========== nextest test summary ==========
  440. 36.40 s > report: target/nextest/ci_gammaloop/junit.xml
  441. 36.40 s > tests: 21, failures: 0, errors: 0
  442. 36.40 s > No failing testcases found.
  443. 36.40 s > =========================================
  444. 36.40 s > Extracting 2 binaries and 2 linked paths to /build/source
  445. 36.40 s > Extracted 16 files to /build/source in 0.12s
  446. 36.40 s > ------------
  447. 36.40 s > Nextest run ID f87bef2a-79a8-4c15-b51a-8a473963c5d3 with nextest profile: ci_gammaloop
  448. 36.40 s > Starting 14 tests across 2 binaries
  449. 36.40 s > ------------
  450. 36.40 s > Summary [ 0.011s] 14 tests run: 14 passed, 0 skipped
  451. 36.40 s >
  452. 36.40 s > ========== nextest test summary ==========
  453. 36.40 s > report: target/nextest/ci_gammaloop/junit.xml
  454. 36.40 s > tests: 14, failures: 0, errors: 0
  455. 36.40 s > No failing testcases found.
  456. 36.40 s > =========================================
  457. 36.40 s > Extracting 5 binaries (including 3 non-test binaries) and 2 linked paths to /build/source
  458. 36.40 s > Extracted 22 files to /build/source in 0.63s
  459. 36.40 s > ------------
  460. 36.40 s > Nextest run ID f4fb7b6e-2a5b-4464-b085-a90fb8d39956 with nextest profile: ci_gammaloop
  461. 36.40 s > Starting 13 tests across 2 binaries
  462. 36.40 s > FAIL [ 0.070s] (10/13) feynkit-py tests::standalone_python_pipeline_covers_generation_graphs_cff_and_kinematics
  463. 36.40 s > stdout ---
  464. 36.40 s >
  465. 36.40 s > running 1 test
  466. 36.40 s > test tests::standalone_python_pipeline_covers_generation_graphs_cff_and_kinematics ... FAILED
  467. 36.40 s >
  468. 36.40 s > failures:
  469. 36.40 s >
  470. 36.40 s > failures:
  471. 36.40 s > tests::standalone_python_pipeline_covers_generation_graphs_cff_and_kinematics
  472. 36.40 s >
  473. 36.40 s > test result: FAILED. 0 passed; 1 failed; 0 ignored; 0 measured; 11 filtered out; finished in 0.06s
  474. 36.40 s >
  475. 36.40 s > stderr ---
  476. 36.40 s >
  477. 36.40 s > thread 'tests::standalone_python_pipeline_covers_generation_graphs_cff_and_kinematics' (894) panicked at crates/feynkit-py/src/lib.rs:438:57:
  478. 36.40 s > called `Result::unwrap()` on an `Err` value: PyErr { type: <class 'AssertionError'>, value: AssertionError(), traceback: Some("Traceback (most recent call last):\n File \"<string>\", line 39, in <module>\n") }
  479. 36.40 s > stack backtrace:
  480. 36.40 s > 0: __rustc::rust_begin_unwind
  481. 36.40 s > 1: core::panicking::panic_fmt
  482. 36.40 s > 2: core::result::unwrap_failed
  483. 36.40 s > 3: feynkit_py::tests::standalone_python_pipeline_covers_generation_graphs_cff_and_kinematics
  484. 36.40 s > 4: <feynkit_py::tests::standalone_python_pipeline_covers_generation_graphs_cff_and_kinematics::{closure#0} as core::ops::function::FnOnce<()>>::call_once
  485. 36.40 s > note: Some details are omitted, run with `RUST_BACKTRACE=full` for a verbose backtrace.
  486. 36.40 s >
  487. 36.40 s > ------------
  488. 36.40 s > Summary [ 1.062s] 13 tests run: 12 passed, 1 failed, 0 skipped
  489. 36.40 s > FAIL [ 0.070s] (10/13) feynkit-py tests::standalone_python_pipeline_covers_generation_graphs_cff_and_kinematics
  490. 36.40 s > stdout ---
  491. 36.40 s >
  492. 36.40 s > running 1 test
  493. 36.40 s > test tests::standalone_python_pipeline_covers_generation_graphs_cff_and_kinematics ... FAILED
  494. 36.40 s >
  495. 36.40 s > failures:
  496. 36.40 s >
  497. 36.40 s > failures:
  498. 36.40 s > tests::standalone_python_pipeline_covers_generation_graphs_cff_and_kinematics
  499. 36.40 s >
  500. 36.40 s > test result: FAILED. 0 passed; 1 failed; 0 ignored; 0 measured; 11 filtered out; finished in 0.06s
  501. 36.40 s >
  502. 36.40 s > stderr ---
  503. 36.40 s >
  504. 36.40 s > thread 'tests::standalone_python_pipeline_covers_generation_graphs_cff_and_kinematics' (894) panicked at crates/feynkit-py/src/lib.rs:438:57:
  505. 36.40 s > called `Result::unwrap()` on an `Err` value: PyErr { type: <class 'AssertionError'>, value: AssertionError(), traceback: Some("Traceback (most recent call last):\n File \"<string>\", line 39, in <module>\n") }
  506. 36.40 s > stack backtrace:
  507. 36.40 s > 0: __rustc::rust_begin_unwind
  508. 36.40 s > 1: core::panicking::panic_fmt
  509. 36.40 s > 2: core::result::unwrap_failed
  510. 36.40 s > 3: feynkit_py::tests::standalone_python_pipeline_covers_generation_graphs_cff_and_kinematics
  511. 36.40 s > 4: <feynkit_py::tests::standalone_python_pipeline_covers_generation_graphs_cff_and_kinematics::{closure#0} as core::ops::function::FnOnce<()>>::call_once
  512. 36.40 s > note: Some details are omitted, run with `RUST_BACKTRACE=full` for a verbose backtrace.
  513. 36.40 s >
  514. 36.40 s > error: test run failed
  515. 36.40 s >
  516. 36.40 s > ========== nextest test summary ==========
  517. 36.40 s > report: target/nextest/ci_gammaloop/junit.xml
  518. 36.40 s > tests: 13, failures: 1, errors: 0
  519. 36.40 s >
  520. 36.40 s > 1. feynkit-py::tests::standalone_python_pipeline_covers_generation_graphs_cff_and_kinematics
  521. 36.40 s > failure: test failure with exit code 101
  522. 36.40 s > thread 'tests::standalone_python_pipeline_covers_generation_graphs_cff_and_kinematics' (894) panicked at crates/feynkit-py/src/lib.rs:438:57:
  523. 36.40 s > called `Result::unwrap()` on an `Err` value: PyErr { type: <class 'AssertionError'>, value: AssertionError(), traceback: Some("Traceback (most recent call last):\n File \"<string>\", line 39, in <module>\n") }
  524. 36.40 s > stack backtrace:
  525. 36.40 s > 0: __rustc::rust_begin_unwind
  526. 36.40 s > 1: core::panicking::panic_fmt
  527. 36.40 s > 2: core::result::unwrap_failed
  528. 36.40 s > 3: feynkit_py::tests::standalone_python_pipeline_covers_generation_graphs_cff_and_kinematics
  529. 36.40 s > 4: <feynkit_py::tests::standalone_python_pipeline_covers_generation_graphs_cff_and_kinematics::{closure#0} as core::ops::function::FnOnce<()>>::call_once
  530. 36.40 s > note: Some details are omitted, run with `RUST_BACKTRACE=full` for a verbose backtrace.
  531. 36.40 s > system-out
  532. 36.40 s > running 1 test
  533. 36.40 s > test tests::standalone_python_pipeline_covers_generation_graphs_cff_and_kinematics ... FAILED
  534. 36.40 s >
  535. 36.40 s > failures:
  536. 36.40 s >
  537. 36.40 s > failures:
  538. 36.40 s > tests::standalone_python_pipeline_covers_generation_graphs_cff_and_kinematics
  539. 36.40 s >
  540. 36.40 s > test result: FAILED. 0 passed; 1 failed; 0 ignored; 0 measured; 11 filtered out; finished in 0.06s
  541. 36.40 s > system-err
  542. 36.40 s > thread 'tests::standalone_python_pipeline_covers_generation_graphs_cff_and_kinematics' (894) panicked at crates/feynkit-py/src/lib.rs:438:57:
  543. 36.40 s > called `Result::unwrap()` on an `Err` value: PyErr { type: <class 'AssertionError'>, value: AssertionError(), traceback: Some("Traceback (most recent call last):\n File \"<string>\", line 39, in <module>\n") }
  544. 36.40 s > stack backtrace:
  545. 36.40 s > 0: __rustc::rust_begin_unwind
  546. 36.40 s > 1: core::panicking::panic_fmt
  547. 36.40 s > 2: core::result::unwrap_failed
  548. 36.40 s > 3: feynkit_py::tests::standalone_python_pipeline_covers_generation_graphs_cff_and_kinematics
  549. 36.40 s > 4: <feynkit_py::tests::standalone_python_pipeline_covers_generation_graphs_cff_and_kinematics::{closure#0} as core::ops::function::FnOnce<()>>::call_once
  550. 36.40 s > note: Some details are omitted, run with `RUST_BACKTRACE=full` for a verbose backtrace.
  551. 36.40 s > =========================================
  552. 36.40 s > Extracting 1 binary and 2 linked paths to /build/source
  553. 36.40 s > Extracted 15 files to /build/source in 0.10s
  554. 36.40 s > ------------
  555. 36.40 s > Nextest run ID 7d24ea97-415c-4787-b927-504f5ed189c1 with nextest profile: ci_gammaloop
  556. 36.40 s > Starting 45 tests across 1 binary (1 test skipped)
  557. 36.40 s > ------------
  558. 36.40 s > Summary [ 0.120s] 45 tests run: 45 passed, 1 skipped
  559. 36.40 s >
  560. 36.40 s > ========== nextest test summary ==========
  561. 36.40 s > report: target/nextest/ci_gammaloop/junit.xml
  562. 36.40 s > tests: 45, failures: 0, errors: 0
  563. 36.40 s > No failing testcases found.
  564. 36.40 s > =========================================
  565. 36.40 s > Extracting 1 binary and 2 linked paths to /build/source
  566. 36.40 s > Extracted 15 files to /build/source in 0.08s
  567. 36.40 s > ------------
  568. 36.40 s > Nextest run ID 9430aded-9ab0-4efa-b975-91a7b3e5e8d4 with nextest profile: ci_gammaloop
  569. 36.40 s > Starting 2 tests across 1 binary
  570. 36.40 s > ------------
  571. 36.40 s > Summary [ 0.018s] 2 tests run: 2 passed, 0 skipped
  572. 36.40 s >
  573. 36.40 s > ========== nextest test summary ==========
  574. 36.40 s > report: target/nextest/ci_gammaloop/junit.xml
  575. 36.40 s > tests: 2, failures: 0, errors: 0
  576. 36.40 s > No failing testcases found.
  577. 36.40 s > =========================================
  578. 36.40 s For full logs, run:
  579. 36.40 s nix log /nix/store/zh4pw054f6hx097n2qj1gy61y2ksp3nz-gammaloop-nextest-feynkit.drv
  580. 36.57 s [0 built (1 failed), 1 cRun failed.